##TITLE=1H_CA-9472-2
 200.13Hz, DMSO-d6+CCl4.
 8 sc
 30.6.2026
##JCAMPDX= 6.0         $$ Bruker NMR JCAMP-DX V2.0
##DATA TYPE= NMR SPECTRUM
##DATA CLASS= NTUPLES
##ORIGIN= UXNMR, Bruker Analytische Messtechnik GmbH
##OWNER= pz
$$ XWIN-NMR		Version 3.5
$$ Tue Jun 30 13:16:17 2026 Russian Standard Time (UT+4h)  she@DPX200
##.OBSERVE FREQUENCY= 200.1313
##.OBSERVE NUCLEUS= ^1H
##.ACQUISITION MODE= SIMULTANEOUS
##.ACQUISITION SCHEME= undefined
##.AVERAGES= 8
##.DIGITISER RES= 18
##SPECTROMETER/DATA SYSTEM= spect
##.PULSE SEQUENCE= zg30
##.SOLVENT NAME= DMSO
##.SHIFT REFERENCE= (INTERNAL, DMSO, 0, 15.488)
##AUDIT TRAIL= $$ (NUMBER, WHEN, WHO, WHERE, WHAT)
$$ ##TITLE= Audit trail, XWIN-NMR		Version 3.5
$$ ##JCAMPDX= 5.01
$$ ##ORIGIN= Bruker BioSpin GmbH
$$ ##OWNER= she
$$ F:/spectra/data/she/nmr/H-C/1/pdata/1/auditp.txt
$$ ##AUDIT TRAIL=  $$ (NUMBER, WHEN, WHO, WHERE, WHAT)
(   1,<2026-06-30 13:15:05.04 +0400>,<she>,<DPX200>,
      <created by zg, POWCHK disabled, PULCHK disabled
       configuration hash MD5:
       00 E9 B6 7A A2 85 ED C7 34 08 36 98 17 FE 4E 26
       data hash MD5: 16K
       97 B2 FF 29 08 F8 88 76 B1 87 F1 55 EA 01 2A 6E>)
(   2,<2026-06-30 13:15:09.53 +0400>,<she>,<DPX200>,
      <Start of raw data processing
       efp BC_mod = 2 LB = 0.25 FT_mod = 6 PKNL = 1 PHC0 = -4366.982 PHC1 = -6.007696 SI = 16K 
       data hash MD5: 16K
       A1 E7 48 56 31 27 84 8D 21 13 4F EE 9A A6 9D EA>)
(   3,<2026-06-30 13:15:32.81 +0400>,<she>,<DPX200>,
      <pk PHC0 = -12.44429 PHC1 = 18.2 
       data hash MD5: 16K
       D8 F6 EB 85 73 BB 98 48 BA DB 85 9A 00 D3 52 29>)
(   4,<2026-06-30 13:15:36.23 +0400>,<she>,<DPX200>,
      <abs ABSG = 5 
       data hash MD5: 16K
       99 0F 4A 12 24 32 E3 7F 75 AA 74 D7 AE B8 4A 6C>)
$$ ##END=
$$ 
$$ hash MD5
$$ 9D A7 33 BE 33 F5 29 80 08 7A 4C 8C 94 90 DF 51
##$RELAX= 
##$RELAX= 
##$RELAX= 
##$RELAX= 
##$RELAX= 
##$RELAX= 
$$ Bruker specific parameters
$$ --------------------------
##$DU= <F:/spectra>
##$EXPNO= 1
##$NAME= <H-C>
##$PROCNO= 1
##$TYPE= <nmr>
##$USER= <she>
##$AMP= (0..31)
100 100 100 100 100 100 100 100 100 100 100 100 100 100 100 100 100 100 
100 100 100 100 100 100 100 100 100 100 100 100 100 100 
##$AQSEQ= 0
##$AQ_mod= 1
##$AUNM= <au_zg>
##$AUTOPOS= <>
##$BF1= 200.13
##$BF2= 200.13
##$BF3= 200.13
##$BF4= 200.13
##$BF5= 200.13
##$BF6= 200.13
##$BF7= 200.13
##$BF8= 200.13
##$BYTORDA= 1
##$CFDGTYP= 0
##$CFRGTYP= 5
##$CHEMSTR= <none>
##$CNST= (0..31)
1 1 145 1 1 1 1 1 1 1 1 1 1 1 1 1 1 1 1 1 1 1 1 1 1 1 1 1 1 1 1 1 
##$CPDPRG= <>
##$CPDPRG1= <>
##$CPDPRG2= <>
##$CPDPRG3= <>
##$CPDPRG4= <mlev>
##$CPDPRG5= <mlev>
##$CPDPRG6= <mlev>
##$CPDPRG7= <mlev>
##$CPDPRG8= <mlev>
##$CPDPRGB= <>
##$CPDPRGT= <>
##$D= (0..31)
0 0.7 0 0 0 0 0 0 0 0 0 0.03 0 0 0 0 0 0 0 0 0 0 0 0 0 0 0 0 0 0 0 0 
##$DATE= 1782810904
##$DBL= (0..7)
120 120 120 120 120 120 120 120 
##$DBP= (0..7)
150 150 150 150 150 150 150 150 
##$DBP07= 0
##$DBPNAM0= <>
##$DBPNAM1= <>
##$DBPNAM2= <>
##$DBPNAM3= <>
##$DBPNAM4= <>
$$ [...]
##$SUBNAM3= <"">
##$SUBNAM4= <"">
##$SUBNAM5= <"">
##$SUBNAM6= <"">
##$SUBNAM7= <"">
##$SUBNAM8= <"">
##$SUBNAM9= <"">
##$SW= 18.0517328524113
##$SWIBOX= (0..15)
0 0 2 0 0 0 0 0 0 0 0 0 0 0 0 0 
##$SW_h= 3612.71676300578
##$TD= 16384
##$TD0= 1
##$TE= 0
##$TE2= 300
##$TE3= 300
##$TEG= 300
##$TL= (0..7)
0 120 120 120 120 120 120 120 
##$TP= (0..7)
150 150 150 150 150 150 150 150 
##$TP07= 0
##$TPNAME0= <>
##$TPNAME1= <>
##$TPNAME2= <>
##$TPNAME3= <>
##$TPNAME4= <>
##$TPNAME5= <>
##$TPNAME6= <>
##$TPNAME7= <>
##$TPOAL= (0..7)
0.5 0.5 0.5 0.5 0.5 0.5 0.5 0.5 
##$TPOFFS= (0..7)
0 0 0 0 0 0 0 0 
##$TUNHIN= 0
##$TUNHOUT= 0
##$TUNXOUT= 0
##$USERA1= <user>
##$USERA2= <user>
##$USERA3= <user>
##$USERA4= <user>
##$USERA5= <user>
##$V9= 5
##$VALIST= <valist>
##$VCLIST= <CCCCCCCCCCCCCCC>
##$VD= 0
##$VDLIST= <DDDDDDDDDDDDDDD>
##$VPLIST= <PPPPPPPPPPPPPPP>
##$VTLIST= <TTTTTTTTTTTTTTT>
##$WBST= 1024
##$WBSW= 4
##$XGAIN= (0..3)
0 0 0 0 
##$XL= 0
##$YL= 0
##$YMAX_a= 425565
##$YMIN_a= -678253
##$ZGOPTNS= <>
##$ZL1= 120
##$ZL2= 120
##$ZL3= 120
##$ZL4= 120
##$ABSF1= 15.49348
##$ABSF2= -2.55837
##$ABSG= 5
##$ABSL= 3
##$ALPHA= 0
##$AQORDER= 0
##$ASSFAC= 0
##$ASSFACI= 0
##$ASSFACX= 0
##$ASSWID= 0
##$AUNMP= <proc_1d>
##$AZFE= 0.1
##$AZFW= 0.1
##$BCFW= 0
##$BC_mod= 2
##$BYTORDP= 0
##$COROFFS= 0
##$CY= -3
##$DATMOD= 1
##$DC= 0
##$DFILT= <>
##$DTYPP= 0
##$F1P= 0
##$F2P= 0
##$FCOR= 1
##$FTSIZE= 16384
##$FT_mod= 6
##$GAMMA= 0
##$GB= 0
##$INTBC= 1
##$INTSCL= 3.241238e-09
##$ISEN= 128
##$LB= 0.25
##$LEV0= 0
##$LPBIN= 0
##$MAXI= 10000
##$MC2= 0
##$MEAN= 0
##$ME_mod= 0
##$MI= 1.114404
##$NCOEF= 0
##$NC_proc= -6
##$NLEV= 6
##$NOISF1= 3.799351
##$NOISF2= 2.8
##$NSP= 0
##$NTH_PI= 0
##$NZP= 0
##$OFFSET= 15.48797
##$PC= 1
##$PHC0= -4379.426
##$PHC1= 12.1923
##$PH_mod= 1
##$PKNL= yes
##$PPARMOD= 0
##$PSCAL= 0
##$PSIGN= 0
##$REVERSE= no
##$SF= 200.130006751529
##$SI= 16384
##$SIGF1= 3
##$SIGF2= 2
##$SINO= 0.751879
##$SIOLD= 32768
##$SREGLST= <19F.Aceton>
##$SSB= 0
##$STSI= 16384
##$STSR= 0
##$SW_p= 3612.71676300578
##$SYMM= 0
##$S_DEV= 0
##$TDeff= 16384
##$TDoff= 0
##$TI= <>
##$TILT= no
##$TM1= 0
##$TM2= 0
##$TOPLEV= 0
##$USERP1= <user>
##$USERP2= <user>
##$USERP3= <user>
##$USERP4= <user>
##$USERP5= <user>
##$WDW= 1
##$XDIM= 16384
##$YMAX_p= 322617102
##$YMIN_p= -312620
$$ End of Bruker specific parameters
$$ ---------------------------------
##NTUPLES= NMR SPECTRUM
##VAR_NAME=  FREQUENCY,     SPECTRUM/REAL,   SPECTRUM/IMAG
##SYMBOL=    X,             R,               I
##VAR_TYPE=  INDEPENDENT,   DEPENDENT,       DEPENDENT
##VAR_FORM=  AFFN,          ASDF,            ASDF
##VAR_DIM=   16384,         16384,           16384
##UNITS=     HZ,            ARBITRARY UNITS, ARBITRARY UNITS
##FACTOR=    0.220516191357247, 1,           1
##FIRST=     3099.60761114783, 0,            0
##LAST=      -513.109151857946, 0,           0
##MIN=       -513.109151857946, -312620,     0
##MAX=       3099.60761114783, 322617102,    0
$$ Real data points
##PAGE= N=1
##DATA TABLE= (X++(R..R)), XYDATA
$$ [...]
11100 -100556 -24368 -1505 -104394 -177474 -145626 -109133 -13806 -28329 -21712 -97787 -72058
11089 -72058 -94385 -163349 -56118 -136735 -64523 -148847 -30345 -42638 -100132 -115560 -126885
11078 -126885 -53913 -100870 -55321 -100010 -18486 16965 -36172 -1685 -82411 23736 -110579
11067 -110579 -121656 -102784 -91821 -151611 -84787 -50983 -98868 5759 -202995 -139618 -198867
11056 -198867 -170190 -47516 -87163 -51883 -73269 -42445 -20148 -65110 -56389 -242799 -237255
11045 -237255 -152968 9152 -111533 -123623 -158639 -199293 -108911 -104552 -145824 -156123 -109766
11034 -109766 -112457 -75738 12583 -174658 -113430 -29820 -87079 -90228 -38969 -181757 -40641
11023 -40641 -38715 -150356 -150101 -162837 5891 -84769 10630 -54974 -51040 -88429 -196082 -102476
11011 -102476 -126651 -93740 -168348 -45296 -138311 -78799 -25326 -192809 -76669 -114366 -23616
11000 -23616 -93210 43627 -27508 -47942 -26257 -86869 -58308 -53239 -58474 -106929 -48047 -47985
10988 -47985 -112516 -73712 -253519 -119206 -113104 -176629 -142251 -133134 -81683 -93427 -118352 -178353
10976 -178353 -115949 -18468 -94165 -97932 -128809 -24465 -61551 -85302 -146897 -182573 -191845 -193977
10964 -193977 -92323 -128741 -97363 -69627 -104188 -152975 -145435 -104020 -199252 -190285 -215691 -149385
10952 -149385 -213699 -180967 -59255 -87039 -31916 -65593 -89398 -102259 -269 -58817 -60456
10941 -60456 -85790 -25009 -124341 -110388 -65053 -101767 -22390 -17363 -38647 -25345 7508 -21346
10929 -21346 -104786 -138762 -129662 -49640 -60157 -76307 -106556 -64527 -64573 -65744 -28887 -14016 -8718
10916 -8718 -51858 -40169 -18524 -111049 -82773 -79360 -144175 -105649 -52698 -100980 -130459 -86734
10904 -86734 -105294 -54793 -121678 -118718 -77336 -98593 -60734 -93577 -110543 -223413 -129160 -47799
10892 -47799 -92554 -68235 -795 -61256 8508 -5724 -60222 -47515 -183202 -108888 -28119
10881 -28119 -64724 -7971 49718 36644 31847 24238 -91713 -64873 -92251 -153627 -96222 24118
10869 24118 20899 -31142 1460 -68416 -91656 -76968 -92106 -117830 -49523 -71657 -92553 -117001
10857 -117001 -169602 -108213 -12823 -124738 -130163 -123667 -204161 -137838 -73099 -138269 -164183 -37372
10845 -37372 -123642 -87474 2001 -117070 -82718 -93775 -117941 -137788 -74451 -127585 -176108
10834 -176108 -93219 -18942 -35289 -118073 -125612 -133652 -115215 -65063 -146046 -138234 -71033 -10229
10822 -10229 -23374 -32676 -49914 -123067 -86572 -65007 -87766 -92129 -83761 13351 -21518 -31757
10810 -31757 -131478 -140817 -166161 -147820 -129019 -214560 -153484 -82685 -13986 -63153 28603 -57477
10798 -57477 -139128 -81691 -2834 -108006 -68325 -50051 -153754 -98057 -70537 -126251 -59080
10787 -59080 -72898 -177444 -76794 -89598 -118358 -79884 -50793 -69559 -77600 -66540 -138456
10776 -138456 -28310 -62239 -149226 -80903 -79375 -29296 -64428 -29369 -175942 -161671 -143147
10765 -143147 -156193 -38204 -74942 -71385 -19499 -132155 -132228 -29862 -48492 -139605 -127096 -121755
10753 -121755 -113494 -103015 -179464 -49191 -50329 -52308 -76825 -79347 -104858 -80994 -115220 -172855
10741 -172855 -137092 -112792 -148407 -189048 -3991 -18724 -91697 -63343 -153089 -43837 -38663
10730 -38663 -80184 -141410 -95225 -47592 -57333 -70215 -119597 -120181 -157236 -152912 -160774 -39108
10718 -39108 -132925 -89445 -89440 -224148 -66199 -97786 -136472 -232940 -204334 -71617 -21654 -73910
10706 -73910 -105860 -124060 -242857 -163976 -129859 -77549 -126626 -120967 -71020 -177324 -120934
10695 -120934 -180450 -170153 -66086 -165309 -203919 -233710 -250965 -239437 -139667 -204117 -72660
10684 -72660 -132146 -136154 -130013 -183620 -111883 -132954 -86907 -112425 -61878 -56484 -144907 -90902
10672 -90902 -35027 -78148 -146999 -39588 -125247 -24296 -88049 -128715 -44521 -144476 -50489
10661 -50489 -107417 -75414 -183631 -154146 -73116 -125877 -140462 -153663 -51854 -70531 -45379
10650 -45379 -63907 -83071 -65694 -147092 -23577 -114525 -76611 -19037 -10522 -88250 -69142 -57519
10638 -57519 45057 37466 -78736 -53943 -15770 -26855 -91489 -205762 -186404 -253080 -162010
10627 -162010 -212352 -174529 -94217 -107449 -70155 -100646 -175350 -219414 -144630 -186309 -69618
10616 -69618 -15968 -158991 -121831 -115971 -124346 -212304 -174693 -123741 -90423 -11668 -117801 -123805
10604 -123805 -191180 -111260 -97008 -20009 -170934 -173641 -112707 -139017 -33939 -139023 -74173
10593 -74173 -35743 -80579 -84592 -161347 -48409 -123893 -27424 -45500 66374 -34360 -48428
10582 -48428 -74267 -94441 -105065 -190288 -51482 -68427 -93997 -86864 -125046 -109435 -134678 -171714
10570 -171714 -140444 -84961 3561 -47536 -166768 -210145 -156107 -122317 -81814 -166216 -113979
10559 -113979 -118376 -109683 -68459 -163778 -229158 -217491 -203245 -78621 55000 -21106 -110642
10548 -110642 -135858 -211292 -164677 -283104 -191202 -217367 -191123 -132092 -124185 -137398 -149503
10537 -149503 12113 -40427 -113491 -66203 -7937 -22675 -20138 -58365 -167474 -75186 -27432
10526 -27432 -28984 -82981 -161221 -150250 -87171 1959 -66496 97960 -17988 -174784 -120992
10515 -120992 -166044 -191869 -31714 -111622 -164226 -159625 -136803 -97041 27672 -3055 -173435
10504 -173435 -168208 -168841 -139151 -139697 -164225 -156857 -71814 -74670 -157155 -94897 -92649 -87596 -130108
10491 -130108 -72816 -193025 -270908 -213242 -149533 -108276 -170876 -163734 -173210 -84659 -136272 -28034
10479 -28034 -81259 -141906 -70526 -70788 -52156 -106774 -139259 -82602 -126465 -74161 -146369 -199629
10467 -199629 -107402 -45491 -116106 -30711 -73685 -113655 -94391 -73883 -70726 -94992 -17727 -116447
10455 -116447 -115693 -75879 -126684 9892 -54710 -98958 -40590 -87738 -81211 17446 -20906 -16842
10443 -16842 117819 13180 -118655 -86479 -2426 -92303 -149867 -17881 -132175 -82976 -27263
10432 -27263 -105769 -39794 -31150 -128922 -122132 -599 -10983 19475 -63968 -142999 -119497 -31070
10420 -31070 -86165 -108796 -15112 -55588 -99829 -43951 -134595 -44060 24646 -67005 -167250
10409 -167250 -174333 -147593 -154188 -143101 -122759 -96909 15952 855 -6229 19122 -82407 -204747
10397 -204747 -209935 -99663 -111775 -84687 -99341 -177464 -30371 -19312 -41055 -27958 -10519
10386 -10519 -44253 -75100 -103213 -132415 -59346 -71343 -188731 -169251 -38986 -105198 -75670
10375 -75670 -56876 -147564 -47557 -31621 -145755 -74902 -77798 -129154 -34864 51027 -5130
10364 -5130 -42280 -19096 -35835 -89944 -15158 -87681 -178820 984 -58296 -74730 -6965 -83171
10352 -83171 32010 60070 -175118 -171431 -83611 -115402 -41154 40689 49676 -43944 -1962 -32977
10340 -32977 -148616 -84716 -114873 -165450 -104781 -115513 -142885 -131965 -189789 -175551 -94562
10329 -94562 -183475 -102280 -108571 -75401 -144752 -172270 -79734 -249238 -149134 -21927 -55686
10318 -55686 -26562 -134497 -312620 -179537 -71770 -130981 -116508 -33379 -48242 -95798 -58456
10307 -58456 -7761 -48824 -25925 -106485 -34469 20355 -89577 -17854 12509 -66405 -11229
10296 -11229 41308 -70209 -109650 -84658 -37337 -86986 -26927 -6131 -61629 -24894 -117249
10285 -117249 -83733 -12078 -83329 -67099 -27685 -117543 -167193 -46039 -88590 -139583 -103582
10274 -103582 -214744 -268353 -161740 -128343 -160246 -85659 -123190 -175717 -75190 -128001 -164392
10263 -164392 -167225 -42064 -93871 -25128 -75200 -42143 -10749 -236785 -120625 23201 26271
10252 26271 -84604 20605 -32795 -178865 -137631 -110400 -96061 -62784 81080 -42019 -130967
10241 -130967 34005 -87297 -84260 -128994 -66471 -31183 18121 51511 -37167 -23505 -23298 -74739
10229 -74739 -198183 -107760 -58585 26220 -89597 -170106 -42549 -38678 -35140 -9824 -53980
10218 -53980 -80768 -60969 -101166 -129029 -112495 -59433 -24581 -123619 -71407 -109124 -146048 -82112
10206 -82112 -91749 27597 -80844 -151757 -127349 -153868 -172518 -88773 -111298 -180836 -24160
10195 -24160 54195 -80405 -94217 -73058 -107900 -174335 -97240 -148329 -65592 -32131 -105053
10184 -105053 -71681 -115858 -122770 -77010 -125150 -88805 22812 -46169 -59554 -80884 -83457 -125739
10172 -125739 -51441 -27558 -85765 -35219 14691 -91823 -149597 -69474 -30569 -29542 -36602 -57638
10160 -57638 8663 -77636 -59831 26688 -65714 -154640 -91051 -30097 -12874 -7512 -113414 -114100
10148 -114100 -43123 -78497 -41274 -75141 -76204 -82612 -211631 -155044 -89800 -24866 -98817 -104593
10136 -104593 -52204 -140184 -153045 -138742 -212271 -177243 -79767 -83774 -90244 -131088 -110944 -29693
10124 -29693 -137521 -61163 -68512 -43125 2698 -92995 -77635 -124850 -137589 -124641 -104671 -120855
10112 -120855 -110524 -110976 -187339 -184228 -62132 -101040 -170187 -70551 -39064 16330 114487 -38068
10100 -38068 -140123 -181609 -141314 -66783 -43922 53857 67781 101923 95853 -156 -13232 -53447
10088 -53447 -34167 -1431 -42977 -76637 108790 -67347 -161007 20152 -3741 -141145 -91213
10077 -91213 -11630 -56276 -40970 -54037 -90304 -114288 -71079 -83274 -37170 -107219 -167797 -9510
10065 -9510 -88787 -161763 19189 -29600 -52602 62438 34479 -99356 -10054 12983 -29200
10054 -29200 -47774 -67003 -44820 -17104 -2910 -44588 -29666 -101683 -142986 -39474 -15030
10043 -15030 6224 43320 38714 -21112 33199 35279 40340 133114 5379 -98387 -1307 33317
10031 33317 78840 -50380 50987 203661 139177 86180 97547 48443 46619 82307 115830
10020 115830 214470 142761 135265 24152 5751 61936 157673 199360 74333 155840 314694
10009 314694 268665 320398 487852 471577 726302 938354 1035752 1239178 1369654 1445620
9999 1445620 1384596 1376980 1367496 1429229 1363739 1214835 1088176 946479 756898 514252 475063
9988 475063 271085 186078 174815 -24953 146384 139193 48876 28167 70095 92287 39118
9977 39118 57115 5908 -16978 12705 84002 84546 85493 33232 34213 45262 -38830 92909 71461
9964 71461 -19335 29218 68805 -39256 -59616 -9311 -61341 -26331 29738 131368 57203
9953 57203 101739 71159 9787 81884 34730 24879 12228 61074 152978 164176 43231 -17833
9941 -17833 -109962 -60879 -21768 -30544 33047 -148 -36003 64680 -52008 -116380 -8047
9930 -8047 -30750 -119165 -34737 -65868 -143954 -64993 -62541 -69587 -32876 45600 -41360 13461
9918 13461 13068 -66570 -3348 -72935 -38539 3545 24729 16327 44516 57907 -48318 31696
9906 31696 -42071 27631 -5640 26482 44598 -43906 12360 567 72678 155476 53939 173251
9894 173251 160659 31010 95537 85546 -25674 177115 65173 85795 208431 139814 84822
9883 84822 54266 56134 39314 22188 41439 36842 -20697 95421 40720 30419 -29879 -23221
9871 -23221 113352 69533 78997 24310 -87368 -836 46612 92959 77605 37042 25134 82265
9859 82265 36423 24120 9294 -4493 95319 100556 169252 177885 168385 62792 -138610 85000
9847 85000 64108 64165 36735 27394 118637 116356 11508 -19138 -28758 -27430 115594 119068 35470
9834 35470 132959 60938 100908 43341 193287 148012 98609 197837 100406 108292 145975 113316
9822 113316 111929 169769 119979 179920 43617 -14598 132600 169125 80167 82293 91443 79324
9810 79324 77707 124212 57583 164584 124967 151424 137522 129174 80389 135188 151101 53978
9798 53978 30165 35189 151757 129713 90987 65819 78661 13199 19155 221454 235979 218473
9786 218473 10256 39786 117801 46358 59815 22314 122979 24655 155820 164541 6151
9775 6151 97659 77301 33462 20114 98956 91007 98932 74664 33624 107896 89723 31671
9763 31671 43737 197976 228142 257372 301596 172138 203632 236147 195658 332822 324247
9752 324247 237460 322533 450929 320320 311443 374863 367888 488276 491677 472326 424851 489208
9740 489208 612778 677450 582520 572499 588409 648988 696573 646135 645220 659114 706702 686224
9728 686224 729713 635950 634214 695250 607354 667552 705859 759006 660921 750231 650318 677731
9716 677731 731469 722582 835419 870457 993347 868639 1007997 1114918 1093927 1096795 957575
9705 957575 992455 979517 957273 910336 899467 827368 690320 726424 698070 698152 807873 790107
9693 790107 625717 734758 657782 659757 739957 700001 641616 764287 633756 651677 692286
9682 692286 640624 596095 688241 708803 627948 675778 653121 534885 645403 650465 572081
9671 572081 612472 555416 519374 586998 386735 370521 440583 360735 426045 291948 254916
9660 254916 261664 315802 323680 252642 313679 396670 258690 334019 281359 172008 254526 244716
9648 244716 252755 308044 284720 247023 139340 193903 231484 180146 170436 203283 151695 267116
9636 267116 182243 165597 157656 79368 164303 173734 166659 216476 214816 235855 197319 191857 244776
9623 244776 137317 262585 433317 349210 376184 267239 92796 280203 344546 272155
9613 272155 293521 315065 286224 319170 319306 280010 289572 281828 275034 354377 451895 318182
9601 318182 288718 386371 283653 382939 416783 357251 409682 440690 301662 291362 265632
9590 265632 276721 367790 369724 370504 381879 355409 329134 376036 401554 272605 308435 397251
9578 397251 282776 411592 473687 289020 272526 320159 422942 523322 498726 454520 409980
9567 409980 511426 671455 709904 665516 612946 520801 558634 541211 627941 558844 469329
9556 469329 512991 580030 570154 566889 493832 591001 618330 464172 628676 644374 611338 713939
9544 713939 662084 609110 602773 650232 621929 714843 678403 694907 699622 726929 782134 792997
9532 792997 833879 800013 951614 898888 916386 972317 863201 818419 845922 815847 785844
9521 785844 804410 776049 810488 835150 742442 767485 720179 787670 836277 832851 835841 836981
9509 836981 820215 902146 844186 973421 758555 750907 794940 803343 935636 947167 955829 856746
9497 856746 909352 913293 962762 883380 832294 1002055 1012160 1023052 1071886 1148665 1156341 1338127
9485 1338127 1498079 1632797 2056934 2314815 2366895 2527898 2466877 2274768 2170580 1990344
9475 1990344 1850649 1764009 1680186 1508647 1555584 1523564 1501584 1570458 1511853 1528163 1610138
9464 1610138 1658533 1749968 1769710 1842661 1803816 1902719 1975751 2074566 2109442 2211334 2295737
9453 2295737 2504161 2561767 2636573 2743902 2935743 3130355 3449371 3578287 3785089 4109474
9443 4109474 4403237 4848199 5311999 5893731 6380324 6954372 7511364 8047923 8527767 8811600
9433 8811600 9076026 9144402 9099242 8995024 8777541 8383881 8065995 7843369 7451201 7255380
9423 7255380 7064948 7054373 7105925 7134304 7301553 7646327 7879153 8401944 9027738 9728058
9413 9728058 10625619 11713659 12639561 13750631 14832496 15731459 16235704 16571813 16531305
9404 16531305 16182307 15445491 14576237 13556436 12451923 11509481 10655655 9790359 9013203
9395 9013203 8484774 7955185 7466124 7245809 7115502 6955609 6887125 7009177 7186728 7392318
9385 7392318 7744550 8076406 8431823 8780959 9087574 9173512 9194502 9100230 8987552 8493219
9375 8493219 7976693 7467954 6909863 6295619 5829744 5269678 4735524 4384848 4076320 3789290
9365 3789290 3516507 3269947 3096598 2904160 2634056 2397350 2340234 2164884 2100590 2025707
9355 2025707 1941387 1854891 1972559 1829672 1738770 1692650 1588374 1518851 1509342 1405657 1379849
9344 1379849 1368581 1280490 1264221 1181290 1133536 1201073 1232418 1174556 1095033 1126613 1167726
9333 1167726 1186848 1169937 1060245 1038310 1026682 1014682 934573 923321 908863 1003615 964641
9322 964641 1056548 1025989 956436 947964 1002029 919758 827701 872549 948224 854649 852707 877037
9310 877037 829314 839576 930138 879184 822010 708344 698546 731060 683674 702735 783637 655908
9298 655908 647310 718525 719231 662079 695090 693367 605813 576924 634920 638373 684391 637530 492395
9285 492395 552583 581738 641254 609380 449398 563445 625929 578265 602395 619143 566131
9274 566131 556843 621376 602800 556982 505838 529475 457716 503829 541820 580525 596091 507320
9262 507320 566873 476634 420758 566634 599040 548459 511935 568193 522741 657779 588440
9251 588440 592752 533415 572863 661366 631591 668899 617421 559637 541267 475784 573729 629722
9239 629722 543407 446757 502277 493276 568778 580750 575086 585557 489275 504949 473313 463728
9227 463728 510113 456567 489561 510955 528904 535350 513810 543348 477700 554172 540673 507799
9215 507799 442002 593719 609521 544060 482831 527482 624920 565979 602719 683763 594302
9204 594302 596799 650647 607451 539910 608560 651810 691717 682071 769922 630477 638373 731729
9192 731729 766716 857687 785427 721883 748379 843911 812593 819916 722366 736593 864774 843040
9180 843040 885187 922063 1058551 1026146 1049413 1107460 1082496 1233006 1256563 1343448 1449386
9169 1449386 1494290 1500084 1633303 1531137 1610804 1672333 1602802 1649518 1805656 1974381 2207788
9158 2207788 2476734 2820552 3251968 3803289 4260660 4854035 5413632 5757344 6009050 6104488
9148 6104488 5937055 5809688 5383286 4827025 4362844 3871335 3338350 2897702 2473800 2158483
9138 2158483 1880919 1733764 1531482 1348358 1332869 1238173 1197795 1163442 1083442 1059539 1098871
9127 1098871 982027 944208 884453 777655 840366 884924 859674 880916 810434 786907 796943
9116 796943 973578 805090 866767 842126 857072 829864 786054 793548 831346 849211 764306
9105 764306 830979 778097 735021 793914 726975 802294 754208 854642 784602 808876 884593
9094 884593 836663 851392 901031 836201 752986 827255 843720 821405 788957 793481 791946 741223
9082 741223 821599 754119 751858 785273 677725 816728 750497 666738 779244 758250 714403
9071 714403 810050 767931 761201 895131 1034574 928459 915608 908890 860147 818058 928605
9060 928605 832692 880271 978006 939131 912561 873338 865362 844942 930951 871538 863365 965197
9048 965197 892032 925811 1007594 870971 861281 997500 904072 972801 1020257 936329 912180
9037 912180 1013620 936049 1014512 1082101 970115 1082648 1065869 1099166 1122249 1158783 1105223
9026 1105223 1122077 1263874 1170462 1134425 1206970 1177794 1035631 1047724 1002281 977898 1103569
9015 1103569 1128064 1188981 1133068 1188973 1137436 1063141 1165394 1071992 1070501 1048998 1088982
9004 1088982 1155381 1138977 1035847 1085231 1057264 1091353 1223869 1179018 1234209 1198877 1186742
8993 1186742 1220913 1216410 1267560 1245798 1272092 1281322 1293278 1289909 1351325 1350398 1355322 1468719
8981 1468719 1408786 1436998 1444658 1450833 1479574 1477669 1518216 1483912 1532865 1448935 1420058 1533893
8969 1533893 1458313 1413095 1522731 1635739 1614092 1674061 1576593 1623452 1712653 1688019 1730314
8958 1730314 1619199 1670123 1732637 1757795 1729225 1681254 1716025 1645521 1692376 1770851 1813749
8947 1813749 1749434 1880548 1781628 1819986 1829932 1786798 1779619 1819592 1950577 1938360 1977369
8936 1977369 2011829 1938148 1971862 1925885 1892639 1971770 2056948 2029865 2134405 2076509 2023428
8925 2023428 2131864 2016390 2051451 2123537 2054622 2058273 2137471 2107062 2224211 2243434 2228897
8914 2228897 2180680 2146493 2227180 2153385 2329335 2340158 2345704 2431885 2310071 2352531 2334401
8903 2334401 2448486 2428939 2475792 2456698 2529238 2513106 2460254 2477159 2510300 2579446 2476990
8892 2476990 2525800 2586317 2597141 2635824 2619735 2568313 2617775 2665386 2683897 2748397 2751593 2686608
8880 2686608 2665641 2725629 2732330 2793093 2799037 2771379 2862308 2936578 2815128 2872381 2825199 2790203
8868 2790203 2819338 2793678 2871054 2876146 2971570 3010815 3019713 2971163 2983650 3062708 3086586 3045014
8856 3045014 3065956 3144209 3115712 3161809 3251934 3229612 3292418 3303158 3274222 3313115 3428858
8845 3428858 3500346 3423163 3468362 3515070 3497881 3543993 3438390 3493738 3661036 3640605 3768857
8834 3768857 3829715 3829077 3702292 3768851 3794840 3840569 3947339 3937997 3952531 3947064 4003898 3973533
8822 3973533 4006251 3968758 3950704 4147670 4170785 4216358 4157068 4292556 4200721 4155910 4265376
8811 4265376 4261228 4377724 4383186 4422030 4438160 4563362 4546078 4604557 4628204 4603289 4621090
8800 4621090 4640076 4665952 4701737 4863916 4771876 4744346 4851755 4858809 4923127 4991774 4965452
8789 4965452 4974325 5068808 4994232 5047367 5163878 5198605 5151056 5199641 5236906 5322044 5526981
8778 5526981 5471389 5505087 5617495 5551986 5623177 5740629 5812568 5764810 5885452 5841216 5751300
8767 5751300 5829955 5845937 5787140 5972228 5974351 5971072 6067998 6094808 6050802 6166115 6149910
8756 6149910 6201769 6261546 6270652 6393817 6359921 6386201 6435179 6492897 6616393 6570363 6583346
8745 6583346 6684737 6669760 6743937 6779732 6705539 6817581 6927167 6936651 6942387 7078058 7196046
8734 7196046 7355006 7666516 7825831 7982337 8090997 8200773 8170920 8171992 7962707 7790879
8724 7790879 7666935 7445155 7448569 7331955 7239791 7195791 7210233 7366560 7252734 7373404
8714 7373404 7258336 7181695 7242161 7312612 7256009 7291540 7335297 7280155 7375894 7362406 7351705
8703 7351705 7380625 7401776 7381815 7433497 7492130 7319980 7483971 7509310 7426188 7470024 7569185
8692 7569185 7593956 7646463 7737085 7726908 7786827 7825606 8003184 8185552 8383434 8583710 8841316
8681 8841316 8838834 8761847 8748433 8628491 8373098 8213487 8007564 7829694 7734527 7665489 7568545
8670 7568545 7581572 7608360 7607377 7578011 7488679 7498552 7396921 7411288 7430894 7509903 7659413 7649124
8658 7649124 7810724 8021901 8223756 8535507 8681554 8721965 8748394 8638700 8347763 8034478
8648 8034478 7794280 7615581 7460273 7259103 7104552 6996158 6889232 6851107 6803420 6691431
8638 6691431 6670180 6677593 6543901 6611335 6617717 6539016 6521048 6470366 6458453 6483224 6476554 6427691
8626 6427691 6335073 6268639 6303080 6294202 6330955 6232351 6212986 6226988 6164224 6176432 6157627 6120042
8614 6120042 6161548 6198190 6236910 6348133 6488607 6688163 6916077 7201612 7387358 7358358
8604 7358358 7398678 7344356 7087548 6831546 6488127 6264171 6043934 5897752 5791632 5675730
8594 5675730 5531574 5395787 5472827 5347285 5181135 5096004 5183600 5087277 5067258 5092935 5048479
8583 5048479 4990171 4985910 5058678 4815914 4690138 4737849 4704953 4723098 4629476 4564507 4468553
8572 4468553 4440330 4495275 4504971 4484609 4558814 4629174 4453412 4373834 4379412 4276138 4219574
8561 4219574 4275777 4264207 4230019 4300634 4161153 4060918 4162129 4095902 4117309 4144275 4030084
8550 4030084 4063239 4027815 3970150 4052610 3988329 3910203 3886204 3994202 3974743 3891596 3919686
8539 3919686 3838558 3807404 3941311 3873062 3735164 3731631 3691559 3774682 3846580 3800713 3839954
8528 3839954 3780871 3818489 3920056 3941825 4075606 4347190 4818647 5210677 5747280 6544447
8518 6544447 6918648 6986113 6909321 6390998 5806188 5275500 4803489 4468040 4103201 3840482
8508 3840482 3584250 3438595 3319569 3272984 3307957 3180675 3102474 3107845 2942748 2932615 2913598
8497 2913598 2920695 2890251 2952432 2904306 2876439 2912093 2794883 2722897 2667385 2777319 2676737
8486 2676737 2675076 2687518 2679211 2696153 2583085 2584427 2599506 2572947 2503599 2572275 2548743 2524679
8474 2524679 2590834 2550398 2439152 2362976 2483855 2439087 2435477 2424822 2405158 2324137 2303808
8463 2303808 2253759 2316163 2464573 2385131 2249969 2192575 2301838 2341206 2261697 2142339 2033437
8452 2033437 2169117 2122831 2096812 2134823 2097495 2123586 2173285 2114820 1874209 1990897 1970569
8441 1970569 1878159 2015832 2004917 1998124 1957470 1949699 1920404 1988321 1900694 1847652 1965049
8430 1965049 1776380 1885473 1859232 1850275 1798787 1847146 1853407 1719142 1833334 1793404 1786518
8419 1786518 1824572 1831646 1815100 1771860 1770852 1718428 1691738 1638701 1753608 1691421 1722219 1735504
8407 1735504 1673666 1671591 1574151 1689703 1635490 1669258 1635612 1543343 1444200 1524354 1626571
8396 1626571 1543626 1615182 1595004 1644128 1579698 1602962 1635542 1478343 1459795 1446884 1528297
8385 1528297 1411308 1510404 1479029 1440184 1478252 1414096 1517013 1344105 1455102 1416064 1453030
8374 1453030 1401526 1367799 1436452 1288538 1397191 1224715 1307226 1233036 1290164 1313210 1291379
8363 1291379 1344313 1298391 1302909 1255607 1340200 1312265 1279498 1338481 1367227 1351889 1226275
8352 1226275 1374612 1299471 1320601 1328732 1242965 1268966 1278780 1404745 1297473 1344860 1330831
8341 1330831 1367068 1268389 1122352 1237333 1333173 1374012 1253349 1216793 1216813 1136888 1279009
8330 1279009 1218348 1261439 1216460 1288989 1277935 1308077 1323559 1169923 1282973 1339988 1415468
8319 1415468 1427139 1478521 1450861 1513122 1541599 1357153 1398377 1230981 1443307 1410543 1438925
8308 1438925 1374332 1307191 1431118 1288501 1400755 1378284 1388364 1342928 1456461 1406728 1392737
8297 1392737 1427609 1458846 1501102 1359289 1542503 1423806 1304840 1355643 1292373 1292988 1138873
8286 1138873 1271046 1192608 1169383 1096992 1189924 1069183 1102119 1123458 1010360 1100811 1032583
8275 1032583 1132348 999382 1007553 1108944 1000921 1027475 990240 964861 912587 996028 1013649
8264 1013649 909921 960666 974921 1003921 946847 994824 922860 945351 983209 930622 1058079
8253 1058079 940711 1052197 1098841 946755 892854 847051 922677 983253 1115132 1035792 930891
8242 930891 826893 823069 945832 868256 863309 787068 885666 902009 869356 869579 751412 885748
8230 885748 877135 872357 803189 904625 898961 947918 924995 899713 916906 948463 944627 908143
8218 908143 940921 908968 890224 808012 711443 890387 839273 903390 886944 915291 837755
8207 837755 886274 999997 995642 960802 874604 992329 1016337 1067894 1103023 1096140 1113521 1192954
8195 1192954 1336897 1171464 1654986 2320331 1446713 1158438 1166672 1159385 1058524 1101134
8185 1101134 1078855 1151253 963275 921520 1003435 982309 998762 1001520 959953 905411 1122121
8174 1122121 1041305 859911 779351 848796 870605 967443 899216 841126 863582 938326 929438
8163 929438 841291 877422 926018 1026288 963842 911352 1003949 932126 880746 1005977 1080916
8152 1080916 1015960 1171523 1162606 1175591 1336158 1583587 1716625 2032162 2356648 2651703
8142 2651703 2891783 2984434 2941860 2840566 2582309 2462350 2534181 2395215 2512607 2744582
8132 2744582 2841846 3027178 3250387 3266191 2958092 2797262 2507719 2185010 2111185 1854133
8122 1854133 1619107 1529374 1534937 1387615 1332965 1217454 1223759 1232968 1155716 1109779 1140125
8111 1140125 1181127 1135698 1177027 1076184 965027 1001325 1091451 1075324 1008842 951477 870262
8100 870262 994398 1004168 1001067 827035 916365 1005385 973880 938779 851512 854014 803962 884862
8088 884862 897153 921618 915594 968131 1049430 941866 902963 912361 1044989 996544 1098203
8077 1098203 1150707 1056240 1041038 1152425 1147196 1187978 1476044 1562526 1841446 2094183 2340980
8066 2340980 2510812 2583937 2673956 2592461 2491107 2406521 2376831 2343350 2272739 2392784 2625561
8055 2625561 2785909 2913019 2960150 2704255 2600327 2532063 2326278 2076560 2008422 1880938
8045 1880938 1747299 1589044 1456611 1346500 1249190 1212372 1168198 1075419 1052218 1085756 1037444
8034 1037444 952878 880940 897314 855348 844838 921182 806904 807711 781482 845613 839604 853936
8022 853936 851263 778715 760800 727772 835386 705257 728881 776689 782396 731324 828804 874472
8010 874472 833641 869059 815749 746229 809632 885939 967377 917156 860330 985489 978634 820155
7998 820155 924609 1024994 998054 1044770 1195459 1102963 1069194 1164616 1114801 1109109 1078621
7987 1078621 1067117 1084148 1222617 1178440 1326201 1350231 1243182 1376153 1400311 1431459 1444633
7976 1444633 1577966 1508641 1576460 1767355 1704681 1782525 1951288 2141757 2108717 2338305
7966 2338305 2417309 2587844 2901236 3134131 3511985 3976961 4501260 5344291 6213767 7064745
7956 7064745 8113010 9208472 10265687 11620142 13217095 14935475 16487354 17739411
7948 17739411 18317821 18607772 18837031 18938688 19162028 19157401 18706784 17758124 16385251 14891978
7938 14891978 13577171 12217662 10979166 9709821 8417246 7105132 6111552 5386500
7930 5386500 4716886 4070224 3594498 3218129 2845152 2588555 2382428 2125832 2017953 1983582
7920 1983582 1945536 1813680 1662282 1542090 1560665 1425236 1418308 1328542 1355341 1273467 1312405
7909 1312405 1219694 1078290 1170201 1170541 1141542 1193336 1231490 982478 937715 996376 892560
7898 892560 902393 937039 949294 865846 993447 911968 906812 861279 764891 853310 883292 835911
7886 835911 802836 925799 781273 929489 996267 829912 782038 868948 818291 720774 777245
7875 777245 654903 642968 789677 688710 640692 709235 713837 636949 737177 625898 737189
7864 737189 676830 584529 633353 679539 625949 583887 641047 530867 544501 741606 640987
7853 640987 495625 515919 489587 479213 603059 554394 547327 703162 668424 729533 664781
7842 664781 642208 711856 686056 640011 605410 739703 681896 645365 675323 627611 602748
7831 602748 691917 791105 793299 987441 995227 1025462 1025944 1111800 1273599 1256915 1382137 1545355
7819 1545355 1692796 1739784 1716262 1751053 1739259 1750144 1746331 1720980 1557526 1574164 1468940
7808 1468940 1287115 1257958 1298261 1157418 1080338 1103511 910959 854702 830369 855211 788955
7797 788955 808363 909767 927840 903783 888694 1010603 1153207 1214740 1278931 1345628 1421717
7786 1421717 1538591 1659605 1621024 1639190 1616881 1699563 1643441 1764792 1784947 1652600 1617788
7775 1617788 1578140 1520835 1450765 1353434 1240452 1269883 1179653 1075466 1103152 947655 909909
7764 909909 910568 802941 860048 819037 730702 610068 610423 518788 475074 546817 556142 590559
7752 590559 573161 494646 489558 509350 458094 567923 629779 573318 665120 664306 613077 610803
7740 610803 786648 800076 750710 871587 1051614 1052371 1061210 1008043 965622 895127 829578 787541
7728 787541 690863 609945 695116 709743 567318 553613 596318 678211 682074 624253 480902
7717 480902 429095 503762 492603 513670 560034 583225 572219 640907 604300 736423 743471 819069
7705 819069 949091 977738 970975 932922 914294 778986 901226 999552 929433 983803 1085458
7694 1085458 994292 886545 867387 810510 875310 748942 761564 872968 809641 752746 693470
7683 693470 645031 658449 772928 792265 702488 617676 696346 655657 693741 756930 750611 694785
7671 694785 770631 809088 700394 727896 674923 704451 764680 850826 870804 899737 1139638
7660 1139638 1289998 1309644 1225791 1327775 1600585 1678861 1673696 1769094 1742492 1746384 1871305
7649 1871305 1913283 1764335 1817456 1899059 1852259 1711061 1663095 1492568 1466747 1382501 1237323
7638 1237323 1230291 1102259 922414 946789 898206 876151 827623 854213 679527 701097 720750
7627 720750 562209 644936 628528 616727 623834 647559 604206 596527 577594 463287 471137 554799
7615 554799 582220 543811 549090 525216 679162 704590 525531 527958 619286 678687 626565 708851
7603 708851 590023 535127 575818 488537 361892 388156 393558 421776 473745 388338 366257
7592 366257 422088 322132 304564 443067 465145 318234 447028 306632 238331 361636 298799
7581 298799 287621 382108 505846 442638 541599 522060 477642 553291 559612 639736 641402 705576
7569 705576 776479 891597 933196 974236 980992 989934 985629 1097618 1068234 957354 1024468 1079406
7557 1079406 927648 939532 902323 755325 672821 693233 647305 570422 591968 570954 442976
7546 442976 458981 490451 483028 496575 408681 505449 392986 365435 356000 386840 488610 508419
7534 508419 412099 420180 380601 539464 559484 421179 483011 425734 367629 496024 477143
7523 477143 333764 401542 440479 418989 473608 448252 372550 327148 370995 333620 458760
7512 458760 377884 281958 449992 351018 360504 350387 379357 376997 436259 435599 352637 390875
7500 390875 372482 390432 367462 459933 500449 492159 546709 511249 555994 533930 434263 450422
7488 450422 465849 508386 492897 522449 440335 323753 455811 408830 491965 525424 570054
7477 570054 528786 623237 635897 560528 627949 519931 571694 578348 675793 846219 831863
7466 831863 999389 1137894 1201869 1152692 1162838 1136487 1136311 1086065 1090180 1212908 1067672
7455 1067672 993707 938055 857607 712419 772804 684740 604654 705703 692728 519499 533228
7444 533228 528876 551263 549613 587150 665932 787997 800514 763241 792200 790004 786106 911191
7432 911191 846487 878357 960356 1020513 989613 1039577 1012885 931410 898070 911944 862861 890658
7420 890658 923327 846619 948956 1003994 1050890 1060179 1030452 992999 1048609 1018298 1044445 1039069
7408 1039069 1155190 1202675 1272861 1377913 1379455 1549228 1707509 1577067 1514092 1528986 1473103
7397 1473103 1413100 1457298 1446331 1451108 1394148 1411224 1217283 1163540 1229754 1109149 1210551
7386 1210551 1222951 1150940 1336892 1370443 1425645 1612255 1723982 1842319 2057604 2202944
7376 2202944 2221444 2364690 2589384 2583496 2797930 2981835 2853473 2884685 2917273 2853570 2924281
7365 2924281 2873951 2869343 2963673 2928367 2867034 2760946 2770988 2703896 2673051 2761273 2669625
7354 2669625 2614867 2654772 2609073 2552009 2530335 2380952 2265268 2332888 2180231 1997438 1830756
7343 1830756 1754138 1720777 1715037 1729347 1555567 1731925 1704272 1754976 1750530 1536644 1670742
7332 1670742 1677252 1612428 1567626 1715344 1759085 1799965 1867700 1892741 1923739 1919330 2076867
7321 2076867 2017712 2136408 2291610 2355343 2341527 2309887 2452359 2548413 2692122 2918346
7311 2918346 3268945 3474406 3741048 4095197 4413322 4646878 4861744 5202113 5553633 6219259
7301 6219259 6829713 7554177 8649928 10094530 12156423 15365373 20521028 27368970 35929592
7292 35929592 45552671 51860949 53448023 51977506 47196290 41414419 36002237 32416090
7284 32416090 30132892 27832292 25389814 23430273 21490603 19264258 16848633 14712433
7276 14712433 12634036 10688569 9379510 8104333 7285890 6804205 6477978 6391172 6522944
7267 6522944 6673411 6809117 6966224 7026798 7295487 7421477 7502453 7492360 7395350 7294726
7257 7294726 6883995 6768582 6346648 6089451 5752974 5250484 4745837 4261563 3819366 3467322
7247 3467322 3197658 2847575 2642909 2550812 2461020 2346093 2280093 2171877 2020600 2102354
7237 2102354 1955521 1971453 2036083 1851307 1811421 1864078 1914468 1811435 1881514 1914565 1884006
7226 1884006 1944260 1945352 1990905 2093441 2297060 2484976 2727238 2924989 3194377 3447716
7216 3447716 3280870 3246242 3057640 2921955 2671088 2632285 2720370 2778081 3019626 3079669
7206 3079669 3232139 3151352 3122648 2917229 2602680 2318536 2078310 2072172 1911681 1788589
7196 1788589 1563060 1500189 1556799 1439316 1460267 1391446 1525915 1504492 1512314 1546199 1606961
7185 1606961 1555904 1409135 1488789 1579951 1633607 1651674 1723312 1777171 1847003 1944259 1903751
7174 1903751 2144050 2285616 2460106 2629658 2877038 3282217 3689687 4327347 5171171 6162520
7164 6162520 7175364 8282002 9309740 10073482 10745576 11187719 11428869 11327796 11171959
7155 11171959 10571309 9595697 8748493 7720837 6692923 5744554 4991499 4206393 3635893
7146 3635893 3254533 2896640 2643433 2435275 2193677 2007746 1897691 1732560 1695013 1650620
7136 1650620 1529310 1652569 1617768 1597768 1528848 1419779 1342909 1261307 1283213 1200530 1150078
7125 1150078 1183764 1214921 1204531 1019534 981395 976465 944454 870568 929805 893932 987235
7114 987235 1032960 997648 1040119 940337 1031160 1100713 994443 1117394 1187457 1246884 1380331
7103 1380331 1588821 1578608 1685661 1764354 1946821 2064574 2285628 2438865 2460621 2743757
7093 2743757 2831770 2818292 2856091 2800454 2728072 2640176 2300132 2075705 1970244 1738982 1639723
7082 1639723 1603536 1406221 1324609 1552834 1590098 1510855 1605486 1533357 1443620 1463386 1444693
7071 1444693 1471078 1531575 1496053 1440200 1306063 1195449 1108652 1093682 951982 920681 792277
7060 792277 669915 704708 836976 765120 676985 760419 789667 771496 819262 808947 841291
7049 841291 989487 1217212 1215892 1359967 1497150 1543486 1452578 1379724 1282127 1203043 1075362
7038 1075362 941559 950910 763191 623696 570448 659082 630784 571876 643408 613239 595191
7027 595191 529817 610360 687838 687675 684377 677732 716980 679086 630672 602195 690035 649864
7015 649864 562353 669584 712762 745769 729430 670022 861938 831882 740689 811892 883821
7004 883821 890402 908063 895884 819489 910243 957394 914049 897482 898351 948432 1003861 1040722
6992 1040722 968869 1034087 1000983 1101812 1251495 1230565 1332583 1501592 1715191 1707201 1741570
6981 1741570 1793898 1660042 1677855 1753383 1718477 1757353 1922270 2222078 2504798 2867942
6971 2867942 3286690 3850278 4447427 5070945 5825295 6557038 7265145 7781940 8167291 8079204
6961 8079204 7586033 6878238 5923161 5120140 4349692 3687953 3151629 2697054 2422159 2120810
6951 2120810 1971274 1970364 1992907 1910821 1957889 1969331 1776719 1748625 1698428 1641938 1716973
6940 1716973 1856075 1977653 2288404 2491293 2497781 2744899 2748084 2661042 2573095 2247898 2091258
6929 2091258 1960323 1759808 1558465 1372392 1327187 1179537 1087353 966083 839609 843716
6919 843716 894354 795058 769294 712529 618686 636396 615596 546973 611341 565611 640873 665263
6907 665263 595365 546908 545112 577623 429718 487112 609094 446277 530023 608558 523079
6896 523079 451353 502282 525271 532455 479003 485698 531025 435974 480486 440099 446891 580912
6884 580912 748978 777436 745049 851207 926350 869128 834806 774446 701071 587263 671288
6873 671288 689752 538174 518252 592089 450006 358863 382014 291991 294409 467852 431362
6862 431362 485997 412089 452866 526481 556920 492488 505055 464901 498709 645855 654329 559388
6850 559388 500831 561653 437461 444364 492915 404372 390686 438484 426115 350939 403357 318150
6838 318150 364427 348804 277103 314598 345634 333472 309745 385204 253333 307470 396367
6827 396367 295044 322468 377481 332229 260598 340856 278501 217512 290146 192279 245054
6816 245054 106276 216321 304547 173276 186795 162517 183467 244024 278700 231831 193942
6805 193942 245123 280958 298791 118931 199889 193991 245928 343137 281595 317158 214082
6794 214082 327258 327516 316040 358459 304582 345893 319024 391609 342333 270420 230133 338868
6782 338868 385223 345259 414345 309694 357035 355469 347757 333558 291287 341080 327555 259603
6770 259603 388591 445632 280964 305350 314166 325321 425026 430318 353012 337145 448537
6759 448537 510298 695757 731136 738523 841136 860886 821692 868332 844306 791149 974505
6748 974505 919525 793822 724573 684247 686039 618852 509419 407844 376167 460781 447875
6737 447875 421545 390819 489263 444354 471898 436009 563328 726004 711774 794724 722809
6726 722809 818668 860841 959578 980111 943658 1093958 988717 881072 784909 774883 717738
6715 717738 557481 559402 551198 477770 421613 409247 322424 347715 476163 401572 449295 372905
6703 372905 456217 393797 356106 381479 391985 397297 230622 401772 389650 402917 493382
6692 493382 481647 383000 413206 448368 434302 462005 421680 465363 464032 328168 371267 408908
6680 408908 509818 560603 620175 565548 613389 659370 629337 697750 669725 642533 654935
6669 654935 736964 763307 650946 574556 539101 540452 508597 619699 553138 539705 491560
6658 491560 520204 571825 466489 511910 535275 461906 410362 370376 445323 367413 384434
6647 384434 429341 388390 313334 289889 290357 279540 310394 325791 373557 350316 369446 336669
6635 336669 232412 333120 371719 369848 402088 437317 357551 394948 407659 350709 444883
6624 444883 438915 492021 455169 437638 471834 542264 458997 459876 491604 481816 451113 459607 468011
6611 468011 439018 426894 458055 437295 406880 396260 416242 400976 452671 453648 466762 410626
6599 410626 481019 452321 476854 453254 417431 434863 461126 490152 446213 398118 449873 487300
6587 487300 484326 394356 466033 444032 439742 498402 480467 491237 479307 626656 538729 465902
6575 465902 532684 455782 453333 481121 431292 463947 477654 390588 424602 448962 455964 438001
6563 438001 448218 451166 458151 492808 392086 388991 529886 523456 485521 589560 524565 525255
6551 525255 501181 473868 409135 456302 425992 421298 427453 437805 344943 271395 342785 423822
6539 423822 447566 374159 348376 392151 337299 295157 374231 365585 372223 407607 420813 298775
6527 298775 329662 403835 382756 434449 501436 443088 369614 289058 256346 344000 387076 357872
6515 357872 381160 355958 249800 365533 394512 300117 257649 295495 214149 213068 349583
6504 349583 327108 204465 228625 321172 205158 340796 247565 268304 326718 303129 276466
6493 276466 199750 226065 114951 349318 280979 253275 268493 194662 201238 259232 245838
6482 245838 78960 291055 276101 179709 300254 297715 316871 281583 311813 181259 278413
6471 278413 278379 207200 273012 200977 204356 207746 224544 207349 244825 360161 258918 309696
6459 309696 353605 276197 284396 324334 284863 207470 267170 266562 378035 351890 224195 188127
6447 188127 182504 230796 207474 250946 238342 331094 357549 256856 239614 270131 270369 286492
6435 286492 356810 308159 289884 279098 402474 320030 287522 338412 273533 365795 400510
6424 400510 310498 313687 327725 295930 248705 296514 185047 261993 220357 279818 293241 194548
6412 194548 187168 221513 282153 149102 293902 328051 260654 296385 381478 292105 271453
6401 271453 299071 214298 269507 282149 351872 367060 333852 429207 419141 433299 411998 444855
6389 444855 561887 509146 502302 456330 403188 330222 384130 291609 295570 459739 452928 447909
6377 447909 364581 463834 510615 527495 488490 597754 635332 628906 625540 647267 615055 664728
6365 664728 727933 667006 733571 744906 729311 746084 628952 600477 529564 525999 685056
6354 685056 621196 594413 703408 621876 500725 649325 497375 431048 473905 418529 411078
6343 411078 368821 475925 509461 453720 471907 447556 568353 500906 458133 531115 492275
6332 492275 458139 590074 504607 429422 565655 585967 506421 486193 515664 591658 639020
6321 639020 759146 721856 831485 832582 827762 920309 916220 727352 739567 739709 629250 648242
6309 648242 560254 533329 646012 760357 599729 682335 641526 510361 564726 632498 534262
6298 534262 587294 780731 678825 727809 757794 801901 933118 879137 926092 931172 906049
6287 906049 816482 946063 918425 842309 754930 899383 900073 850474 984768 963588 977598
6276 977598 1022039 1066678 1014274 1086343 1118657 996918 1062070 1061721 1120158 1122675 1167481 1189378
6264 1189378 1175431 1236708 1174285 1304906 1361735 1327150 1444235 1518596 1624237 1696009 1815997
6253 1815997 1800622 1969853 2258695 2404189 2641089 3014637 3389829 3637077 4008990 4077052
6243 4077052 4216750 4304564 4202320 4243903 4180131 4166666 4238666 4338812 4264825 4350908 4440089
6232 4440089 4385084 4397785 4253974 3978709 3635226 3367183 3082114 2808102 2622456 2327449
6222 2327449 2358803 2189830 2007462 1930783 1919625 1840200 1763633 1784470 1690705 1685290 1683430
6211 1683430 1695296 1580336 1667661 1613326 1701360 1739989 1534895 1554216 1595502 1566158 1442716
6200 1442716 1406405 1361367 1341963 1375535 1223423 1179600 1123461 1233624 1267717 1373945 1346074
6189 1346074 1319505 1478392 1436512 1537155 1522917 1558610 1511624 1549953 1615417 1609830 1621088
6178 1621088 1553255 1766641 1764987 1836807 1750313 1737936 1795341 1762152 1767885 1592247 1610050
6167 1610050 1506611 1498314 1464686 1251537 1326762 1315512 1295257 1234987 1209396 1221008 1408260
6156 1408260 1430126 1331627 1399220 1446912 1575496 1703655 1739230 1793813 1806689 1960744 1975303
6145 1975303 1999003 2012721 2001557 2033933 2036410 2066693 2140282 2180988 2183814 2172857 2081131 2032779
6133 2032779 1944246 1883555 1934543 1750772 1785929 1667758 1691499 1734394 1750393 1874323 1905737
6122 1905737 1966604 1967750 2163521 2134057 2311110 2372461 2560795 2603041 2385650 2459141 2573679
6111 2573679 2597379 2715104 2935203 3115056 3292821 3565489 3737664 3932333 4048653 4114642
6101 4114642 4035024 3952503 3643157 3530985 3433863 3267365 3173307 3122989 3068908 3169516 3247647
6090 3247647 3264754 3331246 3423266 3508286 3572527 3509771 3464472 3481644 3554689 3545405 3503394 3464858
6078 3464858 3451904 3436376 3570748 3712209 3821098 4029400 4121564 4098482 3844294 3626100
6068 3626100 3417403 3337139 3258030 3148893 2972057 2922468 2923776 2885316 2826815 2902381 2881187
6057 2881187 2887189 2985602 2947689 2917464 2941691 2927640 2934520 2943504 2889973 2977596 3125487 3137507
6045 3137507 3215992 3135363 3101179 3160684 3232995 3265866 3201812 3244275 3284321 3337795 3314136
6034 3314136 3290757 3433968 3495315 3587831 3693415 3817494 3996826 4193288 4433970 4481654
6024 4481654 4653594 4734232 4837283 4984133 5050113 5125628 5165212 5359351 5348015 5510927
6014 5510927 5584602 5621788 5674121 5635246 5655988 5746922 6067888 6188962 6445723 6648777 6679119
6003 6679119 6687762 6611209 6535598 6325420 6342187 6388447 6411301 6450995 6350113 6400471 6550884
5992 6550884 6865749 7024023 7212496 7539943 7660130 7923393 8068556 8253614 8358747 8428060
5982 8428060 8571648 8668962 8971093 9026995 9236701 9371373 9580241 9908232 10274715 10546707
5972 10546707 10997873 11517138 11845292 12372400 13033924 13743797 14552302 15506899 16543934
5963 16543934 17918724 19648616 21728453 24446650 27505255 30878045 34034176 36487408
5955 36487408 37852861 38246588 38004655 37316467 36885078 36952502 37669733 39055651 41166657
5946 41166657 43379018 45272294 46555670 46901546 46454182 45633896 44753683 44047675 43846832
5937 43846832 44054963 44959367 46850880 49567404 53468771 58574030 64554387 71105715
5929 71105715 78279912 85741819 94260716 104447290 116577555 130667224 145958934 160521846
5921 160521846 172191281 179270462 181470226 179291960 174711759 169451306 165699300 164547064
5913 164547064 166150035 169751439 173613874 175055492 172289672 165017195 153474113 139442217
5905 139442217 124608460 110179976 96953302 84977605 74650463 65878254 58762423
5898 58762423 53232435 48661803 44946697 41911166 39273778 36846492 34754945 32706862
5890 32706862 31030273 29364790 27823237 26442555 25235546 24131881 23237104 22400704
5882 22400704 21594862 20942559 20386512 19686192 19046809 18531989 18023009 17341437 16940553
5873 16940553 16515408 16153196 15689244 15281728 14906965 14604216 14285557 13833234 13446884
5864 13446884 13087073 12809978 12694922 12638871 12483969 12475930 12401111 12245930 12274589 12079168
5854 12079168 11949062 12003259 11974541 11935074 12016592 12076821 12079612 12147794 12219202 12232826 12182518
5843 12182518 12205954 12390657 12450562 12598571 12744284 13089276 13383752 13702178 14252222 14828611
5833 14828611 15518656 16284948 17069901 17693436 18499464 19296384 20004775 20505020 20891098
5824 20891098 20980132 20870388 20793651 20529918 20261360 20126935 20031030 19907091 19898391 20026773
5814 20026773 20098254 20330751 20482185 20997881 21448772 22005533 22755416 23714702 24707308 25867520
5804 25867520 27204322 28527247 29960116 31469545 32892233 34092374 35313549 36611012
5796 36611012 37507481 38304132 39049934 39723720 40461295 41428522 42666725 44275570 46408178
5787 46408178 48863367 51919391 55572502 60112649 65928594 73337337 83380086 97326224
5779 97326224 117331694 143799181 176564791 214337312 251748833 282223942 304546250
5772 304546250 318646256 322617102 314658596 296240316 271290579 239494836 205375479
5765 205375479 174065415 148879845 128486365 110858812 96737535 86486340 79428285
5758 79428285 74515721 70980942 68850375 67904196 68252562 69834064 72945837 77814023
5750 77814023 85188612 96165641 112469155 135937202 165934985 200438081 234552179
5743 234552179 257773176 264362143 256960005 236643728 209337004 181104683 156112900
5736 156112900 134365292 114037821 96407101 82698247 73050450 65869815 60141839
5729 60141839 55439656 51609732 48691716 46504235 44766160 43544630 43036326 43166942
5721 43166942 43765861 44807028 46044710 47368944 48400091 48877474 49271117 49722260 50483549
5712 50483549 51359427 52763660 53983816 54850070 55663295 56585648 58026358 60137518 63584521
5703 63584521 68993081 77099223 89602635 107124617 128762204 152396791 172807806
5696 172807806 183215787 183850446 175513053 160725442 143753595 127872486 115527882
5689 115527882 104947243 96416060 91058873 89474734 91295593 95945479 104133964 117182439
5681 117182439 137742326 167572559 205378169 248412273 288730930 312183621 315443659
5674 315443659 301021646 271239218 235135338 199247514 168787603 142216259 117673038
5667 117673038 97181692 81994393 71242264 63093726 56474566 50946065 46408428 42405477
5659 42405477 39242189 36548617 34093335 32215651 30660137 29340500 28130802 26976705
5651 26976705 26094008 25206013 24243691 23296988 22423268 21474544 20682834 19976308 19332332
5642 19332332 18665581 18147601 17797793 17472464 17347265 17072734 16803539 16688556 16513574
5633 16513574 16439398 16281063 16299585 16391094 16533351 16811456 17222815 17783020 18374681 18915315
5623 18915315 19337981 19717652 19736834 19822928 19783856 19482998 19364049 19096208 18622239 18101379
5613 18101379 17435567 16755632 15957042 15300657 14667031 14142140 13586405 13051541 12642655
5604 12642655 12211109 11733480 11436985 11202316 10884281 10858327 10591378 10328808 10173183 9878539
5594 9878539 9760478 9590487 9479586 9374654 9232222 9131878 9012993 8810679 8632579 8511752
5584 8511752 8427313 8208467 8015188 7918650 7624440 7391232 7342092 7148116 7010543 6945661
5574 6945661 6947321 6906171 6967792 7066457 7151892 7265406 7365717 7305188 7198420 7161525 7074721
5563 7074721 7000025 6704511 6559533 6478531 6154073 5970308 6066766 6037381 5966429 5970498 6029597
5552 6029597 5789702 5624253 5331770 5239363 4997097 4791417 4737550 4510775 4493095 4407176
5542 4407176 4426847 4331619 4322876 4291336 4145818 4248829 4248669 4312472 4292937 4283318 4194066 4114715
5530 4114715 4000727 3915816 3771320 3699675 3773820 3766469 3691976 3748580 3673949 3549824 3581641
5519 3581641 3485794 3449261 3368088 3321426 3251012 3216536 3026409 3007231 2990173 2827822 2875069
5508 2875069 2884130 2898507 2870237 2771446 2755212 2641061 2604576 2567803 2627164 2690386 2698970 2710879
5496 2710879 2702436 2849680 2896802 2999479 3031458 3029301 3048659 3038174 2966262 2976342 2870899
5485 2870899 2792859 2810074 2790453 2665764 2664371 2663090 2615573 2651642 2644591 2668945 2768260 2813596
5473 2813596 2798273 2669158 2615870 2575803 2813004 2810244 2802722 2823071 2809170 2820288 2803305
5462 2803305 2765008 2760793 2931534 2948053 2957911 2907354 2944159 2899796 2748406 2750103 2786992 2858296
5450 2858296 2879472 2840080 2977721 2859483 3006784 3123870 3157949 3330535 3580119 3727288
5440 3727288 3886615 4154460 4231992 4277266 4426550 4504380 4594804 4571986 4635323 4425233 4379955
5429 4379955 4128581 3889446 3794323 3552639 3547962 3576781 3367588 3403741 3398333 3420874 3454205
5418 3454205 3694283 3836723 3928030 4133362 4376052 4512792 4715583 4974466 5143848 5362879
5408 5362879 5522384 5578934 5647061 5622151 5815696 6213424 6693342 7383636 8331505 9489425
5398 9489425 10601951 11575387 12275310 12522918 12323661 11797647 10806392 9837471 8747032
5389 8747032 7757857 6922379 6268233 5745179 5457649 5128299 4796518 4565539 4347224 4223210
5379 4223210 4035954 3886950 3839096 3774371 3943055 3721451 3706883 3583737 3456532 3438030
5369 3438030 3520900 3589524 3647988 3794487 3841926 3877200 3963937 4008508 3917216 3895982 3951855
5358 3951855 3866978 3968127 3781225 3684683 3770093 3709508 3885574 4029517 4055634 4270347
5348 4270347 4575879 4803646 5123755 5648281 6189930 6738780 7421591 8035639 8742525 9332976
5338 9332976 9655166 9696869 9659667 9116572 8544812 7857422 6988086 6398260 5923105 5408485
5328 5408485 5030778 4779283 4509782 4284289 4165643 3945462 3753864 3787675 3685748 3570421
5318 3570421 3573179 3496867 3424236 3316678 3338919 3263851 3204961 3174921 3183457 3312830 3111779
5307 3111779 2984585 3034168 2965085 2987248 3069800 2996411 2995892 3222046 3114786 3061210 3103672
5296 3103672 3062485 3161697 3219662 3419761 3335317 3348841 3343072 3393385 3368618 3403758 3535197
5285 3535197 3465815 3491142 3627805 3685236 3670518 3580280 3699739 3808987 3780833 3740459 3928253
5274 3928253 3857971 3762743 3865309 3779917 3787963 3816479 3777082 3890933 3987865 3984975 4009834
5263 4009834 4007837 3911827 3909138 3915687 3848944 3716076 3627173 3605133 3556557 3544198 3537095 3631377
5251 3631377 3539070 3463289 3502412 3610954 3515491 3522912 3544436 3604763 3464085 3473398 3399950
5240 3399950 3296724 3343818 3335396 3293352 3328719 3336257 3356843 3428944 3360999 3259155 3319544
5229 3319544 3212993 3158566 3176886 3130512 3133951 3177657 3097321 3104185 3073538 3051691 3042526 3192864
5217 3192864 3153152 3218184 3158243 3092809 3077714 3051694 3183360 3178653 3299053 3287875 3323112
5206 3323112 3272843 3237910 3182497 3217272 3250473 3217707 3302110 3264894 3280573 3156778 3156554 3160674
5194 3160674 3134740 3222286 3207216 3185081 3146951 3251807 3272425 3299515 3214134 3341771 3351423
5183 3351423 3254306 3304440 3325258 3319850 3314293 3354119 3385742 3419784 3488168 3499124 3522970 3401726
5171 3401726 3462289 3373506 3368902 3357949 3377454 3367661 3302540 3309914 3303230 3374928 3288421 3298076
5159 3298076 3424533 3332910 3310981 3171975 3202657 3296342 3253533 3220599 3266485 3297375 3122582
5148 3122582 3148924 3097736 3121679 3147201 3186451 3398148 3313244 3317990 3295738 3252026 3178245
5137 3178245 3291536 3359628 3247814 3332136 3370440 3294831 3289995 3304313 3275895 3289105 3259649
5126 3259649 3257597 3251568 3246433 3255015 3245624 3143672 3134804 3184547 3184861 3233245 3302921 3315908 3293515
5113 3293515 3286545 3290358 3226889 3287246 3336456 3327382 3261399 3178419 3187469 3167606 3171808 3163040 3253723
5100 3253723 3262717 3137390 3244316 3214262 3221358 3222377 3252923 3227337 3347192 3389911 3245836
5089 3245836 3351537 3274077 3397512 3423775 3413955 3463958 3494959 3567174 3470227 3570582 3502476
5078 3502476 3636935 3798974 3833534 3925148 3893787 4013696 4146730 4202618 4310938 4494522
5068 4494522 4671704 4911297 5196303 5427800 5840100 6033721 6211964 6252268 6231592 6145504
5058 6145504 5930485 5845153 5803938 5848415 5972568 6256395 6516850 6732879 6825367 6736163
5048 6736163 6416543 6070008 5821322 5443477 5272653 5063832 4938838 4825437 4608038 4558814
5038 4558814 4507083 4381141 4300373 4267470 4214197 4219916 4219661 4068559 4041636 4046546 4062379 4057407
5026 4057407 4151005 4139050 4021525 4072426 4099757 4199299 4283621 4404053 4464228 4450731 4435193
5015 4435193 4479143 4453676 4513729 4723402 4713139 4765855 4693776 4664448 4817444 4704717 4823381
5004 4823381 4830057 4785197 4918078 5122433 5142325 5161414 5226673 5364011 5544019 5708487 5799741
4993 5799741 5990410 6237327 6542597 6882010 7408236 7917473 8665228 9338720 9616580 9797088
4983 9797088 9841838 9608903 9346734 9164153 8987839 9148381 9415741 9692473 10027411 10464117
4973 10464117 10534927 10208093 9933846 9363606 8809066 8351529 7796116 7405607 7123501 6799277
4963 6799277 6684234 6656064 6376850 6303629 6261105 6138682 6102650 6176023 6094553 6059502 6121211
4952 6121211 6081096 6117458 6111360 5973881 5936212 5991482 5951616 5963681 6086070 5990392 6035181
4941 6035181 6025015 6058924 6053862 6082609 6085910 6128947 6317559 6236708 6259267 6377027 6531573
4930 6531573 6545275 6596326 6789808 6864357 7034449 7136553 7227239 7262234 7420603 7512503 7576512
4919 7576512 7701060 7802138 7914950 7939850 8019933 8175249 8368904 8321855 8513159 8660229
4909 8660229 8660694 8791381 9029328 9083413 9098635 9367758 9575961 9764712 9902674 10014015
4899 10014015 10084361 10214503 10323705 10238530 10343929 10415597 10407792 10469951 10422103 10416975 10443672
4888 10443672 10296497 10220414 10161817 10012165 9762283 9853470 9689129 9655939 9802205 9750066
4878 9750066 9765084 9903132 10023323 9913047 10112276 10079761 10069210 10120612 10120225 10155376 10251512
4867 10251512 10248769 10233389 10403052 10474057 10505317 10706402 10826260 10867531 10890499 11020302 10955108
4856 10955108 11012373 11157595 11279781 11405038 11495603 11623282 11727479 11858636 11964557 12121233
4846 12121233 12264174 12450371 12693468 12823844 12929599 13089691 13308995 13509005 13985804
4837 13985804 14393819 14958972 15678354 16464704 17328905 18082805 18820835 19283908 19541900
4828 19541900 19596916 19761996 19784192 19968641 20478977 21182857 22130126 23532414 25477023
4819 25477023 27789520 30115199 32583204 34432763 34924190 34504971 33519369 31966990 30315882
4810 30315882 29068987 28409991 27683091 27159669 26913474 26838534 27062922 27408683 27934625
4801 27934625 28461775 29104595 29933120 30700725 31621830 32609773 33668064 34708305 35817405
4792 35817405 36966359 38186277 39274191 40542286 42040560 43390567 44967154 46654171
4784 46654171 48446088 50379793 52621072 55143018 58196635 62111148 66739821 71725132
4776 71725132 77179733 82454870 86903278 90253748 92842679 95091730 97585692 101157402
4768 101157402 106864572 114501089 123751432 134156595 143360517 149018535 151161408 149889554
4760 149889554 146429959 142230760 138748048 136627602 135532446 135190760 135430754 135810880
4752 135810880 135370694 133653307 130807164 127015869 122896982 119189723 115720190 113011172
4744 113011172 111076481 109897335 109510497 109712301 110395404 111456029 113051604 115141869
4736 115141869 117626077 120452792 123670815 127163153 131128316 135574791 140151102 145067465
4728 145067465 149540697 153308547 156201366 158361181 159738950 161112721 162559807 164428522
4720 164428522 166780495 169617369 172827087 175079429 175805399 175197162 173454610 171140868
4712 171140868 168947815 167600774 167023830 167029378 167768853 169070155 170541735 171876250 172641299
4703 172641299 172950447 172934253 172849525 172978418 173077943 173243702 173346424 173361285 173435450 173469480
4693 173469480 173361710 173489013 173984424 174982240 176724051 179058074 181454727 183319312 183608932
4684 183608932 182245264 179184001 175272665 171052717 167285921 164214387 162038408 160926479
4676 160926479 160587438 160671959 160543349 159341058 156372412 151851503 146211511 139741557 133349010
4667 133349010 127412482 121842602 116687267 112076691 107900275 104068064 100503710 97007222
4659 97007222 93623751 90203412 86757800 83560052 80516214 77677678 75214233 72995322
4651 72995322 70915877 69262586 67708016 65939752 64249440 62620361 60881032 59291485
4643 59291485 58057950 57038611 56495355 56304136 56393751 56740377 57217746 57389193 57319865
4634 57319865 56651367 55801185 54956702 54047916 53209473 52776212 52609613 52688688 53127319 53861735
4624 53861735 54252381 54460118 54455454 54310953 54107453 53824708 53850691 53849035 54155628 54521718
4614 54521718 55152947 55851957 56398982 56895866 57224686 57416032 57295751 57069464 56608271
4605 56608271 56019389 55463792 54833919 54220391 53632733 53086803 52439697 51671841 50983051
4596 50983051 50411254 49853308 49725301 49712147 49691754 49792694 50007971 49955537 49780582 49623406
4586 49623406 49462090 49316473 49098525 48941854 48562037 48145276 47859376 47678815 47807032
4577 47807032 48141205 48985673 50113296 51311320 52634045 53493537 53729067 53781092 53731538
4568 53731538 53739191 54134816 55043264 56705645 58882148 61564635 64692152 67320884 69129510
4559 69129510 69832212 69569285 68751359 67618216 66731408 66094680 65736832 65863862 66471848
4550 66471848 67574696 69260741 70810519 72354653 74046600 75947434 78144716 80620381
4542 80620381 83465571 86164242 88411238 90073979 90753968 90112679 88376829 86078772
4534 86078772 83244250 80142552 77082858 74242507 71374594 68604564 65967145 63183119
4526 63183119 60559564 57855737 55447425 53338534 51312180 49847234 48661306 47604129
4518 47604129 46823338 46283801 45745593 45291458 44870660 44493155 43948697 43319321 42482690
4509 42482690 41341281 40372149 39063075 37738279 36585159 35246308 34014040 32914869
4501 32914869 31561196 30213004 28803116 27267777 25830071 24465217 23117132 21964231
4493 21964231 20943307 19987474 19046405 18440699 17813624 17137974 16708579 16176122 15853569
4484 15853569 15509724 15170361 14885754 14795551 14437919 14218961 14089017 13792779 13615634 13367109
4474 13367109 13250002 13008865 12976431 12944791 12757824 12819138 12734970 12710970 12656228 12699136 12803286
4463 12803286 12796224 12806859 12804881 12895520 12834321 12833743 12863057 12816717 12925705 13057129 13153808 13188903
4451 13188903 13367214 13427721 13493786 13601330 13688300 13842895 13855220 13963918 13956163 13959381 13960469
4440 13960469 14117148 14143891 14173394 14365023 14365674 14289456 14363397 14478219 14515417 14555009 14575149
4429 14575149 14708498 14723711 14905821 15241257 15220105 15355691 15490983 15621240 15719344 15849189
4419 15849189 16056775 16104670 16130762 16140673 16027716 15929992 15801277 15564404 15380835 15379147 15187114
4408 15187114 15157851 15029429 14870719 14833133 14680481 14684516 14484226 14324970 14083779 13915736
4398 13915736 13639893 13388002 13386586 13323129 13203521 13127561 13244187 13119674 13089326 13030045
4388 13030045 12896780 12869289 12734058 12768855 12699313 12443843 12442956 12369359 12237118 12246432 12225473
4377 12225473 12131051 12049026 12015346 11942830 12087788 12178847 12341225 12492551 12669041 12679988
4367 12679988 12763334 12810962 12679763 12764659 12701276 12710614 12719928 12687350 12666657 12712835 12832554
4356 12832554 12803400 12931232 13094209 13218644 13380068 13675379 13976007 14420977 14889806 15238008
4346 15238008 15695044 16197047 16604478 17044132 17395200 17675722 17919816 18153888 18152245 18181301
4336 18181301 18204816 18232382 18243231 18270870 18222781 18364293 18490416 18482891 18757536 18919238 19189542
4325 19189542 19512651 19783701 20015788 20274810 20457562 20476623 20575696 20502159 20449057 20406055
4315 20406055 20298757 20209880 20099580 20130903 20053604 19994831 19951884 19907599 19776641 19548212
4305 19548212 19379827 19002075 18585532 18435919 18080748 17895152 17693388 17632559 17398438 17322725
4295 17322725 17334460 17377464 17290683 17304337 17381802 17494609 17675965 17762789 18017916 18219765
4285 18219765 18490489 19055864 19603927 20249486 21122726 22414153 24179375 26532669 29877775
4276 29877775 34609676 41097876 48713787 56950315 64264613 69527958 72706644 74740511
4268 74740511 75971475 77160378 78334336 77646103 74369383 68757225 61477973 53877579
4260 53877579 46905714 41003288 35861162 31420438 27580301 24777024 22611380 21111718
4252 21111718 19869939 18901662 18034391 17284252 16693368 15961548 15520698 15024576 14626294
4243 14626294 14411236 14228946 14079106 13927197 13914708 13752094 13766085 13770237 13701992 13745321
4233 13745321 13697654 13850320 13899868 14027362 14048464 14225023 14426755 14641018 15007199 15335971
4223 15335971 15681007 15836104 15986264 16036094 15975184 16075402 15981057 16135423 16040422 15887419
4213 15887419 15644340 15454512 15185491 15064010 14985248 14895807 14864320 14854923 14946797 14967379 14870439
4202 14870439 14807322 14649028 14570298 14335698 14151445 14032599 13913143 13737856 13526055 13496064
4192 13496064 13238763 13015956 12805262 12684912 12400039 12417681 12286421 12191899 12186289 11898803
4182 11898803 11802763 11629337 11469693 11297009 11199653 11041101 10844302 10750720 10446046 10287366
4172 10287366 10173528 9964678 9683023 9595105 9275296 9091921 9020954 8810137 8592154 8510709
4162 8510709 8309588 8127071 7989330 8070571 7984208 8009039 8098006 8067120 8029167 8102231 8073976
4151 8073976 8120269 8266822 8340493 8539501 8581624 8761367 8993973 9087114 9131758 9160967 9122606
4140 9122606 8992706 8971353 8900127 8761262 8855536 8891031 8817184 8843906 8882185 8812780 8817758
4129 8817758 8938745 9149455 9300648 9381206 9734594 10223261 10892999 11704615 12158837 12618866
4119 12618866 12803390 13002459 13153005 13313426 13429186 13555716 13290081 12823675 12310658
4110 12310658 11692992 11057083 10626230 10273575 9966957 9814346 9600848 9479602 9634344
4101 9634344 9589742 9612376 9840395 9941358 10092891 10360787 10485091 10604168 10751562 10890116
4091 10890116 10925240 11082734 11195105 11197382 11512117 11587459 11745375 12147800 12400979 12700892
4081 12700892 13137491 13509042 13963003 14355194 14647415 14931680 15222695 15389244 15598091
4072 15598091 15830553 16054942 16185235 16551811 16851000 17006994 17283560 17616156 17772862
4063 17772862 18096444 18271268 18520050 18630842 18664815 18670360 18623058 18521159 18384411 18546726
4053 18546726 18533199 18735961 18921874 18998822 18996457 18996978 19093551 18988905 18921807 18681091 18463836
4042 18463836 18434770 18328213 18304369 18268742 18347421 18375500 18364510 18506198 18737597 18898753
4032 18898753 19127258 19441518 19736965 19929404 20083034 20375806 20626855 20950802 21372465
4023 21372465 21766559 22087386 22511905 23048887 23450593 23849812 24295969 24669932 25099474
4014 25099474 25551474 25958728 26371079 26971356 27587179 28156592 28891831 29714624 30484563
4005 30484563 31229781 31970491 32726026 33480374 34171447 34878512 35619869 36372884 37165898
3996 37165898 38015964 38639274 39450871 40299238 41202185 41930216 42900029 43730925 44547038
3987 44547038 45601657 46552638 47599335 48753370 49968491 51202094 52675315 53869334
3979 53869334 55234653 56569587 57732431 58927109 60057910 61258755 62471546 63938021
3971 63938021 65429174 67087101 69059158 71117324 73206761 75422520 77459197 79577951
3963 79577951 81706395 83655110 85866752 88014239 90306555 92780757 95403320 98174469
3955 98174469 101149261 104212833 107299330 110447301 113739626 116888871 120143830 123621483
3947 123621483 127092107 130821913 134864509 138996624 143435322 147809594 152140159 156193515
3939 156193515 159925952 163428574 166905742 170334768 173582018 176889484 179884427 182509727
3931 182509727 184631495 186608739 188279691 190018391 192056180 194105532 196320777 198644209
3923 198644209 201000095 203371661 205553913 207463478 209353292 211069225 212641390 214276087
3915 214276087 215695438 216903811 217699519 218321686 218316028 217962949 217190295 216039713 214601850
3906 214601850 213148344 211643175 210132461 208857879 207686447 206867512 206347920 206325920 206597797
3897 206597797 206944715 207193408 206986188 206389541 205315612 203846806 202299118 200736032 199222083
3888 199222083 197660993 196187005 194565014 192875564 190677379 188060759 185112028 181872783
3880 181872783 178259168 174451610 170828613 167234855 163864488 160787753 158068205 155767185
3872 155767185 153699938 151873003 149757242 147465716 144640540 141310262 137544049 133138252
3864 133138252 128699997 124338635 119905281 115747064 111834246 108188924 104896314 101988431
3856 101988431 99087270 96384639 93950035 91692548 89593888 87660179 85910152 84228718
3848 84228718 82908005 81431857 80037802 78649304 77224574 75818593 74295745 72603549
3840 72603549 70874376 69286918 67426836 65714871 64141284 62614127 61102910 59707674
3832 59707674 58338508 56781417 55529633 54078355 52725409 51476501 50241149 49192052
3824 49192052 48217880 47318681 46757280 46309331 45821345 45529620 45335022 45178917 44953516
3815 44953516 44691404 44495131 43920365 43341746 42501463 41702844 40900433 40097777 39303031
3806 39303031 38394361 37602982 36783874 36052656 35253808 34529154 33795441 33132425 32705535
3797 32705535 32184046 31830876 31353636 31019833 30692148 30146092 29718372 29131262 28404233
3788 28404233 27659821 27314669 26828004 26276471 25961326 25654296 25467341 25267632 25095464
3779 25095464 24795694 24383332 24222229 23877174 23477686 22981047 22597642 22145370 21831366
3770 21831366 21519465 21218772 20845195 20485445 20291724 19912370 19454542 19082259 18672813
3761 18672813 18276998 17962143 17641324 17236724 16958915 16691833 16418043 16094027 15802709
3752 15802709 15430679 15113245 14910082 14647951 14459969 14133523 13966356 13704693 13344416
3743 13344416 12964955 12746822 12444245 12037422 11855042 11472439 11114064 10780606 10486504
3734 10486504 10116492 9848912 9740639 9442670 9291769 9000908 8889895 8919954 8803390 8597796
3724 8597796 8447110 8299509 8195094 8195087 7999941 7759164 7613205 7541655 7384823 7142284 7048748
3713 7048748 6675924 6535488 6458562 6162645 6141425 6079191 5890593 5710937 5516433 5439716
3703 5439716 5424557 5377408 5241991 5228008 5159262 5002118 4912171 4908077 4796847 4632033 4692822
3692 4692822 4597875 4612791 4607890 4446382 4330407 4252930 4203578 4185952 4195414 4231157 4248947
3681 4248947 4227917 4191876 4206378 4149980 4087878 4000035 4004812 3881915 3765091 3897064 3811902
3670 3811902 3664638 3712958 3687354 3520471 3570499 3545486 3500010 3468563 3454479 3430780 3392907
3659 3392907 3354905 3177918 3159837 3262835 3283687 3267932 3245408 3169621 3171193 3186087 2986727
3648 2986727 3024815 3043655 2986485 3047151 3053873 2883756 2905531 3065308 2947907 2864889 2881288
3637 2881288 2830052 2874513 3008596 2943386 2906072 2920269 2829983 2737097 2732667 2626728 2744287
3626 2744287 2729906 2761262 2744271 2654212 2628259 2525687 2548645 2518093 2501422 2626886 2695484
3615 2695484 2596313 2640841 2583096 2444590 2527300 2504782 2581656 2505332 2493661 2477529 2373253
3604 2373253 2457568 2389533 2430721 2387071 2397272 2464359 2472603 2384071 2423752 2460044 2221600
3593 2221600 2261216 2264598 2329744 2296992 2269678 2289908 2165510 2277079 2254293 2288015 2307579
3582 2307579 2335080 2366107 2411964 2301322 2271327 2342965 2253143 2419078 2499105 2394798 2341260
3571 2341260 2399209 2487752 2479163 2508799 2377420 2249754 2253423 2139148 2078116 2053612 2118717
3560 2118717 2121825 2128469 2032614 1996711 1951040 1915265 2039986 2059562 2134945 2167019 2353842
3549 2353842 2362611 2356466 2528028 2583724 2656888 2758435 2948325 3035421 3169510 3376777 3366826
3538 3366826 3345196 3250600 3120206 3044795 2875001 2713693 2537202 2414702 2341233 2234884
3528 2234884 2098211 2047689 2033883 2072849 2053617 1973939 2065454 1952917 2033315 2127722 2058549
3517 2058549 2088261 2216914 2431464 2528204 2553016 2604186 2680970 2817106 2999418 3052297 3193162
3506 3193162 3247668 3307718 3275357 3046805 2886958 2700420 2472634 2315586 2260236 2142387
3496 2142387 2070856 1949411 1839527 1805398 1672986 1713589 1693345 1631593 1691714 1772274 1799006
3485 1799006 1745190 1781297 1824682 1875597 1910240 1958020 2030441 2139494 2298314 2359880 2466668
3474 2466668 2546078 2614589 2561156 2547588 2625501 2543160 2567913 2580563 2573469 2622507 2700103 2676317
3462 2676317 2712496 2872804 2999038 3131902 3259130 3394840 3546963 3594403 3573906 3600942
3452 3600942 3619322 3614785 3607208 3477734 3326511 3014002 2855817 2768270 2395022 2309527 2282708
3441 2282708 2255069 2200854 2144924 2083561 1967465 1913623 1711510 1713263 1599331 1583878 1466827
3430 1466827 1511682 1464708 1321561 1369163 1218277 1266758 1345194 1284116 1302641 1264471 1179491
3419 1179491 1199796 1216685 1137417 1131292 1155753 1113438 1084727 1094280 1159021 1147369 1217276 1217002
3407 1217002 1222576 1140220 1102487 1121111 1154698 1000765 945857 954401 837300 845124 811309 818168
3395 818168 780748 837829 842319 727803 833129 752301 726486 701487 715231 751230 833502
3384 833502 780070 747597 694715 624803 688157 662415 633946 597862 531586 664568 642265
3373 642265 719892 624716 577378 606905 566805 664418 655194 801783 708695 734615 771845 771200
3361 771200 698275 666231 650734 612569 712782 705076 738234 789926 666330 680588 632347
3350 632347 604613 580395 709199 689169 614597 628688 532526 532413 534180 565699 557884 570466
3338 570466 536633 522178 630847 581349 607880 623341 568110 539154 666633 687959 635267
3327 635267 752992 685530 734899 627225 647607 627548 748408 798505 661099 709409 609760
3316 609760 569089 469907 483274 414594 474094 501214 409546 610075 567924 570804 516970 413448
3304 413448 408358 378194 453643 444289 433348 471255 395931 425453 533887 430888 396074 517729
3292 517729 463309 549942 568663 467412 521676 437530 520487 383495 479480 570398 480937
3281 480937 476593 434035 345037 378848 365713 271309 386887 378728 405282 502040 393006 389877
3269 389877 342855 409058 314072 365823 485757 371191 287888 325993 330239 278108 362427
3258 362427 232830 359266 308941 333175 410981 406619 398280 264014 344075 214714 249571
3247 249571 366639 389302 402153 402917 438140 386446 457328 238886 294545 333966 377564 499478
3235 499478 511120 452361 374487 517724 461540 343319 442125 499174 641734 706959 743608
3224 743608 641459 675448 701212 637857 703632 647047 698511 700338 880719 813835 735765
3213 735765 745301 634671 702201 619426 704867 718943 741758 736016 674619 738601 557319 634972
3201 634972 637580 664864 713412 699750 679274 703395 752082 718020 783956 808088 948965 1008849
3189 1008849 1066896 1170335 1157556 1323107 1370620 1379907 1365689 1375321 1390741 1371136 1278170
3178 1278170 1261693 1301639 1148270 1171122 1051218 1038552 1016908 1103018 1040409 775980 908267
3167 908267 844668 769598 780523 739809 781635 899703 909743 813636 908363 842685 942780
3156 942780 844756 925372 1034324 1051590 1292759 1221547 1212573 1208127 1182581 1278766 1317090 1261023
3144 1261023 1242683 1208655 1178332 1207930 1141573 1054269 986860 926236 1040951 986181 1049634
3133 1049634 897950 965067 1054845 1045856 1038123 1003151 1023054 1033578 1010446 912209 1020614
3122 1020614 993173 959108 897224 781234 805667 765950 801995 684454 701562 657913 545626
3111 545626 664391 586889 626381 584257 694927 679311 684921 748710 719322 725658 710535 686492
3099 686492 690498 822758 914821 969074 951523 788291 913745 830390 770509 666071 677506
3088 677506 655942 606773 659864 612134 585652 471527 489414 484060 611317 570299 569011 701541
3076 701541 592587 630839 481721 522337 490748 490019 620938 466897 523220 507643 509225
3065 509225 385376 340311 213008 283414 389438 450403 385314 297427 312472 182692 252532
3054 252532 178761 109644 210408 152976 205711 204523 221108 169060 178605 34405 -873 71465
3042 71465 150956 160211 156872 172611 36357 71206 143642 -40060 -20304 -22436 52005 121075
3030 121075 111351 143150 103366 109452 54497 171690 124055 165993 174179 197720 130654 12269
3018 12269 47381 -33869 95957 24102 -63620 -19366 -29738 93982 82481 211943 23947
3007 23947 -26202 -61515 72054 97426 83435 113865 -12406 26248 -65370 -35074 18553
2996 18553 77361 45879 -23585 63831 -56248 59806 48484 -49413 -74991 23950 49850
2985 49850 -44459 20998 -78636 -11949 -15930 -43852 -69524 -19341 -11329 -140298 -73754 -137271
2973 -137271 -78950 -20819 -116366 -119736 -130234 -82806 -132271 -33097 -60567 -72858 -167927 -165228
2961 -165228 -158994 -99859 -82376 -135289 62338 46383 -53442 4632 -125668 -65732 -43589
2950 -43589 -38142 -71235 47725 -68874 -68850 -64293 -131027 -200855 -182006 37100 -23329 29309
2938 29309 -11863 -73110 -19109 -65539 -9857 -58083 -121922 -68304 -39695 -125 -101772 -27755
2926 -27755 -110483 -131053 -154419 -38397 -50569 -5337 -8245 -85417 -33793 -26310 -63961 -125075
2914 -125075 -165873 -66659 -101886 62878 47951 111400 15332 -4057 -162052 -83714 -60770
2903 -60770 -71427 -43225 -17816 66684 -25245 1006 -131443 -50411 -44964 -108849 -77464 -127828
2891 -127828 -11190 -73522 -18933 -131841 -143980 -32925 -9067 16162 -24374 66774 -145865
2880 -145865 -23346 -127729 -33453 3610 -55648 63248 15350 -51455 55536 54435 -51932
2869 -51932 -109823 -29296 -71696 61177 24096 67931 -20462 37717 54434 6314 51770 -4207
2857 -4207 69377 135886 81530 178622 29457 16080 28415 41700 62056 3519 50522 70039
2845 70039 67933 36005 74380 39345 54488 18072 146450 182971 139705 281688 157142
2834 157142 195064 212662 93718 126721 211188 258231 228413 270352 196373 306904 242066
2823 242066 306824 254761 299554 175075 203759 254895 182770 361135 271625 37340 158510
2812 158510 222448 196166 332933 324126 227928 395393 320687 316058 255091 290419 363203 387643
2800 387643 425724 371680 423333 431573 318049 324598 328458 175727 331510 381603 281415
2789 281415 374638 405581 342047 261037 249432 359949 221309 209699 155982 278349 292845
2778 292845 277963 255232 242128 186828 317555 271687 285085 358613 341847 237095 291189
2767 291189 268619 251108 230425 264869 258942 247633 251648 277892 179929 89018 148122 133196
2755 133196 148246 167022 201500 148198 102147 41350 4127 599 79996 96728 86822 13923
2743 13923 118119 103391 122116 55357 66229 -98975 -20814 132600 41254 95083 185735
2732 185735 55163 48563 -7275 -29136 -1200 134454 62211 139602 79792 84070 -12054 -43242
2720 -43242 -95782 -70329 29060 -78723 -48067 58484 -26632 39197 32080 -73953 6938
2709 6938 1528 -69811 -83025 -127370 -74768 28211 -62954 -137221 -79792 -57618 -151973 -51210
2697 -51210 48709 -124432 -17739 43667 -169021 -26854 -70239 -47070 -119252 -62535 -48952
2686 -48952 35052 -48170 -111146 -41186 -124561 -201715 -129933 -85430 -82027 -24942 22832 -136421
2674 -136421 16112 -166515 -74028 -87695 -35026 -37233 -54237 5929 -79639 -49385 -113212
2663 -113212 -64965 -152068 -204397 -106461 -8344 -22880 -138531 -36713 -137689 -108169 -144045
2652 -144045 -127514 -85999 -66022 -44020 -66067 -65475 -69738 26101 -65313 -20124 -112290 -75338
2640 -75338 -177368 -139391 -57038 -131138 -101680 -101705 -131085 -39884 -32242 79289 -63762 -83791
2628 -83791 -137767 -109708 -88628 -63756 -75251 -110021 -62988 -123420 -129581 -171404 -195641 -150424
2616 -150424 -147508 1108 -96303 -13033 -112842 -187272 -145080 -122603 -111891 -132422 -70195 -137437
2604 -137437 70540 -22610 -113718 -116451 17267 73198 16859 150198 33026 237415 192640
2593 192640 143813 264603 151850 192497 152848 120000 -55440 96480 116472 36573 -5613
2582 -5613 -10585 -29844 -124985 5650 -179267 -104097 -49312 -154863 -37613 -67623 -41590
2571 -41590 -33259 9435 -97558 3476 24406 -87193 -28046 -111894 -112308 -34028 -27577 -181788
2559 -181788 -112293 23974 -128013 31 -74040 -59435 -131728 -89942 -117155 -151032 -106120
2548 -106120 -79660 56325 -53604 -12298 -93361 15794 -58269 -89164 -19221 -121810 46073
2537 46073 -123836 -121552 -172198 -106843 -57356 -154610 -117096 -164970 -45491 -39457 8530 -83766
2525 -83766 -53733 -29316 -133364 -31898 -57830 -28353 -87153 -62023 18034 -16425 -5285
2514 -5285 -158153 43804 26340 40427 70647 117413 13674 17298 62813 -56351 -29181
2503 -29181 15537 136704 51022 45072 -45313 -126115 41629 -96440 -4723 27354 -27307
2492 -27307 91771 134624 46020 51268 109161 -14513 40335 55231 123313 58809 62673 -4633
2480 -4633 -98924 88073 -39628 2045 -70503 -76593 19498 85711 102805 -7830 88071 -88140
2468 -88140 17178 -76838 78677 12566 84947 205688 7369 149999 1130 -26826 9008
2457 9008 43996 108433 -17187 29802 -10456 35448 -18210 -64953 -33885 25940 135421 72649
2445 72649 86475 70556 163375 168841 93045 159290 120166 33782 42933 95846 107308 27313
2433 27313 24293 50532 6425 70199 171587 109719 194033 85099 125059 127735 64435 130988
2421 130988 64396 65040 78538 188801 151805 68774 44221 32084 75060 84690 150056 86102
2409 86102 248125 197334 239934 176996 204948 236047 176991 214093 164753 241847 176140 225839
2397 225839 279702 225568 279067 253811 312262 277618 409350 377309 433707 524325 491878
2386 491878 649068 684581 732931 739293 815916 788590 840200 836989 724015 720245 801973 809386
2374 809386 880866 922088 917791 973386 1058727 965102 938846 954061 998714 940521 1069924 1162151
2362 1162151 1238336 1322670 1305391 1447486 1508101 1392457 1489108 1587924 1603716 1681810 1810713
2351 1810713 1747855 1972661 2263639 2574842 2830132 3253655 3818259 4224632 4767873 5096472
2341 5096472 5359369 5549533 5834762 6338782 6965572 7951539 9146908 11010091 13798100
2332 13798100 18434129 25192261 33630774 43929401 53069798 56726398 56324906 52132885
2324 52132885 44664954 36758812 29863353 24874114 20020699 15399456 11865992 9839446
2316 9839446 8621796 7679742 6947586 6393418 5875079 5433246 4875327 4398607 3974020
2307 3974020 3652261 3381798 3022003 2879196 2774561 2511527 2365136 2274779 2178479 2030903
2297 2030903 1956001 1719386 1565604 1626572 1449092 1403993 1440306 1348574 1385372 1398344 1279746
2286 1279746 1212954 1194212 1087201 1068673 1081522 965344 1005828 1035156 1008376 923008 1061882
2275 1061882 973137 876736 907155 786869 795318 811738 761197 776208 777886 717910 784011 754787
2263 754787 707421 712776 733311 658566 594093 768871 698845 637912 621502 639063 591003 471594
2251 471594 518589 430335 453321 438164 545771 474283 444594 430383 421443 486848 496998 448673
2239 448673 363957 419976 346751 301921 385939 402140 451940 341435 335103 290305 341077 205366
2227 205366 243726 257052 156437 252058 236056 330014 296675 268786 234133 187771 264056
2216 264056 200930 140636 150470 169746 198586 132933 162386 179088 181371 82301 252714 190234
2204 190234 129023 238055 199863 168749 91904 123515 60322 54578 40791 -75697 26452
2193 26452 -38862 116714 67879 40099 -10682 81406 130312 58961 168783 74624 138058
2182 138058 105990 81450 -28958 4148 130232 55272 135235 -2672 118969 95772 68526
2171 68526 46810 22207 15073 36727 91339 -31320 24852 -249 -63955 -15148 42087 -17539
2159 -17539 -22663 78815 -73227 -17487 38304 -1812 79830 -18259 -52159 -32264 38985 -77536
2147 -77536 58938 2964 -32947 -40668 -10423 63747 -7086 -25170 -51723 30841 28985 -18419
2135 -18419 25626 -78533 -30264 74763 86810 39189 -30276 -61070 -95141 -13968 -11623 -33842
2123 -33842 -20533 68247 12489 -54561 1892 11314 119600 45931 -40054 21525 18332 58845
2111 58845 44207 27215 -6143 37152 -33088 -67518 -15541 12816 -2021 -9321 41111 -41217
2099 -41217 921 -16648 -64234 -98187 -119652 -76970 -121906 -60285 -49565 -58854 -49104 2698
2087 2698 -3370 -48457 39840 -15884 77201 -2217 -41333 9473 -98211 -75881 14244 70827
2075 70827 -42485 -4830 -27583 -48716 39260 -24641 -78899 -104013 38887 -62963 -29418
2064 -29418 -22888 -13120 141921 136294 186774 192286 198982 208164 282144 263771 78002 172520 238600
2051 238600 74341 77187 42785 -34184 750 96193 -49349 -39346 38775 49545 113932
2040 113932 88612 47822 -12833 -47445 -146999 -60308 -110103 -47834 14381 -71130 -126103 -143481
2028 -143481 20355 -94853 -11309 -32146 -61215 -60214 -97668 -43834 -113067 -85383 -97752
2017 -97752 -71884 -30882 -50762 -8800 -71737 -95928 -52562 -121652 -127056 -95005 -31093 -62199
2005 -62199 1147 -23188 -14629 -3645 28884 -25008 -29394 -82699 -62448 -47148 -145541 -14820
1993 -14820 77196 133921 95593 30139 -8386 -9677 48761 57569 19868 8474 36118 3241
1981 3241 -74739 -5912 17219 -53641 -160580 -86130 -100787 -122664 -59128 8349 -59839 -25571
1969 -25571 5948 -34139 -2108 3076 -25253 -162937 -185751 -51908 -102854 -133379 -160333 -71044
1957 -71044 -163028 -58701 -58515 -175167 -111199 22172 -9149 -95117 -35050 -52904 -113520 -117081
1945 -117081 -147209 -153152 -189630 -25593 82566 -45431 -65731 -41926 39974 -44176 -36796
1934 -36796 -66037 -112860 -51802 21691 -56252 -133711 -38478 -11194 -134325 -132884 -122686 -58497
1922 -58497 -93708 -4441 -64844 36997 -38757 -15756 -88111 -110706 -24399 -65034 -115661 -92209
1910 -92209 -19299 -14961 -15931 -22476 -30939 -77124 -34316 25832 -18100 -24474 -55554 -7130 -78263
1897 -78263 -150578 -67825 -100605 -84745 -28710 43119 -91774 -152660 -158612 -191208 -137242 -108994
1885 -108994 -67349 -133857 -128260 -100998 -98953 -82349 -89568 -36929 -84938 -19019 -89649 -61768
1873 -61768 -90681 -2975 -101028 -124711 -84685 19757 14703 -37343 17989 22333 11053 -45901
1861 -45901 -111557 -96997 -131089 -11992 -57090 -118610 -47116 -56077 -78719 -105774 -11176 -3777
1849 -3777 24802 -13554 -12259 -144297 -86458 -2429 -82771 -104466 -134421 29213 -6384 -60828
1837 -60828 15463 -4543 -100823 -34707 31705 -81289 -25273 -22368 -18069 -91571 -26961 -11141
1825 -11141 -114519 -94266 -99890 -45902 -73628 -64854 -2820 -118127 -55202 -38102 -113434 -247301
1813 -247301 -175025 -54620 -88004 -39079 16461 15293 -92064 530 -133982 -158834 -40363
1802 -40363 -32766 26992 -84765 -54819 -99061 -88468 -147025 -184073 -119846 -89972 -14129 16633
1790 16633 -34195 -22802 7292 -56237 -130066 31154 -31338 -26334 62499 -12591 -105608 -136848
1778 -136848 -61302 -84336 -70075 -2712 2530 -54481 -35985 -15855 -38050 -136964 -133310 21008
1766 21008 -37287 -68898 -50721 1252 -26662 7221 23861 -102670 -98195 291 80200 -19287
1754 -19287 54112 6246 76355 24901 -98913 -84656 -111947 19738 75945 -20220 -34411
1743 -34411 -19540 84742 -40841 -55870 -50056 -18822 -15998 40688 12012 -102237 41869
1732 41869 -84001 -105478 -94665 -24929 -44803 -89770 5782 -56818 -35717 -66366 -120900 -63351
1720 -63351 -48931 -56493 -22366 -263 -60749 63933 -29540 -134279 7476 13616 -109640
1709 -109640 -133920 -42481 -134829 -161160 -79453 -100791 -181340 -103851 -18179 -121246 -11694
1698 -11694 77674 56205 -47607 -61219 -29194 -149371 -55312 -4754 -9970 -38383 91617
1687 91617 82606 -57644 -59109 -31354 10158 -135305 -46225 -45070 -87361 -64447 -31555 -55839
1675 -55839 -119654 -55119 -71193 -147102 -136026 -145884 -99444 -74809 -144598 -189677 -145229 -94425
1663 -94425 -120782 -48104 -50799 21507 67557 -69579 -152780 -99747 -2474 -14223 -25152 10836
1651 10836 -61580 37848 -131167 -221628 -138827 -73501 -72007 -24389 70765 37175 23859 -1887
1639 -1887 -9644 42085 -67282 -87456 -75207 -6824 -77036 95097 46291 -152398 -52814 5966
1627 5966 -56971 -41886 16519 5521 35458 46214 -26571 -58617 -81273 -59685 4876 -98299
1615 -98299 49096 55759 75001 -108430 -28464 68319 -100101 -103606 -58022 -76704 -58430 35576
1603 35576 23915 -69730 24699 54602 76986 -5597 -14781 -52374 -15254 -25741 -81780 -36316
1591 -36316 -83547 -82253 -33128 -58548 16944 48041 -21902 -105512 -18372 -65606 -42009 -29339
1579 -29339 -7920 -71110 -28890 32892 -109719 -103879 -9754 23627 -36408 21299 -18676 26871
1567 26871 31115 36664 26969 -30185 -97375 -31371 -84337 -111076 61692 47960 -40899 -8602
1555 -8602 -9604 -50578 -117975 -41721 -67041 -25453 25662 -38318 -129641 -135890 -101157 -21706
1543 -21706 -15633 -121748 -50995 -43594 -21552 19106 -93660 -3404 -12798 -62482 -60 6151
1531 6151 35077 10686 -4340 -22162 -88043 -78959 4015 64705 57252 -18164 -23469 -37046 -108532
1518 -108532 -41531 -3930 -73369 -10000 -35178 -49725 -97668 -56921 -52118 -178523 -54253
1507 -54253 114 35060 4450 18117 -29559 -48078 -92395 -125046 -34114 -212465 -47964
1496 -47964 -50665 19767 45142 160138 153830 -28825 -12031 -123655 -43214 -86364 6070 -73372
1484 -73372 -48471 -34053 -85344 -57119 -133609 -64767 -76107 -40353 3361 43116 80158 -131419
1472 -131419 -86200 -139205 -129182 -23709 5253 -76935 -78371 98046 -66908 -27898 -87254
1461 -87254 -64210 13938 27480 15165 -16112 35183 -90189 -57896 -122531 -97214 -49798 -31824
1449 -31824 -67713 -91207 -10890 -93449 -101818 -48093 -85920 -72982 -1744 -47444 -100277 40854
1437 40854 62073 -81662 -38964 -113851 -45648 38327 16367 -59835 -53974 -86742 -131775 -6327
1425 -6327 -116339 -33722 -42842 -84068 -99690 -11260 -41353 -103642 -8371 -66169 -37232 -46217
1413 -46217 -26099 -121084 -54302 28085 -56588 -75791 -189343 -101949 -6928 -25833 -45043 24631
1401 24631 4318 15480 6881 -90209 -155909 -205313 -730 -16586 88310 149656 -20046
1390 -20046 11084 -38854 -8399 -159012 -51623 -20143 55352 70337 29994 31242 -153066
1379 -153066 -89459 -159162 10887 -22320 26739 53810 -36597 48295 101069 8523 -71105
1368 -71105 -96301 -29375 -80710 -5689 18726 3999 -5105 34388 46792 -23319 -16958 -95901
1356 -95901 -16742 52005 -19839 21129 -110698 -15684 22 53389 -21111 -5914 48543 -52698
1344 -52698 48246 44992 -2084 -24733 34843 -36360 -103710 -75635 11948 38705 -37834 -36488
1332 -36488 -32754 8227 85934 55821 54202 4231 77390 28122 -43102 -72823 -51830 -101920
1320 -101920 12957 84160 23803 11751 -1190 34105 -65577 -9546 57944 -65809 -19681
1309 -19681 36856 115155 -38336 48647 -46518 -102797 -123558 -29375 -32022 -61180 52220 -14932
1297 -14932 21424 -32430 -28688 -35855 -3136 -14532 41694 57978 23612 -43295 -28385 -51435
1285 -51435 18144 52812 -38195 4646 56907 32273 39023 32413 -31208 11896 9260 24041
1273 24041 106298 53373 16225 54244 87428 11538 20101 44023 -36766 12811 56365 -19324
1261 -19324 77207 123697 70296 -77658 -73698 -75259 16330 89993 80516 55175 30918 24945
1249 24945 24588 -19081 -84447 -142688 -17727 30013 51546 216402 -21532 -49660 -124472 -84486
1237 -84486 -117670 -16400 57652 -9857 65737 -22329 -9437 -60234 -58730 -45532 -684 103033
1225 103033 13853 77821 -28497 15167 16131 41850 12304 7171 58190 56212 127886 39737
1213 39737 -53478 -27320 -66847 -41116 -12155 29400 31127 -33086 -24981 -81439 -56991 -33255
1201 -33255 -28443 34709 -16387 49739 89817 81567 31012 -65022 -2944 5105 -57010 -94627
1189 -94627 2852 -84576 3042 10392 -3598 86663 -74624 -91328 -34143 -16904 -28258 24967
1177 24967 92401 -36295 -10009 -98185 -56133 -54920 -42083 -22372 47964 -17732 -39207 -25260
1165 -25260 -60834 -141894 -78736 -95448 -58585 58636 19464 -36862 -32487 -13060 -117487 -122337
1153 -122337 -54230 -28796 26773 -71229 -28164 -53206 -106194 -104617 -30659 -5 78475 119769
1141 119769 105406 34569 -58695 -16123 -128596 -57138 52316 4872 -48799 36969 -35005
1130 -35005 -116343 -53568 -43833 -77483 -81777 50758 122576 372 51622 -19708 43160 1292
1118 1292 29862 -63234 -43736 -72089 -53953 10228 24534 75039 -30530 -63679 -189826 -136980
1106 -136980 -38254 -52166 13825 -78049 -61621 -70478 -54935 -81507 -91262 -63272 15858 -16971
1094 -16971 38220 -54343 -86223 -22751 -33933 8006 -92774 -64244 12269 76396 48249 72636
1082 72636 38760 13377 37532 19897 -32964 79982 98106 53203 -25133 -73752 -142001 -152575
1070 -152575 -93075 -51113 -19663 31006 19562 1249 -37129 7546 -883 67907 -24046 -37995
1058 -37995 -4617 -26305 5152 -892 -57551 -60588 79224 112899 80217 33457 28951 109447
1046 109447 -8475 85397 642 16999 15420 65292 64079 -24145 44709 -30598 14535 -32527
1034 -32527 145559 55889 52455 9188 -44319 -29467 -25141 7436 -67266 -42582 -47616 -45439
1022 -45439 56288 -25443 10878 3376 13112 -94603 -81870 -84779 -16855 48999 -56448 -68890
1010 -68890 15243 9635 -83839 38501 65673 36511 91278 108992 80178 41823 31768 -55297
998 -55297 -8924 -22880 -30838 75393 25307 20745 39110 59137 -56770 18426 40207 23465
986 23465 68777 84351 51861 40496 108010 58204 9672 54671 -38962 -29223 29608 -7708
974 -7708 40931 21016 2535 -7528 83038 -12715 -8498 6487 -39100 14686 83630 83120 -87157
961 -87157 34155 45705 77266 62524 -27329 -90196 -18133 -25227 -72485 28008 -50117 6476
949 6476 7473 37228 44094 15132 54174 38707 -26465 -147001 -86877 -107 25329 -11345 101463
936 101463 134421 2469 102019 -946 -7303 -14622 47348 60776 9627 90554 -20670 32983
924 32983 -93655 -155149 -32417 64846 -15375 -35738 38158 23432 95304 6873 -9561 -44833
912 -44833 16311 -36889 -80138 97816 12450 59260 49246 -9804 -92680 9931 -7523 48227
900 48227 90225 47900 47203 -6349 -24898 -99813 -35872 -45802 -87032 90405 74032 7056
888 7056 36589 -83488 -80820 -6995 71237 10 38039 83127 75105 51967 73191 70202 -13696
875 -13696 109686 107981 41130 -16678 25172 143930 76296 -20327 -28220 -32483 -70472 -47604
863 -47604 -24662 -5981 57487 -22522 -60108 -114485 -30093 -41621 -49631 51210 -9627 63162
851 63162 2220 92862 -21106 -74639 45391 92086 53554 82088 100209 26021 2028 -81337
839 -81337 -87313 -24713 2425 70108 75323 6549 -23342 -14767 -90466 -105999 -2688 40825
827 40825 58056 71136 -31877 12253 60310 -47890 -73575 -13021 57625 77082 80561 -8000
815 -8000 -3122 5680 -45981 -21959 18794 -41483 -25930 44853 32748 40055 111585 232 35863
802 35863 52291 -35014 -11874 -16554 18626 19908 65971 29552 -57160 32124 -7201 32918
790 32918 99767 20811 44785 77019 21935 13153 92622 10118 29869 135627 81510 56291
778 56291 53327 68337 -19976 47171 42352 -42533 99516 12308 64350 57185 170198 57266
766 57266 11396 50276 13073 84111 107737 26216 23233 22128 25438 59319 136869 -6681
754 -6681 -48145 65757 98968 52220 40362 85916 -10982 53380 -18804 9107 45944 58254
742 58254 77431 75080 13876 -19277 83104 40119 -46368 81121 109781 3747 115329
731 115329 124390 -71766 15327 90330 69591 72417 66364 -873 19015 53326 23364 -26458
719 -26458 36443 3097 63916 3180 -68703 28119 48024 8116 139269 66115 82421 165869
707 165869 47342 -20453 -27973 70567 64064 1841 67136 -15682 -5230 13891 52228 6248
695 6248 15246 21490 83308 19860 -55056 -6262 -28183 -32669 -7540 86590 -13873 -52878 44652
682 44652 36059 -53037 -8526 92384 60711 76528 79650 -50087 37932 7676 -22504 996
670 996 107823 57111 82241 145423 76897 107041 8182 -87189 -2280 -10265 -35023 21729
658 21729 43197 -45673 18222 16778 -65843 10915 121285 9450 -12411 133145 62185 -11445
646 -11445 54168 44271 188186 194191 18269 6118 38836 -159890 54576 96356 -57758
635 -57758 -38352 74634 64190 29807 171664 -16617 -27317 29907 -54326 -27842 19909
624 19909 22919 18625 88982 50387 56577 35089 -56937 53531 -3187 2270 -35454 35306 9071
611 9071 39217 139311 44119 22395 60936 68719 -36615 9963 115703 64361 94749 66852
599 66852 50867 13733 58640 60524 44049 32027 54661 124109 -5189 71431 91710 -1778
587 -1778 18629 68818 111706 32758 100450 119380 19807 3387 114323 58155 56475 178269
575 178269 116769 97172 19570 50979 1722 -37195 -8820 -64863 38062 14949 46865 123488
563 123488 -13956 41373 72413 6317 -37057 47993 41341 18604 30945 3340 -17914 70872
551 70872 154495 62246 59142 39116 -14617 55206 -12579 9024 86998 55168 50322 122303
539 122303 76682 112 42887 12715 -8723 54791 103648 20612 44049 28694 15993 150699
527 150699 87746 -6597 6930 -46622 -67057 -35786 -38757 22299 98381 86174 46201 -28227
515 -28227 14427 -63338 -867 40653 67720 102955 146838 61213 -74063 -67806 15647 45274
503 45274 131448 103302 59443 60760 -30902 -40551 -56148 8190 37375 55514 66044 46156
491 46156 -41168 -12360 82048 99965 110363 -31797 84974 105053 39586 142885 169765
480 169765 39042 -66624 28481 -7982 -12692 -99005 28718 20316 78347 54086 19456 37402
468 37402 -53107 50357 18870 -75213 5903 40294 61481 56209 132551 64519 101760 185626
456 185626 21758 -15121 91164 101729 27040 148610 28767 81366 60474 -38362 31794
445 31794 130455 69811 138399 158847 21969 16812 29817 -16206 -78745 -1430 47569 59384
433 59384 114462 90810 -10413 79600 31528 115255 133451 102085 55903 19082 128398 37425
421 37425 99162 55129 97001 117535 59008 -5142 60528 124014 63800 164302 23168 -30775
409 -30775 -2249 70902 58326 -12105 68930 -6585 127996 128525 15897 23976 119638 51200
397 51200 13787 66214 -25576 77692 75594 51127 46641 115394 88780 27708 106617 168
385 168 -3927 194316 42497 20929 98618 47649 22502 139435 81217 76326 107088 65874
373 65874 9729 177998 61900 -18961 116127 -51351 -30580 47271 1198 -55997 136746
362 136746 120912 36591 161040 118413 89347 157646 55313 -39046 44752 94275 9500
351 9500 106107 417 -33304 89007 26266 -19492 43741 158102 136132 135314 110641 -11041
339 -11041 133113 169317 81668 11666 99050 44950 76959 111933 -25623 107445 166594
328 166594 68665 46157 26801 47923 105721 131831 -25472 33456 101908 40316 100677 67811
316 67811 68603 94437 150306 -38181 -39713 18097 27227 -38510 80397 99846 7818 166941
304 166941 71230 57076 180232 173000 -3665 -8133 46853 1791 104788 -40372 43089
$$ [...]
##END NTUPLES=NMR SPECTRUM
##END=
