##TITLE=1H_CA-9469-1
 200.13Hz, DMSO+CCl4.
 8 sc
 19.6.2026
##JCAMPDX= 6.0         $$ Bruker NMR JCAMP-DX V2.0
##DATA TYPE= NMR SPECTRUM
##DATA CLASS= NTUPLES
##ORIGIN= UXNMR, Bruker Analytische Messtechnik GmbH
##OWNER= pz
$$ XWIN-NMR		Version 3.5
$$ Fri Jun 19 13:42:07 2026 Russian Standard Time (UT+4h)  she@DPX200
##.OBSERVE FREQUENCY= 200.1313
##.OBSERVE NUCLEUS= ^1H
##.ACQUISITION MODE= SIMULTANEOUS
##.ACQUISITION SCHEME= undefined
##.AVERAGES= 8
##.DIGITISER RES= 18
##SPECTROMETER/DATA SYSTEM= spect
##.PULSE SEQUENCE= zg30
##.SOLVENT NAME= DMSO
##.SHIFT REFERENCE= (INTERNAL, DMSO, 0, 15.5045)
##AUDIT TRAIL= $$ (NUMBER, WHEN, WHO, WHERE, WHAT)
$$ ##TITLE= Audit trail, XWIN-NMR		Version 3.5
$$ ##JCAMPDX= 5.01
$$ ##ORIGIN= Bruker BioSpin GmbH
$$ ##OWNER= she
$$ F:/spectra/data/she/nmr/H-C/1/pdata/1/auditp.txt
$$ ##AUDIT TRAIL=  $$ (NUMBER, WHEN, WHO, WHERE, WHAT)
(   1,<2026-06-19 13:40:37.93 +0400>,<she>,<DPX200>,
      <created by zg, POWCHK disabled, PULCHK disabled
       configuration hash MD5:
       00 E9 B6 7A A2 85 ED C7 34 08 36 98 17 FE 4E 26
       data hash MD5: 16K
       BB B9 47 85 24 F0 26 A1 E7 2F A9 E8 BD F5 24 BE>)
(   2,<2026-06-19 13:40:40.20 +0400>,<she>,<DPX200>,
      <Start of raw data processing
       efp BC_mod = 2 LB = 0.25 FT_mod = 6 PKNL = 1 PHC0 = -4212.643 PHC1 = 6.592289 SI = 16K 
       data hash MD5: 16K
       94 B0 0C 63 B6 02 31 EC 57 4F 9F 70 4D 44 3A 88>)
(   3,<2026-06-19 13:41:04.37 +0400>,<she>,<DPX200>,
      <pk PHC0 = -3.501592 PHC1 = -1.4 
       data hash MD5: 16K
       34 20 24 CA 6C BD CD 87 C4 70 AB 5D A6 0D BC 70>)
(   4,<2026-06-19 13:41:08.71 +0400>,<she>,<DPX200>,
      <abs ABSG = 5 
       data hash MD5: 16K
       09 68 D9 1A 02 05 1B 31 0E A3 19 9A DE 29 18 63>)
$$ ##END=
$$ 
$$ hash MD5
$$ 81 49 3F 80 F0 BC CB BF 97 BA 8E 92 AD C0 AD CC
##$RELAX= 
##$RELAX= 
##$RELAX= 
##$RELAX= 
##$RELAX= 
##$RELAX= 
$$ Bruker specific parameters
$$ --------------------------
##$DU= <F:/spectra>
##$EXPNO= 1
##$NAME= <H-C>
##$PROCNO= 1
##$TYPE= <nmr>
##$USER= <she>
##$AMP= (0..31)
100 100 100 100 100 100 100 100 100 100 100 100 100 100 100 100 100 100 
100 100 100 100 100 100 100 100 100 100 100 100 100 100 
##$AQSEQ= 0
##$AQ_mod= 1
##$AUNM= <au_zg>
##$AUTOPOS= <>
##$BF1= 200.13
##$BF2= 200.13
##$BF3= 200.13
##$BF4= 200.13
##$BF5= 200.13
##$BF6= 200.13
##$BF7= 200.13
##$BF8= 200.13
##$BYTORDA= 1
##$CFDGTYP= 0
##$CFRGTYP= 5
##$CHEMSTR= <none>
##$CNST= (0..31)
1 1 145 1 1 1 1 1 1 1 1 1 1 1 1 1 1 1 1 1 1 1 1 1 1 1 1 1 1 1 1 1 
##$CPDPRG= <>
##$CPDPRG1= <>
##$CPDPRG2= <>
##$CPDPRG3= <>
##$CPDPRG4= <mlev>
##$CPDPRG5= <mlev>
##$CPDPRG6= <mlev>
##$CPDPRG7= <mlev>
##$CPDPRG8= <mlev>
##$CPDPRGB= <>
##$CPDPRGT= <>
##$D= (0..31)
0 0.7 0 0 0 0 0 0 0 0 0 0.03 0 0 0 0 0 0 0 0 0 0 0 0 0 0 0 0 0 0 0 0 
##$DATE= 1781862037
##$DBL= (0..7)
120 120 120 120 120 120 120 120 
##$DBP= (0..7)
150 150 150 150 150 150 150 150 
##$DBP07= 0
##$DBPNAM0= <>
##$DBPNAM1= <>
##$DBPNAM2= <>
##$DBPNAM3= <>
##$DBPNAM4= <>
$$ [...]
##$SUBNAM3= <"">
##$SUBNAM4= <"">
##$SUBNAM5= <"">
##$SUBNAM6= <"">
##$SUBNAM7= <"">
##$SUBNAM8= <"">
##$SUBNAM9= <"">
##$SW= 18.0517328524113
##$SWIBOX= (0..15)
0 0 2 0 0 0 0 0 0 0 0 0 0 0 0 0 
##$SW_h= 3612.71676300578
##$TD= 16384
##$TD0= 1
##$TE= 0
##$TE2= 300
##$TE3= 300
##$TEG= 300
##$TL= (0..7)
0 120 120 120 120 120 120 120 
##$TP= (0..7)
150 150 150 150 150 150 150 150 
##$TP07= 0
##$TPNAME0= <>
##$TPNAME1= <>
##$TPNAME2= <>
##$TPNAME3= <>
##$TPNAME4= <>
##$TPNAME5= <>
##$TPNAME6= <>
##$TPNAME7= <>
##$TPOAL= (0..7)
0.5 0.5 0.5 0.5 0.5 0.5 0.5 0.5 
##$TPOFFS= (0..7)
0 0 0 0 0 0 0 0 
##$TUNHIN= 0
##$TUNHOUT= 0
##$TUNXOUT= 0
##$USERA1= <user>
##$USERA2= <user>
##$USERA3= <user>
##$USERA4= <user>
##$USERA5= <user>
##$V9= 5
##$VALIST= <valist>
##$VCLIST= <CCCCCCCCCCCCCCC>
##$VD= 0
##$VDLIST= <DDDDDDDDDDDDDDD>
##$VPLIST= <PPPPPPPPPPPPPPP>
##$VTLIST= <TTTTTTTTTTTTTTT>
##$WBST= 1024
##$WBSW= 4
##$XGAIN= (0..3)
0 0 0 0 
##$XL= 0
##$YL= 0
##$YMAX_a= 333633
##$YMIN_a= -280704
##$ZGOPTNS= <>
##$ZL1= 120
##$ZL2= 120
##$ZL3= 120
##$ZL4= 120
##$ABSF1= 15.48577
##$ABSF2= -2.566079
##$ABSG= 5
##$ABSL= 3
##$ALPHA= 0
##$AQORDER= 0
##$ASSFAC= 0
##$ASSFACI= 0
##$ASSFACX= 0
##$ASSWID= 0
##$AUNMP= <proc_1d>
##$AZFE= 0.1
##$AZFW= 0.1
##$BCFW= 0
##$BC_mod= 2
##$BYTORDP= 0
##$COROFFS= 0
##$CY= -3
##$DATMOD= 1
##$DC= 0
##$DFILT= <>
##$DTYPP= 0
##$F1P= 0
##$F2P= 0
##$FCOR= 1
##$FTSIZE= 16384
##$FT_mod= 6
##$GAMMA= 0
##$GB= 0
##$INTBC= 1
##$INTSCL= 3.241238e-09
##$ISEN= 128
##$LB= 0.25
##$LEV0= 0
##$LPBIN= 0
##$MAXI= 10000
##$MC2= 0
##$MEAN= 0
##$ME_mod= 0
##$MI= 1.114404
##$NCOEF= 0
##$NC_proc= -7
##$NLEV= 6
##$NOISF1= 3.799351
##$NOISF2= 2.8
##$NSP= 0
##$NTH_PI= 0
##$NZP= 0
##$OFFSET= 15.50449
##$PC= 1
##$PHC0= -4216.145
##$PHC1= 5.192289
##$PH_mod= 1
##$PKNL= yes
##$PPARMOD= 0
##$PSCAL= 0
##$PSIGN= 0
##$REVERSE= no
##$SF= 200.130003444712
##$SI= 16384
##$SIGF1= 3
##$SIGF2= 2
##$SINO= 0.751879
##$SIOLD= 32768
##$SREGLST= <19F.Aceton>
##$SSB= 0
##$STSI= 16384
##$STSR= 0
##$SW_p= 3612.71676300578
##$SYMM= 0
##$S_DEV= 0
##$TDeff= 16384
##$TDoff= 0
##$TI= <>
##$TILT= no
##$TM1= 0
##$TM2= 0
##$TOPLEV= 0
##$USERP1= <user>
##$USERP2= <user>
##$USERP3= <user>
##$USERP4= <user>
##$USERP5= <user>
##$WDW= 1
##$XDIM= 16384
##$YMAX_p= 282761919
##$YMIN_p= -1492188
$$ End of Bruker specific parameters
$$ ---------------------------------
##NTUPLES= NMR SPECTRUM
##VAR_NAME=  FREQUENCY,     SPECTRUM/REAL,   SPECTRUM/IMAG
##SYMBOL=    X,             R,               I
##VAR_TYPE=  INDEPENDENT,   DEPENDENT,       DEPENDENT
##VAR_FORM=  AFFN,          ASDF,            ASDF
##VAR_DIM=   16384,         16384,           16384
##UNITS=     HZ,            ARBITRARY UNITS, ARBITRARY UNITS
##FACTOR=    0.220516191357247, 1,           1
##FIRST=     3102.91361683166, 0,            0
##LAST=      -509.803146174121, 0,           0
##MIN=       -509.803146174121, -1492188,    0
##MAX=       3102.91361683166, 282761919,    0
$$ Real data points
##PAGE= N=1
##DATA TABLE= (X++(R..R)), XYDATA
$$ [...]
8064F2656L63153m62945l9721R46163l56534o27240j96542O8255O71935M03918
$$ 62656 425809 -37136 -76857 869306 512772 -114468 -311010 -242755 429180 833098
8054H33098k48824n42451R5053J73402K49149j17849l14163N57857R8051m23094
$$ 833098 584274 41823 136876 310278 559427 441578 127415 685272 783323 360229
8044C60229L66154m12347m83257K89752J08655l78666R8781K31312l15704L24906
$$ 360229 726383 314036 -169221 120531 229186 -149480 -50699 180613 -135091 189815
8034A89815K31588l19063M89910n34153j84036p1047J10281J53025L82130m14326
$$ 189815 421403 102340 592250 58097 -125939 -196986 -86705 66320 448450 34124
8024C4124k51302J93119k31318k4118L804J34912M75302k01463l86944K15980
$$ 34124 -217178 -24059 -255377 -279495 -275691 -140779 334523 133060 -253884 -37904
8014c7904m19526o3917N64361l33408m92554N28002j84686k86807J95241L65345
$$ -37904 -457430 -521347 43014 -290394 -782948 -254946 -439632 -726439 -531198 -165853
8004a65853J69629P0775l15013r2209o1485l70251L09680j11805l37292J64228
$$ -165853 3776 74551 -240462 -332671 -394156 -764407 -454727 -566532 -903824 -739596
7994g39596K16324o19108L2404K29026j60264P42081M94142n88699J09324M70220
$$ -739596 -523272 -1142380 -1109976 -880950 -1041214 -299133 195009 -393690 -284366 185854
7984A85854p2892n2785q2886J19560K25165r2239k7293R1884p145N5948Q60738
$$ 185854 112962 60177 -22709 96851 322016 229777 202484 294368 287223 343171 1203909
7973A203909K37882n34596P4497r199j89393Q7605j83691m28995r6863L73284
$$ 1203909 1441791 907195 981692 972493 783100 870705 687014 258019 161156 534440
7963E34440q160n82049r9410M40552l33926n45512L96750k78191k76850j1653
$$ 534440 526280 -55769 -155179 285373 -48553 -594065 -197315 -475506 -752356 -764009
7953g64009L72388O4018J79193m18078k23690K62463J9006J62312L45958j9272
$$ -764009 -391621 -327603 -148410 -566488 -790178 -527715 -508709 -346397 -439 -19711
7943a9711j53759J65409j79565K021N21784k62476j37809M94636n10393j50922
$$ -19711 -173470 -8061 -187626 -185605 336179 73703 -64106 430530 -79863 -230785
7933b30785o2013k30730M64617M55900j46330j79329n34521l33140P18808L94170
$$ -230785 -292798 -523528 -58911 396989 250659 71330 -463191 -796331 -77523 316647
7923C16647m51393k55484j24218l80036K17704L05534k35311L5380J84690r9081
$$ 316647 -134746 -390230 -514448 -894484 -676780 -371246 -606557 -571177 -386487 -485568
7913d85568L60811J80642l89011M0075k19656K21018R5480j48374p1795J5752
$$ -485568 -124757 55885 -333126 -293051 -512707 -291689 -196209 -344583 -416378 -400626
7903d00626N248J11947J25218P410j61845o5257N72464j50465K5996p3873q1484
$$ -400626 -395378 -283431 -158213 -150803 -312648 -377905 194559 44094 70090 -3783 -85267
7892h5267J24093l1995k04498J92978K4116k42821O2855J86910l22914j22399
$$ -85267 38826 6831 -197667 -4689 19427 -223394 -160539 26371 -296543 -418942
7882d18942O07052L91463m0041k48583m06004k94448R924N15062k97442r6231
$$ -418942 188110 579573 539532 290949 -115055 -409503 -399579 115483 -181959 -278190
7872b78190K64018K30679m833j8288k93209M1299R4439K54114J03316m42931m69797
$$ -278190 -14172 216507 211674 193386 -99823 -58524 35915 290029 393345 -49586 -519383
7861e19383j87298K20861K15094O30767r7320j56823k42761Q4096J34568j46064
$$ -519383 -706681 -485820 -270726 360041 262721 105898 -136863 -52767 81801 -64263
7851f4263L14005L3624l2929K47916k00271l91369l02179K88312Q4975l33702
$$ -64263 249742 283366 250437 498353 298082 -93287 -395466 -107154 -22179 -355881
7841c55881m1887k6006J35013J13163P7374k62693N0744K21724N08275q7206o39040
$$ -355881 -397768 -423774 -288761 -175598 -98224 -360917 -310173 -88449 419826 332620 -306420
7830c06420K40603N8989l78847J31122K18815R3462N87646j18716o08636n0037
$$ -306420 -65817 -6828 -385675 -254553 -35738 57724 645370 526654 -81982 -132019
7820a32019O89343l94395K55161P2896l29035J97230L80382l15353k23151k18566
$$ -132019 557324 162929 418090 490986 161951 359181 739563 424210 201059 -17507
7810a7507j00465M05682K16811m44688k11720L82423q2310K17774K07387m06549
$$ -17507 -117972 287710 504521 59833 -151887 230536 148226 366000 573387 166838
7800A66838Q6043K60154l05259m67618P4631L53196l4087K21649N21063K63153
$$ 166838 252881 513035 207776 -259842 -185211 167985 133898 355547 876610 1139763
7790A139763m20470K11735q2081p21546K12139K72198j98320k77095J00496J16391
$$ 1139763 719293 931028 848947 127401 339540 611738 413418 136323 236819 353210
7780C53210M55809L74142l04105k36862J04763J49242j47194j64689k71266M2754
$$ 353210 809019 1183161 879056 642194 746957 896199 749005 584316 313050 355804
7770C55804Q6104j66258k32795J97157O2239N18384M2308l81134j58241O35658
$$ 355804 441908 275650 42855 240012 302251 820635 862943 481809 323568 959226
7760I59226K73455k68505k65819P8688N57990k65894m84042o20093L04017J76707
$$ 959226 1232681 964176 698357 777045 1335035 1069141 585099 -34994 269023 445730
7750D45730J65658K21732L24855l4451o24924n13924K06478L03129M51702j37996
$$ 445730 611388 833120 1157975 1123524 498600 -15324 191154 494283 945985 807989
7740H07989l40637l66120q4488P29255m8035j69853J6037K32066M93579O315p08723
$$ 807989 467352 101232 16744 745999 697964 528111 544148 776214 1269793 1276108 567385
7729E67385J73420N29218J50553L71558m39485o61476j1128O99937J91392J4178
$$ 567385 740805 1270023 1420576 1792134 1352649 691173 680045 1379982 1571374 1585552
7719A585552k60689k10719o2565j75189k35681k8205O68808O8335l32927j87049
$$ 1585552 1324863 1114144 1051579 876390 640709 612504 1281312 1349647 1016720 829671
7709H29671k33291k26734J36762n14745j43729K37666L7568k00504R3122J38866
$$ 829671 596380 369646 506408 -8337 -152066 85600 123168 -77336 15786 154652
7699A54652K38239M55295r1824o62586j22216k80143j20626L38208N79884J43223
$$ 154652 392891 848186 756362 93776 -28440 -308583 -429209 -91001 488883 632106
7689F32106J70326J24054l83258k82559L0876O07822N43317k39092l40624o08514
$$ 632106 802432 926486 543228 260669 291545 899367 1442684 1203592 862968 254454
7679B54454K26351J37434k07815l31417L03689J00562L0498q0823l11780k03473
$$ 254454 480805 618239 410424 79007 382696 483258 513756 432933 121153 -82320
7669h2320J2887M94227m0367l08321j82882m3367j40043J27312o5551j94112N45661
$$ -82320 -69433 424794 384427 76106 -106776 -150143 -290186 -162874 -228425 -422537 123124
7658A23124q4202l57486L21904L92249l69042R2241K12833l07479K63626r8771
$$ 123124 38922 -318564 3340 395589 26547 118788 331621 24142 287768 188997
7648A88997j98472j95259L51842J12397K007j37299J94559r7191M32221K85043
$$ 188997 -9475 -204734 147108 259505 261512 124213 318772 221581 653802 938845
7638I38845o50285l18519L33480r3479k44136m32188j62954q718N36518M92280
$$ 938845 288560 -29959 303521 210042 -34094 -466282 -629236 -637954 -101436 390844
7628C90844k28652n01562k10266J82801L01916J7276M9434M61172K7325n90409
$$ 390844 162192 -339370 -549636 -366835 -64919 -47643 1791 462963 490288 -100121
7618a00121p0947K7174J00692K42377l5692l17741K75276K35918l4966q4445k36634
$$ -100121 -171068 -143894 -43202 199175 163483 -154258 121018 356936 321970 237525 891
7607H91M55845J43465J55130p27629n05521K32981M93104n0171k82035l91604
$$ 891 456736 600201 755331 27702 -477819 -244838 248266 198095 -83940 -475544
7597d75544Q9927L29575J90492k46254o23202K57132K95528k65p1896k45517L2128
$$ -475544 -385617 -56042 134450 -111804 -735006 -477874 -182346 -182611 -254507 -500024 -467896
7586d67896L48196j02640K8902r8465L47990K69999k02038j13166R7154j19867
$$ -467896 -119700 -222340 -193438 -291903 56087 326086 124048 10882 108036 -11831
7576a1831K49449j24054n72735L35169P4555j54597L63691k73363k58661J89372
$$ -11831 237618 113564 -459171 -124002 -49447 -204044 159647 -113716 -372377 -183005
7566a83005L29441R9862k25045K3589L24219p1598k57462j11213k14699r441r8502
$$ -183005 146436 246298 21253 44842 369061 297463 40001 -71212 -285911 -295352 -393854
7555c93854O538q118J33204j1729k31474J19024Q812J74639K51371k7407O6200
$$ -393854 -387316 -395434 -262230 -273959 -505433 -386409 -377597 -202958 48413 21006 87206
7544H7206j50023r9227O57L62370l84012O0076L33717K760P0916K06756k15638
$$ 87206 -62817 -162044 -161387 200983 -183029 -122953 210764 213524 284440 491196 275558
7533B75558k63017M17346l91085l05655J96925j68125k28736Q0982r6668j21744
$$ 275558 12541 429887 38802 -266853 -69928 -238053 -466789 -385807 -482475 -604219
7523f04219N97797J91905j01625j27903l18869M00826J67213J8677j64943o2824
$$ -604219 -6422 185483 83858 -44045 -362914 37912 205125 223802 58859 -3965
7513c965L6131L8656k13779j55294k50645n2332N59235K54442l47492j55281K76027
$$ -3965 32166 70822 -142957 -298251 -548896 -601228 -41993 212449 -135043 -290324 -14297
7502a4297l5323k74579R1j68754j46972M32633k72074m68913L17377O79071J7469
$$ -14297 -49620 -324199 -324108 -492862 -639834 -207201 -479275 -948188 -630811 48260 65729
7491F5729L85184k02885k32675J19078J25346l70659K66919K88384P9902l27336
$$ 65729 450913 248028 15353 134431 259777 -110882 156037 444421 524323 196987
7481A96987q41169K48567L24863K54312K43681l00226m44086P65064J68131l68001
$$ 196987 -644182 -395615 -70752 183560 427241 127015 -317071 447993 616124 248123
7471B48123o02628J51870N03965J49169l87543p69842k79740M77810K58300R2397
$$ 248123 -354505 -202635 301330 450499 62956 -706886 -986626 -508816 -250516 -158119
7461a58119J14502k59119L88584L54869l45421l54133Q4184L40214J25281m73064
$$ -158119 -43617 -302736 85848 440717 95296 -258837 -174653 165561 290842 -182222
7451a82222k66237J90155J92649J60775j59047K02929j16747Q6494P6971k48011
$$ -182222 -448459 -258304 -65655 95120 -63927 139002 22255 108749 185720 -62291
7441f2291j02574K69544K30454o32865j37230k23627J60990L31527L39982N7594
$$ -62291 -164865 104679 335133 -297732 -434962 -658589 -497599 -166072 173910 231504
7431B31504J68432o15500j36665J00656p7143l7981N83516p2220o70474p2837
$$ 231504 399936 -215564 -352229 -251573 -328716 -366697 216819 144599 -525875 -598712
7421e98712j24609K32885r2895m7152q3764P3140J37873O30377l92575o05041
$$ -598712 -723321 -490436 -583331 -630483 -714247 -641107 -503234 127143 -265432 -870473
7411h70473M10006K97180K34228O5735r6307p01551j23345Q87801M05966r4258
$$ -870473 -460467 -163287 70941 136676 40369 -661182 -784527 103274 509240 414982
7401D14982L1108o09169o7324N43015L3952K73471J9931m21647p56586N86766
$$ 414982 446090 -163079 -230403 312612 346564 620035 639966 218319 -538267 48499
7391D8499L7808l72478K73527J19389M18912p5889k01099j64222J30256J973l65290
$$ 48499 86307 -286171 -12644 106745 525657 449768 248669 84447 214703 216676 -148614
7380a48614R5598j72476j51990J37108K67219q8629M63474j82310l81677R9606
$$ -148614 -53016 -225492 -377482 -240374 26845 -61784 401690 219380 -162297 -62691
7370f2691K48800J71813j38056J15122J20732k92958Q8386L31110k88320J48185
$$ -62691 186109 357922 219866 334988 455720 162762 251148 582258 293938 442123
7360D42123L64511j4270m40970j05367n2425J58242k53134J7639Q9329l4974L12324
$$ 442123 806634 792364 351394 246027 193602 351844 98710 116349 205678 170704 483028
7349D83028l28550j71326j05144r4306j90483J08980n0053m11129K79025M54236
$$ 483028 154478 -16848 -121992 -216298 -406781 -297801 -347854 -758983 -479958 -25722
7339b5722k95328j01786Q32197J06627l40071J97352n56421k12591M40289l06513
$$ -25722 -321050 -422836 409361 515988 175917 373269 -183152 -395743 44546 -261967
7329b61967O9836O9552J69514K10818K85475R3594m97200K30193L92854l70718
$$ -261967 -192131 -122579 46935 257753 543228 636822 139622 369815 762669 391951
7319C91951n83220K50900K17439j4072K89600j78109m14375N91070J97650l95852
$$ 391951 -191269 59631 277070 262998 552598 374489 -39886 551184 748834 352982
7309C52982j74535k24504J40758K72269m08137p9600J76713J7863Q9076j89207
$$ 352982 178447 -46057 94701 366970 -41167 -120767 55946 73809 162885 -26322
7299b6322k42419J05260M07572r2387k93226p5138M14199N5918K7875n21236r7903
$$ -26322 -268741 -163481 244091 151704 -141522 -216660 197539 253457 281332 -239904 -337807
7288c37807N32455N3232k10576n9189k84342K55202M45667k40884k42951O5040
$$ -337807 194648 247880 37304 -21885 -306227 -51025 394642 153758 -89193 -24153
7278b4153m9041J86953j76864k52901L37791J9606j76803k63113J08862N6463
$$ -24153 -73194 113759 -63105 -316006 21785 41391 -135412 -398525 -289663 -233200
7268b33200J66598M5338p19073J847Q90234K94309n04047m25116l2869J43881
$$ -233200 -66602 -21264 -740337 -738490 151744 446053 -57994 -483110 -515979 -372098
7258c72098N59347L02194m79750j67447N90567j46043l09871k48314j13555K89752
$$ -372098 187249 489443 9693 -157754 432813 286770 -23101 -271415 -384970 -95218
7248i5218J47743k47007m75781J55270J66988j69823K27811J67101L92052K21394
$$ -95218 52525 -194482 -670263 -514993 -348005 -517828 -290017 -122916 269136 490530
7238D90530n42621o97113k32953N87883l0716K10935L56608m32730K75700J72296
$$ 490530 -52091 -749204 -982157 -394274 -424990 -214055 142553 -290177 -14477 157819
7228A57819l79307k92144J60049K04431j08807J96701j6627l6835J31161J96453
$$ 157819 -221488 -513632 -353583 -149152 -257959 -61258 -77885 -114720 16441 212894
7218B12894l34322L20340J56090o82624K06446K2124j74877K29401M01647k45469
$$ 212894 -121428 198912 355002 -327622 -121176 -99052 -273929 -44528 357119 111650
7208A11650j65563j56798R1456J77804M13503n4022o3832j91231l63384j64361
$$ 111650 -53913 -210711 -119255 58549 472052 418030 354198 162967 -200417 -364778
7198c64778J65298M06981K95930m72989Q9724K73914k36894j02491Q9021M603
$$ -364778 -199480 207501 503431 30442 120166 394080 157186 54695 143716 148319
7188A48319J50783N88349p56376p15055J67396p4264r2831N29810l83614K0348
$$ 148319 299102 887451 131075 -583980 -416584 -490848 -583679 -53869 -437483 -417135
7178d17135J20324M9280n7015l6908L61859j19654O205j6243m04770k67097M11844
$$ -417135 -296811 -247531 -304546 -341454 20405 -99249 -93044 -109287 -514057 -781154 -369310
7167c69310L83768n10460R5620Q7497n04165m7955N58929j6316O6643L38070j02963
$$ -369310 14458 -496002 -400382 -312885 -817050 -865005 -306076 -322392 -255749 82321 -20642
7156b0642l47381j60985p5059j19643K7659M7028L30114K56829l0521j10003j63122
$$ -20642 -368023 -529008 -604067 -723710 -696051 -649023 -318909 -62080 -92601 -202604 -365726
7145c65726K77324J24830N15709o19309m04925K15040k60884J35448P3103l41394
$$ -365726 -88402 36428 552137 -67172 -472097 -257057 -517941 -382493 -309390 -650784
7135f50784L11629O87970J00122j22347j6841J3913l1912O5526m10066q7017m63538
$$ -650784 -339155 348815 448937 326590 309749 323662 291750 357276 -52790 -139807 -603345
7124f03345Q8665J73044O4294L52986J09209q9193l36643k60714L38380Q5003
$$ -603345 -514680 -341636 -277342 75644 184853 95660 -240983 -501697 -163317 -78314
7114g8314p3801p7307J48560j51849j94534L57006J22001J84933o0960L64977
$$ -78314 -152115 -229422 -80862 -232711 -427245 -70239 51762 236695 175735 540712
7104E40712M01131o38238n20542J08510n682K08185j15421p06539J6248Q44899
$$ 540712 941843 303605 -216937 -108427 -114109 94076 -21345 -727884 -711636 133263
7094A33263P9288p37634j80882J91176p9726N5919Q0446m77973K75493J70234
$$ 133263 212551 -525083 -705965 -514789 -594515 -538596 -458150 -936123 -660630 -490396
7084d90396m08162l02660L2330J84951L87420L63175J65374l36519J1040J48368
$$ -490396 -898558 -1201218 -1168888 -983937 -596517 -233342 -67968 -404487 -393447 -245079
7074b45079k3702o8789J51938L21426L17185k3719l13351j44572L06526j30840
$$ -245079 -268781 -337570 -185632 135794 452979 429260 115909 -28663 277863 147023
7064A47023j64715P8609m8661O9932n9877l50015k40878M46548N13209k55856
$$ 147023 -17692 60917 12256 82188 22311 -327704 -568582 -122034 391175 135319
7054A35319l45976k92078J0825N08622k62511o67416o7607M33170J728J60681
$$ 135319 -210657 -502735 -491910 16712 -245799 -913215 -980822 -547652 -545924 -385243
7044c85243m94568r0128O28607N65762m9053j05103L05882J00249M22021l30046
$$ -385243 -879811 -969939 -341332 224430 175377 70274 376156 476405 898426 568380
7034E68380k87457k78119J33739J41518k61700J76997N18448J68260J47354k90909
$$ 568380 280923 2804 136543 278061 16361 193358 711806 880066 1027420 736511
7024G36511m77213l70182M26503N01402p73949Q9646k4298k09603k28129j33512
$$ 736511 259298 -110884 315619 817021 43072 132718 108420 -101183 -329312 -462824
7014d62824m1871K18553M21516j05206l67196p0593J05997R2157K2811k15378
$$ -462824 -504695 -286142 135374 30168 -337028 -407621 -301624 -209467 -186656 -402034
7004d02034k27430o7388Q6264p8986l00652O58565O39064J22410J5943l95133
$$ -402034 -629464 -696852 -610588 -689574 -990226 -331661 307403 429813 445756 50623
6994E0623j9498M2802J324k80095L0898L93110J43958M1397p84275k37899L23376
$$ 50623 31125 73927 75251 -204844 -173946 219164 363122 404519 -379756 -617655 -294279
6983b94279N9354L42300j12484k56572L31688n645k52323l54430L18093J41295
$$ -294279 -234925 107375 -5109 -261681 70007 64362 -187961 -542391 -224298 -83003
6973h3003l25085J81540j71338L9830M26384o0955L8011j23880Q9571M18460j89830
$$ -83003 -408088 -226548 -397886 -358056 68328 7373 45384 -78496 11075 429535 239705
6962B39705n2208K68191j60532j98445J56755K0603k29613M31446k53205j65106
$$ 239705 187497 455688 295156 96711 253466 274069 44456 475902 222697 57591
6952E7591J67034l755k96273J67818M5600j55393K58082m6267o57305L43299K76007
$$ 57591 224625 220870 -75403 92415 138015 -17378 240704 194437 -462868 -119569 156438
6941A56438J08773k94435p3743j38951K09553J08860j41848Q0049J39332L90287
$$ 156438 265211 -29224 -102967 -241918 -32365 76495 -65353 14696 154028 544315
6931E44315k3322r5573j66028l49117j35057J08587n76898P8581N99728J22958
$$ 544315 520993 425420 259392 -89725 -224782 -116195 -693093 -614512 -14784 108174
6921A08174l89354L57036k0146J56314K6958n39486m49678J61445N04317k7000
$$ 108174 -281180 75856 55710 212024 238982 -300504 -750182 -588737 -84420 -111420
6911a11420k88639m4150r3000n6825K72973J03862j77285M40137J15943j05406
$$ -111420 -400059 -444209 -537209 -594034 -321061 -217199 -394484 45653 161596 56190
6901E6190P1748j78700l26312k22369j21152J37636j38932L9049J34465M49035
$$ 56190 127938 -50762 -377074 -599443 -720595 -582959 -721891 -682842 -548377 -99342
6891i9342j31977L26218L61628k57853l48573M30833k5902j66001J4316L3725
$$ -99342 -231319 94899 456527 198674 -149899 280934 255032 89031 103347 137072
6881A37072k5888k40932N3859N03009J59922J45732k70469J89242j79168L23166
$$ 137072 111184 -129748 -75889 427120 587042 732774 462305 651547 472379 795545
6871G95545J79191m64263N963K28392m8248k58488j07694k96715J22944M76475
$$ 795545 974736 510473 516436 744828 696580 438092 330398 33683 156627 633102
6861F33102l42016j58007N6619K06453K74597j60263R0505j22243m53531m65334
$$ 633102 291086 133079 189698 396151 670748 510485 600990 478747 25216 -440118
6851d40118J45550j37829n3505J97713M21336l27679R462j04805p7508p8544L35675
$$ -440118 -294568 -432397 -485902 -288189 133147 -194532 -185070 -289875 -367383 -445927 -110252
6840a10252L31811l73026j04921O75736k29671o5367r1033m73240K47504N72133
$$ -110252 221559 -151467 -256388 419348 189677 124310 33277 -439963 -192459 379674
6830C79674k87221l22529M8809n9385M84054K57604J01661l59585l85798l14698
$$ 379674 92453 -230076 -181267 -240652 243402 501006 602667 243082 -142716 -457414
6820d57414O6874K58096k13901l83046J82621M25525J41556M54219j74215q06434
$$ -457414 -390540 -132444 -346345 -729391 -546770 -121245 20311 474530 300315 -506119
6810e06119R288P63555j21839m64049k34705N3943l37396L20953J08082J42016
$$ -506119 -496831 266724 144885 -319164 -553869 -499926 -837322 -516369 -408287 -266271
6800b66271O3093O38517j20919K39931O03140j8171m55103j73089l13522J10688
$$ -266271 -203178 435339 314420 554351 1157491 1139320 684217 511128 197606 308294
6790C08294J9026p6652J49089n9074l9790P93898K00326o74897N2004l5428J92614
$$ 308294 327320 250668 399757 340683 300893 1094791 1295117 620220 672224 636796 829410
6779H29410N4376n03109m26944K38466k71708m46627L60762k36930k21827N64142
$$ 829410 883786 380677 -46267 192199 -79509 -526136 -165374 -402304 -624131 -59989
6769e9989q6811p893K54101K18486k90466J38358m50680j03157L6820k32290j90610
$$ -59989 -146800 -154693 99408 317894 27428 165786 -284894 -388051 -351231 -583521 -774131
6758g74131N37086j51873M61205R3755j52455k01755j10038k91016J4927O43394
$$ -774131 -237045 -388918 72287 166042 13587 -188168 -298206 -589222 -574295 69099
6748F9099r8535j73978k3034k94533k75439P06638K63994m00117J0158L51751
$$ 69099 -29436 -203414 -226448 -520981 -796420 -89782 174212 -225905 -215747 136004
6738A36004P0453J62064k8892k42558l3754J74428j26525k4879K96642l89239
$$ 136004 206457 368521 339629 97071 63317 237745 111220 86341 382983 -6256
6728f256n10205K61887M48774L2603J29051k14531l60044K88796M43157J2087
$$ -6256 -516461 -254574 194200 226803 355854 141323 -218721 70075 513232 525319
6718E25319o2982J774m7786k0831k41792m46812L04016M44321J16493m7466j00468
$$ 525319 462337 464111 416325 395494 153702 -293110 10906 455227 571720 524254 423786
6707D23786K50314K96127J00830J64201J06232j34173j99007J93764n42045k88734
$$ 423786 674100 970227 1071057 1235258 1341490 1207317 1008310 1202074 660029 371295
6697C71295L71817J24035j92259l7713J89060j67108O5904j31770P5361J44032
$$ 371295 743112 867147 674888 637175 826235 659127 725031 593261 668622 812654
6687H12654j64165l68941m76988j67570L54260p4041L18843J5155n43476L17245
$$ 812654 648489 279548 -197440 -365010 -10750 -84791 234052 249207 -294269 22976
6677B2976M03342l34083O737K09016J58686j10542l31866m13260M73400j56545
$$ 22976 426318 92235 98972 307988 466674 356132 24266 -388994 84406 -72139
6667g2139k05339L43355j18563j19292L01283J60768m67137L22034N58704l06198
$$ -72139 -277478 65877 -52686 -171978 129305 290073 -177064 144970 703674 397476
6657C97476N3615k47978q22756O7363K48870J06794L42691J38790l49549j13385
$$ 397476 451091 203113 -619643 -552280 -303410 -196616 146075 284865 -64684 -178069
6647a78069M3550j35926j35601N91392J98597l95300l43452K58305M52762j68606
$$ -178069 -134519 -270445 -406046 185346 383943 -11357 -354809 -96504 356258 187652
6637A87652k04704J88136K04879K69423r107k56853K61587L32086n4153l64723
$$ 187652 -17052 171084 375963 645386 636279 379426 641013 973099 918946 554223
6627E54223j24867m39000M64581N22926m43510n91538L27400L56286l7394l01925
$$ 554223 429356 -9644 454937 977863 534353 -57185 270215 626501 589107 287182
6617B87182l58423M22953K58458j9760k78736l77635L56454K55612k55079N7130
$$ 287182 -71241 351712 610170 590410 311674 -65961 290493 546105 291026 348156
6607C48156k04434N7218K2688L02270L21987J99962k078l7132o23278Q7444M76179
$$ 348156 143722 200940 223628 525898 847885 1047847 1045769 1008637 385359 472803 948982
6596I48982K28407k57133o4868l21410L84221j39213j93115n64899j0452L78630
$$ 948982 1177389 920256 855388 533978 918199 778986 585871 20972 10520 389150
6586C89150J0351K77289m56043J7867L6334J15036K2717j63922l93987J03773
$$ 389150 399501 676790 220747 238614 274948 389984 412701 248779 -145208 -41435
6576d1435j0663j8270p0345m5296j132O58093k78353n38619J5603O63749j80940
$$ -41435 -52098 -70368 -140713 -186009 -187141 470952 192599 -346020 -330417 333332 152392
6565A52392J39318K21466n92397O4331O84919l9598k51174K02014K73796r7320
$$ 152392 291710 513176 -79221 -14890 670029 630431 379257 581271 855067 757747
6555G57747J4732J51080J4826k03382J36256M63578m55531N5878j70243m68477
$$ 757747 772479 923559 938385 735003 871259 1334837 879306 935184 764941 296464
6545B96464L88170O44251n99840l24121M66415p2247l84506l4403k74139L3173
$$ 296464 684634 1328885 729045 404924 871339 799092 414586 380183 106044 139217
6535A39217M20272m02713l46635k86841K43606L84939P8318m1095q177N82213
$$ 139217 559489 156776 -189859 -476700 -233094 151845 230163 189068 180891 763104
6525G63104K5674m20913J92921K81649L21130K1112l99167j86202m13039K28449
$$ 763104 788778 367865 560786 842435 1163565 1184677 785510 599308 186269 414718
6515D14718P28739O656R7198j57071n2000k49478J39328L0651J9296j22634j12566
$$ 414718 1143457 1150113 1247311 1090240 1038240 788762 928090 958741 978037 855403 742837
6504G42837j2848J5690j1042m55283L6640Q2018L05429l26963j94749R7363K60547
$$ 742837 729989 745679 734637 279354 315994 398012 703441 376478 181729 279092 539639
6493E39639j44138K87728Q1803o8306J3375K0k89808k72276K44516L7889n5842
$$ 539639 395501 683229 765032 696726 710101 710121 420313 148037 392553 430442 374600
6482C74600K60822p2838l98898J87105L47326K38988k02812l13114N29418J75711
$$ 374600 635422 562584 163686 350791 698117 937105 734293 421179 950597 1126308
6472A126308m01278K97695q1859L1949L98187O9366l18190q1681N41010j02117
$$ 1126308 725030 1022725 940866 972815 1371002 1440368 1122178 1040497 1581507 1479390
6462A479390m62009J76077k34333L9623M79950l64692m12361M96427M81367K78189
$$ 1479390 1017381 1193458 959125 998748 1478698 1114006 701645 1198072 1679439 1957628
6452A957628k55615m76412j21740L07875o4357O6786M8878l42873k44324L6930
$$ 1957628 1702013 1225601 1103861 1411736 1347379 1414165 1463043 1120170 875846 912776
6442I12776j66334Q4237Q62203P5200p60707r9311J99554J4867K33947r3747J1187
$$ 912776 746442 830679 1692882 1768082 1007375 908064 1107618 1122485 1356432 1262685 1273872
6431A273872K95583O87984j71323o34807n77890j40064P08572K09059j74431j51579
$$ 1273872 1569455 2257439 2086116 1451309 873419 733355 1441927 1650986 1476555 1324976
6421A324976r2518L05884K14978k18957j92012M38513N00539j32811m68889j08442
$$ 1324976 1232458 1538342 1753320 1534363 1342351 1780864 2281403 2148592 1679703 1571261
6411A571261k9570l60639J06170O3871K8878J18160J97383r6883q09229M10932
$$ 1571261 1541691 1181052 1287222 1351093 1379971 1498131 1695514 1598631 789402 1200334
6401A200334M72746q750N703q6545j24140J95818j13722J63749j97411K7878K42738
$$ 1200334 1673080 1664330 1670033 1583488 1459348 1655166 1541444 1705193 1507782 1535660 1778398
6390A778398j46827o7217L98079k22084m32359J035270l8026n97405n0663J38607
$$ 1778398 1631571 1564354 1962433 1740349 1307990 2343260 2305234 1707829 1657166 1795773
6380A795773l03898K72494L8473L602L14602J84283l43390J01244J40087l25380
$$ 1795773 1491875 1764369 1802842 1806444 2121046 2305329 1961939 2063183 2203270 1877890
6370A877890K4204j21148j15803p3837j69949o8158K08890k43227j66540L60195
$$ 1877890 1902094 1780946 1665143 1591306 1421357 1353199 1562089 1318862 1152322 1512517
6360A512517N5329M90773L4621l82632K71054j10530J4425k5149M88139j37855
$$ 1512517 1567846 2058619 2093240 1710608 1981662 1871132 1885557 1860408 2348547 2210692
6350B210692r0042N5859J19823p0912J33131Q639N6021j16782J75809M78j73631
$$ 2210692 2120650 2176509 2296332 2225420 2358551 2367190 2423211 2306429 2482238 2482716 2309085
6339B309085P8606l63093p2269J73343k17199k75306J41678J40199n8948r0833
$$ 2309085 2387691 2024598 1952329 2125672 1908473 1633167 1774845 1915044 1856096 1765263
6329A765263L22605j78514K29744K93664k53871j44954L87599k03512l8440J83747
$$ 1765263 2087868 1909354 2139098 2432762 2178891 2033937 2421536 2218024 2179584 2363331
6319B363331J98460J07183J10011l84861L20206j65105l45501M13188K16889l80434
$$ 2363331 2561791 2668974 2778985 2394124 2714330 2549225 2203724 2616912 2833801 2453367
6309B453367J61106O3855j49591K83490L11816m92465k35216J52647k23108L10366
$$ 2453367 2614473 2678328 2528737 2812227 3124043 2631578 2396362 2549009 2325901 2636267
6299B636267J22838p4920K26703K21236n9085j36796Q2031l30644K78468K90219
$$ 2636267 2759105 2684185 2910888 3132124 3073039 2936243 3018274 2687630 2966098 3256317
6289C256317l40677m45132k35510M53333k2944k65907l52827P11194M52453K48496
$$ 3256317 2915640 2470508 2234998 2688331 2665387 2399480 2046653 2757847 3210300 3458796
6279C458796k38279l05953K29567K31091J50724J09947m10265j21336M45208j06856
$$ 3458796 3220517 2914564 3144131 3375222 3525946 3635893 3225628 3104292 3549500 3442644
6269C442644j46393K10741N7277O8323R2483J8314J68994q2770L54394k04555
$$ 3442644 3296251 3506992 3564269 3632592 3725075 3743389 3912383 3829613 4184007 3979452
6259C979452j7119j46831q996l96297R3712P85746L91491J0947P2916l49557k11967
$$ 3979452 3962333 3815502 3806506 3410209 3503921 4289667 4681158 4692105 4765021 4415464 4203497
6248D203497K98683j28755k44896K83210j39705M1663K64526m70758K79965J42148
$$ 4203497 4502180 4373425 4128529 4411739 4272034 4313697 4578223 4107465 4387430 4529578
6238D529578N66548M74133k0002m72646j6145m07438J15493L88546N97131q8978
$$ 4529578 5096126 5570259 5550257 5077611 5061466 4654028 4769521 5158067 5755198 5666220
6228E666220O9043M9039J70898K83967L16302K15792M6956m40236K57050L70952
$$ 5666220 5735263 5784302 5955200 6239167 6555469 6771261 6818217 6377981 6635031 7005983
6218G005983l26905R7988M70997n6787L23533O99072n63128n7558M56280k58370
$$ 7005983 6679078 6777066 7248063 7191276 7514809 8213881 7650753 7593195 8049475 7791105
6208G791105J26213M74964k86167L40379M49792k77433j69538P65516k37269N15113
$$ 7791105 7917318 8392282 8106115 8446494 8896286 8618853 8449315 9214831 8977562 9492675
6198I492675J34193j26212L05204L03243O0533M53016P2568J22647M51295L8960
$$ 9492675 9626868 9500656 9805860 10109103 10169636 10622652 10695220 10817867 11269162 11308122
6188A1308122J53014M07350J62166K11205P76165q9214M48262P80830j42372J78353
$$ 11308122 11461136 11868486 12030652 12241857 13018022 12928808 13377070 14157900 14015528 14193881
6178A4193881N77256J31303m4271K65317N56745K69658R27911O82484J64429N43208
$$ 14193881 14771137 14902440 14858169 15123486 15680231 15949889 16877800 17560284 17724713 18267921
6168A8267921L11052L10568R25518M2514L34152O04908R91821N44960P56084Q12981
$$ 18267921 18578973 18889541 19815059 19857573 20191725 20796633 21788454 22333414 23089498 23902479
6158B3902479J109163J633508J115229Q42952O73510O57257J586261J906209J176341
$$ 23902479 25011642 26645150 27760379 28603331 29276841 29934098 31520359 33426568 34602909
6149C4602909J344821J670247K472406J884812J736481J885118K367990K658455
$$ 34602909 35947730 37617977 40090383 41975195 43711676 45596794 47964784 50623239
6141E0623239K592358K205750J419728J553733K208501J466305J545964R40037
$$ 50623239 53215597 55421347 56841075 58394808 60603309 62069614 63615578 64555615
6133F4555615M4094k5309L82074n86367m34689M14935L83681r4408K83755P67538
$$ 64555615 64599709 64574400 64956474 64370107 63935418 64350353 64734034 64639626 64923381 65690919
6123F5690919O62718J038785J516723J618073K162876L050925K471824K507597
$$ 65690919 66353637 67392422 68909145 70527218 72690094 75741019 78212843 80720440
6115H0720440L513376M013772M353898N169163M564256M851601M879501N502978
$$ 80720440 84233816 88247588 92601486 97770649 102334905 107186506 112066007 117568985
6107A17568985N050720M707397L122172J982144J307960k67375j591180k038506
$$ 117568985 122619705 127327102 130449274 132431418 133739378 133472003 131880823 129842317
6099A29842317l234211l351708l899734m329328l688918m189878l290270k510838
$$ 129842317 126608106 123256398 119356664 115027336 111338418 107148540 103858270 101347432
6091A01347432k100530k035036r32189j041726o76512k04179P71750J335002K090794
$$ 101347432 99246902 97211866 96279677 95237951 94561439 94357260 95129010 96464012 98554806
6082I8554806K594308K841573K880108L695241L921100M018533M158427L298215
$$ 98554806 101149114 103990687 106870795 110566036 114487136 118505669 122664096 125962311
6074A25962311L012961K363773J195263M39110j216010k363251l576607m354052
$$ 125962311 128975272 131339045 132534308 132973418 131757408 129394157 125817550 121463498
6066A21463498n047296n004742n897223o065004m954601m500710m506021l837904
$$ 121463498 116416202 111411460 105514237 99449233 94494632 89993922 85487901 81649997
6058H1649997m023134l944591k614661k140979k452234j666213q61218j534123
$$ 81649997 77626863 73682272 71067611 68926632 66474398 64808185 63946967 62412844
6050F2412844n68298j193936l31605Q2443M19846J77412L08421l14339J3905K58353
$$ 62412844 61844546 60650610 60319005 60401448 60821294 60998706 61307127 60992788 61006693 61265046
6040F1265046p23948m00069j363089k021111j822959j972167k317136k623024
$$ 61265046 60541098 60141029 58777940 56756829 54933870 52961703 50644567 48021543
6032D8021543j783081k445786k048781k135937k571715j949756j384522j867179
$$ 48021543 46238462 43792676 41743895 39607958 37036243 35086487 33701965 31834786
6024C1834786j288890r65002j265455j304613j318062j096630p86312l85043o04994
$$ 31834786 30545896 29580894 28315439 27010826 25692764 24596134 23809822 23424779 22819785
6015B2819785p55871j177944m25034n46327k70108j003792o76180p97363n15199
$$ 22819785 22063914 20885970 20460936 19914609 19644501 18640709 17964529 17167166 16651967
6006A6651967m80154q19559o99049n49886L36761q2955n83434n76378j43697L9127
$$ 16651967 16171813 15352254 14653205 14103319 14440080 14357125 13773691 13197313 13053616 13092743
5996A3092743J04264r6916m54841k49907k17120r8269j32853l48335m81886L34557
$$ 13092743 13197007 13100091 12645250 12395343 12178223 12079954 11947101 11598766 11116880 11451437
5986A1451437J64114m1846k80226m13391K3409R3988l54075J73068j59419o52506
$$ 11451437 11615551 11573705 11293479 10880088 10903497 10997485 10643410 10816478 10657059 10004553
5976A0004553j2924l91646J07182m6892j92560m74629j92998l23156J2294J56593
$$ 10004553 9991629 9599983 9707165 9660273 9467713 8993084 8800086 8476930 8489224 8645817
5966H645817l94024l15491J03408K78434J03841K2534n80353J62029J58555O72894
$$ 8645817 8251793 7936302 8039710 8318144 8421985 8444519 7864166 8026195 8184750 8857644
5956H857644K18331N1039l1591j37384J53832m54287R5824M9812K9535L55206
$$ 8857644 9075975 9127014 9095423 8958039 9111871 8657584 8753408 8803220 8832755 9187961
5946I187961m2271k18299m93364j05624l42620m75285M98549l70785l40744J71408
$$ 9187961 9145690 8927391 8434027 8328403 7985783 7510498 8009047 7638262 7297518 7468926
5936G468926p6336k25404r6946R3753k0497N7897n18157m49188k94905k54389
$$ 7468926 7392590 7167186 7070240 7163993 7143496 7201393 6683236 6234048 5939143 5684754
5926E684754L67601m34967j53037p7864M42242P79q3798M6564l3048j72909O72976
$$ 5684754 6052355 5617388 5464351 5386487 5828729 5829508 5745710 5792274 5759226 5586317 6259293
5915F259293K76072p6103o65935o60292O0312k26038J11548K30538O9831K31538
$$ 6259293 6535365 6459262 5793327 5133035 5193347 4967309 5078857 5309395 5379226 5610764
5905E610764K23217m74102k47917K45992l91324m50791k07286l2787j92358K05302
$$ 5610764 5833981 5359879 5111962 5357954 4966630 4515839 4308553 4275766 4083408 4288710
5895D288710o7665l98128k3168M93228L16404K7596K38023o74330o4688M845j96871
$$ 4288710 4221045 3822917 3799749 4292977 4609381 4636977 4875000 4200670 4135982 4140827 3943956
5884C943956l49504L28637j43823n4980q9057k91947m29676N90210O7966k33926
$$ 3943956 3594452 3923089 3779266 3724286 3635229 3343282 2913606 3503816 3571782 3337856
5874C337856K56682M54113q01563l6283J38690o74352M72256L48950m16161n85320
$$ 3337856 3594538 4048651 3247088 3210805 3349495 2675143 3147399 3496349 3080188 2494868
5864B494868K75934J18881K27449R2459o1880J2383p4236K05389K99914p51884
$$ 2494868 2770802 2889683 3117132 3209591 3147711 3160094 3085858 3291247 3591161 2839277
5854B839277k74338P81115K00262J81583L49848l89837m08733L30298l1165k77850
$$ 2839277 2564939 3346054 3546316 3727899 4077747 3687910 3279177 3609475 3578310 3300460
5844C300460K88998k34053l53957L47821M92694l23739k70653l360K23250J16559
$$ 3300460 3589458 3355405 3001448 3349269 3841963 3518224 3247571 3244211 3467461 3584020
5834C584020k03946j66254o5199j7660L06285R451O3654L5539J65970L72560m936
$$ 3584020 3380074 3213820 3148621 3130961 3437246 3446697 3510351 3545890 3711860 4084420 4079484
5823D079484J61296j03521l5225J22029k12680L07618R3172K61151Q40885j65870
$$ 4079484 4240780 4137259 4102034 4224063 4011383 4319001 4412173 4673324 5514209 5348339
5813E348339l9995j82737q4830J12643J11663M5319K59094j43245k58130n2463
$$ 5348339 5308344 5125607 5040777 5153420 5265083 5310402 5569496 5426251 5168121 5115658
5803E115658K95029r8023M07663J69474J16177j26462K07327k1821l58050O28199
$$ 5115658 5410687 5312664 5720327 5889801 6005978 5879516 6086843 6065022 5706972 6335171
5793F335171K18742L34197J53826l28415l57561O63620L83211K28191n3295L11067
$$ 6335171 6553913 6888110 7041936 6713521 6355960 7019580 7402791 7630982 7577687 7888754
5783G888754O11956P02809L00635J38681J97799N16685R42331N57564K44346M90812
$$ 7888754 8500710 9203519 9504154 9642835 9840634 10357319 11299650 11857214 12101560 12592372
5773A2592372P90413O74484J256559J388538P87079M97069L72956J029177J533393
$$ 12592372 13382785 14057269 15313828 16702366 17489445 17986514 18359470 19388647 20922040
5764B0922040J724157J403511J145935J379957J455962J251292J251394R02119
$$ 20922040 22646197 24049708 25195643 26575600 28031562 29282854 30534248 31436367
5756C1436367O42296K03355k99738p56215j446050j223524j718960j775744j835709
$$ 31436367 32078663 32282018 31982280 31226065 29780015 28556491 26837531 25061787 23226078
5747B3226078j780350j306539j079477j367924j197468j390393p06961o46860
$$ 23226078 21445728 20139189 19059712 17691788 16494320 15103927 14396966 13750106
5739A3750106r97481o01871m28816r35406o50144L49204n87270q17633j36536
$$ 13750106 12752625 12150754 11721938 10786532 10136388 10485592 9898322 9080689 8944153
5730H944153l43681m96184k7740r0680l30808k75929j60281r47494Q9969J44618
$$ 8944153 8600472 8104288 8076548 7985868 7655060 7379131 7218850 6271356 6361325 6505943
5720F505943l37829m14010L06410j43838R7508L3092k57230l46026K4837L18235
$$ 6505943 6168114 5754104 6060514 5916676 6014184 6047276 5790046 5444020 5468857 5787092
5710E787092o34919k55678l68530j15447k19319J64847m6667k20041K20281O5963
$$ 5787092 5152173 4896495 4527965 4412518 4193199 4358046 4311379 4091338 4311619 4377582
5700D377582p35527k80859J41345J05368J73885l9520l96166j19718K33378l76792
$$ 4377582 3642055 3361196 3502541 3607909 3781794 3742274 3346108 3226390 3459768 3082976
5690C082976L1554N0901j80656m68530o4315L66713n3219p3359J69591J99864
$$ 3082976 3114530 3165431 2984775 2516245 2451930 2818643 2765424 2692065 2861656 3061520
5680C061520j0232J41679q0817j73676k13868M05227J27127k57388N51972j31486
$$ 3061520 3051288 3192967 3112150 2938474 2724606 3129833 3256960 2999572 3551544 3420058
5670C420058n12947j0188K30783k07164K03955k13970o6622J79089K13283k35810
$$ 3420058 2907111 2896923 3127706 2920542 3124497 2910527 2843905 3022994 3236277 3000467
5660C000467p275k71719m73781p4786K09851J94751J27310J47291l68163j1582
$$ 3000467 2993192 2721473 2247692 2172906 2382757 2577508 2704818 2852109 2483946 2472364
5650B472364K23108J17852j36805n22765j54347M38337K64870k59520l58303k926
$$ 2472364 2695472 2813324 2676519 2153754 1999407 2437744 2702614 2443094 2084791 2081865
5640B081865n9530N41046J23050K62507k8870k6014m08228J05883L17236J16194
$$ 2081865 2022335 2563381 2686431 2948938 2920068 2894054 2485826 2591709 2908945 3025139
5630C025139p3150k69172m31936M81164M10466l23116j77714J50377l54793J9857
$$ 3025139 2951989 2682817 2250881 2732045 3142511 2819395 2641681 2792058 2437265 2457122
5620B457122L74355m96399l99847k75796N8034j6300J16198K48404q3713l09979
$$ 2457122 2831477 2335078 1935231 1659435 1717469 1701169 1817367 2065771 1982058 1672079
5610A672079J72474K71134j29219P9203K05380m7211k88140M89656O0544m65448
$$ 1672079 1844553 2115687 1986468 2065671 2271051 2223840 1935700 2425356 2485900 2020452
5600B020452K51878K2834m20966J70581O52908N88645J65568n81688p2151L45138
$$ 2020452 2272330 2295164 1874198 2044779 2697687 3286332 3451900 2870212 2798061 3143199
5590C143199j75480M25646n5055q92040M18740O00097n31445O719j22315n04248
$$ 3143199 2967719 3393365 3338310 2446270 2865010 3465107 2933662 2940381 2818066 2313818
5580B313818O03260L70090m72287n01160j72924p4787L34433M04532k15427L50818
$$ 2313818 2917078 3287168 2814881 2313721 2140797 2066010 2400443 2804975 2589548 2940366
5570B940366l45056m54290j37076j12410k60564M12398M11764l25533J3074M82609
$$ 2940366 2595310 2141020 2003944 1891534 1630970 2043368 2455132 2129599 2142673 2625282
5560B625282q8092l38371K37661R5585J48154j89389O7910k63450l13760r226
$$ 2625282 2537190 2198819 2436480 2532065 2680219 2490830 2558740 2295290 1981530 1972304
5550A972304M23332L12550r4857O67942k51043n83585L67068r66j17035K80914
$$ 1972304 2395636 2708186 2613329 3281271 3030228 2446643 2813711 2812745 2695710 2976624
5540B976624l6145n50016J34519j35166J26466k04943o4177J77175l1118k29885
$$ 2976624 2940479 2390463 2524982 2389816 2516282 2311339 2247162 2424337 2393219 2163334
5530B163334M58513J53817j98833M07161j11342l77445N34190J87890Q541l31327
$$ 2163334 2621847 2775664 2576831 2983992 2872650 2495205 3029395 3217285 3225826 2894499
5520B894499l85504J2337K90555K84107J76923j8261j86264j2734N47893l57760
$$ 2894499 2508995 2521332 2811887 3095994 3272917 3254656 3068392 3055658 3603551 3245791
5510C245791k65668j50855l30308P9640N67399p5278J21819M23820j84105j99568
$$ 3245791 2980123 2829268 2498960 2578600 3145999 3070721 3192540 3616360 3432255 3232687
5500C232687M05836O69696m20674n0939o50007j89002K51101O47872j80193j88073
$$ 3232687 3638523 4308219 3887545 3836606 3186599 2997597 3248698 3896570 3716377 3528304
5490C528304l33819m1854R990J31685K47363j71981L15527K54289N1882o22092
$$ 3528304 3194485 3152631 3162621 3294306 3541669 3369688 3685215 3939504 3991386 3369294
5480C369294r1495n90420K98096N40912K50341k6332q5373J29940r7286L67283
$$ 3369294 3277799 2687379 2985475 3526387 3776728 3750396 3665023 3794963 3697677 4064960
5470D064960M09276k86497l9297J28708k27648O1682l33555J78341j66540m1196
$$ 4064960 4474236 4187739 4148442 4277150 4049502 4111184 3777629 3955970 3789430 3748234
5460C748234P27939k68674j72091P7459K11100j56339o1041J43846J14306L81150
$$ 3748234 4476173 4207499 4035408 4112867 4323967 4167628 4106587 4250433 4364739 4745889
5450D745889J00782q17982n4132M16216K3394j9498j94652l87742J05604L19972
$$ 4745889 4846671 4028689 3974557 4390773 4414167 4394669 4200017 3812275 3917879 4237851
5440D237851J13919M21398m23014K18870l8173j11555J90382L25293p03838M78234
$$ 4237851 4351770 4773168 4350154 4569024 4530851 4419296 4609678 4934971 4231133 4709367
5430D709367L14281k45216j86299J12053L18763j41332L82182M98894k41223n3636
$$ 4709367 5023648 4778432 4592133 4704186 5022949 4881617 5263799 5762693 5521470 5467834
5420E467834k38581m17535J92876N34183j2646p8017O941J28051j56754m8727
$$ 5467834 5229253 4811718 5004594 5538777 5526131 5448114 5455055 5583106 5426352 5377625
5410E377625J40270K74241L00643m75173k42674l15335L67826L02378O7350k41487
$$ 5377625 5517895 5792136 6092779 5617606 5374932 5059597 5427423 5729801 5797151 5555664
5400E555664j9688k07959K49391k1108k18863L46915O39708j13727k02476M37798
$$ 5555664 5535976 5328017 5577408 5556300 5337437 5684352 6324060 6210333 6007857 6445655
5390F445655k19296N1521j48222J47296J17804M42207l63649O7741r8817k17182
$$ 6445655 6226359 6277880 6129658 6276954 6394758 6836965 6473316 6541057 6442240 6225058
5380F225058K17302N43192M51675n9055m02317l69233K84989j66848N2126P9270
$$ 6225058 6442360 6985552 7437227 7378172 6975855 6606622 6891611 6724763 6776889 6856159
5370F856159j81359L7595M17135j32751n56125J41283O91901J32538k4129K27650
$$ 6856159 6674800 6712395 7129530 6996779 6440654 6581937 7273838 7406376 7382247 7609897
5360G609897l94140j29939M58198L38768m28837j4708L82087O8118l5307L65028
$$ 7609897 7215757 7085818 7544016 7882784 7453947 7439239 7821326 7889444 7854137 8219165
5350H219165M37893o4104O39429j35771p07031l18318O13815L89926K9576r8141
$$ 8219165 8657058 8592954 9232383 9096612 8389581 8071263 8685078 9075004 9104580 9006439
5340I006439J20055Q8060L62322j16064k92171r1634M93236L44722o11172k90321
$$ 9006439 9126494 9214554 9576876 9460812 9168641 9077007 9570243 9914965 9303793 9013472
5330I013472O47516l44854j65573M99949p4866K66245J59962o1763l67078M90010
$$ 9013472 9660988 9316134 9150561 9650510 9575644 9841889 10001851 9940088 9573010 10063020
5320A0063020L39929K63866K72132n54658o8347N53911J64069K24054L020k90138
$$ 10063020 10402949 10666815 10938947 10384289 10315942 10869853 11033922 11257976 11260996 10970858
5310A0970858L14696O11030J75310J93233k21941j56583M53953J07033K90392
$$ 10970858 11285554 11896584 12071894 12265127 12043186 11886603 12340556 12447589 12737981
5301A2737981L28K41572j23093K21936P3825K72573O65242K03387o61374J04446
$$ 12737981 12738309 12979881 12856788 13078724 13152549 13425122 14090364 14293751 13632377 13736823
5291A3736823K91466P478M88474O46697j13316N1311Q96670J66728L25584K72170
$$ 13736823 14028289 14035767 14524241 15170938 15057622 15108933 16005603 16172331 16497915 16770085
5281A6770085J89469m3773O30661N94813R110p4980M18198O91370R6364P80221
$$ 16770085 16959554 16915781 17546442 18141255 18150365 18075385 18493583 19184953 19281317 20061538
5271B0061538K81500J85335K72311P13329K11861n6741M71710L91195Q7813K47685
$$ 20061538 20343038 20528373 20800684 21514013 21725874 21669133 22140843 22532038 22619851 22867536
5261B2867536M69201M40899P47334L20011L41805L9103M77636N56098P35798O4634
$$ 22867536 23336737 23777636 24524970 24844981 25186786 25225889 25703525 26259623 26995421 27060055
5251B7060055K78442N87174Q48104O98155N66132R1155M66644Q89278Q33807P68403
$$ 27060055 27338497 27925671 28773775 29471930 30038062 30129217 30595861 31485139 32318946 33087349
5241C3087349P83406Q55517P56106P97509N46361P81949P49837Q76563J028122
$$ 33087349 33870755 34726272 35482378 36279887 36826248 37608197 38358034 39234597 40262719
5232D0262719J066112L84865J320069J671811N86877Q34431J415036J084328J389556
$$ 40262719 41328831 41713696 43033765 44705576 45292453 46126884 47541920 48626248 50015804
5223E0015804J357614P47769Q66484J536112J511128J321665J711258J273184
$$ 50015804 51373418 52121187 52987671 54523783 56034911 57356576 59067834 60341018
5215F0341018J582758J632845K079745K037288J329137J593521K487598K480957
$$ 60341018 61923776 63556621 65636366 67673654 69002791 70596312 73083910 75564867
5207G5564867J626098K870311K609734K192639K552809K880831K843395K826644
$$ 75564867 77190965 80061276 82671010 84863649 87416458 90297289 93140684 95967328
5199I5967328L310803L155468L713016M002385L908383L518526M031624M577647
$$ 95967328 99278131 102433599 106146615 110149000 114057383 117575909 121607533 126185180
5191A26185180M840300M960334M896317N231471O017381O069981N796094N968964
$$ 126185180 131025480 135985814 140882131 146113602 152130983 158200964 163997058 169966022
5183A69966022O681533P173239P150191O922588O816538P247723Q357265P364336
$$ 169966022 176647555 183820794 190970985 197893573 204710111 211957834 220315099 227679435
5175B27679435P815604P448588O864554O929415N995689N204101N121735M096468
$$ 227679435 235495039 242943627 249808181 256737596 262733285 267937386 273059121 277155589
5167B77155589L276970J836230M93130l03896j451422k635835l646021m664174
$$ 277155589 280432559 282268789 282761919 282458023 281006601 278370766 274724745 270060571
5159B70060571n300393o033428p049817p872139q372956p603698p532113q075583
$$ 270060571 264760178 258726750 251676933 243804794 235431838 227828140 220296027 212220444
5151B12220444q402798q556979p931707p068148p289105p471931o883921o578698
$$ 212220444 203817646 195260667 187328960 180260812 172971707 165499776 158615855 152037157
5143A52037157o242903o304324n693985n480548n204428m613120m528863m237607
$$ 152037157 145794254 139489930 133795945 128315397 123110969 118497849 113968986 109731379
5135A09731379m749986l961710l533912l448809l494151k956320l535711k925389
$$ 109731379 104981393 101019683 97485771 94036962 90542811 87586491 84050780 81125391
5127H1125391l013117k585223k498187k223372k044211k005239k376129k365286
$$ 81125391 78112274 75527051 73028864 70805492 68761281 66756042 64379913 62014627
5119F2014627j617003j560892j624851j649044j497949j742370r86679j407651
$$ 62014627 60397624 58836732 57211881 55562837 54064888 52322518 51335839 49928188
5111D9928188j756381j412654j369723j185304j207694j060674j046438j092986
$$ 49928188 48171807 46759153 45389430 44204126 42996432 41935758 40889320 39796334
5103C9796334j457521o04419n72016j208607j042113l23046q89121q52302o09162
$$ 39796334 38338813 37734394 37162378 35953771 34911658 34588612 33699491 32847189 32238027
5094C2238027j117014p30555J18275r90804j130428r2919n29918j85509n08477
$$ 32238027 31121013 30390458 30508733 29517929 28387501 28294582 27764664 27579155 27070678
5085B7070678q79455q34273k75293J88817m25571m29677p77334Q839m25734l57734
$$ 27070678 26191223 25356950 25081657 25270474 24844903 24415226 23637892 23646731 23220997 22863263
5075B2863263m18423n65652o2437N7876n17401n23996k55521k27868m10968L52533
$$ 22863263 22444840 21879188 21816751 21874627 21357226 20833230 20577709 20349841 19938873 20291406
5065B0291406n88620q14904m41573l39986J24013m72736o7163m52820k26952k62460
$$ 20291406 19702786 18887882 18446309 18106323 18230336 17757600 17690437 17237617 17010665 16748205
5055A6748205p0936l05624J28142l14828j71769l96261j97841k44960j27409m07818
$$ 16748205 16677269 16371645 16499787 16184959 16013190 15616929 15419088 15174128 15046719 14638901
5045A4638901J32925o5935J77990k43855n1343j76350J76586j67336R9305k09929
$$ 14638901 14771826 14705891 14883881 14640026 14588683 14412333 14588919 14421583 14520888 14310959
5035A4310959l67658J02914k31575l79731k17016k9806o21644k14443P65J34003
$$ 14310959 13943301 14046215 13814640 13434909 13217893 13188087 12566443 12352000 12352765 12486768
5025A2486768J08435J12487m86684j20354k5426J13941l67568j72258j80526j55715
$$ 12486768 12595203 12707690 12221006 12100652 12075226 12189167 11821599 11649341 11468815 11313100
5015A1313100j65808k78241k16312J87696N0753j9430L699n4073j96280l48187
$$ 11313100 11147292 10869051 10652739 10840435 10891188 10871758 10875457 10821384 10625104 10276917
5005A0276917j36813l28353J52651O4825N72408k49595p05112K48629k95086J29383
$$ 10276917 10140104 9811751 9964402 10029227 10601635 10352040 9646928 9895557 9600471 9729854
4995I729854L95257J73303K13056J57096j16108m67280p4466K19431J56793k82055
$$ 9729854 10125111 10298414 10511470 10668566 10552458 10085178 10010712 10230143 10386936 10104881
4985A0104881K18054J8897j3706l82389j71269l9418m900L24831r7392m14914
$$ 10104881 10322935 10341832 10328126 9945737 9774468 9735050 9730150 10054981 9957589 9542675
4975I542675q9397j00711j5490L3495L0272o86464l37026L74292m16575J8538
$$ 9542675 9453278 9352567 9337077 9370572 9400844 8714380 8377354 8751646 8335071 8353609
4965H353609K63012J9963q22810j86246k49139L16422K43315K78859j38908j07333
$$ 8353609 8616621 8636584 7813774 7627528 7378389 7694811 7938126 8216985 8078077 7970744
4955G970744K97016j05352r56096M41160P80088j65647K61391l76983n00483N61796
$$ 7970744 8267760 8162408 7206312 7647472 8427560 8261913 8523304 8146321 7645838 8207634
4945H207634K40392k29066j55627j53914J34257N20267O3250j044472n12667N00812
$$ 8207634 8448026 8218960 8063333 7909419 8043676 8563943 8627193 7582721 7070054 7570866
4935G570866N11330N8110n56766o10019K04874r3322K25389M1310n86062m6078
$$ 7570866 8082196 8140306 7583540 6973521 7178395 7085073 7310462 7351772 6765710 6719632
4925F719632O96747p71695j67202K75883J03131L06764L44544j36755m47634L1867
$$ 6719632 7416379 6644684 6477482 6753365 6856496 7163260 7507804 7371049 6923415 6955282
4915F955282m43195K58810j4321L03843L41670o5505k79298J37106P6021j71262
$$ 6955282 6512087 6770897 6756576 7060419 7402089 7336584 7057286 7194392 7270413 7099151
4905G099151N88053j75056p2635Q19733m5149l78998L15904m95202n8320L93025
$$ 7099151 7687204 7512148 7439513 8259246 8214097 7835099 8151003 7655801 7597481 7990506
4895G990506J09865j14440P9651J78350M652j8875m6676O7672L16010m391p5816
$$ 7990506 8100371 7985931 8065582 8243932 8248584 8229709 8183033 8250705 8566715 8562324 8486508
4884H486508k10033j05053N67807N02975q36582k17429M3233K36934M86966Q8093
$$ 8486508 8276475 8171422 8739229 9242204 8405622 8188193 8231426 8468360 8955326 9043419
4874I043419o83082L41181L26960l5086Q77472N79150n46015k52780O60055l56320
$$ 9043419 8360337 8701518 9028478 8993392 9870864 10450014 9903999 9651219 10311274 9954954
4864I954954M59727L83465o2334j13319L38973K98019L14125N0436K01065J24141
$$ 9954954 10414681 10798146 10735812 10622493 10961466 11259485 11573610 11624046 11825111 11949252
4854A1949252L2420L50706J07044k2345J71022M7961N82822K27195N1119L06776
$$ 11949252 11981672 12332378 12439422 12417077 12588099 12636060 13218882 13446077 13497196 13803972
4844A3803972N29448K21670N10480J11888j90080K71888O93992J17606N22915
$$ 13803972 14333420 14555090 15065570 15177458 14987378 15259266 15953258 16070864 16593779
4835A6593779M66235L71237P81001R00565K08326O14427O53513J434672J650998
$$ 16593779 17060014 17431251 18212252 19112817 19321143 19935570 20589083 22023755 23674753
4826B3674753O39578N29448Q24431J464478J397219J476056Q07365P35222R53779
$$ 23674753 24314331 24843779 25668210 27132688 28529907 30005963 30813328 31548550 32502329
4817C2502329Q12501k11302j90122n58230l00360n94069p82071q58098r80415
$$ 32502329 33314830 33103528 32913406 32355176 32054816 31460747 30678676 29820578 28840163
4808B8840163q53984j346862j043984j078448k61147o43740j100652n43614m71262
$$ 28840163 27986179 26639317 25595333 24516885 24255738 23611998 22511346 21967732 21496470
4799B1496470K79350k20215p65739l35128J88357K67482P8441m77855p87223p6930
$$ 21496470 21775820 21555605 20789866 20454738 20643095 20910577 20989018 20511163 19723940 19647010
4789A9647010O75381j7762j3839j24005r6959M34048M25361n48325m9792M70244
$$ 19647010 20322391 20304629 20290790 20166785 20069826 20503874 20929235 20380910 20331118 20801362
4779B0801362q3655j1654J92431m43619R2569O85105L13488k6310K39990K17981
$$ 20801362 20717707 20706053 20898484 20454865 20547434 21232539 21546027 21519717 21759707 21977688
4769B1977688M93570N12856k69560K95266Q08435K75870N90915M39030L05800
$$ 21977688 22471258 22984114 22714554 23009820 23818255 24094125 24685040 25124070 25429870
4760B5429870M68614M96300Q45035Q67697N75403R13667N64495K83191N74252
$$ 25429870 25898484 26394784 27239819 28107516 28682919 29596586 30161081 30444272 31018524
4751C1018524J033483Q79584M64475K86126P91085P81088R68665J064313O42282
$$ 31018524 32052007 32931591 33396066 33682192 34473277 35254365 36223030 37287343 37929625
4742C7929625N53727J237850J326746P15213J194615J467964J218558J379459
$$ 37929625 38483352 39721202 41047948 41763161 42957776 44425740 45644298 47023757
4734D7023757J956591J249026J206933J999680K072257J676177K754611K178981
$$ 47023757 48980348 50229374 51436307 53435987 55508244 57184421 59939032 62118013
4726F2118013K360598K372822K046954K389091K666547K278649K523296K516965
$$ 62118013 64478611 66851433 68898387 71287478 73954025 76232674 78755970 81272935
4718H1272935K647569K433160K334881K762630K496012K615197K058717K257520
$$ 81272935 83920504 86353664 88688545 91451175 93947187 96562384 98621101 100878621
4710A00878621K344656J613147K349507K246620J865657K210786K323869K080013
$$ 100878621 103223277 104836424 107185931 109432551 111298208 113508994 115832863 117912876
4702A17912876J828696K022773K536551K554867L221109K547855K767428K866401
$$ 117912876 119741572 121764345 124300896 126855763 130076872 132624727 135392155 138258556
4694A38258556K399711K389179K794751K586899J913193J921578J253592J118740
$$ 138258556 140658267 143047446 145842197 148429096 150342289 152263867 153517459 154636199
4686A54636199P94718P85219L74531R72o8075o69594j043835j260921j795594
$$ 154636199 155430917 156216136 156590667 156591639 156523564 155853970 154810135 153549214 151753620
4677A51753620k109644j324962q72743k054809k554500k086088j937965k040877
$$ 151753620 149643976 148319014 147446271 145391462 142836962 140750874 138812909 136772032
4669A36772032j716742k529690k153165k253230k200513k091094k982955k727562
$$ 136772032 135055290 132525600 130372435 128119205 125918692 123827598 120844643 118117081
4661A18117081j812700l009104l061792k339336l045017l340379k640604l417682
$$ 118117081 116304381 113295277 110233485 107894149 104849132 101508753 98868149 95450467
4653I5450467l375642k236907l008059l283204k198143k106722k890228k326030
$$ 95450467 92074825 89837918 86829859 83546655 81348512 79241790 76351562 74025532
4645G4025532k373992k350483j617540j435359k282026j553745r08959j134583
$$ 74025532 71651540 69301057 67683517 66248158 63966132 62412387 61503428 60368845
4637F0368845q79789j236438r18875o12018l07070o82517m93227o18750j74655
$$ 60368845 59489056 58252618 57333743 56721725 56414655 55732138 55238911 54620161 54445506
4628E4445506L66291j02181k25448K91166J82500l55149J48449N4600k55298O7155
$$ 54445506 54811797 54709616 54484168 54775334 54957834 54602685 54751134 54805734 54550436 54617591
4618E4617591N50577j72267l0548n7331j27925O70318J43670J09193P13664R35684
$$ 54617591 55168168 54995901 54965353 54908022 54780097 55450415 55594085 55703278 56416942 57352626
4608E7352626O23502R97985N75492J015418J414913Q58170J234964R75241Q09485
$$ 57352626 57976128 58974113 59549605 60565023 61979936 62838106 64073070 65048311 65857796
4599F5857796J033372J327731P37783J595749J132728J012799J024154J277987
$$ 65857796 66891168 68218899 68956682 70552431 71685159 72697958 73722112 75000099
4591G5000099J131790Q10858Q05089J68516O33557M60476J48281K06433j07649
$$ 75000099 76131889 76942747 77747836 77916352 78549909 79010385 79158666 79365099 79257450
4582G9257450O34723R15419J51589L7045j9908J08852N27139Q29934j6976l923
$$ 79257450 79892173 80807592 80959181 80996226 80976318 81085170 81612309 82442243 82425267 82421344
4572H2421344O80603P74378Q52414R08723R49129J368518J941517J686756J350431
$$ 82421344 83101947 83876325 84728739 85637462 86586591 87955109 89896626 91583382 92933813
4563I2933813J910049J354279K238052K802153J829610K311966K979128K148161
$$ 92933813 94843862 96198141 98436193 101238346 103067956 105379922 108359050 110507211
4555A10507211K153732K317715K262786K508913K702480K282206J523567J995590
$$ 110507211 112660943 114978658 117241444 119750357 122452837 124735043 126258610 128254200
4547A28254200J558603J985733K072905J571763J912606K451595J529279J999992
$$ 128254200 129812803 131798536 133871441 135443204 137355810 139807405 141336684 143336676
4539A43336676J903983J716346J655534J583847O31348J061134J520862Q89532
$$ 143336676 145240659 146957005 148612539 150196386 150827734 151888868 153409730 154299262
4531A54299262N37301M8414l86931l32498j40396j034432j452183j423717k068492
$$ 154299262 154836563 154884977 154498046 154165548 154025152 152990720 151538537 150114820 148046328
4522A48046328k011536k092526k875202k671813k655474l445521k992581k517426
$$ 148046328 146034792 143942266 141067064 138395251 135739777 132294256 129301675 126784249
4514A26784249k636167k590005k456975k518539k481821j773008k110752k159841
$$ 126784249 124148082 121558077 119101102 116582563 114100742 112327734 110216982 108057141
4506A08057141k657172j893407k418036k335889k484240k584262k653210k128355
$$ 108057141 105399969 103506562 101088526 98752637 96268397 93684135 91030925 88902570
4498H8902570k501810k508998k917103l236565l180237k396619k316895k644278
$$ 88902570 86400760 83891762 80974659 77738094 74557857 72161238 69844343 67200065
4490F7200065k521190l224279k900196k450456k030286k291253k178645k489822
$$ 67200065 64678875 61454596 58554400 56103944 54073658 51782405 49603760 47113938
4482D7113938j866448j629752j491426j986035j290778j012921j412118j282708
$$ 47113938 45247490 43617738 42126312 40140277 38849499 37836578 36424460 35141752
4474C5141752j704906j119452q45572k41785p06487j240412j187806o54023r43492
$$ 35141752 33436846 32317394 31471822 31230037 30523550 29283138 28095332 27441309 26497817
4465B6497817r93318p44879m42603l08856p14298p13326o62047n47335l34962
$$ 26497817 25504499 24759620 24317017 24008161 23293863 22580537 21918490 21371155 21036193
4456B1036193q9984m45655m54925n66690j056064l53937m49671n21947k59738
$$ 21036193 20946209 20500554 20045629 19478939 18422875 18068938 17619267 17097320 16837582
4447A6837582q8491k40152p1365l52066k80930l046p145k95350j38884N3884m10217
$$ 16837582 16749091 16508939 16437574 16085508 15804578 15801532 15794387 15499037 15360153 15414037 15003820
4436A5003820q28802j9292K12857M5124J91540l25664j24074l750j13648l22322
$$ 15003820 14175018 14155726 14368583 14413707 14605247 14279583 14155509 14151759 14038111 13715789
4426A3715789j13137q2768J54033n00181o41805n41397m7242O742O6481l20762
$$ 13715789 13602652 13519884 13673917 13173736 12531931 11990534 11943292 11950034 12016515 11695753
4416A1695753o14633k48507N63468j13461n23348k23543m7315n287O0746o80392
$$ 11695753 11081120 10832613 11396081 11282620 10759272 10535729 10488414 10483127 10543873 9863481
4406I863481m33012j3654K44536J1823j43061k18841P6761J83324j62953j43612
$$ 9863481 9430469 9416815 9661351 9673174 9530113 9311272 9388033 9571357 9408404 9264792
4396I264792o35345J5685J08025l54499k52775M06991N1771l71867k55346L8574
$$ 9264792 8629447 8645132 8753157 8398658 8145883 8552874 8604645 8232778 7977432 8016006
4386H016006j00450j06411M41945l99002P631K00715m10866k83048O0438n9093
$$ 8016006 7915556 7809145 8251090 7852088 7859719 8060434 7649568 7366520 7426958 7367865
4376G367865N66114j40405m54204k22511m78964N27158J60142m97799j14431R7781
$$ 7367865 7933979 7793574 7339370 7116859 6637895 7165053 7325195 6827396 6712965 6810746
4366F810746k31685L48493l5400l07293m51073j19243Q1528L24198K42316l26490
$$ 6810746 6579061 6927554 6892154 6584861 6133788 6014545 6096073 6420271 6662587 6336097
4356F336097k49846k24209Q4157J92605J72734m78686k29166l39178N81835M84175
$$ 6336097 6086251 5862042 5946199 6138804 6311538 5832852 5603686 5264508 5846343 6330518
4346F330518m97860m88684K25782J64235j06351K51001n36325l24253O75154K37717
$$ 6330518 5832658 5343974 5569756 5733991 5627640 5878641 5342316 5018063 5693217 5930934
4336E930934m54818N05611k10169J64000k71635m04908m2552L05368J06078n89720
$$ 5930934 5476116 5981727 5771558 5935558 5663923 5259015 5216463 5521831 5627909 5038189
4326E038189P7714o1186J60366k5606K59189n66334j26335K56853K08779Q0126
$$ 5038189 5115903 5054717 5215083 5189477 5448666 4882332 4755997 5012850 5221629 5301755
4316E301755o93089N1401L25256k99229o7661M22124l58008J50915L80665Q0519
$$ 5301755 4608666 4660067 4985323 4686094 4618433 5040557 4682549 4833464 5214129 5294648
4306E294648n20428M35278J25674n45727o3761J89300L29522J47634k99397m59606
$$ 5294648 4774220 5209498 5335172 4789445 4725684 4914984 5244506 5392140 5092743 4633137
4296D633137L67653K96091J60394j590p0866n6421o65862j46278J40395l44778
$$ 4633137 5000790 5296881 5457275 5455685 5384819 5328398 4662536 4516258 4656653 4311875
4286D311875k70682M59040q7304J0384K23026L14017m70405J10317J35534j30902
$$ 4311875 4041193 4500233 4412929 4423313 4646339 4960356 4489951 4600268 4735802 4604900
4276D604900L58555j42619j46953j54316J12734J20544K53504j72788n09729L70683
$$ 4604900 4963455 4820836 4673883 4519567 4632301 4752845 5006349 4833561 4323832 4694515
4266D694515M93107K80881J58028j24497l46122n1856O7572L29407J31978m58123
$$ 4694515 5187622 5468503 5626531 5502034 5155912 5104056 5171628 5501035 5633013 5174890
4256E174890k80676K57894O1139j17809N9731l04943L47999J01420L35394j46464
$$ 5174890 4894214 5152108 5213247 5095438 5155169 4850226 5198225 5299645 5635039 5488575
4246E488575J57453o20742k86473O88268M21785o94060l82754q0922n8713J6144
$$ 5488575 5646028 5025286 4738813 5427081 5848866 5154806 4772052 4691130 4632417 4648561
4236D648561k01586K83207J31638K3464K52018K38877k71212K2254r6796k44378
$$ 4648561 4446975 4730182 4861820 4885284 5137302 5376179 5104967 5127221 5030425 4786047
4226D786047J0686K29074L8476J4195J75051J491k65433K99332J68257l25358
$$ 4786047 4796733 5025807 5064283 5078478 5253529 5255020 4989587 5288919 5457176 5131818
4216E131818L04909O1799M76833r0984q70875L07837O5255M5055M28304j94452
$$ 5131818 5436727 5498526 5975359 5884375 5013500 5321337 5386592 5431647 5859951 5665499
4206E665499k3026J20348j74603k47674l3321L79810m0304Q3770k74286J8660
$$ 5665499 5642473 5762821 5588218 5340544 5307223 5687033 5646729 5730499 5456213 5474873
4196E474873l0382j65242l93928J31074J94795L1635J25040o94715j01011O60614
$$ 5474873 5444491 5279249 4885321 5016395 5211190 5242825 5367865 4673150 4572139 5232753
4186E232753l9078k05495K09435j86045J98036N6389N6782l14323K5962K69389
$$ 5232753 5193675 4988180 5197615 5011570 5209606 5265995 5322777 5008454 5034416 5303805
4176E303805L61786P2741P0220M53372J39880K71858J67001j81688l11070M0705
$$ 5303805 5665591 5738332 5808552 6261924 6401804 6673662 6840663 6658975 6347905 6388610
4166F388610N35240o34606n2288O54215l1997m79891J62988m32827p28513P96291
$$ 6388610 6923850 6289244 6236956 6891171 6859174 6379283 6542271 6109444 5380931 6177222
4156F177222N48345n38150l51962j98161J45203L32432n58661J19953K68709J05699
$$ 6177222 6725567 6187417 5835455 5637294 5782497 6114929 5556268 5676221 5944930 6050629
4146F050629j63531l2735l50500K04417P89645j6517j65589M87010K54478k26588
$$ 6050629 5887098 5854363 5503863 5708280 6497925 6481408 6315819 6802829 7057307 6830719
4136F830719K31414o62711l42989Q26578J49736L9649q7906k42364K86422O62038
$$ 6830719 7062133 6399422 6056433 6883011 7032747 7072396 6984490 6742126 7028548 7690586
4126G690586m80996K22993M55140l66882n19876K66449p2602m38702Q8667k39147
$$ 7690586 7209590 7432583 7887723 7520841 7000965 7267414 7194812 6756110 6844777 6605630
4116F605630K25153N38490J37316m57818l61914l06425L84158J38243K05068K98646
$$ 6605630 6830783 7369273 7506589 7048771 6686857 6380432 6764590 6902833 7107901 7406547
4106G406547l55448l51386Q40182j71784m79347K86777J01832J91800O39425L30576
$$ 7406547 7051099 6699713 7539895 7368111 6888764 7175541 7277373 7469173 8108598 8439174
4096H439174m74126J44382K78550J65832j62678j45755K56531J43908k85221K39705
$$ 8439174 7965048 8109430 8387980 8553812 8391134 8245379 8501910 8645818 8360597 8600302
4086H600302K92523n40368K18370J39886m59140O93721M74284p94042J64658M20168
$$ 8600302 8892825 8352457 8570827 8710713 8251573 8945294 9419578 8625536 8790194 9210362
4076I210362m07703L76211J88161n29730M24263N25787l75324N8169M09277k85320
$$ 9210362 8802659 9178870 9367031 8837301 9261564 9787351 9412027 9470196 9879473 9594153
4066I594153N88314L06533l21610M33375R4658k90101O03620n411m09295K42083
$$ 9594153 10182467 10489000 10167390 10600765 10695423 10405322 11008942 11003531 10594236 10836319
4056A0836319R5515L64266L73970P9059j73542M32265N67918L49544P52361Q0480
$$ 10836319 10931834 11296100 11670070 11749129 11575587 12007852 12575770 12925314 13677675 13758155
4046A3758155l81064N22117j80494m22932l74707L46179M31002j08224R4286K19319
$$ 13758155 13377091 13899208 13718714 13295782 12921075 13267254 13698256 13590032 13684318 13903637
4036A3903637n29378M69104O70047l98503J58846N07103m27457K25051L06341
$$ 13903637 13374259 13843363 14513410 14114907 14273753 14780856 14353399 14578450 14884791
4027A4884791k20226O5805J53992P0591L8305j51915J09972K38588L69997K11102
$$ 14884791 14664565 14730370 14884362 14954953 14993258 14841343 14951315 15189903 15559900 15771002
4017A5771002J76444N9490k47047K19082K653L7821M50510K75866n9630M17329
$$ 15771002 15947446 16006936 15759889 15978971 15981624 16019445 16469955 16745821 16686191 17103520
4007A7103520Q1100L49409L79027J61832L61895N00695N9254K1713J49117O86627
$$ 17103520 17184620 17534029 17913056 18074888 18436783 18937478 18996732 19018445 19167562 19854189
3997A9854189J85563L26232N04215K39088P56203M25439k9581m8343P64115P62027
$$ 19854189 20039752 20365984 20870199 21109287 21865490 22290929 22261348 22213005 22977120 23739147
3987B3739147L79731j16706J89384O07002J056723O44460K78923K11664J64114
$$ 23739147 24118878 24002172 24191556 24798558 25855281 26499741 26778664 26990328 27154442
3978B7154442P95031P88279Q76515M33968P94371P08134J052755J257403M87656
$$ 27154442 27949473 28737752 29614267 30048235 30842606 31550740 32603495 33860898 34348554
3969C4348554K91837J124941J207786J015604J470051R91378m0618J161740J903628
$$ 34348554 34640391 35765332 36973118 37988722 39458773 40450151 40409533 41571273 43474901
3960D3474901J057945R20350J508676J099015J298203J756527J712139J389465
$$ 43474901 44532846 45453196 46961872 48060887 49359090 51115617 52827756 54217221
3952E4217221J153702J349145J400377J725922J393036J144225J445989J867820
$$ 54217221 55370923 56720068 58120445 59846367 61239403 62383628 63829617 65697437
3944F5697437K547073J571531J155440J798349J731703K065251K367646J152206
$$ 65697437 68244510 69816041 70971481 72769830 74501533 76566784 78934430 80086636
3936H0086636J494472J898863J630677J686494J731196J832314K338058J917507
$$ 80086636 81581108 83479971 85110648 86797142 88528338 90360652 92698710 94616217
3928I4616217K111050K243288K041613K863244K955955K783082K361966L002388
$$ 94616217 96727267 98970555 101012168 103875412 106831367 109614449 111976415 114978803
3920A14978803L012664K891667K630747K988601L489498L969580L475778L495323
$$ 114978803 117991467 120883134 123513881 126502482 129991980 133961560 137437338 140932661
3912A40932661L667687L347474L178916L806355L548406L415970L695427L596914
$$ 140932661 144600348 147947822 151126738 154933093 158481499 161897469 165592896 169189810
3904A69189810L529639L598498M214243L863031L701913M074370M506396M495193
$$ 169189810 172719449 176317947 180532190 184395221 188097134 192171504 196677900 201173093
3896B01173093M744192M994187M543287M606875M583455M132319L712235M194275
$$ 201173093 205917285 210911472 215454759 220061634 224645089 228777408 232489643 236683918
3888B36683918L737168K967821K525160K235580J882291J702986J605223J066330
$$ 236683918 240421086 243388907 245914067 248149647 250031938 251734924 253340147 254406477
3880B54406477O97725O44003P53625k6769n96137q24383o57994n39622n48644
$$ 254406477 255104202 255748205 256501830 256475061 255878924 255054541 254396547 253856925 253308281
3871B53308281j394195j880916j408974j826935k128139j993157k879638l421685
$$ 253308281 251914086 250033170 248624196 246797261 244669122 242675965 239796327 236374642
3863B36374642k897047l219517l968691m155421m778903m986002m680355n364204
$$ 236374642 233477595 230258078 226289387 222133966 217355063 212369061 207688706 202324502
3855B02324502n421937n503589n277275n102754m995163n174663m234843m507590
$$ 202324502 196902565 191398976 186121701 181018947 176023784 170849121 166614278 162106688
3847A62106688m610176l869810l721065l933984l244041l689601m043258l545168
$$ 162106688 157496512 153626702 149905637 145971653 142727612 139038011 134994753 131449585
3839A31449585l199234l145160k655053l075127l587412l243645k862618k807655
$$ 131449585 128250351 125105191 122450138 119375011 115787599 112543954 109681336 106873681
3831A06873681k922958l209875l088123k193441k826669k654737k889506k900517
$$ 106873681 103950723 100740848 97652725 95459284 92632615 89977878 87088372 84187855
3823H4187855k336273j755306k102438j921196j762702k336648j961024j573328
$$ 84187855 81851582 80096276 77993838 76072642 74309940 71973292 70012268 68438940
3815F8438940j968622j649156j158199j283311j613913j587157j924744j133168
$$ 68438940 66470318 64821162 63662963 62379652 60765739 59178582 57253838 56120670
3807E6120670j199199j647991r56005j147495j617865j146288j618690j467028
$$ 56120670 54921471 53273480 52317475 51169980 49552115 48405827 46787137 45320109
3799D5320109r14681r01077j202023q53711j461773j363762o96308p13308r91185
$$ 45320109 44405428 43504351 42302328 41448617 39986844 38623082 37926774 37213466 36222281
3790C6222281q28948r29575p10184q52731j119232r41582l85171l94579q97938
$$ 36222281 35393333 34463758 33753574 32900843 31781611 30840029 30454858 30060279 29162341
3781B9162341p10521n26102m61893p7534o56203q94617n08117n95552l77326k99134
$$ 29162341 28451820 27925718 27463825 27386291 26730088 25835471 25327354 24731802 24354476 24055342
3771B4055342m96446p85614m96599k46666k70074r30858p22347r5710j62802m36740
$$ 24055342 23558896 22773282 22276683 22030017 21759943 20829085 20106738 20011028 19848226 19411486
3761A9411486p1410m37581m03929P398m48864p82628j49130J13253k28455J20125
$$ 19411486 19340076 18902495 18498566 18505964 18057100 17274472 17125342 17238595 17010140 17130265
3751A7130265l90401p04890n49498K10188J28047K2031j30092m37480L6487l28304
$$ 17130265 16739864 16034974 15485476 15695664 15823711 15845742 15715650 15278170 15314657 14986353
3741A4986353P2136J25803J603j64819K02391l73169k30979K33348o03957n79933
$$ 14986353 15058489 15184292 15185895 15021076 15223467 14850298 14619319 14852667 14248710 13668777
3731A3668777L32594J01902l32285l10147k13382j51392n8k59893k38419l87732
$$ 13668777 14001371 14103273 13770988 13460841 13247459 13096067 13096009 12836116 12597697 12209965
3721A2209965K15843j53142m91448k98109o2049l07112k50087l54097J34312M21018
$$ 12209965 12425808 12272666 11781218 11483109 11421060 11113948 10863861 10509764 10644076 11065094
3711A1065094k00142k59660r1095k03012j54572p2519N21407k13763l8266J17699
$$ 11065094 10864952 10605292 10514197 10311185 10156613 10084094 10605501 10391738 10353472 10471171
3701A0471171r4150q7110K52594K0128l60966L63590L57200Q9717o61944k59433
$$ 10471171 10377021 10289911 10542505 10562633 10201667 10565257 10922457 11012174 10350230 10090797
3691A0090797P7243K45381r5314K7940l07856P4605j52190m46579k32573K31794
$$ 10090797 10168040 10413421 10318107 10346047 10038191 10112796 9960606 9514027 9281454 9513248
3681I513248K89025J29007j85192l65543j61684k8161M2768K30906J56203J1239
$$ 9513248 9802273 9931280 9746088 9380545 9218861 9190700 9233468 9464374 9620577 9631816
3671I631816R3764q7115o38151m21292N82618L79811j05230j40340m8010J20590
$$ 9631816 9725580 9638465 9000314 8579022 9161640 9541451 9436221 9295881 9247871 9368461
3661I368461l1093J49562j61859N5233J73756M2882r7743J41316L0787L34914
$$ 9368461 9337368 9486930 9325071 9380304 9554060 9596942 9499199 9640515 9671302 10006216
3651A0006216L61098J5938m01643J67782O0655j98210K2049O79829K13172j7760
$$ 10006216 10367314 10383252 9981609 10149391 10210046 10011836 10033885 10713714 10926886 10909126
3641A0909126R7994l21159n1983K96690N69455J8949j13346r604j42265J57500
$$ 10909126 11007120 10685961 10633978 10930668 11500123 11519072 11405726 11396122 11253857 11411357
3631A1411357j23964j14263L71800j90645K11768K43966j23034j9783K66706K01213
$$ 11411357 11287393 11173130 11544930 11354285 11566053 11810019 11686985 11667202 11933908 12135121
3621A2135121R82L65145K32780J75706l415L68308O11200L89096K14143M71244
$$ 12135121 12136103 12501248 12734028 12909734 12906319 13274627 13885827 14274923 14489066 14960310
3611A4960310K84212L096O05274J10001L41330l23305O63922j77687R336N40318
$$ 14960310 15244522 15247618 15852892 15962893 16304223 15980918 16644840 16467153 16476489 17016807
3601A7016807N24106N78098O01939o5393P9904J26451O12733k12057k43660J112007
$$ 17016807 17540913 18119011 18720950 18655557 18735461 18861912 19474645 19262588 19018928 20130935
3591B0130935L70983J42357K30279N85650k52209O13620R11712M30552K9278N67355
$$ 20130935 20501918 20644275 20874554 21460204 21207995 21821615 22733327 23163879 23193157 23760512
3581B3760512N26249M10118M47705J178515N67073N36690O38535K25160L41564
$$ 23760512 24286761 24696879 25144584 26323099 26890172 27426862 28065397 28290557 28632121
3572B8632121J184363M03251N18154J135047R34159R68303J454902M06918K27897
$$ 28632121 29816484 30219735 30737889 31872936 32807095 33775398 35230300 35637218 35865115
3563C5865115J424279J345281N79074J084569J244131O48806J645159J730220
$$ 35865115 37289394 38634675 39213749 40298318 41542449 42191255 43836414 45566634
3555D5566634J184472J191732J466627J517795J999459J787148K385402J832525
$$ 45566634 46751106 47942838 49409465 50927260 52926719 54713867 57099269 58931794
3547E8931794K482283K976701L029763K331584L305043L717982L202683M225538
$$ 58931794 61414077 64390778 67420541 69752125 73057168 76775150 79977833 84203371
3539H4203371M763122M230093N365250O056106N306289N866743O620147O214947
$$ 84203371 88966493 93196586 98561836 104617942 109924231 115790974 122411121 128626068
3531A28626068O642636O421822N574038M855747L812272K837966J450741N6896
$$ 128626068 135268704 141690526 147264564 152120311 155932583 158770549 160221290 160278186
3523A60278186j126101j470536k246607k522451k559519k763770k359524j421648
$$ 160278186 159152085 157681549 155434942 152912491 150352972 147589202 145229678 143808030
3515A43808030j515812o97558K08569L68946J569389K752031K923117L737120
$$ 143808030 142292218 141594660 141803229 142172175 143741564 146493595 149416712 153153832
3507A53153832N101452N433141O040389P559813Q221219Q538096R525742Q941165
$$ 153153832 158255284 163688425 169728814 177288627 185509846 194047942 203573684 212514849
3499B12514849R630493R105540Q118627O831650M459442J737027m89887l260740
$$ 212514849 222145342 231250882 239369509 246201159 250660601 252397628 251907741 248647001
3491B48647001n916341o604068q809166j0694656r629315r958901j0653889r472921
$$ 248647001 242730660 236126592 227317426 216622770 206993455 197034554 186380665 176907744
3483A76907744q468501q441428o970911m974607n038197l991886l139333k114307
$$ 176907744 168439243 159997815 153026904 148052297 143014100 139022214 135882881 133768574
3475A33768574j879376j113501j96324N60339K05404J589545K422691K082169
$$ 133768574 131889198 130775697 130579373 131139712 131345116 132934661 135357352 137439521
3467A37439521K202894K349534J306070J509517J038527j002388k304021l553932
$$ 137439521 139642415 141991949 143298019 144807536 145846063 144843675 142539654 138985722
3459A38985722m315058m474731n842684o120531o469495o098119o206727n882916
$$ 138985722 134670664 130195933 124353249 118232718 111763223 105665104 99458377 93575461
3451I3575461o271999n655177m306456m123559l867967l649294l394363l131121
$$ 93575461 87303462 81648285 77341829 73218270 69350303 65701009 62306646 59175525
3443E9175525k601692k803155k180358k322403j895831k209221j822530j878655
$$ 59175525 56573833 53770678 51590320 49267917 47372086 45162865 43340335 41461680
3435D1461680j256964j619555j477022j373177j133319j326326j719449j725223
$$ 41461680 40204716 38585161 37108139 35734962 34601643 33275317 31555868 29830645
3427B9830645r58030j085893q95057p04120j459223j444964j42079K6147o51707
$$ 29830645 28872615 27786722 26891665 26187545 24728322 23283358 23141279 23167426 22515719
3418B2515719j030856n31617k06623k86309j99583r18433p13142j42906O83439
$$ 22515719 21484863 20953246 20746623 20460314 20260731 19342298 18629156 18486250 19169689
3409A9169689m21154p59242m07279j55936m32742M8846k93333n99955l54921J85584
$$ 19169689 18748535 17989293 17582014 17426078 16993336 17042182 16748849 16148894 15793973 15979557
3399A5979557n43737n20805j68235k99726n10883k4884k83504o04951L5779j68621
$$ 15979557 15435820 14915015 14746780 14447054 13936171 13911287 13627783 13022832 13058611 12889990
3389A2889990k15204n05621j85108k7548j88723m69752J82589j70923m13467J44657
$$ 12889990 12674786 12169165 11984057 11956509 11767786 11298034 11480623 11309700 10896233 11040890
3379A1040890Q2260m89820j45154K86837N9516k0074L3169j66507m47889l78776
$$ 11040890 11123150 10633330 10488176 10775013 10834529 10814455 10847624 10681117 10233228 9854452
3369I854452R5931j53731P9758J48884l85450n66974J76795j4489J97721N0978
$$ 9854452 9950383 9796652 9876410 10025294 9639844 9072870 9249665 9235176 9432897 9483875
3359I483875n60041m36940j64665n32471n8425O13137l11635q4670R5108k80096
$$ 9483875 8923834 8486894 8322229 7789758 7731333 8344470 8032835 7948165 8043273 7763177
3349G763177l63908N8201m27219j16645M66599p2150k23482j14465l08012j8494
$$ 7763177 7399269 7457470 7030251 6913606 7380205 7308055 7084573 6970108 6662096 6643602
3339F643602q4452Q7483J00078p1988o41825k0809K64011p9572J92953J56572
$$ 6643602 6559150 6646633 6746711 6674723 6032898 6012089 6276100 6196528 6389481 6546053
3329F546053k75445L6592n4265r6176K82278J06468l90321m6526L38747l98700
$$ 6546053 6270608 6307200 6252935 6156759 6439037 6545505 6155184 6108658 6447405 6048705
3319F048705l9155j47654M17823j10892j77085j12268K33872o08249k4921M27622
$$ 6048705 6009550 5861896 6279719 6168827 5991742 5879474 6113346 5505097 5480176 5907798
3309E907798k07628J5528K05274l94801m06015N2545o3210K53715M72500o1119
$$ 5907798 5700170 5715698 5920972 5526171 5120156 5172701 5109491 5363206 5835706 5774587
3299E774587n77104p8300K75431O15671M13119n79936j07145j24971o6640O72037
$$ 5774587 5197483 5119183 5394614 6010285 6423404 5843468 5736323 5611352 5544712 6216749
3289F216749r0797o20206N07918N59400O8804M15861m11264n1283O4562l44449
$$ 6216749 6125952 5505746 6013664 6573064 6641868 7057729 6646465 6595182 6659744 6315295
3279F315295j07098R9945L4655k08408K238m44382K4579R5101k33042J22901j79193
$$ 6315295 6208197 6308142 6342797 6134389 6136627 5692245 5716824 5811925 5578883 5701784 5522591
3268E522591j72290j01269L48267l65193N1376J02078m70901J16206N16865k57074
$$ 5522591 5350301 5249032 5597299 5232106 5283482 5385560 4914659 5030865 5547730 5290656
3258E290656M3884j64429j6774M49919p6814p33088l44035j1751j82252K43887
$$ 5290656 5334540 5170111 5153337 5603256 5526442 4793354 4449319 4437568 4255316 4499203
3248D499203n1860m36672J28469J93257O4438j89403m12646r3553N86572K73477
$$ 4499203 4447343 4010671 4139140 4332397 4396835 4207432 3794786 3701233 4287805 4561282
3238D561282n43140k49991J14492j85359j09458r8058K21827j48788J0507J99242
$$ 4561282 4018142 3768151 3882643 3697284 3587826 3489768 3711595 3562807 3573314 3772556
3228C772556l58278m59140r1538J78965L33385l4885k32550l9037k61905J89784
$$ 3772556 3414278 2955138 2863600 3042565 3375950 3341065 3108515 3069478 2807573 2997357
3218B997357m0620k09207k41386M34672P33808K07060n35802j62552J94574k8485
$$ 2997357 2956737 2747530 2506144 2940816 3674624 3881684 3345882 3183330 3377904 3349419
3208C349419M61214k72296l42335k00295k64969K36719K68919M1594k287J98205
$$ 3349419 3810633 3538337 3196002 2995707 2730738 2967457 3236376 3277970 3275683 3473888
3198C473888k64072l52163l43825j21061K23987o5301J6949q5275k711J81410
$$ 3473888 3209816 2857653 2513828 2392767 2616754 2551453 2568402 2483127 2480416 2661826
3188B661826l9928o2969K29887j0039K7402k95639k80749j01515J77882L52784
$$ 2661826 2621898 2558929 2788816 2778777 2806179 2510540 2229791 2128276 2306158 2658942
3178B658942k6340K53399l42508j00616K078N1082j52563M86158P6434l1513j68773
$$ 2658942 2632602 2886001 2543493 2442877 2444955 2496037 2343474 2829632 2906066 2874553 2705780
3167B705780o91222n00663O75360K07563m3725J8123o54766q6862M79092L06505
$$ 2705780 2014558 1513895 2189255 2396818 2353093 2371216 1716450 1629588 2108680 2415185
3157B415185k40015L81159k3367o5805J75708k87598j84449L64789J5892k40742
$$ 2415185 2175170 2556329 2532962 2467157 2642865 2355267 2170818 2535607 2551499 2310757
3147B310757L28741J90418k81451N7240J26310M23766N2471k52316o6640J18401
$$ 2310757 2639498 2829916 2548465 2605705 2732015 3155781 3208252 2955936 2889296 3007697
3137C007697k01041j36288M26309j86150l84332L70933N1370l36626j69929l48514
$$ 3007697 2806656 2670368 3096677 2910527 2526195 2897128 2948498 2611872 2441943 2093429
3127B093429P8090N17797l66728k87845k1687M06329K60744k82749k59766m50045
$$ 2093429 2171519 2689316 2322588 2034743 2013056 2419385 2680129 2397380 2137614 1687569
3117A687569M23622J75857l87710n13601K10263l3114J12666j1686k33185Q4894
$$ 1687569 2111191 2287048 1899338 1385737 1596000 1562886 1675552 1663866 1430681 1515575
3107A515575l7274J95023K53683j36560p4579j55082o185k89261J18175L38395
$$ 1515575 1478301 1673324 1927007 1790447 1715868 1560786 1554601 1265340 1383515 1721910
3097A721910k95257j40047K47052J97096K38129P8566j30583k02499o968M43823
$$ 1721910 1426653 1286606 1533658 1730754 1968883 2047449 1916866 1714367 1707399 2151222
3087B151222k44399o6578k33423J36859J89541M40265l33230n48682N5015N94748
$$ 2151222 1906823 1840245 1606822 1743681 1933222 2373487 2040257 1491575 1546590 2141338
3077B141338K36546p9870r02980j43500R25369k17641n38567j79922m45009j72127
$$ 2141338 2377884 2298014 1395034 1251534 2176903 1959262 1420695 1240773 795764 623637
3067F23637P87417l77873m13992M005K83944m36220o3687j60680J05460M9034
$$ 623637 1411054 1033181 619189 623194 907138 470918 407231 246551 352011 401045
3057D01045n3739q4442O86998J67219j07758K48928k0933P4471J532k99369k01196
$$ 401045 347306 262864 949862 1117081 1009323 1258251 1237318 1311789 1313321 1013952 812756
3046H12756M45876k19767j02097N25727j88015q57137k9073J42848K78882Q44549
$$ 812756 1258632 1038865 936768 1462495 1274480 417343 388270 531118 810000 1654549
3036A654549n16516p50236K85966j93051j41478K18334n03359m51464P64433N7888
$$ 1654549 1138033 387797 673763 480712 339234 557568 54209 -397255 367178 425066
3026D25066j27321m09895R7356K11819O26407m51390j69655N6038K13287J66255
$$ 425066 297745 -112150 -14794 197025 823432 372042 202387 258425 471712 637967
3016F37967j36158j43039K7757O08438K44863J61964m48970k73078M76921Q1173
$$ 637967 501809 358770 386527 994965 1239828 1401792 952822 679744 1156665 1237838
3006A237838j02215k07119k38230K90950j39293k13155j76758l52413p3626L15921
$$ 1237838 1135623 928504 690274 981224 841931 628776 452018 99605 25979 341900
2996C41900P8720k73589N5732J09290M2708J03110j39765m56086k7444M96627
$$ 341900 420620 147031 202763 312053 354761 457871 318106 -137980 -165424 331203
2986C31203J0419L2681J77443k36207j09095j76829J95593M03198L48774k81613
$$ 331203 341622 374303 551746 315539 206444 29615 225208 628406 977180 695567
2976F95567k76878j77535J19287L45203j30228k78137P2640j63479Q9862R7268
$$ 695567 418689 241154 360441 705644 575416 297279 369919 206440 296302 393570
2966C93570m63240j04493L94614K55821k93956J60980K47829k69487l95946J8929
$$ 393570 -69670 -174163 220451 476272 182316 343296 591125 321638 -74308 -55379
2956e5379j28125k7625K90031J57794l59674M9448M65544M31189l8444k98834
$$ -55379 -183504 -211129 78902 236696 -122978 -73530 392014 823203 784759 485925
2946D85925o0900M45263j7257m13298k08876j74206Q6620K94422n0944k1406l02994
$$ 485925 425025 870288 853031 439733 230857 56651 143271 437693 386749 365343 62349
2935F2349N65853J81194J07314o95459l40070L20061l528q8062q2750m38831J85166
$$ 62349 628202 809396 916710 221251 -118819 201242 197714 109652 26902 -411929 -226763
2924b26763P8702L8207J15313q5643J17519M70922J56897l75347j40240J99521
$$ -226763 -148061 -109854 5459 -80184 37335 508257 665154 289807 149567 349088
2914C49088m5731L7662M20293o40939O8890N50418p3463l14691L45506l74051
$$ 349088 303357 341019 761312 120373 189263 739681 666218 351527 697033 322982
2904C22982O6675K97091K74277j41438k05687k00640J48095k9149j34459q0975
$$ 322982 389657 686748 961025 819587 613900 413260 561355 532206 397747 316772
2894C16772k39596j23980K8980p4644j30170j46536J28906n1218r222L92436q5772
$$ 316772 77176 -46804 -17824 -92468 -222638 -369174 -240268 -291486 -300708 91728 5956
2883E956R9959p5096K499l77361j9378q3858l4483K38727K04385P5558k56862
$$ 5956 105915 30819 33318 -344043 -363421 -447279 -481762 -243035 -38650 36908 -219954
2872b19954M62243K10538l14387J81448K3191m53423K20828K62177l53756K24553
$$ -219954 242289 452827 138440 319888 343079 -110344 110484 372661 18905 243458
2862B43458Q316k40828J05236J17419j27230j72282J97956j12242m2660K05980
$$ 243458 251774 10946 116182 233601 106371 -65911 132045 19803 -22857 183123
2852A83123l55148J93554K85352j26827l85502J15882O9449J37432J67070K69651
$$ 183123 -172025 21529 306881 180054 -205448 -89566 -20117 117315 284385 554036
2842E54036j44433m60775M03037L20094o8754k02714J54217l16166r0434K2929
$$ 554036 409603 -51172 351865 671959 603205 400491 554708 238542 148108 171037
2832A71037k59251l69916Q17043M14921n43680N7763o8018k40482K75223L84931
$$ 171037 -88214 -458130 358913 773834 230154 287917 219899 -20583 254640 639571
2822F39571l43557o10405J09134L88340j97709J31996k04988k51150L41195K47470
$$ 639571 296014 -314391 -205257 183083 -14626 117370 -87618 -338768 2427 249897
2812B49897k65741k85392N73850k30485K50145o8833k02442J26533j84169J41988
$$ 249897 -15844 -301236 272614 42129 292274 223441 20999 147532 -36637 105351
2802A05351l54678j72284M21434O1863q643K0966q7789K1569j27540N80046R2261
$$ 105351 -249327 -421611 -177 61686 53043 74009 -13780 7789 -119751 460295 552556
2791E52556m61029j3237J85418j42371j52325L28460M03749M779n7053p19790
$$ 552556 91527 78290 263708 121337 -30988 297472 701221 706000 648947 -70843
2781g0843j96020P02737J47694j30197j88446r1241l31551K20120J54854o3396
$$ -70843 -266863 435874 583568 453371 264925 173684 -157867 62253 217107 153711
2771A53711k05368J80346O4782j81117k06892J2168J72789M35639J18272k38648
$$ 153711 -51657 128689 193471 12354 -194538 -182370 -9581 426058 544330 305682
2761C05682m25038L4790K11037J2400K31467J91517m58095k83776L71194o2058
$$ 305682 -119356 -84566 126471 138871 370338 561855 103760 -180016 191178 129120
2751A29120l05370L10587J78291q55942J06606J93393K0058M25828Q3883l01470
$$ 129120 -176250 134337 312628 -543314 -436708 -243315 -223257 202571 286454 -15016
2741a5016m91283P1481P7556n9075N91652Q0778p1504M07352j83305n18801R4098
$$ -15016 -506299 -434818 -357262 -416337 175315 256093 184589 591941 408636 -110165 -16067
2730a6067J48389l59403m5105K64131M1591j66400l18025J83525J08189L56209
$$ -16067 132322 -227081 -272186 -8055 33536 -132864 -450889 -267364 -159175 197034
2720A97034O11588p5089q28924q7070Q5292M39555Q2978p491m59973m56860J99040
$$ 197034 808622 733533 -95391 -182461 -97169 342386 425364 417873 -42100 -498960 -299920
2709b99920J94291L47615M07486j24986l57231j3036J46749N7818m41803K71800
$$ -299920 -105629 241986 649472 524486 167255 154219 300968 358786 -83017 188783
2699A88783J28322Q6652q5916o40254j0842M5094L18262L08214J84091l23247
$$ 188783 317105 403757 317841 -322413 -333255 -288161 30101 338315 522406 199159
2689A99159M5335j59997m32390O0453J03374L08857J00791k75691l60287P512
$$ 199159 244494 84497 -347893 -287440 -184066 124791 225582 -50109 -410396 -402884
2679d02884L48252K76079M31567J78083q79674l55950M28748j13622k8679L8793
$$ -402884 -54632 221447 653014 831097 -48577 -404527 24221 -89401 -118080 -79287
2669g9287o9518k9076o0318P4327j87826K11241M91957L0490r1400l45235n42254
$$ -79287 -148805 -177881 -238199 -163872 -351698 -140457 351500 381990 290590 -54645 -596899
2658e96899M96634n7553J44471M07691j17572R0413j51889p09449K05484M24644
$$ -596899 -100265 -157818 -13347 394344 276772 367185 215296 -494153 -288669 135975
2648A35975n8140r397M56639l44893k62197L66421R395K91160l99928J82581L0899
$$ 135975 77835 68438 525077 180184 -82013 284408 293803 584963 185035 367616 398515
2637C98515l38950k99489q4159L13422L22531N36562n26193l97368M2959K66905
$$ 398515 59565 -239924 -324083 -10661 311870 848432 322239 -75129 -32170 234735
2627B34735L07484Q9380J36652j543j11712l15173j04300j67738P2489K51895
$$ 234735 542219 631599 768251 766708 654996 339823 235523 67785 140274 392169
2617C92169M80380m86941O7481r8714j90039p6594L7537K5429O4512K5625N3302
$$ 392169 872549 385608 453089 354375 164336 87742 125279 150708 215220 240845 294147
2606B94147J75649n11824r7482Q92912N6908l77417L13067m86444L68276K09644
$$ 294147 469796 -42028 -139510 753402 810310 432893 745960 259516 627792 837436
2596H37436j50563m57528M70135J74026m60508K13579P0687N5592L07749L60253
$$ 837436 686873 229345 699480 873506 412998 626577 697264 752856 1060605 1420858
2586A420858l7169m39783m3583O37335r6172k02784L4396l05174J8269j14788
$$ 1420858 1383689 943906 900323 1537658 1441486 1238702 1273098 967924 986193 871405
2576H71405j21956J60105K46705m24316j32454r9538L82330M36803m01307m70309
$$ 871405 749449 909554 1156259 731943 599489 499951 882281 1319084 917777 447468
2566D47468o9868n6593K73281K28755m49783m01268N48375P83599l80715J26205
$$ 447468 377600 321007 594288 823043 373260 -28008 520367 1303966 923251 1049456
2556A049456j64704m94664Q49947L08476m33475j80938L49174n55420L26053k62288
$$ 1049456 884752 390088 1240035 1548511 1115036 934098 1283272 727852 1053905 791617
2546G91617m1167K85379m5150J56776P9671m99367l81062L25842k51127K03900
$$ 791617 750450 1035829 990679 1147455 1227126 727759 346697 672539 421412 625312
2536F25312J09315j51354l81683O43647k50410n9113L92554J63227j29997L59512
$$ 625312 734627 583273 201590 845237 594827 535714 928268 1091495 961498 1321010
2526A321010j66110n08261M94278J86367j05682K00066K34417n75189k24100P35559
$$ 1321010 1154900 646639 1140917 1327284 1221602 1421668 1656085 1080896 856796 1592355
2516A592355K65666q7915m56078n9965n26750J24577L24733k19733j63844L13917
$$ 1592355 1858021 1770106 1314028 1254063 727313 851890 1176623 956890 793046 1106963
2506A106963l09936P8760j70152j91764m5619L23179j03736n3499R3987q92832
$$ 1106963 797027 875787 705635 513871 468252 791431 687695 634196 728183 -164649
2496a64649K56595J90727L07556M36483M06286n24681K18502j34548j00053R5473
$$ -164649 91946 282673 590229 1026712 1432998 908317 1126819 992271 892218 987691
2486I87691J73563p6699n6142o2630K86286K57381k92510J11506L6976K90905
$$ 987691 1161254 1084555 1028413 965783 1252069 1509450 1216940 1328446 1365422 1656327
2476A656327j28819j20293o05227k22441j20106P11639L38577l77964J70309P8933
$$ 1656327 1527508 1407215 801988 579547 459441 1171080 1509657 1131693 1302002 1380935
2466A380935j86188L1678L58502k51467J26014O13339k68937k60114K09583J70657
$$ 1380935 1194747 1226425 1584927 1333460 1459474 2072813 1803876 1543762 1753345 1924002
2456A924002Q5820j5328j16956L9910J15542L50080M89212l0495l02572L32810
$$ 1924002 2009822 1994494 1877538 1917448 2032990 2383070 2872282 2841787 2539215 2872025
2446B872025k62719n01964M52841L8035o99789M2100L60430l44112M27447K38998
$$ 2872025 2609306 2107342 2560183 2598218 1898429 1940529 2300959 1956847 2384294 2623292
2436B623292j81273O388K75641j19194M5942L487k79400n1327K34757K41989L81069
$$ 2623292 2442019 2448407 2724048 2604854 2650796 2654283 2374883 2323556 2558313 2800302 3181371
2425C181371N8444m38835N64288K29296j810L130R0663J2675l02815K54950k29330
$$ 3181371 3239815 2800980 3365268 3594564 3592754 3595884 3686547 3699222 3396407 3651357 3422027
2414C422027L32132K11916l04290J25404N1392L74721L9878j43775q9450P6250
$$ 3422027 3754159 3966075 3661785 3787189 3838581 4213302 4253180 4109405 4019955 4096205
2404D096205j2651j86647P5541k06560j75011N39361J29551L48534l62073L04212
$$ 4096205 4083554 3896907 3972448 3765888 3590877 4130238 4259789 4608323 4246250 4550462
2394D550462N29254j04363O52972p9090j31144P6226O73527j08362K27285N44037
$$ 4550462 5079716 4975353 5628325 5549235 5418091 5494317 6167844 6059482 6286767 6830804
$$ [...]
##END NTUPLES=NMR SPECTRUM
##END=
