##TITLE=1H_CA-9464
 200.13Hz, DMSO-d6.
 8 sc
 25.6.2026
##JCAMPDX= 6.0         $$ Bruker NMR JCAMP-DX V2.0
##DATA TYPE= NMR SPECTRUM
##DATA CLASS= NTUPLES
##ORIGIN= UXNMR, Bruker Analytische Messtechnik GmbH
##OWNER= pz
$$ XWIN-NMR		Version 3.5
$$ Thu Jun 25 14:16:06 2026 Russian Standard Time (UT+4h)  she@DPX200
##.OBSERVE FREQUENCY= 200.1313
##.OBSERVE NUCLEUS= ^1H
##.ACQUISITION MODE= SIMULTANEOUS
##.ACQUISITION SCHEME= undefined
##.AVERAGES= 8
##.DIGITISER RES= 18
##SPECTROMETER/DATA SYSTEM= spect
##.PULSE SEQUENCE= zg30
##.SOLVENT NAME= DMSO
##.SHIFT REFERENCE= (INTERNAL, DMSO, 0, 15.5045)
##AUDIT TRAIL= $$ (NUMBER, WHEN, WHO, WHERE, WHAT)
$$ ##TITLE= Audit trail, XWIN-NMR		Version 3.5
$$ ##JCAMPDX= 5.01
$$ ##ORIGIN= Bruker BioSpin GmbH
$$ ##OWNER= she
$$ F:/spectra/data/she/nmr/H-C/1/pdata/1/auditp.txt
$$ ##AUDIT TRAIL=  $$ (NUMBER, WHEN, WHO, WHERE, WHAT)
(   1,<2026-06-25 14:14:25.31 +0400>,<she>,<DPX200>,
      <created by zg, POWCHK disabled, PULCHK disabled
       configuration hash MD5:
       00 E9 B6 7A A2 85 ED C7 34 08 36 98 17 FE 4E 26
       data hash MD5: 16K
       C8 5A B4 FE 53 4E 7A 73 86 48 6D 9B 6C 20 00 20>)
(   2,<2026-06-25 14:14:27.57 +0400>,<she>,<DPX200>,
      <Start of raw data processing
       efp BC_mod = 2 LB = 0.25 FT_mod = 6 PKNL = 1 PHC0 = -4221.73 PHC1 = 13.3923 SI = 16K 
       data hash MD5: 16K
       F6 95 CC 78 3B F0 D4 06 E5 9F B3 93 B2 80 CA AA>)
(   3,<2026-06-25 14:14:48.67 +0400>,<she>,<DPX200>,
      <pk PHC0 = -5.579165 PHC1 = 3.6 
       data hash MD5: 16K
       3B FB FF 3A 2D 40 09 80 5F 08 F9 83 B0 3F AD FD>)
(   4,<2026-06-25 14:14:52.42 +0400>,<she>,<DPX200>,
      <abs ABSG = 5 
       data hash MD5: 16K
       8D 3C 8A ED A7 5F C2 C8 0E E5 31 60 FF BF 9C 80>)
(   5,<2026-06-25 14:15:29.53 +0400>,<she>,<DPX200>,
      <pk PHC0 = -3.916628 PHC1 = 5.6 
       data hash MD5: 16K
       FC F4 F7 B7 C9 AC 72 AA 4B 8D DE D8 99 94 06 F8>)
(   6,<2026-06-25 14:15:33.46 +0400>,<she>,<DPX200>,
      <abs ABSG = 5 
       data hash MD5: 16K
       1F D2 E1 CA 8D F8 6F 10 5C A8 E4 A4 07 0B 45 2A>)
$$ ##END=
$$ 
$$ hash MD5
$$ FC E4 84 17 D8 25 45 BB 32 D4 93 BF A6 C5 EE ED
##$RELAX= 
##$RELAX= 
##$RELAX= 
##$RELAX= 
##$RELAX= 
##$RELAX= 
$$ Bruker specific parameters
$$ --------------------------
##$DU= <F:/spectra>
##$EXPNO= 1
##$NAME= <H-C>
##$PROCNO= 1
##$TYPE= <nmr>
##$USER= <she>
##$AMP= (0..31)
100 100 100 100 100 100 100 100 100 100 100 100 100 100 100 100 100 100 
100 100 100 100 100 100 100 100 100 100 100 100 100 100 
##$AQSEQ= 0
##$AQ_mod= 1
##$AUNM= <au_zg>
##$AUTOPOS= <>
##$BF1= 200.13
##$BF2= 200.13
##$BF3= 200.13
##$BF4= 200.13
##$BF5= 200.13
##$BF6= 200.13
##$BF7= 200.13
##$BF8= 200.13
##$BYTORDA= 1
##$CFDGTYP= 0
##$CFRGTYP= 5
##$CHEMSTR= <none>
##$CNST= (0..31)
1 1 145 1 1 1 1 1 1 1 1 1 1 1 1 1 1 1 1 1 1 1 1 1 1 1 1 1 1 1 1 1 
##$CPDPRG= <>
##$CPDPRG1= <>
##$CPDPRG2= <>
##$CPDPRG3= <>
##$CPDPRG4= <mlev>
##$CPDPRG5= <mlev>
##$CPDPRG6= <mlev>
##$CPDPRG7= <mlev>
##$CPDPRG8= <mlev>
$$ [...]
##$SUBNAM3= <"">
##$SUBNAM4= <"">
##$SUBNAM5= <"">
##$SUBNAM6= <"">
##$SUBNAM7= <"">
##$SUBNAM8= <"">
##$SUBNAM9= <"">
##$SW= 18.0517328524113
##$SWIBOX= (0..15)
0 0 2 0 0 0 0 0 0 0 0 0 0 0 0 0 
##$SW_h= 3612.71676300578
##$TD= 16384
##$TD0= 1
##$TE= 0
##$TE2= 300
##$TE3= 300
##$TEG= 300
##$TL= (0..7)
0 120 120 120 120 120 120 120 
##$TP= (0..7)
150 150 150 150 150 150 150 150 
##$TP07= 0
##$TPNAME0= <>
##$TPNAME1= <>
##$TPNAME2= <>
##$TPNAME3= <>
##$TPNAME4= <>
##$TPNAME5= <>
##$TPNAME6= <>
##$TPNAME7= <>
##$TPOAL= (0..7)
0.5 0.5 0.5 0.5 0.5 0.5 0.5 0.5 
##$TPOFFS= (0..7)
0 0 0 0 0 0 0 0 
##$TUNHIN= 0
##$TUNHOUT= 0
##$TUNXOUT= 0
##$USERA1= <user>
##$USERA2= <user>
##$USERA3= <user>
##$USERA4= <user>
##$USERA5= <user>
##$V9= 5
##$VALIST= <valist>
##$VCLIST= <CCCCCCCCCCCCCCC>
##$VD= 0
##$VDLIST= <DDDDDDDDDDDDDDD>
##$VPLIST= <PPPPPPPPPPPPPPP>
##$VTLIST= <TTTTTTTTTTTTTTT>
##$WBST= 1024
##$WBSW= 4
##$XGAIN= (0..3)
0 0 0 0 
##$XL= 0
##$YL= 0
##$YMAX_a= 515176
##$YMIN_a= -373632
##$ZGOPTNS= <>
##$ZL1= 120
##$ZL2= 120
##$ZL3= 120
##$ZL4= 120
##$ABSF1= 15.50449
##$ABSF2= -2.547359
##$ABSG= 5
##$ABSL= 3
##$ALPHA= 0
##$AQORDER= 0
##$ASSFAC= 0
##$ASSFACI= 0
##$ASSFACX= 0
##$ASSWID= 0
##$AUNMP= <proc_1d>
##$AZFE= 0.1
##$AZFW= 0.1
##$BCFW= 0
##$BC_mod= 2
##$BYTORDP= 0
##$COROFFS= 0
##$CY= -3
##$DATMOD= 1
##$DC= 0
##$DFILT= <>
##$DTYPP= 0
##$F1P= 0
##$F2P= 0
##$FCOR= 1
##$FTSIZE= 16384
##$FT_mod= 6
##$GAMMA= 0
##$GB= 0
##$INTBC= 1
##$INTSCL= 3.241238e-09
##$ISEN= 128
##$LB= 0.25
##$LEV0= 0
##$LPBIN= 0
##$MAXI= 10000
##$MC2= 0
##$MEAN= 0
##$ME_mod= 0
##$MI= 1.114404
##$NCOEF= 0
##$NC_proc= -7
##$NLEV= 6
##$NOISF1= 3.799351
##$NOISF2= 2.8
##$NSP= 0
##$NTH_PI= 0
##$NZP= 0
##$OFFSET= 15.50449
##$PC= 1
##$PHC0= -4231.226
##$PHC1= 22.5923
##$PH_mod= 1
##$PKNL= yes
##$PPARMOD= 0
##$PSCAL= 0
##$PSIGN= 0
##$REVERSE= no
##$SF= 200.130003444719
##$SI= 16384
##$SIGF1= 3
##$SIGF2= 2
##$SINO= 0.751879
##$SIOLD= 32768
##$SREGLST= <19F.Aceton>
##$SSB= 0
##$STSI= 16384
##$STSR= 0
##$SW_p= 3612.71676300578
##$SYMM= 0
##$S_DEV= 0
##$TDeff= 16384
##$TDoff= 0
##$TI= <>
##$TILT= no
##$TM1= 0
##$TM2= 0
##$TOPLEV= 0
##$USERP1= <user>
##$USERP2= <user>
##$USERP3= <user>
##$USERP4= <user>
##$USERP5= <user>
##$WDW= 1
##$XDIM= 16384
##$YMAX_p= 389888052
##$YMIN_p= -926297
$$ End of Bruker specific parameters
$$ ---------------------------------
##NTUPLES= NMR SPECTRUM
##VAR_NAME=  FREQUENCY,     SPECTRUM/REAL,   SPECTRUM/IMAG
##SYMBOL=    X,             R,               I
##VAR_TYPE=  INDEPENDENT,   DEPENDENT,       DEPENDENT
##VAR_FORM=  AFFN,          ASDF,            ASDF
##VAR_DIM=   16384,         16384,           16384
##UNITS=     HZ,            ARBITRARY UNITS, ARBITRARY UNITS
##FACTOR=    0.220516191357247, 1,           1
##FIRST=     3102.91361683177, 0,            0
##LAST=      -509.803146174012, 0,           0
##MIN=       -509.803146174012, -926297,     0
##MAX=       3102.91361683177, 389888052,    0
$$ Real data points
##PAGE= N=1
##DATA TABLE= (X++(R..R)), XYDATA
$$ [...]
8379A115048P815M8918k28431k0836n4019J3491j72967J67151J36984p6290o136
$$ 1115048 1122863 1171781 943350 922514 868495 881986 709019 876170 1013154 936864 930728
8368I30728k3912m40387K03881L12250p9359J8447l51621R6262K03779J57492
$$ 930728 906816 466429 670310 982560 903201 921648 570027 666289 870068 1027560
8358A027560n9069j73381J81994j84533j14092J2046k88721K61624K54010P6507
$$ 1027560 968491 795110 977104 792571 678479 690525 401804 663428 917438 993945
8348I93945p0603K17581l88689q1221o79m6863j50452o5332K94577M3600K3918
$$ 993945 923342 1140923 752234 671013 670334 623471 473019 407687 702264 745864 769782
8337G69782j9605k58515K34179K64393L2705M2358J1146R9001k92415j65215L6520
$$ 769782 750177 491662 725841 990234 1022939 1065297 1076443 1175444 883029 717814 754334
8326G54334K87269k49306o287l7692p7715k1429J44322o1615J17861J78369j81555
$$ 754334 1041603 792297 786010 748318 670603 649174 793496 731881 849742 1028111 846556
8315H46556J0946k68892J63073L81751p4078j2319m3726n2774k37374k10170Q4479
$$ 846556 857502 588610 751683 1133434 1059356 1047037 1003311 950537 713163 502993 587472
8304E87472L57272J54285n4860j15890m00906j55231L90201N725r6006M5385k7681
$$ 587472 944744 1099029 1044169 928279 527373 372142 762343 768068 672062 717447 689766
8293F89766L83166m7970o71807K09094J83875N2157r4132l193J9650p1777N0801
$$ 689766 1072932 1024962 353155 562249 746124 798281 704149 700956 720606 648829 699630
8282F99630o4431L90175J18560q7752m25746j78530K03247L9256J59658J14265
$$ 699630 635199 1025374 1143934 1056182 630436 451906 655153 694409 854067 968332
8272I68332j9955k23382k29668P4847j47918R4332O3407O8547J09200J09566j04413
$$ 968332 948377 724995 495327 570174 422256 516588 579995 648542 757742 867308 762895
8261G62895k30385q6942K87838M05852j64818m7607o0130k11043j23745j28172
$$ 762895 532510 445568 733406 1139258 974440 926833 866703 655660 531915 403743
8251D03743l2927J75357j69793N9776P5265L6680k58343r366M7954J67251K06809
$$ 403743 370816 546173 376380 436156 511421 548101 289758 280392 328346 495597 702406
8240G02406j28650L667k29094K01084q0904J6884M9229M9822j2768l9812J22417
$$ 702406 573756 577423 348329 549413 468509 485393 534622 584444 571676 531864 654281
8229F54281k25321L2722L0636k5770J59914q4814j27697k40904P308Q1187K26508
$$ 654281 428960 461682 492318 466548 626462 541648 413951 173047 180355 261542 488050
8218D88050J58060K61861k37178J48987j37188j50720J35446j18084R9397j67178
$$ 488050 646110 907971 670793 819780 682592 531872 667318 549234 648631 481453
8208D81453j11897j60163j1594j3114J81068K1090J66841l8125J31358k07880
$$ 481453 369556 209393 197799 184685 365753 386843 553684 515559 646917 439037
8198D39037k23232J04704n4092l8988J96229o41754k9383Q18010p687k9893J77033
$$ 439037 215805 320509 266417 227429 423658 -218096 -247479 570531 562844 532951 709984
8187G09984J57350J80766j92927n57480J38872J75632l2746j83095J65476J81886
$$ 709984 867334 1048100 855173 297693 436565 612197 579451 396356 561832 743718
8177G43718j70935k30432j27789P015M11K98590K800J44347J08004l64716r0773
$$ 743718 572783 342351 214562 221577 221988 520578 523378 667725 775729 411013 320240
8166C20240L1849j33512L78753J46816j77596R6710k32202j65483Q4998k870J28877
$$ 320240 352089 218577 597330 744146 566550 663260 431058 265575 350573 347703 476580
8155D76580J33337j57143q3152o1491K35899j15167j06729J16979L30608k08804
$$ 476580 609917 452774 369622 308131 544030 428863 322134 439113 769721 560917
8145E60917j79350j96120j42047P7707L06243O2380j10927J50313j33569O6846
$$ 560917 381567 185447 43400 121107 427350 489730 378803 529116 395547 462393
8135D62393L1309q2449M01841O1398j65076j67054l15299J62658J49509j00142
$$ 462393 493702 411253 813094 874492 709416 542362 227063 389721 539230 439088
8125D39088k10662K41154J39518j06560M2095j30324m7251K77005n734M9217J1505
$$ 439088 228426 469580 609098 502538 544633 414309 367058 644063 638329 687546 699051
8114F99051l54527j99417J90429Q9497j5929M79384j89307j27122J33556m01873
$$ 699051 344524 145107 335536 425033 409104 888488 699181 572059 705615 303742
8104C03742j24312Q5345O8923K70517K10814k54888k53324j95189J14537M0431
$$ 303742 179430 264775 333698 604215 815029 560141 306817 111628 226165 266596
8094B66596j0363N452N9385J38633r1713m2650J4671Q421N749j78919J54736K00477
$$ 266596 256233 261685 321070 459703 367990 325340 340011 348432 354181 175262 329998 530475
8082E30475M5122l4291j42778k6154L23631l03754j48138L39472j27720j29944
$$ 530475 575597 541306 398528 372374 696005 392251 244113 583585 455865 325921
8072C25921R8586r7213o7598k0436K72143j25264m01041L73K11044L34742K04789
$$ 325921 424507 327294 259696 239260 511403 386139 -14902 -14529 196515 531257 736046
8061G36046j26648k27232j74454j09405J10909K04877L61524J51673j61515j74856
$$ 736046 609398 382166 207712 98307 209216 414093 775617 927290 765775 590919
8051E90919l14388K10450J44258o563M0491R8365j04205j49340r6187l4719j02540
$$ 590919 276531 486981 631239 624676 665167 763532 659327 509987 413800 379081 276541
8040B76541N9840J85992P367J6190k17796k0993J20427J63220j86320j6131M9765
$$ 276541 336381 522373 529740 545930 328134 307141 427568 590788 404468 388337 438102
8029D38102j09116Q2545m3989L7895o4732L796J85080j49799n1718K008M1454
$$ 438102 328986 411531 367542 405437 340705 344501 529581 379782 328064 330072 371526
8018C71526J31586J76879j80367q4613j4386j69794J14808J15818J29016K03303
$$ 371526 503112 679991 499624 415011 400625 230831 345639 461457 590473 793776
8008G93776M8254j18742j69016k61857K02317J40678N1202K1179Q0374k168k5098
$$ 793776 842030 723288 554272 292415 494732 635410 686612 707791 788165 785997 760899
7997G60899l12210p6587K82062j32521Q9073J01551J72441k75372M9922J73226
$$ 760899 448689 372102 654164 521643 610716 712267 884708 609336 659258 832484
7987H32484m8075j26798K93084l4925j53488n0828r6120R0099L47736j05851m5910
$$ 832484 784409 657611 950695 915770 762282 711454 615334 705433 1053169 947318 901408
7976I01408J7683k8197k43371Q0735J70461k23442k14248J95137R2987J40346
$$ 901408 919091 890894 647523 728258 898719 675277 461029 656166 749153 889499
7966H89499j55302k11755j34396O9831K02481Q2283R1095p6113j96228k75243
$$ 889499 734197 522442 388046 457877 660358 742641 833736 757623 561395 286152
7956B86152K07286K22048j19386N5079m0012j20004M7838J10700K08522R9699
$$ 286152 493438 715486 596100 651179 611167 491163 539001 649701 858223 957922
7946I57922N7711j90192J69142j89656n8167j02566J93782J19252j12786Q3825
$$ 957922 1015633 825441 994583 804927 746760 644194 837976 957228 844442 928267
7936I28267j71401l16681O9292J59489j28338N3456Q9838J23448l27608j01656
$$ 928267 756866 440185 509477 668966 540628 594084 683922 807370 479762 378106
7926C78106J53404k1547n0183L44092K92958n9564l14564j54572J12017j59958
$$ 378106 531510 509963 459780 803872 1096830 1037266 722702 568130 680147 520189
7916E20189K50814N0491j5848M9907k9780j67278j01780L35236K77533P2249n7725
$$ 520189 771003 821494 805646 855553 825773 658495 556715 891951 1169484 1241733 1184008
7905A184008p4038J7858l10652j04201j42432L15197J31355J0607Q6040j07091
$$ 1184008 1109970 1127828 817176 712975 570543 885740 1017095 1027702 1113742 1006651
7895A006651j65547J6460L0515J21941J53302n3463j82566j35927n49J14944l0088
$$ 1006651 841104 857564 888079 1010020 1163322 1109859 927293 791366 790817 905761 875673
7884H75673M1015L0804j59582P5114o1730R8119n7631K0882L00175j71281K4714
$$ 875673 916688 947492 787910 863024 801294 899413 841782 862664 1162839 991558 1016272
7873A016272q2594j41050q237J84390p2740J62741K42711R040k7641k02020J6391
$$ 1016272 933678 792628 784391 968781 896041 1058782 1301493 1310533 1282892 1080872 1097263
7862A097263J21613K23996j17289j29838J4158p9241m2413n5832L2966L68229
$$ 1097263 1218876 1442872 1325583 1195745 1209903 1130662 1088249 1032417 1065383 1433612
7852A433612L3794j76537M3581J06344k73117K07694J03264k8482J93651j27106
$$ 1433612 1467406 1290869 1334450 1440794 1167677 1375371 1478635 1450153 1643804 1516698
7842A516698m1187k03080r0622n0186k4615K11089O8044K206j13644k75932R090
$$ 1516698 1475511 1272431 1181809 1131623 1107008 1318097 1386141 1388347 1274703 998771 1007861
7831A007861J13112K9346K71772J44064P5326q1530m9205J4770j55278L82957
$$ 1007861 1120973 1150319 1422091 1566155 1641481 1559951 1510746 1525516 1370238 1753195
7821A753195L17459j13111j07938n7719k43161J85711J53919K16011o4361m07037
$$ 1753195 2070654 1957543 1849605 1791886 1548725 1734436 1888355 2104366 2040005 1632968
7811A632968m4055j1654J377N2848K29087K71115N12529o15568m16798k30546
$$ 1632968 1588913 1577259 1578636 1631484 1860571 2131686 2644215 2028647 1611849 1381303
7801A381303j75015L22726r9738L14140Q5921P144R0861m23919n5998J34838M16849
$$ 1381303 1206288 1529014 1429276 1743416 1829337 1836481 1927342 1503423 1447425 1582263 1999112
7790A999112J45497K50186N7896l02363j16587K01212j00052k10403J56735R8672
$$ 1999112 2144609 2394795 2452691 2150328 2033741 2234953 2134901 1924498 2081233 2179905
7780B179905k62711m08534P7450J31254k10968K96996j9131N8357L8316k50614
$$ 2179905 1917194 1508660 1586110 1717364 1506396 1803392 1784261 1842618 1880934 1630320
7770A630320j34868O4618K8514P5798K47840J27694K23855k03201j89198j41532
$$ 1630320 1495452 1560070 1588584 1664382 1912222 2039916 2263771 2060570 1871372 1729840
7760A729840L36292J84439L9271J64395k83393j65745l9289j51685O4979l3173
$$ 1729840 2066132 2250571 2289842 2454237 2170844 2005099 1965810 1814125 1879104 1845931
7750A845931K87388q8872m5597k47747M8854j3221J39325O7884P3057J15433j40763
$$ 1845931 2133319 2044447 1998850 1751103 1799957 1786736 1926061 1993945 2067002 2182435 2041672
7739B041672o5838k70148K67775Q107R2393K19333l6832l09446n1347K03616R2040
$$ 2041672 1975834 1705686 1973461 1981568 2073961 2293294 2256462 1947016 1895669 2099285 2191325
7728B191325J2062P8289j04943p4541j23696r6743Q8140q749J31507K95849J20956
$$ 2191325 2203387 2281676 2176733 2102192 1978496 1881753 1969893 1961144 2092651 2388500 2509456
7717B509456l01024j34376J73576j06268J37221K89442P8564j39052J7591j06160
$$ 2509456 2208432 2074056 2247632 2141364 2278585 2568027 2646591 2507539 2525130 2418970
7707B418970j18402J77986J84370j76741p7087L06314J85324r3693m9002N9042
$$ 2418970 2300568 2478554 2662924 2486183 2409096 2715410 2900734 2807041 2758039 2817081
7697B817081j18119j5595P1217m512j33259k36618K44105J44180j05846P7647
$$ 2817081 2698962 2683367 2754584 2750072 2616813 2380195 2624300 2768480 2662634 2740281
7687B740281p1527L70272K09592l95416j81776K92842o6779J40079K14286k24411
$$ 2740281 2668754 3039026 3248618 2853202 2671426 2964268 2897489 3037568 3251854 3027443
7677C027443k42049k3569O305K76137L19540p047p0702r5416r8747M74852j37442
$$ 3027443 2785394 2761825 2768130 3044267 3363807 3356760 3286058 3190642 3091895 3566747 3429305
7666C429305J1271K72488m4912J7360j45359j20774m9057K99946J73648n184j25139
$$ 3429305 3440576 3713064 3668152 3685512 3540153 3419379 3370322 3670268 3843916 3838732 3713593
7655C713593J6843j29132j22435J47299R9817O8243m533K51663J9206l2967r4690
$$ 3713593 3730436 3601304 3478869 3626168 3725985 3794228 3789695 4041358 4060564 4027597 3932907
7644C932907Q6597J81088J58763M5077O8399L9708l49304r5293M9829J38009K84946
$$ 3932907 4019504 4200592 4359355 4404432 4472831 4512539 4163235 4067942 4117771 4255780 4540726
7633D540726K0047r0785J82225Q930n7421k5262K2554K25736K82194n2466j96104
$$ 4540726 4560773 4469988 4652213 4661143 4603722 4578460 4601014 4826750 5108944 5056478 4860374
7622D860374L3846J09432r0544J16843k9366P3754J20955J05015l54003K02495
$$ 4860374 4894220 5003652 4913108 5029951 5000585 5074339 5195294 5300309 4946306 5148801
7612E148801j218L5061J73707r255Q8218j21704L59639j38237k9949N5600L16881
$$ 5148801 5147583 5182644 5356351 5347096 5435314 5313610 5673249 5535012 5505063 5560663 5877544
7601E877544k7076j43535j26094K09379q235J9731J33004n1124J40535J83283
$$ 5877544 5850468 5706933 5580839 5790218 5781983 5801714 5934718 5883594 6024129 6207412
7591F207412o426O2403L8456p1013K14891K28693r0178k24604J36352O133q6472
$$ 6207412 6200986 6263389 6301845 6230832 6445723 6674416 6584238 6359634 6495986 6502119 6415647
7580F415647k16541L51047K55899j14560k6958L4122J41932J28877J79625K36803
$$ 6415647 6199106 6550153 6806052 6691492 6664534 6698656 6840588 6969465 7149090 7385893
7570G385893l17855k44188n0199J73022J3409j51830J62654N4954P0127J33736
$$ 7385893 7068038 6823850 6773651 6946673 6960082 6808252 6970906 7025860 7095987 7229723
7560G229723k32043j31773M7318J46496J01017J33056K48071O2540m0060k42900
$$ 7229723 6997680 6865907 6913225 7059721 7160738 7293794 7541865 7604405 7564345 7321445
7550G321445M3995m464p0335J04671K64665J39323j03510j53555j2124n153j93244
$$ 7321445 7365440 7360976 7290641 7395312 7659977 7799300 7695790 7542235 7530111 7524958 7331714
7539G331714N7972j34926J0345Q0483J3652K34466R698Q6744k7268k26334m1048
$$ 7331714 7389686 7254760 7265105 7345588 7359240 7593706 7603404 7690148 7662880 7436546 7395498
7528G395498q4400j32651n8784J23273j10306O0147K40129l56849k11975k0166
$$ 7395498 7311098 7178447 7119663 7242936 7132630 7192777 7432906 7076057 6864082 6843916
7518F843916m0943K43482J4134p0642o5672j5029j33988R8014O4432k51374l307
$$ 6843916 6802973 7046455 7060589 6989947 6924275 6909246 6775258 6873272 6937704 6686330 6683023
7507F683023J2105j17702j67156J43544K03449J29469j10324q9065q007j09575
$$ 6683023 6695128 6577426 6410270 6553814 6757263 6886732 6776408 6687343 6679336 6569761
7497F569761j70058J23663j23432J04868N9709j53614L40025j77087k80165k22669
$$ 6569761 6399703 6523366 6399934 6504802 6564511 6410897 6750922 6573835 6293670 6071001
7487F071001q5993q6681l2795p2495O6771p868k03405n2916M4206K32565q6355
$$ 6071001 5985008 5898327 5865532 5793037 5859808 5851940 5648535 5595619 5639825 5872390 5786035
7476E786035J50628l62794j17670L01389r9104j67043O151n1369j36572O3219
$$ 5786035 5936663 5573869 5456199 5757588 5658484 5491441 5497592 5446223 5309651 5372870
7466E372870J14034j46710j78657K3452J90610K73953k39335l8501l00023r468
$$ 5372870 5486904 5340194 5161537 5184989 5375599 5649552 5410217 5371716 5071693 5062225
7456E062225J59383o68k29265K11007j37727l20267j36631j23986l608j6131K57621
$$ 5062225 5221608 5220940 4991675 5202682 5064955 4744688 4608057 4484071 4480463 4464332 4721953
7445D721953k747o9926q1198O6428k52455N1528O1096j51708j24215j29704J62472
$$ 4721953 4719206 4649280 4568082 4634510 4382055 4433583 4494679 4342971 4218756 4089052 4251524
7434D251524J03099j69696K95893J57036m4353j81797j57025j2542J01752j01444
$$ 4251524 4354623 4184927 4480820 4637856 4593503 4411706 4254681 4242139 4343891 4242447
7424D242447Q6297j36178j56889J01493r1827r4783k23880O9062j936J36919l4444
$$ 4242447 4328744 4192566 4035677 4137170 4045343 3950560 3726680 3795742 3793806 3930725 3896281
7413C896281j85918P6060J81800N0346k01922M12560M48892J5314n6129j1209
$$ 3896281 3710363 3786423 3968223 4018569 3816647 4229207 4678099 4693413 4637284 4626075
7403D626075o762K30468j2142l2433j43731l94312l14284k32457j57729Q6526
$$ 4626075 4619313 4849781 4837639 4805206 4661475 4267163 3952879 3720422 3562693 3649219
7393C649219M6102K02758M8395j06690j05827P681j35157J40098j08404j13627
$$ 3649219 3695321 3898079 3946474 3839784 3733957 3741638 3606481 3746579 3638175 3524548
7383C524548N8130N6262j57502j50807N7161k08545J46903Q5420J54122j33647
$$ 3524548 3582678 3638940 3481438 3330631 3387792 3179247 3326150 3411570 3565692 3432045
7373C432045J17939j23483k03280l5723J53296J28126O5517K533p9223q4538M4032
$$ 3432045 3549984 3426501 3223221 3187498 3340794 3468920 3534437 3536970 3457747 3373209 3417241
7362C417241M6335K3451j74069j02230K79053m35802l87089L09700J78423o5056
$$ 3417241 3463576 3487027 3312958 3210728 3489781 3053979 2666890 2976590 3155013 3089957
7352C089957J2186K37724l4695l29668n9810L08594p4427q390J23942r541l85992
$$ 3089957 3102143 3339867 3305172 2975504 2915694 3224288 3149861 3141471 3265413 3255872 2869880
7341B869880J7474J67773N818r8023J66845k08342n5957K095j89657K71574J6087
$$ 2869880 2887354 3055127 3060945 2962922 3129767 2921425 2865468 2867563 2677906 2949480 2965567
7330B965567j28106j78K42743K17468l75895l34185n3490N5677M25235j3166p9730
$$ 2965567 2837461 2837283 3080026 3297494 2921599 2587414 2533924 2589601 3014836 3001670 2921940
7319B921940J53648k3512M8986m7471j13853R679J35505J79807j82893k87802
$$ 2921940 3075588 3052076 3101062 3053591 2939738 2949417 3084922 3264729 3081836 2794034
7309B794034o0144k8571M5218K76728J16547k38922r6554K61510q031k07801j37254
$$ 2794034 2733890 2705319 2750537 3027265 3143812 2904890 2808336 3069846 3061815 2854014 2716760
7298B716760Q4112j17868l1663k68347Q6082Q1372p8097K18207J65290j82952
$$ 2716760 2800872 2683004 2651341 2382994 2469076 2550448 2472351 2690558 2855848 2672896
7288B672896j5412k441J5447K54134q499Q1116j81921r3944J4965k82242q5336
$$ 2672896 2657484 2655043 2670490 2924624 2916125 2997241 2815320 2721376 2736341 2454099 2368763
7277B368763J03385Q2478p6126J63906Q2J25061j28914m54586J64292l8921K85549
$$ 2368763 2472148 2554626 2478500 2642406 2642488 2767549 2638635 2184049 2348341 2309420 2594969
7266B594969J2002O2486R2619k6754l07991N0134o1387K44901k59277K89624n3559
$$ 2594969 2606971 2669457 2762076 2735322 2427331 2477465 2416078 2660979 2401702 2691326 2637767
7255B637767k08263L03472j14180Q1454r8760l2765J24520j42254k1105M22115
$$ 2637767 2429504 2732976 2618796 2700250 2601490 2568725 2693245 2550991 2529886 2952001
7245B952001N5101R3413K0822K66589p9359k45462k01114R9385P6146k94476j56587
$$ 2952001 3007102 3100515 3121337 3387926 3308567 3063105 2861991 2961376 3037522 2743046 2586459
7234B586459O8402q4575k5474Q230O6500k35971j3843O9054J60908R5830k61978
$$ 2586459 2654861 2570286 2544812 2553042 2619542 2383571 2369728 2438782 2599690 2695520 2433542
7223B433542l8932L52373m2062j13595r493K07833m7368L0681n7120L0751L01732
$$ 2433542 2394610 2746983 2704921 2591326 2581833 2789666 2742298 2772979 2715859 2746610 3048342
7212C048342K05187j25225J32664L6884k22671n1043O4302o0709N2157l02469
$$ 3048342 3253529 3128304 3260968 3297852 3075181 3024138 3088440 3027731 3079888 2777419
7202B777419k79034M6387K86352m08050j75565J13745j736J73047j1282q3754
$$ 2777419 2498385 2544772 2831124 2423074 2247509 2361254 2359518 2532565 2521283 2437529
7192B437529q8929J04526J78483p6666k55267J91377j10875J39862j77079k33428
$$ 2437529 2348600 2453126 2631609 2554943 2299676 2491053 2380178 2520040 2342961 2109533
7182B109533J55366J78918R5319j56509j39927R6901J22622k3041j24554m5429
$$ 2109533 2264899 2443817 2539136 2382627 2242700 2339601 2462223 2439182 2314628 2269199
7172B269199N6140Q2259k09326l44516L12652J11469p5679K09052K77626L3787
$$ 2269199 2325339 2407598 2198272 1853756 2166408 2277877 2202198 2411250 2688876 2722663
7162B722663N4145J20008m27145J6281j81490J33113J91034j78782m24136Q8214
$$ 2722663 2776808 2896816 2469671 2485952 2304462 2437575 2628609 2449827 2025691 2113905
7152B113905L05640K58110j42588j32604Q9616N1524j1637j45949N6902K1807
$$ 2113905 2419545 2677655 2535067 2402463 2492079 2543603 2531966 2386017 2442919 2464726
7142B464726l11824r6972M3928J93418L13Q2575K30870m9343P863M1246m23910
$$ 2464726 2152902 2055930 2099858 2293276 2293589 2376164 2607034 2557691 2565554 2606800 2182890
7131B182890q0805M1776r920J98220r6414N4898R9739J62189K7514k99970j93419
$$ 2182890 2102085 2143861 2133941 2332161 2235747 2290645 2390384 2552573 2580087 2280117 2086698
7120B086698J74400J56090j20583j93416J27424K37227k8147n1543q322k38358
$$ 2086698 2261098 2417188 2296605 2103189 2230613 2467840 2439693 2388150 2379828 2141470
7110B141470j5991Q2314j49327J14041O0966J27948O8314K1862L5364k132p8619
$$ 2141470 2125479 2207793 2058466 2172507 2233473 2361421 2429735 2451597 2486961 2484829 2406210
7099B406210j05020R7076K2601j05937L9329N9703J8471Q0114j53521N8220N9424
$$ 2406210 2301190 2398266 2420867 2314930 2354259 2413962 2432433 2512547 2359026 2417246 2476670
7088B476670q826j40277K31892n577J7440j28606j08682P0229J48099K02867k45602
$$ 2476670 2467844 2327567 2559459 2553882 2571322 2442716 2334034 2404263 2552362 2755229 2509627
7077B509627j01408J00798J06707O4793P9338l07363j87603l3668j52395J92456
$$ 2509627 2408219 2509017 2615724 2680517 2759855 2452492 2264889 2231221 2078826 2271282
7067B271282J25654J31285K47904j00434q7261j53516k6958J83154R2740j52432
$$ 2271282 2396936 2528221 2776125 2675691 2588430 2434914 2407956 2591110 2683850 2531418
7057B531418J14667J90351m14385k74561P4334J47180O2249J36651o8352K9107
$$ 2531418 2646085 2836436 2422051 2147490 2221824 2369004 2431253 2567904 2499552 2528659
7047B528659q5044j23971J32444l0740R4297J25221j72552j02916R0136n447J05909
$$ 2528659 2443615 2319644 2452088 2421348 2515645 2640866 2468314 2365398 2455534 2450087 2555996
7036B555996k5473R5888K57635r8147n8328k13501j5485K76983p5772Q7140n2562
$$ 2555996 2530523 2626411 2884046 2785899 2727571 2514070 2498585 2775568 2699796 2786936 2734374
7025B734374j22265L1455J50038J32748j60935j14202L6313J8148j14218q7781
$$ 2734374 2612109 2643564 2793602 2926350 2765415 2651213 2687526 2705674 2591456 2503675
7015B503675P0842J42673Q625j12049j47506L75469N4699k56770o8601n7730J23537
$$ 2503675 2574517 2717190 2725815 2613766 2466260 2841729 2896428 2639658 2571057 2513327 2636864
7004B636864J21370k4191p1200k444j7099m004M05378J3372K3506j38092N1865
$$ 2636864 2758234 2734043 2662843 2660399 2643300 2639296 3044674 3058046 3081552 2943460 2995325
6993B995325J29944o0964j29831j43712j8836Q953k9373r1282J98930K521j51517
$$ 2995325 3125269 3064305 2934474 2790762 2771926 2780879 2751506 2660224 2859154 2861675 2710158
6982B710158J68231J37303q5851k48875J5902J624j44542K90939P0379K21575
$$ 2710158 2878389 3015692 2929841 2680966 2696868 2698492 2553950 2844889 2915268 3136843
6972C136843k27038j73206j7684J29041q3058L5766O6677L9008m8543j5917L09003
$$ 3136843 2909805 2736599 2718915 2847956 2764898 2800664 2867341 2906349 2857806 2841889 3150892
6961C150892O3310k17114k55715K11242J56662N5646j98019N4107N359j47462
$$ 3150892 3214202 2997088 2741373 2952615 3109277 3164923 2966904 3021011 3026370 2878908
6951B878908J30605N4434J0410p2552L08768j3447o0088P1515q7602p3857p2900
$$ 2878908 3009513 3063947 3074357 3001805 3310573 3297126 3237038 3308553 3220951 3147094 3074194
6940C074194O1580J2576j4888k07325q083K52821j15348M6687K08380p9499J38543
$$ 3074194 3135774 3148350 3133462 2926137 2918054 3170875 3055527 3102214 3310594 3231095 3369638
6929C369638Q8609j43424j62254O9020m5058j00686n5557J34790K66039q8972
$$ 3369638 3458247 3314823 3152569 3221589 3176531 3075845 3020288 3155078 3421117 3332145
6919C332145j40804j88600k0402L1760M1362j5314r641J16389J57984m9148l41864
$$ 3332145 3191341 3002741 2982339 3014099 3055461 3040147 3030506 3146895 3304879 3255731 2913867
6908B913867K4890K18407k6043r6253K63340J24465J24803l32067o0305P8219
$$ 2913867 2938757 3157164 3131121 3034868 3298208 3422673 3547476 3215409 3155104 3233323
6898C233323n6080Q4739K81639L8190j78113o0476j5653P2729j84323Q9038J63770
$$ 3233323 3177243 3261982 3543621 3581811 3403698 3343222 3327569 3400298 3215975 3305013 3468783
6887C468783J08480p2091o4020N2161J27296n3061q4560N4684j32545r2947Q0929
$$ 3468783 3577263 3505172 3441152 3493313 3620609 3567548 3482988 3537672 3405127 3312180 3393109
6876C393109l8040K14331p1100q6784j38504j26603L63645J57093l20448P7545
$$ 3393109 3355069 3569400 3498300 3411516 3273012 3146409 3510054 3667147 3346699 3424244
6866C424244j66069l5600J42226j4582j19544J43236Q3002J12778j21906k04119
$$ 3424244 3258175 3222575 3364801 3350219 3230675 3373911 3456913 3569691 3447785 3243666
6856C243666J60294P8104p0181l1936K72657j09609j26138N8000J13382J02007
$$ 3243666 3403960 3482064 3411883 3379947 3652604 3542995 3416857 3474857 3588239 3690246
6846C690246k41651l5535K74212j00917R4801N8573k82780p4455J37683p190K27743
$$ 3690246 3448595 3413060 3687272 3586355 3681156 3739729 3456949 3382494 3520177 3512987 3740730
6835C740730J74532J02612J92702k2514l61070l16914J44666K73711k41881K13099
$$ 3740730 3915262 4017874 4210576 4188062 3826992 3510078 3654744 3928455 3686574 3899673
6825C899673J39241k50769J89249K62386P7244j72802J10066N291J20837L5234
$$ 3899673 4038914 3788145 3977394 4239780 4317024 4144222 4254288 4259579 4380416 4415650
6815D415650J21685l9352K4490J58676M4891j04858J34440J8991q4074R4387q4233
$$ 4415650 4537335 4497983 4522473 4681149 4726040 4621182 4755622 4774613 4690539 4784926 4700693
6804D700693r0787K0770j06854k00033L49349R6651J43491k32164J29934J69002
$$ 4700693 4609906 4630676 4523822 4323789 4673138 4769789 4913280 4681116 4811050 4980052
6794D980052j77171J25958J40283k5987K36298K21485l62959j31651K02275M6405
$$ 4980052 4802881 4928839 5069122 5043135 5279433 5500918 5137959 5006308 5208583 5254988
6784E254988j41975n4298M4470l52038J9075K46228r870j95900J3870J21862J37571
$$ 5254988 5113013 5058715 5103185 4751147 4770222 5016450 5006580 4810680 4824550 4946412 5083983
6773E083983J06701J37210j00474j06513K10989J3091K19275K46116J52858K23396
$$ 5083983 5190684 5327894 5227420 5120907 5331896 5344987 5564262 5810378 5963236 6186632
6763F186632j2914k10955m1700K10020L45802J581j26028P4693J13468j79434
$$ 6186632 6173718 5962763 5921063 6131083 6476885 6478466 6352438 6427131 6540599 6361165
6753F361165k96631J07552J51680M40641K4916J18303J28683N28558J86885L5350
$$ 6361165 6064534 6172086 6323766 6764407 6789323 6907626 7036309 7564867 7751752 7787102
6743G787102J07336K13077K38587K24138J67897J04241j267O3792j36728n45820
$$ 7787102 7894438 8107515 8346102 8570240 8738137 8842378 8841111 8904903 8768175 8222355
6733H222355k29636j21149j86732m95511j02686j26686k51856k8637l6984K0822
$$ 8222355 7992719 7871570 7684838 7189327 7086641 6959955 6708099 6679462 6642478 6663300
6723F663300j71303m39665p5014K22646j03660K4725J18923j17576P904j89319
$$ 6663300 6491997 6052332 5977318 6199964 6096304 6121029 6239952 6122376 6130280 5940961
6713E940961K24323j95769j36962j99630R0032j62375K24249j59807M3209N5142
$$ 5940961 6165284 5969515 5832553 5632923 5722955 5560580 5784829 5625022 5668231 5723373
6703E723373k3965J4917O3413J42589J16807j74132J34763K9878j0002J02332
$$ 5723373 5699408 5714325 5777738 5920327 6037134 5863002 5997765 6027643 6017641 6119973
6693F119973r3437j28528O1013M466j70258K28486R5584k32253j75589R5508M1476
$$ 6119973 6026536 5898008 5959021 5963487 5793229 6021715 6117299 5885046 5709457 5804965 5846441
6682E846441N2694R9088j30113r8177K20864l28757J45160J78908o8093q301Q409
$$ 5846441 5899135 5998223 5868110 5769933 5990797 5662040 5807200 5986108 5918015 5909714 5918123
6671E918123l4463K34731j07754q6922K01439P6794q3237n6960n9813Q9750K4794
$$ 5918123 5883660 6118391 6010637 5923715 6125154 6201948 6118711 6061751 6001938 6091688 6116482
6660F116482P1616r9821m8346M9683J07967O5582j17157J71079J59927m07969
$$ 6116482 6188098 6088277 6039931 6089614 6197581 6263163 6146006 6317085 6477012 6069043
6650F069043R8254K65590k22726j56694J0972J52567K83250j19424m7515N398
$$ 6069043 6167297 6432887 6210161 6053467 6064439 6217006 6500256 6380832 6333317 6338715
6640F338715J02800L8075j23421K36441O1811J3105L72812J96388L8886K9964
$$ 6338715 6441515 6479590 6356169 6592610 6654421 6667526 7040338 7236726 7275612 7305576
6630G305576l31780Q5128J46982k59176j89550J54912J95099p1207k57244K14746
$$ 7305576 6973796 7058924 7205906 6946730 6757180 6912092 7107191 7035984 6778740 6993486
6620F993486J40320n8342r3948p0560k268j15716M7144p0792r2183Q1877n0989
$$ 6993486 7133806 7075464 6981516 6910956 6908688 6792972 6840116 6769324 6677141 6759018 6708029
6609F708029K82694K96641Q6319n0935J06405J20591j37489Q8466r9651r233K99478
$$ 6708029 6990723 7287364 7373683 7322748 7429153 7549744 7412255 7500721 7401070 7391837 7691315
6598G691315k8746q226k42250l0028p2585L4118K04627k18633O1172J37943K5311
$$ 7691315 7662569 7654343 7412093 7382065 7309480 7343598 7548225 7329592 7390764 7528707 7554018
6587G554018K19202K96358m2706N5348J89578J34152J23832O0118K41276L66195
$$ 7554018 7773220 8069578 8026872 8082220 8271798 8405950 8529782 8589900 8831176 9197371
6577I197371K19689J21098Q293K12693J74187J25089L6597K21420P5852k5219
$$ 9197371 9417060 9538158 9546451 9759144 9933331 10058420 10095017 10316437 10392289 10367070
6567A0367070N70916M40135P61945J111868J220760J758528K120806K613032K887154
$$ 10367070 10937986 11378121 12140066 13251934 14472694 16231222 18352028 20965060 23852214
6558B3852214K852872K575011K458817K149769J795199J762171J497478N46584
$$ 23852214 26705086 29280097 31738914 33888683 35683882 37446053 38943531 39490115
6550C9490115k88409o87223j310613j620877j634568k167269k407398k385255
$$ 39490115 39201706 38514483 37203870 35582993 33948425 31781156 29373758 26988503
6542B6988503k298202j890076j577406j831531j479109j084502r78930q33602
$$ 26988503 24690301 22800225 21222819 19391288 17912179 16827677 15848747 15015145
6534A5015145p04115q07016l74572o06884q65523n45305l47786n93061o73835
$$ 15015145 14311030 13504014 13129442 12522558 11657035 11111730 10763944 10170883 9497048
6525I497048Q130k34392k58999j07975k82904j60460j11356o2853k29231j24300
$$ 9497048 9505178 9270786 9011787 8903812 8620908 8460448 8349092 8286239 8057008 7932708
6515G932708O4177r8309P2627q5645j33224m016k4337J28480L7221k07226J13023
$$ 7932708 7996885 7898576 7971203 7885558 7752334 7748318 7723981 7852461 7889682 7682456 7795479
6504G795479r1694J44102k10481l0300R4265K07788L57694o91445k76047K89599
$$ 7795479 7703785 7847887 7637406 7607106 7701371 7909159 8266853 7575408 7299361 7588960
6494G588960K30423J20825J08345n1774k02045M4018j8707J00721j47472J05663
$$ 7588960 7819383 7940208 8048553 7996779 7794734 7838752 7820045 7920766 7773294 7878957
6484G878957P4257k13073J16997l8525O8295n1217k27223j86600K72150j30843
$$ 7878957 7953214 7740141 7857138 7818613 7886908 7835691 7608468 7421868 7694018 7563175
6474G563175o8125n5925P2837o7913o6053L93549p6421j24649k87761K24435J68341
$$ 7563175 7495050 7439125 7511962 7444049 7377996 7771545 7695124 7570475 7282714 7507149 7675490
6463G675490J81606K3378J64392j11389J39740L3412m5599L6133J09840j9991
$$ 7675490 7857096 7880474 8044866 7933477 8073217 8106629 8061030 8097163 8207003 8187012
6453H187012j00140P0315L3991J8759k3146j38657j49332K48265J94152Q8670
$$ 8187012 8086872 8157187 8191178 8209937 8186791 8048134 7898802 8147067 8341219 8429889
6443H429889k50844J51815Q6840l6645J13601j3076K20265M4598j5753o9348L12291
$$ 8429889 8179045 8330860 8417700 8381055 8494656 8481580 8701845 8746443 8730690 8661342 8973633
6432H973633L08250K12844K40921L71015J82241n8120N6635M55974L33125r6971
$$ 8973633 9281883 9494727 9735648 10106663 10288904 10230784 10287419 10743393 11076518 10979547
6422A0979547J82408L08942K7383J58067J17738j49376K68958K9423o0773J47873
$$ 10979547 11161955 11470897 11498280 11656347 11774085 11624709 11893667 11923090 11862317 12010190
6412A2010190j1339k0525J63659J01639K05342K51527j18015j80707O7382m7886
$$ 12010190 11998851 11978326 12141985 12243624 12448966 12700493 12582478 12401771 12469153 12421267
6402A2421267r2294l019L5357l33539J63967j88219m57981m97409J2295j78671
$$ 12421267 12328973 12325954 12361311 12027772 12191739 12003520 11545539 11048130 11060425 10881754
6392A0881754k75631l7662q7580k08950Q942J3976J8277k30895N4449m435j3783
$$ 10881754 10606123 10568461 10480881 10271931 10280873 10294849 10313126 10082231 10136680 10132245 10118462
6381A0118462p0674j72154P063k5944k49432j67670r9271k5611O1802j07563j08422
$$ 10118462 10047788 9875634 9882697 9856753 9607321 9439651 9340380 9314769 9376571 9269008 9160586
6370I160586l5997L4572m8857N4019k86583J2537L35462q963k04070K12382m5079
$$ 9160586 9124589 9159161 9110304 9164323 8877740 8890277 9225739 9216776 9012706 9225088 9180009
6359I180009k8388n7192j15682L52850J87258o4476J22340k4466J08059K00962
$$ 9180009 9151621 9094429 8978747 9331597 9518855 9454379 9576719 9552253 9660312 9861274
6349I861274J32995k19019n2505j0170j89366j18560q809J55555K69261q7530
$$ 9861274 9994269 9775250 9722745 9712575 9523209 9404649 9395840 9551395 9820656 9733126
6339I733126O4550O8499J32115j74076J347L64653l3064m07552m03738J29422
$$ 9733126 9797676 9866175 9998290 9824214 9825561 10190214 10157150 9749598 9345860 9475282
6329I475282K05926k11282J51947N1258j24191m9459K64056l74l38595K02251
$$ 9475282 9681208 9469926 9621873 9673131 9548940 9499481 9763537 9763163 9424568 9626819
6319I626819j19694j19950j01272L31747L80214l2576N7926j51142L0617K1700
$$ 9626819 9507125 9387175 9285903 9617650 9997864 9965288 10023214 9872072 9902689 9924389
6309I924389j17707J59101J95593J26090Q3787j25562l01740L1830K05136l630
$$ 9924389 9806682 9965783 10161376 10287466 10371253 10245691 9943951 9975781 10180917 10177287
6299A0177287l12381J92855M19415J47433L05928N26357N82311R76539Q69690
$$ 10177287 9864906 10057761 10477176 10624609 10930537 11456894 12039205 13015744 13885434
6290A3885434Q15633J253516Q42667Q23145O34611M73711L11379p931k56237n01126
$$ 13885434 14701067 15954583 16797250 17620395 18255006 18728717 19040096 19032165 18775928 18274802
6280A8274802n40474q06536j052580p59513n39035o64185l42186l75836k58423
$$ 18274802 17734328 16927792 15875212 15115699 14576664 13912479 13570293 13194457 12936034
6271A2936034k58803l68649k71740N5311j72786l22705n6713k04949M8587j45462
$$ 12936034 12677231 12308582 12036842 12092153 11919367 11596662 11539949 11335000 11383587 11238125
6261A1238125p1889r6022k53644k21766J62929P1870k16936L88121j04401k51263
$$ 11238125 11166236 11070214 10816570 10594804 10757733 10829603 10612667 11000788 10896387 10645124
6251A0645124J78290J71647K71606k57941J7763L32576n5020K1247K5693J41076
$$ 10645124 10823414 10995061 11266667 11008726 11026489 11359065 11304045 11325292 11350985 11492061
6241A1492061m8670j46698P6805k0363J27465M1635J65414l3579k02567R2113
$$ 11492061 11443391 11296693 11373498 11353135 11480600 11522235 11687649 11654070 11451503 11543616
6231A1543616R3324k1771J39699K80511J02736k9234l57511L4984M56037K10106
$$ 11543616 11636940 11615169 11754868 12035379 12138115 12108881 11751370 11786354 12242391 12452497
6221A2452497k4271j3016r4960l552L02676J03432K5968P5105r3772N3502K58315
$$ 12452497 12428226 12415210 12320250 12316698 12619374 12722806 12748774 12823879 12730107 12783609 13041924
6210A3041924j41446j18616K69932j60792q4803J73875J90750L89320K97759J1711
$$ 13041924 12900478 12781862 13051794 12891002 12806199 12980074 13170824 13560144 13857903 13869614
6200A3869614J65915K83743n8055O5653J02713L61004K15351K63558N56515K38290
$$ 13869614 14035529 14319272 14261217 14326870 14429583 14790587 15005938 15269496 15826011 16064301
6190A6064301J26190p6871J38669Q0568J81374K99576M40545j5572K59508L01946
$$ 16064301 16190491 16113620 16252289 16332857 16514231 16813807 17254352 17238780 17498288 17800234
6180A7800234K78918J07581M62183j03579J27069L57991P5963K19771J86327K71677
$$ 17800234 18079152 18186733 18648916 18545337 18672406 19030397 19106360 19326131 19512458 19784135
6170A9784135j86660M01148Q407j54353K60982J89372K91072J80732K03382K13501
$$ 19784135 19597475 19998623 20007030 19852677 20113659 20303031 20594103 20774835 20978217 21191718
6160B1191718j5205O8852Q6542J55187l10234J95128M03402J22886l3085K28381
$$ 21191718 21176513 21245365 21331907 21487094 21176860 21371988 21775390 21898276 21865191 22093572
6150B2093572J26327K68297N56771L27193N32149M50096L96534M67812M97570
$$ 22093572 22219899 22488196 23044967 23372160 23904309 24354405 24750939 25218751 25716321
6141B5716321O45548N50945L00693J32733J08804M55477K22299K6698M48333M67723
$$ 25716321 26361869 26912814 27213507 27346240 27455044 27910521 28132820 28159518 28607851 29075574
6131B9075574L91892M18012L30341P0112N04478P20917L96718M80013K58200L15338
$$ 29075574 29467466 29885478 30215819 30285931 30790409 31511326 31908044 32388057 32646257 32961595
6121C2961595N91379O72835M21359K15202L05868J31084r6008r192k4512k26382
$$ 32961595 33552974 34225809 34647168 34862370 35168238 35299322 35203314 35194122 35169610 34943228
6111C4943228l42680k25967l56375l84091n4438j37642k00324p6171q2245J85713
$$ 34943228 34600548 34374581 34018206 33634115 33579677 33442035 33241711 33165540 33083295 33269008
6101C3269008M19018j28436M01551K85676N36147N60469K28049K08005M81757
$$ 33269008 33688026 33559590 33961141 34246817 34782964 35343433 35571482 35779487 36261244
6092C6261244N20747N10084N57880Q26989Q05237Q76872O59885J012162R48756
$$ 36261244 36781991 37292075 37849955 38676944 39482181 40359053 41018938 42031100 42979856
6083D2979856J028142J154794J239523J108462J136881J490827J148658J548178
$$ 42979856 44007998 45162792 46402315 47510777 48647658 50138485 51287143 52835321
6075E2835321J324526J154183J118997J119688J120477J089650P72669P04821
$$ 52835321 54159847 55314030 56433027 57552715 58673192 59762842 60535511 61240332
6067F1240332N45433Q43949J39536L16351K30763O9042m1860k5414r7054m42696
$$ 61240332 61785765 62629714 62769250 63085601 63316364 63385406 63343546 63318132 63221078 62778382
6057F2778382n16529l05851p41079l52493m87845j025195o83859n94533k45525
$$ 62778382 62261853 61956002 61214923 60862430 60374585 59349390 58665531 58070998 57825473
6048E7825473m92616q05531o24025n92167o78246o46631n53875o82917p06202
$$ 57825473 57332857 56527326 55903301 55311134 54632888 53986257 53432382 52749465 52043263
6039E2043263m48001o13981m82101k39246j53546k29100j84725j48512j49478
$$ 52043263 51595262 50981281 50499180 50259934 50106388 49877288 49692563 49544051 49394573
6030D9394573M3044L89910K16485k02997K27188O0096K16900L76828k6557K57258
$$ 49394573 49437617 49827527 50044012 49841015 50068203 50128299 50345199 50722027 50695470 50952728
6020E0952728Q1473j00293J66930M8756j77925J7510m16753m52742k83091m92077
$$ 50952728 51034201 50933908 51100838 51149594 50971669 50989179 50572426 50119684 49836593 49344516
6010D9344516o48966o70924q06916r16613p57291o48346n47091q25071p06609
$$ 49344516 48695550 48024626 47217710 46301097 45543806 44895460 44348369 43523298 42816689
6001D2816689o70840o81860n31819m99576q16876o19241m75370m34549l80130
$$ 42816689 42145849 41463989 40932170 40432594 39615718 38996477 38521107 38086558 37706428
5992C7706428k91508k91699m89127m33421l64078j59672l85113k32657K47093
$$ 37706428 37414920 37123221 36634094 36200673 35836595 35676923 35291810 35059153 35306246
5983C5306246k18624l35043J10490P5312j21609O4982o8354J82712J62374K03677
$$ 35306246 35087622 34752579 34863069 34938381 34816772 34881754 34813400 34996112 35158486 35362163
5973C5362163L4686J34418J09199l99714N5577p1593r9088k53893l29462n91540
$$ 35362163 35396849 35531267 35640466 35240752 35296329 35224736 35125648 34871755 34542293 33950753
5963C3950753k12527n30745k33879m25119k54479j42404k89080l62138j87804
$$ 33950753 33738226 33207481 32973602 32548483 32294004 32151600 31862520 31500382 31312578
5954C1312578r6202J88374K23J3630Q9487K71369L23193J35502K94672J5479M20942
$$ 31312578 31216376 31404750 31404973 31418603 31508090 31779459 32102652 32238154 32532826 32548305 32969247
5943C2969247l40847j90474j14823J1438j26154k96164m58975m30071k65930k51613
$$ 32969247 32628400 32437926 32323103 32334541 32208387 31912223 31453248 31023177 30757247 30505634
5933C0505634m45981l29286p4882l02025k32059l76198m39373k09449K2994k19752
$$ 30505634 30059653 29730367 29655485 29353460 29121401 28745203 28305830 28096381 28119375 27899623
5923B7899623p0099j77309k36721j39407r8754j17194O6515q589k01293l9028
$$ 27899623 27829524 27652215 27415494 27276087 27177333 27060139 27126654 27118065 26916772 26877744
5913B6877744K27476J42381L07340Q5851L4696J2737j6352O9343p4110o2612j50177
$$ 26877744 27105220 27247601 27554941 27640792 27675488 27688225 27671873 27741216 27667106 27604494 27454317
5902B7454317J16574j5238l74266j31665j28J20139K78999k76832j88536N6746
$$ 27454317 27570891 27555653 27181387 27049722 27049594 27169733 27448732 27171900 26983364 27040110
5892B7040110j16610q0932k79479J04975K41938m6726j1377k3141p0259k29500
$$ 27040110 26923500 26842568 26563089 26668064 26910002 26863276 26851899 26828758 26758499 26528999
5882B6528999J16932L5982J8193K8246Q7392k21309J95009J80133q1780J92516
$$ 26528999 26645931 26681913 26700106 26728352 26815744 26594435 26789444 26969577 26887797 27080313
5872B7080313K76234L25433K58656J95050K58356N56920K45412j08548K69591
$$ 27080313 27356547 27681980 27940636 28135686 28394042 28950962 29196374 29087826 29357417
5863B9357417M62228j68550k80656J01484n9274j5940j89538J09425J87117J6008
$$ 29357417 29819645 29651095 29370439 29471923 29412649 29396709 29207171 29316596 29503713 29519721
5853B9519721J4044K43412L53673N7399N09689M49632K58127K93637J2078J61717
$$ 29519721 29533765 29777177 30130850 30188249 30697938 31147570 31405697 31699334 31711412 31873129
5843C1873129j21381Q032j76177r3334j00549j71787o0373j32303J16791J07820
$$ 31873129 31751748 31759780 31583603 31490269 31389720 31217933 31157560 31025257 31142048 31249868
5833C1249868o3544L5560N20740J66869K05545L58115L03876L51225M00465P05914
$$ 31249868 31186324 31221884 31742624 31909493 32115038 32473153 32777029 33128254 33528719 34234633
5823C4234633J90317K77130O9485M71259J05272n0581K59833L8145J33576j96774
$$ 34234633 34424950 34702080 34771565 35242824 35348096 35297515 35557348 35595493 35729069 35532295
5813C5532295l2271j09445K54306N53505N79159M02762M63737O31893P77023J004343
$$ 35532295 35500024 35390579 35644885 36198390 36777549 37180311 37644048 38275941 39052964 40057307
5803D0057307J386905J765948K039676K999126M337019M578917N040001M732738
$$ 40057307 41444212 43210160 45249836 48248962 52585981 57164898 62204899 66937637
5795F6937637L839261J249116o72701j118765k54602k573036m363305l717213
$$ 66937637 70776898 72026014 71353313 70234548 69979946 67406910 63043605 59326392
5787E9326392k913312k100965k151105j490844j175549q36326q68218m64523n08634
$$ 59326392 56413080 54312115 52161010 50670166 49494617 48658291 47790073 47325550 46816916
5778D6816916k08024k02227n81832l84685m51502l63495j52132J46532j63782
$$ 46816916 46608892 46406665 45824833 45440148 44988646 44625151 44473019 44619551 44455769
5769D4455769k30654O4086j15331L53506L65076J9879M20103K11471J85834N36778
$$ 44455769 44225115 44289201 44173870 44527376 44892452 44912331 45332434 45543905 45729739 46266517
5759D6266517j269J18837L92678K93109K45750L04377L65477J58708Q3872K17804
$$ 46266517 46265248 46384085 46776763 47069872 47315622 47619999 47985476 48144184 48228056 48445860
5749D8445860L30135N20845J30430N07963N39150J60841r3774L89146M01084O39167
$$ 48445860 48775995 49296840 49427270 49935233 50474383 50635224 50541450 50930596 51331680 51970847
5739E1970847L90400L54998O33846Q21868M84536L06757O35354N89100R62785
$$ 51970847 52361247 52716245 53350091 54171959 54656495 54963252 55598606 56187706 57150491
5730E7150491P16637O52688K77075M64925N31167L39810L61086M96749M452J83830
$$ 57150491 57867128 58519816 58796891 59261816 59792983 60132793 60493879 60990628 60995080 61178910
5720F1178910M27683J16494l1589J86852M83431O88474M44370K59817O32880N88283
$$ 61178910 61606593 61723087 61691498 61878350 62361781 63050255 63494625 63754442 64387322 64975605
5710F4975605N47742N85232J041817J192339R28008J001421P18175N96088J212750
$$ 64975605 65523347 66108579 67150396 68342735 69270743 70272164 70990339 71586427 72799177
5701G2799177J269023R49848Q72652R92777O70417N61006Q68378P84028O35290
$$ 72799177 74068200 75018048 75890700 76883477 77553894 78114900 78983278 79767306 80402596
5692H0402596L35674N18882K69200J24102L33902j47460J69394J29304N940R5579
$$ 80402596 80738270 81257152 81526352 81650454 81984356 81836896 82006290 82135594 82141534 82237113
5682H2237113k99096r1594m8437K77480J50050L49334M78926P48524P79807Q02933
$$ 82237113 81938017 81846423 81797986 82075466 82225516 82574850 83053776 83802300 84582107 85385040
5672H5385040O97832P05651J240561J022093J236632J017479Q15468J026266Q12757
$$ 85385040 86082872 86788523 88029084 89051177 90287809 91305288 92120756 93147022 93959779
5663I3959779P55647O02923R18436R49686O84373L08002K42700N44777N26720
$$ 93959779 94715426 95318349 96236785 97186471 97870844 98178846 98421546 98966323 99493043
5654I9493043K28683N36005N16696P06812Q00532K64540P52174Q23843O91117
$$ 99493043 99721726 100257731 100774427 101481239 102281771 102546311 103298485 104122328 104813445
5645A04813445O52742Q56808O56859R51282P19326R29278P43497J169152J008479
$$ 104813445 105466187 106322995 106979854 107931136 108650462 109579740 110323237 111492389 112500868
5636A12500868J444705J267173R47326R66910J267699J564716J239923J510387
$$ 112500868 113945573 115212746 116160072 117126982 118394681 119959397 121199320 122709707
5628A22709707J212418J246181J301734J439960J764597J106177J471978J774997
$$ 122709707 123922125 125168306 126470040 127910000 129674597 130780774 132252752 134027749
5620A34027749J639203J416029J370234J496926J597908J666076J868073J929974
$$ 134027749 135666952 137082981 138453215 139950141 141548049 143214125 145082198 147012172
5612A47012172J750237J779321J569281J897710J768805J932953K155289K267464
$$ 147012172 148762409 150541730 152111011 154008721 155777526 157710479 159865768 162133232
5604A62133232J769376J914272J913701K264702K101755K238227K406553K028179
$$ 162133232 163902608 165816880 167730581 169995283 172097038 174335265 176741818 178769997
5596A78769997K022983K154387K292967K257764K277317K432551K110228K341635
$$ 178769997 180792980 182947367 185240334 187498098 189775415 192207966 194318194 196659829
5588A96659829K540399K631398K695547K547849K528739K507786K543590K768742
$$ 196659829 199200228 201831626 204527173 207075022 209603761 212111547 214655137 217423879
5580B17423879K936338K788956K614462K981914K828896K820543L003515K934622
$$ 217423879 220360217 223149173 225763635 228745549 231574445 234394988 237398503 240333125
5572B40333125K848654K957313L143622L400242L189794L188121K991621L204295
$$ 240333125 243181779 246139092 249282714 252682956 255872750 259060871 262052492 265256787
5564B65256787L379865L254891L311937L260983L264550L314232L168963L353708
$$ 265256787 268636652 271891543 275203480 278464463 281729013 285043245 288212208 291565916
5556B91565916L211991L334309L321210L296231L559058L411873L629928L363324
$$ 291565916 294777907 298112216 301433426 304729657 308288715 311700588 315330516 318693840
5548C18693840L145777L213332L224069L162205L225444K873339K975246K985064
$$ 318693840 321839617 325052949 328277018 331439223 334664667 337538006 340513252 343498316
5540C43498316K895922K972686L218566K946281K718679K484562K281147K458099
$$ 343498316 346394238 349366924 352585490 355531771 358250450 360735012 363016159 365474258
5532C65474258K439720K342098J892398K177050K092606J682767J683918J586965
$$ 365474258 367913978 370256076 372148474 374325524 376418130 378100897 379784815 381371780
5524C81371780J451597J190162J431192R63144P72197M62500N56805M61997J71144
$$ 381371780 382823377 384013539 385444731 386407875 387180072 387642572 388199377 388661374 388832518
5515C88832518N67453M88081l88329l08972k83810l79858m83926q08240j105665
$$ 388832518 389399971 389888052 389499723 389190751 388906941 388527083 388043157 387234917 386129252
5506C86129252j196798q80472j127535j835094k182395j762580j879406k039039
$$ 386129252 384932454 384051982 382924447 381089353 378906958 377144378 375264972 373225933
5498C73225933k073101k257333k591419k729859k586436k767002k836520k743095
$$ 373225933 371152832 368895499 366304080 363574221 360987785 358220783 355384263 352641168
5490C52641168k611799k910741k860362k853446l040147l133802l172864l078895
$$ 352641168 350029369 347118628 344258266 341404820 338364673 335230871 332058007 328979112
5482C28979112k682732k928727k795513l035735k872603k987481l194387l316166
$$ 328979112 326296380 323367653 320572140 317536405 314663802 311676321 308481934 305165768
5474C05165768l055350k982463l334860l333781k964477l039202l264618k703568
$$ 305165768 302110418 299127955 295793095 292459314 289494837 286455635 283191017 280487449
5466B80487449k515693k691795k299459k013068j711895j312562j370542j235170
$$ 280487449 277971756 275279961 272980502 270967434 269255539 267942977 266572435 265337265
5458B65337265r48107q62122j237987j137405j398332j680867j987570k235951
$$ 265337265 264389158 263527036 262289049 261151644 259753312 258072445 256084875 253848924
5450B53848924k912558l174582l519188l804516m135639m141122m067583l920450
$$ 253848924 250936366 247761784 244242596 240438080 236302441 232161319 228093736 224173286
5442B24173286m113690m202936l986480l363901l407034l380770k695129k818559
$$ 224173286 220059596 215856660 211870180 208506279 205099245 201718475 199023346 196204787
5434A96204787k436340k461995k287534k081054j941806k001093j959259j934051
$$ 196204787 193768447 191306452 189018918 186937864 184996058 182994965 181035706 179101655
5426A79101655k340898k398275k325207k112272k399546j733747j883135j944723
$$ 179101655 176760757 174362482 172037275 169925003 167525457 165791710 163908575 161963852
5418A61963852j662441j520194j909382j617160j995070k180462k095023k043585
$$ 161963852 160301411 158781217 156871835 155254675 153259605 151079143 148984120 146940535
5410A46940535k354273k443253k809707k949867k398649k344934k312583k440269
$$ 146940535 144586262 142143009 139333302 136383435 133984786 131639852 129327269 126887000
5402A26887000k155949k121032k051757j962769k146422k055445j804863j700335
$$ 126887000 124731051 122610019 120558262 118595493 116449071 114393626 112588763 110888428
5394A10888428j935217k152612j772610j408123j894474j610696j404320j282900
$$ 110888428 108953211 106800599 105027989 103619866 101725392 100114696 98710376 97427476
5386I7427476j462355j477640j279371j378573j139592j131008j232113j247916
$$ 97427476 95965121 94487481 93208110 91829537 90689945 89558937 88326824 87078908
5378H7078908q58891r71443p61745r46791j119182j066451q19433o10136q58047
$$ 87078908 86220017 85248574 84486829 83540038 82420856 81354405 80534972 79924836 79066789
5369G9066789j038967o13367r09171p04388o38803o66654j080873j076337j046442
$$ 79066789 78027822 77414455 76505284 75800896 75162093 74495439 73414566 72338229 71291787
5360G1291787q88187q07580j047484p27887q04402j048855q83597r72482p24029
$$ 71291787 70403600 69596020 68548536 67820649 67016247 65967392 65083795 64111313 63387284
5351F3387284q19816q35743q48820o50206n26158o88515j007057q15400p30191
$$ 63387284 62567468 61731725 60882905 60232699 59706541 59018026 58010969 57195569 56465378
5342E6465378n01370n23912n25405p46927q43879q22958o76595n63910o15900
$$ 56465378 55964008 55440096 54914691 54167764 53323885 52500927 51824332 51260422 50644522
5333E0644522n20171l19185m91733q23350m18131n08330n33018l36603n31918
$$ 50644522 50124351 49805166 49313433 48490083 48071952 47563622 47030604 46694001 46162083
5324D6162083o82840l43504n85581p50687m44847p553m78239k05666m41873m58762
$$ 46162083 45479243 45135739 44550158 43799471 43354624 43347071 42868832 42663166 42221293 41762531
5314D1762531l21743m85995m42958m96703o91280k69695p9684j09719m12869p20968
$$ 41762531 41440788 40954793 40511835 40015132 39323852 39054157 38974473 38864754 38451885 37730917
5304C7730917m09444j19233k76305k51572k84220o52297k2478l23689l05698m66023
$$ 37730917 37321473 37202240 36925935 36674363 36390143 35737846 35715368 35391679 35085981 34619958
5294C4619958n9869r276p3786n74118o05632l39415j69898j12524l64656j57756
$$ 34619958 34560089 34550813 34477027 33902909 33297277 32957862 32787964 32675440 32310784 32153028
5284C2153028k19348m60073o39328j93342j7899J02818l0461k31564l90913o10109
$$ 32153028 31933680 31473607 30834279 30640937 30623038 30725856 30695395 30463831 30072918 29462809
5274B9462809k87636r4130j81146l9339j57938j23854k06726l08080m57441l20646
$$ 29462809 29175173 29081043 28899897 28860558 28702620 28578766 28372040 28063960 27606519 27285873
5264B7285873m84004N5191K61857j82339l93263l90164m9043l48377o5998K12686
$$ 27285873 26801869 26857060 27118917 26936578 26543315 26153151 26104108 25755731 25689733 25902419
5254B5902419k36835l85708m64782l13981j78865m4625j20964j02551n2728j46103
$$ 25902419 25665584 25279876 24815094 24501113 24322248 24277623 24156659 24054108 24001380 23855277
5244B3855277n13921k45561j9526p3251K14649J3073k86319L8093k17275k71535
$$ 23855277 23341356 23095795 23076269 23003018 23217667 23230740 22944421 22982514 22765239 22493704
5234B2493704m44719j07595n5115j70113M0261j15076k57030k33847j00236j983
$$ 22493704 22048985 21941390 21886275 21716162 21756423 21641347 21384317 21150470 21050234 21048251
5224B1048251O254J12503j21236j31437k29361j35265j97260j19984q9792L81763
$$ 21048251 21054505 21167008 21045772 20914335 20684974 20549709 20352449 20232465 20142673 20524436
5214B0524436Q0696l23955K04603L1040N5084J58496J93896k13051j53024k4600
$$ 20524436 20605132 20281177 20485780 20516820 20571904 20730400 20924296 20711245 20558221 20533621
5204B0533621l95254n11761k2205j41898j5775k83968k44396k61472k67562p8565
$$ 20533621 20138367 19626606 19604401 19462503 19446728 19162760 18918364 18656892 18389330 18310765
5194A8310765p7623p5038P2887n0341j01421p4216m76878m34042Q3398k02880
$$ 18310765 18233142 18158104 18230991 18180650 18079229 18005013 17528135 17094093 17177491 16974611
5184A6974611L3278L37739j1173Q4148k90790m26874j8997o3010J40690j44277
$$ 16974611 17007889 17345628 17334455 17418603 17127813 16700939 16681942 16618932 16759622 16615345
5174A6615345j24587J27055j57948j8537K31861J38162M4325P454N6097O5863
$$ 16615345 16490758 16617813 16459865 16441328 16673189 16811351 16855676 16863130 16919227 16985090
5164A6985090k00636Q9263J85963K23579r4460j00640O4281J03571O2835K90399
$$ 16985090 16784454 16873717 17059680 17283259 17188799 17088159 17152440 17256011 17318846 17609245
5154A7609245J37314K40870L71444J2853k01551j51030M43228K36859J33112J04927
$$ 17609245 17746559 17987429 18358873 18371726 18170175 18019145 18462373 18699232 18832344 18937271
5144A8937271L47871m244K82506k13562l26698K38201L05007M22460k66342J1577
$$ 18937271 19285142 19280898 19563404 19349842 19023144 19261345 19566352 19988812 19722470 19734047
5134A9734047K61177K54091j41410R8971J2220j96778K4491M4048J21118j48055
$$ 19734047 19995224 20249315 20107905 20206876 20219096 20022318 20046809 20090857 20211975 20063920
5124B0063920P2935K34327J89097r9784k71473K07534K74939o4822J01090p8799
$$ 20063920 20136855 20371182 20560279 20460495 20189022 20396556 20671495 20606673 20707763 20628964
5114B0628964K86323p0250r9197K99070J81403L27191k5255J37740M9872q1143
$$ 20628964 20915287 20845037 20745840 21044910 21226313 21553504 21528249 21665989 21715861 21634718
5104B1634718K60027J8100K17655K09696L20239J36948P5693J10778J31872j08001
$$ 21634718 21894745 21912845 22130500 22340196 22660435 22797383 22873076 22983854 23115726 23007725
5094B3007725K95774K05795K03835K91724n5029k09215M849J01403j48884K30930
$$ 23007725 23303499 23509294 23713129 24004853 23949824 23740609 23745458 23846861 23697977 23928907
5084B3928907P5150J2214j25806j00015r5512J11206Q9264n3316j36050N07l38506
$$ 23928907 24004057 24016271 23890465 23790450 23694938 23806144 23895408 23842092 23706042 23706549 23368043
5073B3368043k44212r8834j79363l747j4314o3655l63184k76460k5308k43538
$$ 23368043 23123831 23024997 22845634 22841887 22827573 22763918 22400734 22124274 22098966 21855428
5063B1855428j58891J43529K39245J40547m19231o0107J80547j70658j75420j82716
$$ 21855428 21696537 21840066 22079311 22219858 21800627 21740520 21921067 21750409 21574989 21392273
5053B1392273Q8968M9406k20263k73562L0244j04986j86189k06537k80698O4982
$$ 21392273 21481241 21530647 21310384 21036822 21067066 20962080 20775891 20569354 20288656 20353638
5043B0353638l01353m36536j32007j45216N0729r6673l73681m36573j44199k59046
$$ 20353638 20052285 19615749 19483742 19338526 19389255 19292582 18918901 18482328 18338129 18079083
5033A8079083k53774o01583k20393k35662k30811k28034J02839n46576m30691
$$ 18079083 17825309 17223726 17003333 16767671 16536860 16308826 16411665 15865089 15434398
5024A5434398j99412l47766m99539k03628j69198k95425q432k15517P7292k68571
$$ 15434398 15234986 14887220 14387681 14184053 14014855 13719430 13710998 13495481 13572773 13304202
5014A3304202k59704J43329j64309k16107k00718k57011M4888j1900j54677M010
$$ 13304202 13044498 13187827 13023518 12807411 12606693 12349682 12394570 12382670 12227993 12232003
5004A2232003K4135m84406j73825r2300K31168L79153j16875k5284J08818j2710
$$ 12232003 12256138 11771732 11597907 11505607 11736775 12115928 11999053 11973769 12082587 12069877
4994A2069877j76962O1708q9346L35666j475l92761J32615K20476l6297K25417
$$ 12069877 11892915 11954623 11865277 12200943 12199468 11806707 11939322 12159798 12123501 12348918
4984A2348918L33520j07070P2314M11021K54459J80593M88285R1060N63151J68992
$$ 12348918 12682438 12575368 12647682 13058703 13313162 13493755 13982040 14073100 14636251 14805243
4974A4805243N33668P78421N16388O53727M43987L20202L36511K03705M87857
$$ 14805243 15338911 16117332 16633720 17287447 17731434 18051636 18388147 18591852 19079709
4965A9079709M266j31366J36449K0217n0053n100j11903o7065J42205Q741J59988
$$ 19079709 19083975 18952609 19089058 19109275 19059222 19054122 18942219 18875154 19017359 19026100 19186088
4954A9186088R0652K68681K90090l6983j63063L69533J55372Q2612M50529M42092
$$ 19186088 19276740 19545421 19835511 19798528 19635465 20004998 20160370 20242982 20693511 21135603
4944B1135603J82216J80092N10651J22332J37438J07699M81580L54815J80825
$$ 21135603 21317819 21497911 22008562 22130894 22268332 22376031 22857611 23212426 23393251
4935B3393251J53525M28815k07553L18223L76380L79014M07892K94637J56907
$$ 23393251 23546776 23975591 23768038 24086261 24462641 24841655 25249547 25544184 25701091
4926B5701091J74642J11230K64776M71438J81464P3249J63408L5309k46928j42185
$$ 25701091 25875733 25986963 26251739 26723177 26904641 26977890 27141298 27176607 26929679 26787494
4916B6787494J69539J74439k97819J65202n684j26530j78611k02231J17159j2957
$$ 26787494 26957033 27131472 26833653 26998855 26993171 26866641 26688030 26485799 26602958 26590001
4906B6590001O2175K38105k96643j75993P9888J86565j12258J03814K7729N0551
$$ 26590001 26652176 26890281 26593638 26417645 26497533 26684098 26571840 26675654 26703383 26753934
4896B6753934k24999J12244J34760k80178j28875N8726L02275J41942k32673J83786
$$ 26753934 26528935 26641179 26775939 26495761 26366886 26425612 26727887 26869829 26637156 26820942
4886B6820942N54158j43223O9064p636L72833J41767J87762L65485K52101L35471
$$ 26820942 27375100 27231877 27300941 27293305 27666138 27807905 27995667 28361152 28613253 28948724
4876B8948724J31304M61404J80085Q2009K67742J74237J14611r1542r4832Q9250
$$ 28948724 29080028 29541432 29721517 29803526 30071268 30245505 30360116 30268574 30173742 30262992
4866C0262992P0755K18240J22794M86634K64933k29307l0162M51871K96639K85889
$$ 30262992 30333747 30551987 30674781 31161415 31426348 31197041 31166879 31618750 31915389 32201278
4856C2201278L96064M58536K06248L59545M91578O35525L28588L79807K57699
$$ 32201278 32597342 33055878 33262126 33621671 34113249 34748774 35077362 35457169 35714868
4847C5714868L97062J03619j74082k5933n2367j50172j91082k21570l32919k09974
$$ 35714868 36111930 36215549 36041467 36015534 35963167 35812995 35621913 35400343 35067424 34857450
4837C4857450k14812l45495R5467J92768k7677K91476R55202J112685J746356
$$ 34857450 34642638 34297143 34392610 34585378 34557701 34849177 35804379 36917064 38663420
4828C8663420K138807K945164L513228L428875K820883J802773Q78016J18621
$$ 38663420 40802227 43747391 47260619 50689494 53510377 55313150 56191166 56309787
4820E6309787o42242o85954j413675k637710k870550k409865j968773j581882
$$ 56309787 55667545 54981591 53567916 50930206 48059656 45649791 43681018 42099136
4812D2099136j412223r87947m51303m42213n96781n96924l79922o69589n06984
$$ 42099136 40686913 39698966 39247663 38805450 38208669 37611745 37231823 36562234 36055250
4803C6055250k34067j63609m44093k3121j10651k34041j73072l4931m72094j21106
$$ 36055250 35821183 35657574 35213481 35190360 35079709 34845668 34672596 34637665 34165571 34044465
4793C4044465l73669l71556n73154j62982m28158m48250n91181l83369l99964
$$ 34044465 33670796 33299240 32726086 32563104 32134946 31686696 31095515 30712146 30312182
4784C0312182o75578m36697o17384o39071m65188n29222n20615m85269j95990
$$ 30312182 29636604 29199907 28582523 27943452 27478264 26949042 26428427 25943158 25747168
4775B5747168l27554o70384k71015o2249j46456p4815j20784l93198n37418m05715
$$ 25747168 25419614 24749230 24478215 24415966 24269510 24194695 24073911 23680713 23143295 22737580
4765B2737580k64015l35346m06898l02219m55360k87056j75730n15066n06127
$$ 22737580 22473565 22138219 21731321 21429102 20973742 20686686 20510956 19995890 19489763
4756A9489763j52874j30648k82083l25791j09772M8903l15023M7477n3080O3759
$$ 19489763 19336889 19206241 18924158 18598367 18488595 18537498 18222475 18269952 18216872 18280631
4746A8280631m1724j48192k52944j130K46676M7028J05222J80882L71886K05607
$$ 18280631 18238907 18090715 17837771 17836641 18083317 18130345 18235567 18416449 18788335 18993942
4736A8993942J95081j36170J31236O14896N76494N24108M85400M72831M95181
$$ 18993942 19189023 19052853 19184089 19798985 20375479 20899587 21384987 21857818 22352999
4727B2352999M83110Q26718R40886Q78418R01810R19020J154848J014567R72741
$$ 22352999 22836109 23662827 24603713 25482131 26383941 27302961 28457809 29472376 30445117
4718C0445117J012013J157742J017302R68460Q61262P47289J097218Q81075L86634
$$ 30445117 31457130 32614872 33632174 34600634 35461896 36209185 37306403 38187478 38574112
4709C8574112N95017O83984N97542M26773N69241K46344O24328N17490P30260
$$ 38574112 39169129 39853113 40450655 40877428 41446669 41693013 42317341 42834831 43565091
4700D3565091J148072Q21519Q57182J019170J059139R26623J219758J528512J907229
$$ 43565091 44713163 45534682 46391864 47411034 48470173 49396796 50616554 52145066 54052295
4691E4052295J119858J199326J282851J164016P97246Q90875O84542K62699L71340
$$ 54052295 55172153 56371479 57654330 58818346 59615592 60506467 61191009 61453708 61825048
4682F1825048n7611m41865p24377p24665p04480n99361j106367o82181q32361
$$ 61825048 61767437 61325572 60601195 59876530 59172050 58572689 57466322 56784141 55951780
4673E5951780j330781j014082p83389j223436p28388o09088q59465r45545r16749
$$ 55951780 54620999 53606917 52823528 51600092 50871704 50262616 49403151 48457606 47540857
4664D7540857j126820m26391p59600q60240o93099q03357q71731q34759j042331
$$ 47540857 46414037 45987646 45228046 44367806 43674707 42871350 41999619 41164860 40122529
4655D0122529r80737j027773j052314r67115j286462j096920j547406j334422
$$ 40122529 39141792 38114019 37061705 36094590 34808128 33711208 32163802 30829380
4647C0829380j068993q74468q63911r35528o42165n64235p64564m27584o2149
$$ 30829380 29760387 28885919 28022008 27086480 26444315 25880080 25115516 24687932 24625783
4638B4625783K95420O15838O93151J508370K539681L124154M145344L895235L343589
$$ 24625783 24921203 25537041 26230192 27738562 30278243 33402397 37547741 41442976 44786565
4629D4786565K187084J268812M89560n63544j361509j910970k394165l135877
$$ 44786565 46973649 48242461 48732021 48168477 46806968 44895998 42501833 39365956
4621C9365956k530451j717267j384938q07982o359J011225J079446J445533J816717
$$ 39365956 36835505 35118238 33733300 32925318 32918959 33930184 35009630 36455163 38271880
4612C8271880J686537K142294K023478J912958K608364L025685L071976L155454
$$ 38271880 39958417 42100711 44124189 46037147 48645511 51671196 54743172 57898626
4604E7898626L392427K937546K545577K841711K937012L159586L201489L174929
$$ 57898626 61291053 64228599 66774176 69615887 72552899 75712485 78913974 82088903
4596H2088903K450549J562548J229674O30362K37619K9972J01778j012831j637601
$$ 82088903 84539452 86102000 87331674 87962036 88199655 88229627 88331405 87318574 85680973
4587H5680973j724436k509983k912475k739107k455212k766099k813397l562464
$$ 85680973 83956537 81446554 78534079 75794972 73339760 70573661 67760264 64197800
4579F4197800l651972l602806l550297l390752l281276l167617l483044l364315
$$ 64197800 60545828 56943022 53392725 50001973 46720697 43553080 40070036 36705721
4571C6705721k989847k767041k737009k214722j839047j625274j561812j442820
$$ 36705721 33715874 30948833 28211824 25997102 24158055 22532781 20970969 19528149
4563A9528149j199417q48048j069473p68629o43682o43882n38797o30213p35562
$$ 19528149 18328732 17480684 16411211 15642582 14998900 14355018 13816221 13186008 12450446
4554A2450446n55309l68724L2152j26486n27440n26094j77588l44544m51398k44765
$$ 12450446 11895137 11526413 11558565 11432079 10904639 10378545 10200957 9856413 9405015 9160250
4544I160250k60114l5147O9361k01808k08025k82347k93357Q8968J6782R737l20926
$$ 9160250 8900136 8864989 8934350 8732542 8524517 8242170 7948813 8037781 8054563 8064300 7743374
4533G743374P642j75525k12568j7502k40028k22258l489k59637k31063l4370k23655
$$ 7743374 7751016 7575491 7362923 7345421 7105393 6883135 6879646 6620009 6388946 6354576 6130921
4522F130921M1885k356q7234k0761R3373l96682k19280m64727r0441j5574K2084
$$ 6130921 6172806 6170450 6083216 6062455 6155828 5759146 5539866 5075139 4984698 4969124 4991208
4511D991208K48830P4574J10836j90860K64113l31584J11940k42355L8044K00535
$$ 4991208 5240038 5314612 5425448 5234588 5498701 5167117 5279057 5036702 5074746 5275281
4501E275281n2238K20420l23941k18467J6567r3060k9536K6829m37292l67365
$$ 5275281 5223043 5443463 5119522 4901055 4917622 4824562 4795026 4821855 4384563 4017198
4491D017198j03696N0768L71178J32288q1243J27334m1002k65733J34975k50019
$$ 4017198 3913502 3964270 4335448 4467736 4386493 4513827 4472825 4207092 4342067 4092048
4481D092048N1663J33084k63431j94553l8354K4351M4150m1392K09409m0378J24562
$$ 4092048 4143711 4276795 4013364 3818811 3780457 3804808 3848958 3807566 4016975 3976597 4101159
4470D101159q4574j50957j38267Q3458J77229P6532K57693r5758q1870j42163
$$ 4101159 4016585 3865628 3727361 3810819 3988048 4064580 4322273 4226515 4144645 4002482
4460D002482J35773R7436K53879O1947K2214k7775n1733j76698r8661K0140J07938
$$ 4002482 4138255 4235691 4489570 4551517 4573731 4545956 4494223 4317525 4218864 4239004 4346942
4449D346942k6997J71993k96942k24005K61469J63877O7358p0136R8687k608r7491
$$ 4346942 4319945 4491938 4194996 3970991 4232460 4396337 4463695 4393559 4492246 4489638 4392147
4438D392147M6386m8772p9166j55855Q95o2307J03069M0574q550J84060Q235k06768
$$ 4392147 4438533 4389761 4310595 4154740 4155635 4093328 4196397 4236971 4228421 4412481 4420716 4213948
4426D213948J95508K33566J22689p9474l98764j88323j9715L54378J62926J18339
$$ 4213948 4409456 4643022 4765711 4686237 4287473 4099150 4079435 4433813 4596739 4715078
4416D715078j16158j662r2241J11732j51815J04299J24100k15595l02652k67354
$$ 4715078 4598920 4597258 4505017 4616749 4464934 4569233 4693333 4477738 4175086 3907732
4406C907732k33063L05881Q4555M4258K01222K8098N3355j80195K39164L53578
$$ 3907732 3674669 3980550 4065105 4109363 4310585 4338683 4392038 4211843 4451007 4804585
4396D804585l5842j5101L17270K9876l8349k31077K16292Q8216q7323J29817K03118
$$ 4804585 4768743 4753642 5070912 5100788 5062439 4831362 5047654 5135870 5048547 5178364 5381482
4385E381482q7826p5533m36552J13492J81224M9825M1260q8047p5516J20139k3580
$$ 5381482 5293656 5218123 4781571 4895063 5076287 5126112 5167372 5079325 5003809 5123948 5100368
4374E100368Q6251K30724j8513K11349j48048m6453k70303Q0398L10613K80934
$$ 5100368 5186619 5417343 5398830 5610179 5462131 5415678 5145375 5225773 5536386 5817320
4364E817320P0547J5952K32784j10453j01068K57168L47239k9326J17004J73237
$$ 5817320 5887867 5903819 6136603 6026150 5925082 6182250 6529489 6500163 6617167 6790404
4354F790404J01954j52674J94997L67297k9369J91396N2414j23831N4661J17009
$$ 6790404 6892358 6739684 6934681 7301978 7272609 7464005 7516419 7392588 7447249 7564258
4344G564258j505m8698J77297L76126Q9713L31651K12317q7705J0485o5277M65479
$$ 7564258 7562753 7514055 7691352 8067478 8157191 8488842 8701159 8613454 8623939 8558662 9024141
4333I024141L89808R7867Q5036J03946J59318K71060K51902J20344k53117K01048
$$ 9024141 9413949 9511816 9596852 9700798 9860116 10131176 10383078 10503422 10250305 10451353
4323A0451353M79395J73028k74834J24921L50838J53516M90629K55109J43449
$$ 10451353 10930748 11103776 10828942 10953863 11304701 11458217 11948846 12203955 12347404
4314A2347404L69175J57121L00780L45198N21305O74819N27589M58858L96344
$$ 12347404 12716579 12873700 13174480 13519678 14040983 14715802 15243391 15702249 16098593
4305A6098593O59812M25773R73172M51336R36582Q39154Q79773J173385Q88117
$$ 16098593 16758405 17184178 18157350 18608686 19545268 20384422 21264195 22437580 23325697
4296B3325697R95127J387664J527223J487890J521161J380525J345359J825982
$$ 23325697 24320824 25708488 27235711 28723601 30244762 31625287 32970646 34796628
4288C4796628J843177J968456J947348K272450J984809J786522K343140K381545
$$ 34796628 36639805 38608261 40555609 42828059 44812868 46599390 48942530 51324075
4280E1324075K577209K660402K708600K656296K526516K499058K815311K652058
$$ 51324075 53901284 56561686 59270286 61926582 64453098 66952156 69767467 72419525
4272G2419525K809902K760798K531828K511097K209825K184706K085935J959287
$$ 72419525 75229427 77990225 80522053 83033150 85242975 87427681 89513616 91472903
4264I1472903J628653J532808J587870J243138O73810Q34808O51828L30616L80445
$$ 91472903 93101556 94634364 96222234 97465372 98139182 98973990 99625818 99956434 100336879
4255A00336879J99003j60649l26913l53596m27096o68996q32213r21458j018874
$$ 100336879 100535882 100375233 100048320 99694724 99267628 98598632 97766419 96844961 95826087
4246I5826087j033674j338309j620691j891048j862768k329981k281225k125769
$$ 95826087 94792413 93454104 91833413 89942365 88079597 85749616 83468391 81342622
4238H1342622k373861k782614k581342k595685k273439k246086j937920j816820
$$ 81342622 78968761 76186147 73604805 71009120 68735681 66489595 64551675 62734855
4230F2734855j607287j158715n73521L96120J690981K679657M545786P544452
$$ 62734855 61127568 59968853 59395332 59791452 61482433 64162090 68707876 76252328
4222G6252328J0914292J2973383J2778418J0819475N778453K261994R0587k354596
$$ 76252328 87166620 100140003 112918421 123737896 129516349 131778343 131868930 129514334
4214A29514334m664838q226829j0604076j1987962j1673130r235258p756912o127383
$$ 129514334 124849496 116622667 106018591 94030629 82357499 73122241 65365329 59237946
4206E9237946m350735l478416l471763k993104k751802k602155k265517k718172
$$ 59237946 54887211 51408795 47937032 44943928 42192126 39589971 37324454 34606282
4198C4606282k573108k244193j813040j973163j913897j691997j225431q28314
$$ 34606282 32033174 29788981 27975941 26002778 24088881 22396884 21171453 20343139
4190B0343139p13404o71284n96991n70436k90515l66305m92265l27812j09449
$$ 20343139 19629735 18958451 18361460 17791024 17500509 17134204 16641939 16314127 16204678
4181A6204678l01539m10773m75376k02871j52806K6794m11727m52976k2798k36404
$$ 16204678 15903139 15492366 15016990 14814119 14661313 14688107 14276380 13823404 13800606 13564202
4171A3564202m61022j66402l10469l97923L8092j5206j35307j97041k08603J09552
$$ 13564202 13103180 12936778 12626309 12228386 12266478 12251272 12115965 11918924 11710321 11819873
4161A1819873J35337R164M4943N2471Q9078o4095J42433l16679K99809M35547
$$ 11819873 11955210 11964374 12009317 12061788 12150866 12086771 12229204 11912525 12212334 12647881
4151A2647881k8758k14914p955P0444j69139p5481O5712O3835J53626J91295K59208
$$ 12647881 12619123 12404209 12396254 12466698 12297559 12222078 12287790 12351625 12505251 12696546 12955754
4140A2955754j0297j94569J88342L54843J29313M19676M06743O03645J3691O9749
$$ 12955754 12945457 12750888 12939230 13294073 13423386 13843062 14249805 14853450 14867141 14936890
4130A4936890Q8316N5297K93820J56392K75584O30252L16660K48223J66801L90773
$$ 14936890 15025206 15080503 15374323 15530715 15806299 16436551 16753211 17001434 17168235 17559008
4120A7559008K07243L87678L23223Q5001L06510J63305L25736N30854K56709L08728
$$ 17559008 17766251 18153929 18477152 18562153 18868663 19031968 19357704 19888558 20145267 20453995
4110B0453995J57988K83880M17375N62912M05707O92102P04530J84004P91749
$$ 20453995 20611983 20895863 21313238 21876150 22281857 22973959 23678489 23862493 24654242
4101B4654242O67627Q71200Q52008Q28095M74094J088932J191081J113569Q68356
$$ 24654242 25321869 26193069 27045077 27873172 28347266 29436198 30627279 31740848 32609204
4092C2609204R01924J120062J038994J176402J135173J048968J259445J234013
$$ 32609204 33511128 34631190 35670184 36846586 37981759 39030727 40290172 41524185
4084D1524185O83587Q99793R94160J155496J049211Q80839Q01467O49690J215408
$$ 41524185 42207772 43107565 44101725 45257221 46306432 47187271 47988738 48638428 49853836
4075D9853836R80877Q65196Q49965O26979R26784O72315M46600N98414Q05255
$$ 49853836 50834713 51699909 52549874 53176853 54103637 54775952 55222552 55820966 56626221
4066E6626221O15420Q94816R75315O95123R15388J011521J062590J154913J547452
$$ 56626221 57241641 58136457 59111772 59806895 60722283 61733804 62796394 63951307 65498759
4057F5498759J925788K078050K088634K641519L328931L984537L940770L852082
$$ 65498759 67424547 69502597 71591231 74232750 77561681 81546218 85486988 89339070
4049H9339070L720049K945863K844978K828657K581188K065363J910645K323220
$$ 89339070 93059119 96004982 98849960 101678617 104259805 106325168 108235813 110559033
4041A10559033K651956K657385K866652L463245L451204L800300M228405M164830
$$ 110559033 113210989 115868374 118735026 122198271 125649475 129449775 133678180 137843010
4033A37843010M147676M286481L973657M088891M391145M111263M052166M287962
$$ 137843010 141990686 146277167 150250824 154339715 158730860 162842123 166894289 171182251
4025A71182251L719249L951576L788426L580900L528194L230858K810112K695109
$$ 171182251 174901500 178853076 182641502 186222402 189750596 192981454 195791566 198486675
4017A98486675K474523K141203J719859J279628J151531P25099L60321J12554
$$ 198486675 200961198 203102401 204822260 206101888 207253419 207978518 208338839 208451393
4009B08451393k58616n66444j035073j544771j308561j630574j812949k411972
$$ 208451393 208192777 207626333 206591260 205046489 203737928 202107354 200294405 197882433
4001A97882433k377861k238845k622342k959710k951112k858962l250546l501158
$$ 197882433 195504572 193265727 190643385 187683675 184732563 181873601 178623055 175121897
3993A75121897l538713l358985l547115l548488l686481l640191l695191l471995
$$ 175121897 171583184 168224199 164677084 161128596 157442115 153801924 150106733 146634738
3985A46634738l562777l502296l241444l410428l130444l108941l303567k771415
$$ 146634738 143071961 139569665 136328221 132917793 129787349 126678408 123374841 120603426
3977A20603426k871513k517336k405496k520515k441815k598077k210541k128352
$$ 120603426 117731913 115214577 112809081 110288566 107846751 105248674 103038133 100909781
3969A00909781j958496j958799j876138j704832j657026j518475j425537j492095
$$ 100909781 98951285 96992486 95116348 93411516 91754490 90236015 88810478 87318383
3961H7318383j259795q97243r82842p30621n70835r15644j192716q72399m47600
$$ 87318383 86058588 85161345 84178503 83447882 82877047 81961403 80768687 79896288 79448688
3952G9448688o63919q41417j022852n45230j059246j184618j052188q61366r21604
$$ 79448688 78784769 77943352 76920500 76375270 75316024 74131406 73079218 72217852 71296248
3943G1296248j116336j178408j305487j397222j316266j594322j503519j317571
$$ 71296248 70179912 69001504 67696017 66298795 64982529 63388207 61884688 60567117
3935F0567117j313197j067726j319958j458055j248895j152123p41162o03608
$$ 60567117 59253920 58186194 56866236 55408181 54159286 53007163 52266001 51662393
3927E1662393m32478q15050j083858j158710q45529o57671o34062j005770j072678
$$ 51662393 51229915 50414865 49331007 48172297 47326768 46669097 46035035 45029265 43956587
3918D3956587j217325j148312j289622q17598p27933j074816p28533m35993l86612
$$ 43956587 42739262 41590950 40301328 39483730 38755797 37680981 36952448 36516455 36129843
3909C6129843n58756l80891o27996k21276j09293j21511k01924k71025l3619k04215
$$ 36129843 35571087 35190196 34562200 34340924 34231631 34110120 33908196 33637171 33603552 33399337
3899C3399337J02442K92117N58518N65778K88695K03895J84654M15559P6058K90293
$$ 33399337 33501779 33793896 34352414 34918192 35206887 35410782 35595436 36010995 36087053 36377346
3889C6377346q4288P8474J53220k00607l51785M346k20196j0322O6751O2400m0197
$$ 36377346 36293058 36371532 36524752 36324145 35972360 35976706 35756510 35746188 35812939 35875339 35835142
3878C5835142j45195k26742n2636Q5225J65483p3362J79486N9510k25625J13799
$$ 35835142 35689947 35463205 35410569 35495794 35661277 35587915 35767401 35826911 35601286 35715085
3868C5715085P9249L80219K11138M46293M56710Q85693M46599L51751Q34111J057991
$$ 35715085 35794334 36174553 36385691 36831984 37288694 38174387 38620986 38972737 39806848 40864839
3858D0864839J247404R59404J374145J300907J563948J800880K004759K112737
$$ 40864839 42112243 43071647 44445792 45746699 47310647 49111527 51116286 53229023
3850E3229023K360425K767456L083469L131532L330382L590833L891988M176461
$$ 53229023 55589448 58356904 61440373 64571905 67902287 71493120 75385108 79561569
3842G9561569M154259M900987M708687N014672M937717N093383N790956N638974
$$ 79561569 83715828 88616815 93325502 98340174 103277891 108371274 114162230 119801204
3834A19801204N306939N636425N547866N400298M942930M765857M761987M322122
$$ 119801204 125108143 130744568 136292434 141692732 146635662 151401519 156163506 160485628
3826A60485628M348327M087500L289685K953426K556344J992446J956256J458212
$$ 160485628 164833955 168921455 172211140 175164566 177720910 179713356 181669612 183127824
3818A83127824R51383K16461k26335o14776j084566k006375j996924k443919k566109
$$ 183127824 184079207 184295668 184069333 183454557 182369991 180363616 178366692 175922773 173356664
3809A73356664l061991l651097m034103m051119m261822m527043m708029m950015
$$ 173356664 170294673 166643576 162609473 158558354 154296532 149769489 145061460 140111445
3801A40111445n009618m884842m813943n082420m807530m925531m951919m712642
$$ 140111445 135101827 130216985 125403042 120320622 115513092 110587561 105635642 100923000
3793A00923000m697853m698404m144868m347746m377228l674955l400931l034478
$$ 100923000 96225147 91526743 87381875 83034129 78656901 74981946 71581015 68546537
3785F8546537l302388k873481l021765k725480k412774k274299j853918j823104
$$ 68546537 65244149 62370668 59348903 56623423 54210649 51936350 50082432 48259328
3777D8259328j658042j764650j479734j360292j062497q12200r07532q02740q40944
$$ 48259328 46601286 44836636 43356902 41996610 40934113 40121913 39214381 38411641 37570697
3768C7570697q26260p84302p92488o79912k08635l08214k52031l52324p80682
$$ 37570697 36744437 35960135 35167647 34487735 34279100 33970886 33718855 33366531 32585849
3759C2585849l54844n60057m20210l69637m61357m13503m70612p38436m38859
$$ 32585849 32231005 31670948 31250738 30881101 30419744 30006241 29535629 28797193 28358334
3750B8358334n44674p60299o20613m14371o15698n20800p92832q33260o17947
$$ 28358334 27813660 27053361 26432748 26018377 25402679 24881879 24089047 23255787 22637840
3741B2637840j21078m76519q36590p17414n47801m75001n86612p59987p06411
$$ 22637840 22516762 22040243 21203653 20486239 19938438 19463437 18876825 18116838 17410427
3732A7410427l62787k10102n60207n83362n97560k72897k00959n28199n06739
$$ 17410427 17047640 16837538 16277331 15693969 15096409 14823512 14622553 14094354 13587615
3723A3587615j50503l64922m97072j85311k75501k67706j45333j06901k43631
$$ 13587615 13437112 13072190 12575118 12389807 12114306 11846600 11701267 11594366 11350735
3714A1350735j57971m66486l03289l19864k02927L7380k15122j30370j47421j56526
$$ 11350735 11192764 10726278 10422989 10103125 9900198 9937578 9722456 9592086 9444665 9288139
3704I288139l01126k71729l00820P8698j89851o8656j55781k29594k14113k48929
$$ 9288139 8987013 8715284 8414464 8493162 8303311 8234655 8078874 7849280 7635167 7386238
3694G386238j25630J76693r489m4640j61231q6225P566j65504L6190j51780J14190
$$ 7386238 7260608 7437301 7427812 7383172 7221941 7135716 7143282 6977778 7013968 6862188 6976378
3683F976378R0540l73657j98948j07142j19876N7349j6741J9914l1040Q1379l10631
$$ 6976378 7066918 6693261 6494313 6387171 6267295 6324644 6307903 6327817 6296777 6378156 6067525
3672F067525l7827l1885p2287K13436O8917j78567k20463p8376p1266j20911M70827
$$ 6067525 6029698 5997813 5925526 6138962 6207879 6029312 5808849 5730473 5659207 5538296 6009123
3661F009123M8030k45164j62061J16271j20307K090l6807p1565l20283j41100
$$ 6009123 6057153 5811989 5649928 5766199 5645892 5647982 5611175 5539610 5219327 5078227
3651E078227j72669r0007K76379j163k60680O0984m8123k90423o9427m1351k98619
$$ 5078227 4905558 4815551 5091930 5090767 4830087 4891071 4842948 4552525 4483098 4441747 4143128
3640D143128l63213J21626M27239j79894l47770M7309O2998j75281j966r7092
$$ 4143128 3779915 3901541 4328780 4148886 3801116 3848425 3911423 3736142 3734176 3637084
3630C637084l1608o9697R1739k59780j9779j6956l44892Q4969Q4821J43242o207
$$ 3637084 3605476 3535779 3627518 3367738 3347959 3331003 2986111 3071080 3155901 3299143 3292936
3619C292936j74629k36271j68393N5790j0721j14947p4689J17501j67394j94020
$$ 3292936 3118307 2882036 2713643 2769433 2758712 2643765 2569076 2686577 2519183 2325163
3609B325163j65542J69811J91727n7667k37719J6027M5649J77610P1531k45606
$$ 2325163 2159621 2329432 2521159 2463492 2225773 2241800 2287449 2465059 2536590 2290984
3599B290984J3453J67989K8823j26428J58964l4230M6510K7778J35074k31793
$$ 2290984 2304437 2472426 2501249 2374821 2533785 2499555 2546065 2573843 2708917 2477124
3589B477124r9294J00627J58978j04425K1761K21328K97368l15613j41747J18508
$$ 2477124 2377830 2478457 2637435 2533010 2554771 2776099 3073467 2757854 2616107 2734615
3579B734615L1927k4890R0397j7591K62907k49332q9317k6625k50703j10992K42475
$$ 2734615 2766542 2741652 2832049 2814458 3077365 2828033 2738716 2712091 2461388 2350396 2592871
3568B592871R3788J11437J18379K1223j63348l3210O8248K06543M6540k06925
$$ 2592871 2686659 2798096 2916475 2937698 2774350 2741140 2809388 3015931 3062471 2855546
3558B855546p3176o2311p5603K79047K30499n359L93438j32552r7760j25489M7046
$$ 2855546 2782370 2720059 2644456 2923503 3154002 3148643 3542081 3409529 3311769 3186280 3233326
3547C233326K66278J14280J7608Q517j16855P7981j22170j57735R6252M4500K16441
$$ 3233326 3499604 3613884 3631492 3640009 3523154 3601135 3478965 3321230 3417482 3461982 3678423
3536C678423l58j13429j66617Q3298J48395r7056n094J50497Q6392M9014j36741
$$ 3678423 3678065 3564636 3398019 3481317 3629712 3532656 3527562 3678059 3764451 3813465 3676724
3525C676724O025q7488k92629q5088n6502m9738J35242J5978J14622J26885k32597
$$ 3676724 3682749 3595261 3302632 3217544 3161042 3111304 3246546 3262524 3377146 3504031 3271434
3514C271434M1095k81022m1175k4764k69136r4692J60052l4493j18757J12551
$$ 3271434 3312529 3031507 2990332 2965568 2696432 2601740 2761792 2727299 2608542 2721093
3504B721093N5593m4558k14164L0651J70480j8153j79767k24713j19285N2529
$$ 2721093 2776686 2732128 2517964 2548615 2719095 2700942 2521175 2296462 2177177 2229706
3494B229706k6110l678k0371n3047K6517k40243P6051J42875J5715L1639J77217
$$ 2229706 2203596 2199918 2179547 2126500 2153017 1912774 1988825 2131700 2147415 2179054 2356271
3483B356271j93058j4528K61592j6675q738J4347K19893K7616k68510j29222J86286
$$ 2356271 2163213 2148685 2410277 2393602 2384864 2399211 2619104 2646720 2378210 2248988 2435274
3472B435274j62633L6133K97423P6931k4332j96208J81852j54317J5541J87860
$$ 2435274 2272641 2308774 2606197 2683128 2658796 2462588 2644440 2490123 2505664 2693524
3462B693524K17599k1895j34560J59682r0672Q6779L24827R7637P719j05783L85497
$$ 2693524 2911123 2889228 2754668 2914350 2823678 2910457 3235284 3332921 3340640 3234857 3620354
3451C620354j55371K1587L70587K18284L18162j0463K8627n6778K81857L74977
$$ 3620354 3464983 3486570 3857157 4075441 4393603 4383140 4411767 4354989 4636846 5011823
3441E011823j1371K78951O01240J11535J71939K30263J81056N8629K10525r6777
$$ 5011823 5000452 5279403 5880643 5992178 6164117 6394380 6575436 6634065 6844590 6747813
3431F747813m1082r8373k33434m6002n8794m31196l31469j76954m32281j68921
$$ 6747813 6706731 6608358 6374924 6328922 6270128 5838932 5507463 5330509 4898228 4729307
3421D729307k54576k66641j95782l93056l6593k7500j52701N0630j55263k42076
$$ 4729307 4474731 4208090 4012308 3619252 3582659 3555159 3402458 3453088 3297825 3055749
3411C055749L29335k8897o53358J25933j98468J23919J58756m06153j42102P923
$$ 3055749 3385084 3356187 2702829 2828762 2630294 2754213 2912969 2506816 2364714 2372637
3401B372637p3340J99914o4025j51199J34956k85092k52251J77201J08156j41395
$$ 2372637 2299297 2499211 2435186 2283987 2418943 2133851 1881600 2058801 2166957 2025562
3391B025562q5657k33147m9191K31465j18582J06144k9651j53908l43743p5481
$$ 2025562 1939905 1706758 1657567 1889032 1770450 1876594 1846943 1693035 1349292 1273811
3381A273811l9218j57374j3859L42508J69184k45157M3448k3279k18744J5279
$$ 1273811 1234593 1077219 1063360 1405868 1575052 1329895 1373343 1350064 1131320 1146599
3371A146599J62083k4589J47730k9874J10607j07808K67688O8405M2313j09984
$$ 1146599 1308682 1284093 1431823 1401949 1512556 1404748 1672436 1740841 1783154 1673170
3361A673170l2316k6831R2965J09147J50795K30876q7937K4013J40728k30431
$$ 1673170 1640854 1614023 1706988 1816135 1966930 2197806 2109869 2133882 2274610 2044179
3351B044179R1925j53374m3415k53057o5482J75750j54347K1528k75254l8437
$$ 2044179 2136104 1982730 1939315 1686258 1620776 1796526 1642179 1663707 1388453 1350016
3341A350016j30599J68250j42863Q930Q5917J27566j79773j15114M6907j18824
$$ 1350016 1219417 1387667 1244804 1253734 1339651 1467217 1287444 1172330 1219237 1100413
3331A100413J34344K12926p2931r4617L40234j08891o732j39790j90964J5191
$$ 1100413 1234757 1447683 1374752 1280135 1620369 1511478 1504746 1364956 1173992 1189183
3321A189183J96138l1303j42615J21840p9966M5138J87147J40634j34453N6978
$$ 1189183 1385321 1354018 1211403 1333243 1253277 1298415 1485562 1626196 1491743 1548721
3311A548721k38338l34407J00999O0514J50412k34225N0831K04098m2431P148
$$ 1548721 1310383 975976 1076975 1137489 1287901 1053676 1104507 1308605 1266174 1273322
3301A273322j07629p1947K89871j51979L9289K17460r5146j05044K03809J97150
$$ 1273322 1165693 1093746 1383617 1231638 1270927 1488387 1393241 1288197 1492006 1689156
3291A689156j55815l89777j87552R9122K39044o0596M6407m2901R2868J50724
$$ 1689156 1533341 1143564 956012 1055134 1294178 1233582 1279989 1237088 1329956 1480680
3281A480680L4380M384j16648r6638q2191P5270N2724L4148L0423j70890k99784
$$ 1480680 1515060 1519444 1402796 1306158 1223967 1299237 1351961 1386109 1416532 1245642 945858
3270I45858J84783j72022R4883J82290M9536k5417j55102j22635q828J32906K88989
$$ 945858 1130641 958619 1053502 1235792 1285328 1259911 1104809 982174 973346 1106252 1395241
3259A395241O0665p9207j88331P2999q4332j1502J3666J52008K52808r6232o00468
$$ 1395241 1455906 1376699 1188368 1261367 1177035 1165533 1179199 1331207 1584015 1487783 887315
3248H87315M5320K50330L0363j07645L37022j45288j00277k33158j80336m9644
$$ 887315 932635 1182965 1213328 1105683 1442705 1297417 1197140 963982 783646 734002
3238G34002J38749R2714j18018N6912n8884j21086k82439J46217L08937L8725
$$ 734002 872751 965465 847447 904359 845475 724389 441950 588167 897104 935829
3228I35829k02957r8122J25028n1466j99079J64792J31971J45992k01016j55213
$$ 935829 732872 634750 759778 708312 509233 674025 805996 951988 750972 595759
3218E95759j3038K29676k2953J37066j14310q93J87946k91136k25846N2620K0167
$$ 595759 582721 812397 789444 926510 812200 811307 999253 708117 482271 534891 555058
3207E55058J7473P5877K20837j52365m1461R7704k67126j31188J88103J24114
$$ 555058 572531 648408 869245 716880 675419 773123 505997 374809 562912 687026
3197F87026O0412O1426k71594J17937K66063r9132r8040k77j94495R9115J3581
$$ 687026 747438 808864 537270 655207 921270 822138 724098 723821 529326 628441 642022
3186F42022j14811p5982m07408J02398K78950J76226K22977J98195k98885N069
$$ 642022 527211 451229 43821 146219 425169 601395 824372 1022567 723682 728751
3176G28751K26315p0728r6686n8806k5452m2634j01649P0209p7494J15856J06536
$$ 728751 955066 884338 787652 728846 703394 660760 559111 629320 551826 667682 774218
3165G74218k7282j14222k16000J83865P4595j48155n7137J35459K23670J09130
$$ 774218 746936 632714 416714 600579 675174 527019 469882 605341 829011 938141
3155I38141r0406O8645K44691o4563K3643j26960o1123J17338l35670n7484J18591
$$ 938141 847735 916380 1161071 1096508 1120151 993191 932068 1049406 713736 656252 774843
3144G74843P8314J1347O05K61220j1713K822j08628k31712J00219J17876K61458
$$ 774843 853157 864504 865109 1126329 1114616 1117438 1008810 777098 877317 995193 1256651
3133A256651j58234q9602P6743j35605K81712K27689l3352N1461r1344j24661
$$ 1256651 1098417 1008815 1085558 949953 1231665 1459354 1426002 1477463 1386119 1261458
3123A261458l6036L6023K58931N1841k23016r3738N8984j84179K03540J83458
$$ 1261458 1225422 1261445 1520376 1572217 1349201 1255463 1314447 1130268 1333808 1517266
3113A517266k15303Q0458K54667j52563j02774J54219o3030N0294m7586K85205
$$ 1517266 1301963 1382421 1637088 1484525 1381751 1535970 1472940 1523234 1475648 1760853
3103A760853J74781j66764k92795j61428J24987k0590J0700J56130j45407r3406
$$ 1760853 1935634 1768870 1476075 1314647 1439634 1419044 1429744 1585874 1440467 1347061
3093A347061J77230o2143l4343J87255j8424j37013q4543J22502j15662K12235
$$ 1347061 1524291 1462148 1427805 1615060 1596636 1459623 1375080 1497582 1381920 1594155
3083A594155j4211k39629L633L8115l9521q716J17934l03005n2750M6781J88564
$$ 1594155 1579944 1340315 1343948 1382063 1342542 1333826 1451760 1148755 1096005 1142786 1331350
3072A331350k29795M8470j28598q3537J99721J81072j01763q8094M9281q2394
$$ 1331350 1101555 1150025 1021427 937890 1137611 1318683 1216920 1128826 1178107 1095713
3062A095713l5999L0268N5451j21354m1801J6568P9711l43218l21336L74401k6836
$$ 1095713 1059714 1089982 1145433 1024079 982278 998846 1078557 735339 414003 788404 761568
3051G61568r6659p938J25292J32647k20001J79740p7840o9450J30898j00210j32582
$$ 761568 664909 656971 782263 914910 694909 874649 796809 727359 858257 758047 625465
3040F25465P9822j20099j05172p0037L56704o35j41422l7635j65950j53192L16107
$$ 625465 705287 585188 480016 409979 766683 766048 624626 586991 421041 267849 583956
3029E83956n1273K1375R013r9082P4068R5806O7953k21190k27006K18889J97771
$$ 583956 532683 554058 563071 463989 538057 633863 701816 480626 253620 472509 670280
3018F70280l5348j55967n0323j20769O6737j36898J03712J80098j059r2081r6598
$$ 670280 634932 478965 428642 307873 374610 237712 341424 521522 520463 428382 331784
3007C31784R354k87828l2484K86313q8172M8563J34408k38554j26834N7901J05335
$$ 331784 341138 53310 20826 307139 218967 267530 401938 163384 36550 94451 199786
2996A99786K9350j92255j18594K5764j85836M45615K57362M4254L7746k44498
$$ 199786 229136 36881 -81713 -55949 -241785 203830 461192 505446 543192 298694
2986B98694o1580R4023K4300J89673m3372j07382l39352j8541J01625o1311k39739
$$ 298694 237114 331137 355437 545110 501738 394356 55004 36463 138088 76777 -162962
2975a62962K85995J18770J5634J4835j06948k4056L06449L5430j87872k53806
$$ -162962 123033 241803 257437 272272 165324 141268 447717 483147 295275 41469
2965D1469J02423J17024J26533j71691j37881L7376J72718j41988J0785j23463
$$ 41469 143892 260916 387449 215758 77877 115253 287971 145983 156768 33305
2955C3305j45627N08891k56246j25046O975J03449K62308j29057P2997n5952l10929
$$ 33305 -112322 396569 140323 15277 22252 125701 388009 258952 331949 275997 -34932
2944c4932J19295Q9305J12379j3561O3472K0K9961k21745j38904O7751Q8431Q0113
$$ -34932 84363 173668 286047 272486 335958 335978 365939 144194 5290 73041 161472 241585
2932B41585k46275P9827m3274j22459K03834K37667N9439l1139Q9987j43415J55107
$$ 241585 -4690 75137 31863 -90596 113238 350905 410344 379205 469192 325777 480884
2921D80884j46827j43136J31782q7848j0080K55688L5692q273J37480l69812j37337
$$ 480884 334057 190921 322703 234855 224775 480463 516155 507882 645362 275550 138213
2910A38213j5377R8293j36388k25287L28903r0941j90447L5536J50954L0534j4718
$$ 138213 122836 221129 84741 -140546 188357 97416 -93031 -57495 93459 123993 109275
2899A09275j41760j73733R7889L05267K7521L3073K4748l8775j09374k42734L90084
$$ 109275 -32485 -206218 -108329 196938 224459 257532 282280 243505 134131 -108603 281481
2888B81481M05235j4358k88587n3185j15175j86144L02866j37771m6617L29773
$$ 281481 686716 672358 383771 330586 215411 29267 332133 194362 147745 477518
2878D77518M3365l73764j13554O8539k0882K31041P6087j00539j70677j13712
$$ 477518 520883 147119 33565 102104 81222 312263 388350 287811 117134 3422
2868C422L65466j9069k64591O1315L78824k93441O6748J75430M6375j52153O9576
$$ 3422 368888 349819 85228 146543 525367 231926 298674 474104 520479 368326 437902
2857D37902O8824o177K40771l36376k18661N7184J26641J7622P4959J7165K04859
$$ 437902 506726 500549 741320 404944 186283 243467 370108 387730 462689 479854 684713
2846F84713j5319k43150l14362o5777J58441L27703l9184l9650k79765o417j52880
$$ 684713 669394 426244 111882 46105 204546 532249 493065 453415 173650 167233 14353
2835A4353J29985J00937k2236n9319j3523Q3982r555M8581K5192J95264n2084
$$ 14353 144338 245275 223039 163720 150197 234179 224624 273205 298397 493661 441577
2824D41577j74248j03930l4107o4739k0600p7382K65529L60235j24365j28419
$$ 441577 267329 163399 129292 64553 43953 -33429 232100 592335 467970 339551
2814C39551j91074o673J87006k20972K2336J13577Q1274j96651j7811k67205J6679
$$ 339551 148477 141804 328810 107838 130174 243751 325025 128374 110563 -156642 -139963
2803a39963K68419J63944K9989k9634R7969l6066k00404j00323n4145Q465l2891
$$ -139963 128456 292400 322389 292755 390724 354658 154254 53931 -214 8251 -24640
2792b4640K26926j6222k80269J57765n4081J3140J18931o4680J20492K9428k31840
$$ -24640 202286 186064 -94205 63560 9479 22619 141550 76870 197362 226790 -5050
2781e050m2976J7716J69929R911J0316j63598k7014J6127L4136K69441k06577
$$ -5050 -48026 -30310 139619 149530 159846 -3752 -30766 -14639 19497 288938 82361
$$ [...]
##END NTUPLES=NMR SPECTRUM
##END=
