##TITLE=1H_CA-9457
 200.13Hz,DMSO+CCl4.
 8 sc
 
 5.5.2026
##JCAMPDX= 6.0         $$ Bruker NMR JCAMP-DX V2.0
##DATA TYPE= NMR SPECTRUM
##DATA CLASS= NTUPLES
##ORIGIN= UXNMR, Bruker Analytische Messtechnik GmbH
##OWNER= pz
$$ XWIN-NMR		Version 3.5
$$ Tue May  5 13:53:46 2026 Russian Standard Time (UT+4h)  she@DPX200
##.OBSERVE FREQUENCY= 200.131
##.OBSERVE NUCLEUS= ^1H
##.ACQUISITION MODE= SIMULTANEOUS
##.ACQUISITION SCHEME= undefined
##.AVERAGES= 8
##.DIGITISER RES= 18
##SPECTROMETER/DATA SYSTEM= spect
##.PULSE SEQUENCE= zg30
##.SOLVENT NAME= CDCl3
##.SHIFT REFERENCE= (INTERNAL, CDCl3, 0, 14.1129)
##AUDIT TRAIL= $$ (NUMBER, WHEN, WHO, WHERE, WHAT)
$$ ##TITLE= Audit trail, XWIN-NMR		Version 3.5
$$ ##JCAMPDX= 5.01
$$ ##ORIGIN= Bruker BioSpin GmbH
$$ ##OWNER= she
$$ F:/spectra/data/she/nmr/H-C/1/pdata/1/auditp.txt
$$ ##AUDIT TRAIL=  $$ (NUMBER, WHEN, WHO, WHERE, WHAT)
(   1,<2026-05-05 13:52:15.12 +0400>,<she>,<DPX200>,
      <created by zg, POWCHK disabled, PULCHK disabled
       configuration hash MD5:
       00 E9 B6 7A A2 85 ED C7 34 08 36 98 17 FE 4E 26
       data hash MD5: 16K
       C1 08 4F 3B D9 F9 D5 2C 7A 6B 85 09 70 B7 EC 80>)
(   2,<2026-05-05 13:52:17.93 +0400>,<she>,<DPX200>,
      <Start of raw data processing
       efp BC_mod = 2 LB = 0.25 FT_mod = 6 PKNL = 1 PHC0 = -4067.684 PHC1 = 14.59229 SI = 16K 
       data hash MD5: 16K
       32 0E 12 4C 40 DC DC 22 02 CC 35 A1 B1 37 F5 03>)
(   3,<2026-05-05 13:52:53.45 +0400>,<she>,<DPX200>,
      <pk PHC0 = 0.5735664 PHC1 = -1.6 
       data hash MD5: 16K
       31 E0 26 EC D4 57 9C 91 EA A8 88 90 36 D4 81 99>)
(   4,<2026-05-05 13:52:59.20 +0400>,<she>,<DPX200>,
      <abs ABSG = 5 
       data hash MD5: 16K
       70 28 66 8D 13 A6 8A 34 54 58 41 6B 4F C8 55 A0>)
$$ ##END=
$$ 
$$ hash MD5
$$ E5 28 29 BB 04 3B 25 46 BA A5 87 8F AC 86 7A AE
##$RELAX= 
##$RELAX= 
##$RELAX= 
##$RELAX= 
##$RELAX= 
##$RELAX= 
$$ Bruker specific parameters
$$ --------------------------
##$DU= <F:/spectra>
##$EXPNO= 1
##$NAME= <H-C>
##$PROCNO= 1
##$TYPE= <nmr>
##$USER= <she>
##$AMP= (0..31)
100 100 100 100 100 100 100 100 100 100 100 100 100 100 100 100 100 100 
100 100 100 100 100 100 100 100 100 100 100 100 100 100 
##$AQSEQ= 0
##$AQ_mod= 1
##$AUNM= <au_zg>
##$AUTOPOS= <>
##$BF1= 200.13
##$BF2= 200.13
##$BF3= 200.13
##$BF4= 200.13
##$BF5= 200.13
##$BF6= 200.13
##$BF7= 200.13
##$BF8= 200.13
##$BYTORDA= 1
##$CFDGTYP= 0
##$CFRGTYP= 5
##$CHEMSTR= <none>
##$CNST= (0..31)
1 1 145 1 1 1 1 1 1 1 1 1 1 1 1 1 1 1 1 1 1 1 1 1 1 1 1 1 1 1 1 1 
##$CPDPRG= <>
##$CPDPRG1= <>
##$CPDPRG2= <>
##$CPDPRG3= <>
##$CPDPRG4= <mlev>
##$CPDPRG5= <mlev>
##$CPDPRG6= <mlev>
##$CPDPRG7= <mlev>
##$CPDPRG8= <mlev>
##$CPDPRGB= <>
##$CPDPRGT= <>
##$D= (0..31)
0 0.7 0 0 0 0 0 0 0 0 0 0.03 0 0 0 0 0 0 0 0 0 0 0 0 0 0 0 0 0 0 0 0 
##$DATE= 1777974734
##$DBL= (0..7)
120 120 120 120 120 120 120 120 
##$DBP= (0..7)
150 150 150 150 150 150 150 150 
##$DBP07= 0
##$DBPNAM0= <>
##$DBPNAM1= <>
##$DBPNAM2= <>
##$DBPNAM3= <>
##$DBPNAM4= <>
$$ [...]
##$SUBNAM3= <"">
##$SUBNAM4= <"">
##$SUBNAM5= <"">
##$SUBNAM6= <"">
##$SUBNAM7= <"">
##$SUBNAM8= <"">
##$SUBNAM9= <"">
##$SW= 18.0517599122864
##$SWIBOX= (0..15)
0 0 2 0 0 0 0 0 0 0 0 0 0 0 0 0 
##$SW_h= 3612.71676300578
##$TD= 16384
##$TD0= 1
##$TE= 0
##$TE2= 300
##$TE3= 300
##$TEG= 300
##$TL= (0..7)
0 120 120 120 120 120 120 120 
##$TP= (0..7)
150 150 150 150 150 150 150 150 
##$TP07= 0
##$TPNAME0= <>
##$TPNAME1= <>
##$TPNAME2= <>
##$TPNAME3= <>
##$TPNAME4= <>
##$TPNAME5= <>
##$TPNAME6= <>
##$TPNAME7= <>
##$TPOAL= (0..7)
0.5 0.5 0.5 0.5 0.5 0.5 0.5 0.5 
##$TPOFFS= (0..7)
0 0 0 0 0 0 0 0 
##$TUNHIN= 0
##$TUNHOUT= 0
##$TUNXOUT= 0
##$USERA1= <user>
##$USERA2= <user>
##$USERA3= <user>
##$USERA4= <user>
##$USERA5= <user>
##$V9= 5
##$VALIST= <valist>
##$VCLIST= <CCCCCCCCCCCCCCC>
##$VD= 0
##$VDLIST= <DDDDDDDDDDDDDDD>
##$VPLIST= <PPPPPPPPPPPPPPP>
##$VTLIST= <TTTTTTTTTTTTTTT>
##$WBST= 1024
##$WBSW= 4
##$XGAIN= (0..3)
0 0 0 0 
##$XL= 0
##$YL= 0
##$YMAX_a= 919454
##$YMIN_a= -965862
##$ZGOPTNS= <>
##$ZL1= 120
##$ZL2= 120
##$ZL3= 120
##$ZL4= 120
##$ABSF1= 16.2857
##$ABSF2= -1.766191
##$ABSG= 5
##$ABSL= 3
##$ALPHA= 0
##$AQORDER= 0
##$ASSFAC= 0
##$ASSFACI= 0
##$ASSFACX= 0
##$ASSWID= 0
##$AUNMP= <proc_1d>
##$AZFE= 0.1
##$AZFW= 0.1
##$BCFW= 0
##$BC_mod= 2
##$BYTORDP= 0
##$COROFFS= 0
##$CY= -3
##$DATMOD= 1
##$DC= 0
##$DFILT= <>
##$DTYPP= 0
##$F1P= 0
##$F2P= 0
##$FCOR= 1
##$FTSIZE= 16384
##$FT_mod= 6
##$GAMMA= 0
##$GB= 0
##$INTBC= 1
##$INTSCL= 3.241238e-09
##$ISEN= 128
##$LB= 0.25
##$LEV0= 0
##$LPBIN= 0
##$MAXI= 10000
##$MC2= 0
##$MEAN= 0
##$ME_mod= 0
##$MI= 1.114404
##$NCOEF= 0
##$NC_proc= -4
##$NLEV= 6
##$NOISF1= 3.799351
##$NOISF2= 2.8
##$NSP= 0
##$NTH_PI= 0
##$NZP= 0
##$OFFSET= 14.11293
##$PC= 1
##$PHC0= -4067.111
##$PHC1= 12.99229
##$PH_mod= 1
##$PKNL= yes
##$PPARMOD= 0
##$PSCAL= 0
##$PSIGN= 0
##$REVERSE= no
##$SF= 200.129981938933
##$SI= 16384
##$SIGF1= 3
##$SIGF2= 2
##$SINO= 0.751879
##$SIOLD= 32768
##$SREGLST= <19F.Aceton>
##$SSB= 0
##$STSI= 16384
##$STSR= 0
##$SW_p= 3612.71676300579
##$SYMM= 0
##$S_DEV= 0
##$TDeff= 16384
##$TDoff= 0
##$TI= <>
##$TILT= no
##$TM1= 0
##$TM2= 0
##$TOPLEV= 0
##$USERP1= <user>
##$USERP2= <user>
##$USERP3= <user>
##$USERP4= <user>
##$USERP5= <user>
##$WDW= 1
##$XDIM= 16384
##$YMAX_p= 316116092
##$YMIN_p= -387011
$$ End of Bruker specific parameters
$$ ---------------------------------
##NTUPLES= NMR SPECTRUM
##VAR_NAME=  FREQUENCY,     SPECTRUM/REAL,   SPECTRUM/IMAG
##SYMBOL=    X,             R,               I
##VAR_TYPE=  INDEPENDENT,   DEPENDENT,       DEPENDENT
##VAR_FORM=  AFFN,          ASDF,            ASDF
##VAR_DIM=   16384,         16384,           16384
##UNITS=     HZ,            ARBITRARY UNITS, ARBITRARY UNITS
##FACTOR=    0.220516191357248, 1,           1
##FIRST=     2824.42048561445, 0,            0
##LAST=      -788.296277391336, 0,           0
##MIN=       -788.296277391336, -387011,     0
##MAX=       2824.42048561445, 316116092,    0
$$ Real data points
##PAGE= N=1
##DATA TABLE= (X++(R..R)), XYDATA
$$ [...]
8549f8723P9605o189k8841m4070J3712j5951J9042q8686J74N0685l7798M1400
$$ -68723 10882 4693 -24148 -68218 -54506 -70457 -51415 -140101 -139927 -89242 -127040 -85640
8537h5640m5231K5786K1k1111R5038Q3703O458j7122J7123L1635j69274n5215
$$ -85640 -130871 -105085 -105064 -126175 -31137 52566 59024 41902 59025 90660 -78614 -133829
8525a33829K2783j5344J19714J68268p1316j05869R427L5643j31814j06K8649
$$ -133829 -111046 -126390 -6676 161592 90276 -15593 -6166 29477 -102337 -102443 -73794
8514g3794L2234L8824r0807o8214J2256j2393L920N7258O2311l0669k0211n0156
$$ -73794 -41560 -2736 -93543 -161757 -149501 -161894 -157974 -100716 -38405 -69074 -89285 -139441
8502a39441O537L7724o4199K8825J6675Q3588j43090m9786J4349M9461J35217
$$ -139441 -132904 -95180 -159379 -130554 -113879 -30291 -173381 -223167 -208818 -159357 -24140
8491b4140O0217l6513J1539K7309P8297L6564j22179o4573k1199n6525m2718p2198
$$ -24140 36077 -436 11103 38412 116709 153273 31094 -33479 -54678 -111203 -153921 -226119
8479b26119R7872J28014q5276n3973K7348N1818m6208J06512K9727M7746N6147
$$ -226119 -128247 -233 -85509 -139482 -112134 -60316 -106524 -12 29715 77461 133608
8468A33608p394K8118m0879q266o0737j14029M7010p7818m2847L7019K3002l6696
$$ 133608 126214 154332 113453 105187 44450 -69579 -22569 -100387 -143234 -106215 -83213 -119909
8456a19909k5788J4040n0617K845R4774J09618o0261J7982J7888m6977n6156J14488
$$ -119909 -145697 -131657 -182274 -179429 -84655 24963 -35298 -17316 572 -46405 -102561 11927
8444A1927N6167N7389k9922j23474j04935J9981n7470J5648o0389J14679N0933
$$ 11927 68094 125483 95561 -27913 -132848 -112867 -170337 -154689 -215078 -100399 -49466
8433d9466K88k0373j67964K9932N4142J47264R3344L5703p5268k3217n0407n5400
$$ -49466 -49178 -69551 -237515 -207583 -153441 -6177 87167 122870 47602 24385 -26022 -81422
8421h1422M2570j27952N9827J29745j48831P7954R1217j40338q8429M9660Q7467
$$ -81422 -38852 -166804 -106977 22768 -126063 -48109 43108 -97230 -185659 -135999 -48532
8410d8532J7378Q7863j1957k02964k4167k9807O6924J6150M5673o2315j955P1287
$$ -48532 -31154 56709 44752 -158212 -182379 -212186 -145262 -129112 -83439 -145754 -147709 -76422
8398g6422p7655l772J02419p7355M2732m1162m1936j9060o0260J36406l9196J4959
$$ -76422 -154077 -157849 -55430 -132785 -90053 -131215 -173151 -192211 -252471 -116065 -155261 -140302
8386a40302K6606j5627K8196K2336M4772n904j56561J6537l4762L7679l4101J32033
$$ -140302 -113696 -129323 -101127 -78791 -34019 -39923 -196484 -179947 -214709 -177030 -211131 -79098
8374g9098L2638p1125L1549n3261j6440j39813m8191O4275J01771k975J28660
$$ -79098 -46460 -117585 -86036 -139297 -155737 -295550 -343741 -279466 -177695 -180670 -52010
8363e2010l0720K34Q6858q1669j13103J7012o6413M4863N6598M1923n8264N3575
$$ -52010 -82730 -82496 4362 -77307 -190410 -173398 -239811 -194948 -138350 -96427 -154691 -101116
8351a01116P562j31239M2827J59232q3747r8489O7838J159n9370N9232R3834J9775
$$ -101116 -93554 -224793 -181966 -22734 -106481 -204970 -137132 -135973 -195343 -136111 -42277 -22502
8339b2502o0455p3572J35120K7843j27635n958J5670p8582j8274J8127j5767m0717
$$ -22502 -82957 -156529 -21409 6434 -121201 -127159 -111489 -190071 -208345 -190218 -205985 -246702
8327b46702L0505J13024k7856j5362l8229l003j1483R0171O5900J03986N4526
$$ -246702 -216197 -103173 -131029 -146391 -184620 -187623 -199106 -108935 -43035 60951 115477
8316A15477p7093j6999Q50l2338O2913r6063l9993r4166m9488O7297J00822N1861
$$ 115477 38384 21385 22235 -10103 52810 -43253 -83246 -177412 -226900 -159603 -58781 -6920
8304f920r4227j13408n6097K45406M927J6207n4063Q4552K3083L6820l7483J01440
$$ -6920 -101147 -214555 -270652 -25246 -20319 -4112 -58175 26377 49460 86280 48797 150237
8292A50237N4908K3595n9289K241q3133j10025j18930N4865j0994P6538J37142
$$ 150237 205145 228740 169451 171692 88559 -21466 -140396 -85531 -96525 -19987 117155
8281A17155p1848J7570q535m6530p384q18J01938n6649l814j4825K1175r678q8844
$$ 117155 45307 62877 54342 7812 428 -390 101548 44899 41085 26260 47435 37757 -51087
8268e1087K6157j9307K8590P6556k433M4229p6132q3993J32559j08850L8668P7617
$$ -51087 -24930 -44237 -15647 60909 58476 102705 26573 -57420 75139 -33711 4957 82574
8256H2574K8924j25099q0730J07162O9412j67627J10713p4192k8588j8595L401
$$ 82574 111498 -13601 -94331 12831 82243 -85384 25329 -48863 -77451 -96046 -92645
8245i2645P9077j1103J2184q8980J9236l3557J1329o5994J9205J58481J19349
$$ -92645 -13568 -24671 -12487 -101467 -82231 -115788 -104459 -170453 -151248 7233 126582
8234A26582r4697L7625m9493M8667k3360j3561Q382m7392j60918O7686n0870l458
$$ 126582 31885 69510 20017 68684 45324 31763 40145 -7247 -168165 -100479 -151349 -154807
8222a54807k6132l0242J69571j01671P2850r8479j95301J9867K75476J09199N7051
$$ -154807 -180939 -211181 -41610 -143281 -70431 -168910 -364211 -344344 -68868 40331 97382
8211I7382j02846O3132l8361P448j38657R2322P7201j31181k9771J14748q6353
$$ 97382 -5464 57668 19307 26755 -111902 -19580 57621 -73560 -103331 11417 -74936
8200g4936p4461N1363l4632j24132K662L24832o6681K0905l7627m5996J94517
$$ -74936 -149397 -98034 -132666 -256798 -254136 70696 4015 24920 -12707 -58703 135814
8189A35814j45585l7032k4865k13007n7003J07093K38098j76765p8125L6612O8725
$$ 135814 -9771 -46803 -71668 -284675 -341678 -234585 3513 -173252 -251377 -214765 -146040
8178a46040l8249n5153n502Q7683k0574J73573M9777j53973p53J18986o173m9173
$$ -146040 -184289 -239442 -244944 -157261 -177835 -4262 45515 -108458 -109211 9775 3602 -45571
8166d5571K07M2257J8414j30777q5281L4011K13816l6056j82048L5313K1221J5494
$$ -45571 -45364 -3107 15307 -115470 -200751 -166740 47076 11020 -171028 -135715 -114494 -99000
8154i9000J4246j48054o4403N6745J34268p0068J7270j03008L5147Q6241J16819
$$ -99000 -84754 -232808 -297211 -240466 -106198 -176266 -158996 -262004 -226857 -140616 -23797
8143b3797m3168j98532m9136J10855J9140M1222N7289m4070l0770l897O308J8292
$$ -23797 -66965 -265497 -314633 -203778 -184638 -143416 -86127 -130197 -160967 -164864 -158556 -140264
8131a40264k3786J78535K7124k07081L0583M9756K6431l0722p4145j907J15489
$$ -140264 -164050 14485 41609 -165472 -134889 -85133 -58702 -89424 -163569 -165476 -49987
8120d9987j0756l9433j3653m6133j5353j0999J15062r5081r8623R6432J12919
$$ -49987 -60743 -100176 -113829 -159962 -175315 -186314 -71252 -166333 -264956 -168524 -55605
8109e5605K7466n8036K0120n7670J40574p242r6636J21325N9727J50426j54316
$$ -55605 -28139 -86175 -66055 -123725 16849 9607 -87029 34296 94023 244449 90133
8098I0133l3212l7898q4115l2383p1192k5862Q7811K530r7897P7742N8525k3333
$$ 90133 56921 19023 -65092 -97475 -168667 -194529 -106718 -104188 -202085 -124343 -65818 -89151
8086h9151m0518L0129o9431Q8075k9194p009n3099P1190M5889J189j0742O2461
$$ -89151 -129669 -99540 -168971 -80896 -110090 -117099 -170198 -99008 -53119 -51930 -62672 -211
8074b11n2880n1310j46300M1414J52049N9266j2304N0810P730j95352n3853k9400
$$ -211 -53091 -104401 -250701 -209287 -57238 2028 -10276 40534 48264 -147088 -200941 -230341
8062b30341P2406J8506Q1883l6408L645n6692O1288L5848K2776Q1781m2954j21332
$$ -230341 -157935 -139429 -57546 -93954 -90309 -147001 -85713 -49865 -27089 54692 11738 -109594
8050a09594N8288R700Q7486K4070k21580M9165M0936N7062j76925r4337R2295
$$ -109594 -51306 -41606 45880 69950 -151630 -102465 -61529 -4467 -181392 -275729 -183434
8039a83434L9521m3177J536N5990J900m6884O3957l9919l3508J1529l0809J8197
$$ -183434 -143913 -187090 -185554 -129564 -127664 -174548 -110591 -150510 -184018 -172489 -203298 -185101
8027a85101K587J06109P6545j9641M5654j38929j9925L6274l5591P6727j3731
$$ -185101 -182514 -76405 140 -19501 26153 -112776 -132701 -96427 -132018 -55291 -69022
8016f9022n6360O680K8043l3007l9812n3865Q7288j4499Q2305m6941k5424J42866
$$ -69022 -125382 -118702 -90659 -123666 -163478 -217343 -130055 -144554 -62249 -109190 -134614 8252
8004H252l733j76955N530L9588O0111K315Q0858j0981o0124j25L5128l1350q1307
$$ 8252 4519 -172436 -166906 -127318 -67207 -64892 15966 4985 -55139 -55264 -20136 -51486 -132793
7991a32793J13712j26566m4281O3179k3700n4855Q9246l1641k1160m3164J04261
$$ -132793 -19081 -145647 -189928 -126749 -150449 -205304 -116058 -147699 -168859 -212023 -107762
7980a07762o0606k5314J19796J8612j02299J411Q899J44383M0510j07775m5739
$$ -107762 -168368 -193682 -73886 -55274 -157573 -156162 -147263 -2880 37630 -70145 -115884
7969a15884j7209l5791K46p0870j481J12343r4347J2698j5696M8552O7745K4331
$$ -115884 -133093 -168884 -168638 -239508 -240989 -128646 -222993 -210295 -225991 -177439 -109694 -85363
7957h5363O1869N8792O0094N0808j25340j1425M486J5335k8221M1541j4690K9753
$$ -85363 -23494 35298 95392 146200 20860 9435 13921 29256 1035 42576 27886 57639
7945E7639R4183k8974j3437j10727j7999l6283j34812m7020J26909j7714o073
$$ 57639 151822 122848 109411 -1316 -19315 -55598 -190410 -237430 -110521 -128235 -134308
7934a34308J5121J5165K7550j07174l1438R3698n108L9132r3181j5088P5194N6435
$$ -134308 -119187 -104022 -76472 -183646 -215084 -121386 -126494 -87362 -180543 -195631 -120437 -64002
7922f4002P2410k4995M1331O2705p6289j56171O1152N1127M1260n5750j77331
$$ -64002 8408 -16587 24744 87449 11160 -145011 -83859 -32732 8528 -47222 -224553
7911b24553J23326J24408m7465k1076M6800M0211k166K1000j40826j1670J9545
$$ -224553 -101227 23181 -24284 -45360 1440 41651 39485 60485 -80341 -92011 -72466
7900g2466J8353K0624N3626N0217l1557k8837m2146r6955R9568K8266o3075j3794
$$ -72466 -54113 -33489 20137 70354 38797 9960 -32186 -129141 -29573 -1307 -64382 -78176
7888g8176O7956j8040P1754o1496O8161j680q8528l7189M8473j04559r6667n5354
$$ -78176 -10220 -28260 43494 -18002 50159 48479 -40049 -77238 -28765 -133324 -229991 -285345
7876b85345J62141J5848k7995m0097J5133N3253o9672K3155M244L0994J06513
$$ -285345 -123204 -107356 -135351 -175448 -160315 -107062 -176734 -153579 -149335 -118341 -11828
7865a1828O2041L6215M548l725J4018j53419k1790O1451L7850q5441m2092L7294
$$ -11828 50213 86428 90976 87251 101269 -52150 -73940 -12489 25361 -60080 -102172 -64878
7853f4878Q1252j49442l2619n1535r2765P862K5370k9061m0942L6890J23111J17560
$$ -64878 16374 -133068 -165687 -217222 -309987 -302125 -276755 -305816 -346758 -309868 -186757 -69197
7841f9197M3643K402Q1640j25945k5326p7009j3107j0500j2286P3226o681n5852
$$ -69197 -25554 -23152 58488 -67457 -92783 -169792 -182899 -193399 -205685 -132459 -139140 -194992
7829a94992J8277r345j36647N9030L3462L6871j363m9018n511j0115J22087K01873
$$ -194992 -176715 -186060 -322707 -263677 -230215 -193344 -194707 -243725 -249236 -259351 -137264 64609
7817F4609j47699l0455j477O9957j23341n7785L0274L5639M8486k3596j6438l8258
$$ 64609 -83090 -113545 -115022 -45065 -168406 -226191 -195917 -160278 -111792 -135388 -151826 -190084
7805a90084J4102K7197J20073m3474r7260l7779Q8195q4866J10700L9903J05384
$$ -190084 -175982 -148785 -28712 -72186 -169446 -207225 -119030 -203896 -93196 -53293 52091
7794E2091R72n014j13084k426j091N2781m9707O8927N8384k6611o0349q1802q1165
$$ 52091 53063 48049 -65035 -67461 -68552 -15771 -65478 3449 61833 35222 -25127 -106929 -188094
7781a88094m4017L2912Q7091K4898r6365O5634L3023j20090k5705o1282J3921
$$ -188094 -232111 -199199 -112108 -87210 -183575 -117941 -84918 -205008 -230713 -291995 -278074
7770b78074P5566J07306L2882Q0513l9895r6218M8759N6735j9268l6815p262r4469
$$ -278074 -202508 -95202 -62320 18193 -21702 -117920 -69161 -12426 -31694 -68509 -75771 -170240
7758a70240K3614J28725n9863N222J32021K1741r4482j2880l9210K3467J5696
$$ -170240 -146626 -17901 -77764 -72542 59479 81220 -13262 -26142 -65352 -41885 -26189
7747b6189k0257L2538j961M7365l9132n7893o146m6278L9803K0648j09988J36415
$$ -26189 -46446 -13908 -15869 31496 -7636 -65529 -71675 -117953 -78150 -57502 -167490 -31075
7735c1075J13187r7731j8411J00028n1125o8449p3929Q2433p2544j4627J4586
$$ -31075 82112 -15619 -34030 65998 14873 -53576 -127505 -45072 -117616 -132243 -117657
7724a17657J2618m5568J15035K7137l8396Q656K6195n3075J09341L9574K04623
$$ -117657 -105039 -150607 -35572 -8435 -46831 -38175 -11980 -65055 44286 83860 288483
7713B88483n3648j1134P490O7863M3212j01487p2843J12791p9305k3305j08922
$$ 288483 234835 223701 231191 299054 342266 240779 167936 280727 201422 178117 69195
7702F9195p0078K4522j0608k3153k2833J52803k6869j46925J11734Q1770L9076
$$ 69195 -883 23639 13031 -10122 -32955 119848 92979 -53946 57788 139558 178634
7691A78634O6696n538q0011m5426J15396p886o0395m7124j28109k8511J474m3337
$$ 178634 245330 239792 159781 114355 229751 221865 161470 114346 -13763 -42274 -40800 -84137
7679h4137K8330O570P6489l1440k2681Q651J9214o3256J3402j04285j2638l3184
$$ -84137 -55807 -49237 27252 -4188 -26869 -18218 996 -62260 -48858 -153143 -165781 -198965
7667a98965J32824J9144J0736O7122O5445k6640p9673M224k9759q1605R7356K6813
$$ -198965 -66141 -46997 -36261 30861 96306 69666 -10007 -5783 -35542 -117147 -19791 7022
7655G022j5388R5669K7538l5341q2074l5887n0194n9465K2881Q9426M2418N1641
$$ 7022 -8366 87303 114841 79500 -2574 -38461 -88655 -148120 -125239 -35813 6605 58246
7643E8246k0712J5210k1385n0729n9197r6437m877j09298M8832K30867J27623
$$ 58246 37534 52744 31359 -19370 -78567 -175004 -179881 -289179 -240347 -9480 118143
7632A18143q9575O2625m9981m9482N7879K2376J0178q4915n0626k195J2579m0178
$$ 118143 28568 91193 41212 -8270 49609 71985 82163 -2752 -53378 -55573 -42994 -83172
7620h3172J4794L7539j16993l3407O4907q363m9942r3023J65079Q0746r5596J23302
$$ -83172 -68378 -30839 -147832 -181239 -116332 -124695 -174637 -267660 -102581 -21835 -117431 5871
7608E871J22054M1483q3145n0372P2629n5387N123R304M2221J3988j32879n5066
$$ 5871 127925 169408 86263 35891 108520 53133 58256 67560 109781 123769 -9110 -64176
7596f4176P6829j38041o7632j5162N6651l8795J05611J4707n3636K2962q8880
$$ -64176 12653 -125388 -193020 -208182 -151531 -190326 -84715 -70008 -123644 -100682 -189562
7585a89562O2991P6587m1311n0234K8625L6034Q4538m5135Q8854o3915r3118K3873
$$ -189562 -126571 -49984 -91295 -141529 -112904 -76870 7668 -37467 51387 -12528 -105646 -81773
7573h1773l085L161Q8471r9116p3968j23463m562P5913M293j8599P8014J5848
$$ -81773 -84858 -81697 6774 -92342 -166310 -289773 -294335 -218422 -214129 -232728 -154714 -138866
7561a38866m903N5218P1955l2279m1210M5751Q9030j3589m9992O8938q3899R774
$$ -138866 -143769 -88551 -16596 -48875 -90085 -44334 44696 31107 -18885 50053 -33846 -24072
7549b4072K8229n4969L6273O1695l2396M181j02665L9507J15237j4211m2610K7514
$$ -24072 4157 -50812 -14539 47156 14760 18941 -83724 -44217 71020 56809 14199 41713
7537D1713o4782L5802M2490N44Q3216j26010k4322K8076N3603O8061K0280j07392
$$ 41713 -23069 12733 55223 55767 138983 12973 -11349 16727 70330 138391 158671 51279
7525E1279m4864j18796j1519J38672J02162r1732p3303M03j9931j78591J13389
$$ 51279 6415 -112381 -123900 14772 116934 25202 -48101 -47698 -67629 -246220 -132831
7514a32831O4487j67793O602K30293q2739q9055J09810j05874O8441N0K0886J5808
$$ -132831 -68344 -236137 -229535 758 -81981 -171036 -61226 -167100 -98659 -98609 -77723 -61915
7502f1915R6622O3266P3940K3744l2279q2736j9574k9308r8703N321L5843p0111
$$ -61915 34707 97973 171913 195657 163378 80642 61068 31760 -66943 -61622 -25779 -95890
7490i5890J8948o5826p3671k9355j0009Q6634M9783J691J0228o58n131m0348J32797
$$ -95890 -76942 -142768 -216439 -245794 -255803 -169169 -119386 -117695 -107467 -108125 -113256 -153604 -20807
7477b0807L2790J20058p420n6934m1118p3094m0985j2781j5549N2532j8265r4477
$$ -20807 11983 132041 124621 67687 26569 -46525 -87510 -100291 -115840 -63308 -81573 -176050
7465a76050m8443o6900L5797j8831K4956K8056p0119L2336J1729N2984J05884
$$ -176050 -224493 -291393 -255596 -274427 -249471 -221415 -291534 -259198 -247469 -194485 -88601
7454h8601P6217N8392l9458L349K728k1174J13822q6909J4342j2096r6199q2594
$$ -88601 -12384 46008 6550 9899 12627 -8547 105275 18366 32708 20612 -75587 -158181
7442a58181O4459J4965o4685m2386J5461j1381L0841k9900j6837K5526Q63P5003
$$ -158181 -93722 -78757 -143442 -185828 -170367 -181748 -150907 -180807 -197644 -172118 -171255 -96252
7430i6252P472l5966Q5931M0733k4394R7602j30781O5980k5629N8899Q9747M27
$$ -96252 -88780 -124746 -38815 1918 -22476 75126 -55655 10325 -15304 43595 133342 133769
7418A33769P7143j19339j29754r0745j30638j2292R8441R5029M005R081Q7421
$$ 133769 210912 91573 -38181 -128926 -259564 -271856 -173415 -78386 -74381 -65300 22121
7407B2121J7474L4103L9222q3972q9823N5228J19506J3385O9772M7884j510K05226
$$ 22121 39595 73698 112920 28948 -60875 -5647 113859 127244 197016 244900 243390 448616
7395D48616Q8824P336J38270J03965J85086J33135J2189Q1361q0577J5926l7001
$$ 448616 537440 544776 683046 787011 972097 1105232 1117421 1198782 1118205 1134131 1097130
7384A097130j90847k36548q0347n9444p5566j49285p2104J1598K2633L6697n0034
$$ 1097130 906283 669735 589388 529944 454378 305093 232989 244587 267220 303917 253883
7373B53883N1465q1652Q2047p216L6109j6442N931j18996j9318J8313R5983r5707
$$ 253883 305348 223696 305743 298527 334636 318194 324125 205129 185811 204124 300107 204400
7361B04400j8693m7858j02114P1457L6480n0680o326l9255q352M7666R7378M1700
$$ 204400 185707 137849 35735 107192 143672 92992 86666 47411 39059 86725 184103 225803
7349B25803N4883m3425L741N7585P8338P795k197Q7728M0402p501J1341j59325
$$ 225803 280686 237261 241002 298587 376925 384720 382523 470251 510653 503152 514493 355168
7337C55168p5886R392L6844r1247j7337K7543r2612k1352j1717K9824l3712p312
$$ 355168 279282 288674 325518 234271 216934 244477 151865 130513 118796 148620 114908 107596
7325A07596k9718L421m9112J16320l43O5601J20241J38835l2190l5703m970j9662
$$ 107596 77878 81299 32187 148507 148164 213765 334006 472841 440651 404948 399978 380316
7313C80316j8543L1277q3992q7829o9506q4952o5150r0246K4980j487L8108j49946
$$ 380316 361773 393050 309058 221229 151723 66771 1621 -88625 -63645 -65132 -27024 -176970
7301a76970M2457J93231K01063p8095j00868J01132Q1549M4620j22462M0547J2737
$$ -176970 -134513 58718 259781 181686 80818 181950 263499 308119 185657 226204 238941
7290B38941p9652J21009K7930j38064m1127J759o1836p4381J1697p4394q4198
$$ 238941 159289 280298 308228 170164 129037 130796 68960 -5421 6276 -68118 -152316
7279a52316M0209k0693K8226Q0742N0662o7480q5003j3058l6781M8165N7172k9276
$$ -152316 -112107 -132800 -104574 -23832 26830 -40650 -125653 -138711 -175492 -127327 -70155 -99431
7267i9431k8599N2783P0084J14433m5110l5762j58425j9864k084J6594r7940N1931
$$ -99431 -128030 -75247 -5163 109270 64160 28398 -130027 -149891 -151975 -135381 -233321 -181390
7255a81390R5984k5455P3367j4163l3077j7527O5520J6626J64789O8644m364K0048
$$ -181390 -85406 -110861 -37494 -51657 -84734 -102261 -36741 -20115 144674 213318 208954 229002
7243B29002j09484M3896L8740J17146k391j6690O8962m3667j39372P6374j12269
$$ 229002 119518 163414 202154 319300 316909 300219 369181 325514 186142 262516 150247
7232A50247M7928Q4514j30097j25288O1148j52779L8861n7734j18284L418N3986
$$ 150247 198175 282689 152592 27304 88452 -64327 -25466 -83200 -201484 -198066 -144080
7221a44080Q1656Q7097J30653R6812R5753J4597o4233j3906J62927P8827O7271
$$ -144080 -62424 24673 155326 252138 347891 362488 298255 284349 447276 526103 593374
7210E93374O8878K0416n8631m1067j70336j94563p1964j7322n7305O5519j12957
$$ 593374 662252 682668 624037 582970 412634 218071 146107 128785 71480 136999 24042
7199B4042R7342M2778j02055K6295L8945R9348J69287P0902Q5139J62495J62710
$$ 24042 121384 164162 62107 88402 127347 226695 395982 466884 552023 714518 877228
7188H77228M7894K2321J97342L2116N5769K3136q9819r3815j62562o7565m1138
$$ 877228 925122 947443 1144785 1176901 1232670 1255806 1165987 1072172 909610 842045 800907
7177H00907l1654N1803j47763O4567p0984q2604J14746R9044J89714j4437j12768
$$ 800907 769253 821056 673293 737860 666876 584272 699018 798062 987776 973339 860571
7166H60571R3712J83366J20205R3030m425n8463N226K74132K0709M3204n8428
$$ 860571 954283 1137649 1257854 1350884 1346459 1287996 1293222 1567354 1588063 1631267 1572839
7155A572839O6662k7875j3293j72389l4481j48998J40642j68587J3706M808j19156
$$ 1572839 1639501 1611626 1598333 1425944 1391463 1242465 1383107 1214520 1228226 1233034 1113878
7144A113878N6327k882P61p496j6207N9923J86281J38375K99973K45249K13202
$$ 1113878 1170205 1167323 1168084 1160588 1144381 1204304 1390585 1528960 1828933 2074182 2287384
7133B287384J07129J05463P071P2509l7666J0039j35899k10274q3305N4916k57439
$$ 2287384 2394513 2499976 2507047 2579556 2541890 2551929 2416030 2205756 2122451 2177367 1919928
7122A919928j17083j27615j6330L1493j2109M3332k9786K19725K23784R9088K01529
$$ 1919928 1802845 1675230 1658900 1690393 1678284 1721616 1691830 1911555 2135339 2234427 2435956
7111B435956J57359J04716L55355L12532J71276J19054J21121n3703j36045K5866
$$ 2435956 2593315 2698031 3053386 3365918 3537194 3656248 3777369 3723666 3587621 3613487
7101C613487M7594j19613p1735m4920j18230r3131O335r3398J5710J79737K45233
$$ 3613487 3661081 3541468 3469733 3424813 3306583 3213452 3219787 3126389 3142099 3321836 3567069
7090C567069L25896L12179L30206L90304M40384L42038L21338N37995L73791L42584
$$ 3567069 3892965 4205144 4535350 4925654 5366038 5708076 6029414 6567409 6941200 7283784
7080G283784M56481M25817K49130K93385K78841K78916K90279K07514K87020K39825
$$ 7283784 7740265 8166082 8415212 8708597 8987438 9266354 9556633 9764147 10051167 10290992
7070A0290992N49089P37970R72162J338810J644969J994100K465464K797313L134867
$$ 10290992 10840081 11578051 12550213 13889023 15533992 17528092 19993556 22790869 25925736
7061B5925736L569879M056433M668002N456781O514213P879029R859176J2447447
$$ 25925736 29495615 33552048 38220050 43676831 50191044 58070073 67929249 80376696
7053H0376696J6218263K0602856K4561816K6413565K3452152J5341864M713352
$$ 80376696 96594959 117197815 141759631 168173196 191625348 206967212 211680564
7046B11680564n510713j5803342k4016408k5411491k2673248j9320704j5998922
$$ 211680564 206169851 190366509 166350101 140938610 118265362 98944658 82945736
7039H2945736j2954949r933674p850399o486423n672558m734426m180407l654781
$$ 82945736 69990787 60057113 52206714 45720291 40047733 35313307 31132900 27478119
7031B7478119l286059k792054k393453k010847j623048j030113p39948m31467
$$ 27478119 24192060 21400006 19006553 16995706 15372658 14342545 13602597 13171130
7023A3171130k38609l0941j5179P4730J41191R3638J88893L05716M15559O21389
$$ 13171130 12932521 12901580 12886401 12961131 13102322 13195960 13384853 13690569 14106128 14727517
7013A4727517Q09697R93488J005587N35984k03591p14023j181388j844775j796231
$$ 14727517 15537214 16530702 17536289 18072273 17868682 17154659 15973271 14128496 12332265
7004A2332265j489132j387611r92454p76931n82549m94786k11259j24743j51583
$$ 12332265 10843133 9455522 8463068 7686137 7103588 6608802 6397543 6272800 6121217
6995F121217j27093j81139j30653q9874Q3025j51448j97760j95731k15649j92359
$$ 6121217 5994124 5812985 5682332 5592458 5675483 5524035 5326275 5130544 4914895 4722536
6985D722536l66712l26459j68591k05354j21469k34234j92046k50223j33456p9341
$$ 4722536 4355824 4029365 3860774 3655420 3533951 3299717 3107671 2857448 2723992 2644651
6975B644651p0034p9780K1801J18163J09720J11908M9770K5863N3769K1042p7100
$$ 2644651 2574617 2494837 2516638 2634801 2744521 2856429 2906199 2932062 2985831 3006873 2929773
6964B929773M2559l0081j4096j13514k61043j46518l31162j73109j38300j22730
$$ 2929773 2972332 2942251 2928155 2814641 2553598 2407080 2075918 1902809 1764509 1641779
6954A641779p6022o9902j31514M2972K6887m0271O1010J4645k3888q7186K1573
$$ 1641779 1565757 1495855 1364341 1407313 1434200 1393929 1454939 1469584 1445696 1358510 1380083
6943A380083J14085J02785k8899R7856K6384J0301Q2589o5339p7736l0384n7453
$$ 1380083 1494168 1596953 1568054 1665910 1692294 1702595 1785184 1719845 1642109 1611725 1554272
6932A554272l6349j66762j80794M5520j18658K9547M0324q7966r9374m5505j13268
$$ 1554272 1517923 1351161 1170367 1215887 1097229 1126776 1167100 1079134 979760 934255 820987
6921H20987r4554j51858L5666m2578l5847J38398J90596L5494K9478n745K4245
$$ 820987 726433 574575 610241 567663 531816 670214 860810 896304 925782 920037 944282
6910I44282J36642m9163j87210m21j45622l8179k08k04743j21237m1383j8688
$$ 944282 1080924 1031761 844551 844130 698508 660329 660121 455378 334141 292758 274070
6899B74070q6680k29814p9333N4121R818M8676m9059m703J69092O1224Q1733N7651
$$ 274070 187390 -42424 -121757 -67636 -57818 -9142 -58201 -62904 106188 167412 249145 306796
6887C06796P1002P5148l7653p6882P530K9711q2684m5120M3557j748O1004o8452
$$ 306796 377798 452946 415293 338411 345941 375652 292968 247848 291405 289657 350661 282209
6875B82209j0144m3152j52200O8850j26112n3278M692k463P8435K23585j3529
$$ 282209 272065 228913 76713 145563 19451 -33827 -29135 -31598 46837 270422 256893
6864B56893N072j46646K8343M8590l7636j03706j37869Q443J1224J2459m872N6617
$$ 256893 261965 115319 143662 192252 154616 50910 -86959 -78516 -67292 -54833 -59705 -3088
6852c088n0212j68813J00604k3184Q5085P1201r5844J6201p1835m162N7777j21219
$$ -3088 -53300 -222113 -121509 -144693 -59608 11593 -84251 -68050 -139885 -144047 -86270 -207489
6840b07489j994k1290M342J60901l5838o7921j5170P7311J87577M8760M753j26093
$$ -207489 -209483 -230773 -226431 -65530 -101368 -169289 -184459 -107148 80429 129189 133942 7849
6828G849K725p390l7485o5953r9091J6606K4066k5693k9988m0418l0794P9192
$$ 7849 10574 3184 -34301 -100254 -199345 -182739 -158673 -184366 -214354 -254772 -285566 -206374
6816b06374q9776n726L7882J38577O8740K8614J00936O1963q829j00315L5149
$$ -206374 -296150 -301876 -263994 -125417 -56677 -28063 72873 134836 126007 25692 60841
6805F0841J00266Q708L2306p321m7540R757p3579o717q525k5186j6094j27515
$$ 60841 161107 169815 202121 194800 147260 157017 83438 76721 68196 43010 26916 -100599
6793a00599n8769j7535j43140n268q782J57514J38410p0693L6904J33076N1692
$$ -100599 -159368 -176903 -320043 -325311 -334093 -176579 -38169 -108862 -71958 61118 112810
6782A12810O5103N1433j7993L1467J21972m3595R4751n2999K5699r4547q1008
$$ 112810 177913 229346 211353 242820 364792 321197 415948 362949 388648 294101 213093
6771B13093n9241j5978j05823j11909k3230O6066p701m1127J09034J2602q2824
$$ 213093 153852 137874 32051 -79858 -103088 -37022 -44723 -85850 23184 35786 -47038
6760d7038R5717O7560q274P5710o0249N6940J22019n5795K6460P34j13440J0427
$$ -47038 48679 116239 107965 183675 123426 180366 302385 246590 273050 273784 160344 170771
6748A70771k8368J6401j15292l4047m0261m2108j36879O8319K2749L3151q4454
$$ 170771 142403 158804 43512 9465 -30796 -72904 -209783 -141464 -118715 -85564 -170018
6737a70018R4652J3442M6526p9899J15682R4009K082N2650L720l5380J31979j25277
$$ -170018 -75366 -61924 -15398 -95297 20385 114394 116476 169126 172846 137466 269445 144168
6725A44168J4197R3604m6999k1758K7578q3038k4209r5632q2741M8158J07766
$$ 144168 158365 251969 204970 183212 210790 127752 103543 7911 -74830 -26672 81094
6714H1094J41347K3666L794O6462L0691P3559J19084M6677K00777K73908J15447
$$ 81094 222441 246107 249901 316363 347054 420613 539697 586374 787151 1061059 1176506
6703A176506J14284j7585j30851r687k77852l23238m1677j25927n1620J642k14785
$$ 1176506 1290790 1273205 1142354 1132667 854815 531577 489900 363973 312353 313995 99210
6692I9210N9306k2260j19403p1416o4599J8999K2079K2872J3323j55298L2071
$$ 99210 158516 136256 16853 -54563 -119162 -100163 -78084 -55212 -41889 -197187 -165116
6681a65116J66029j10948m3656J14858m8128p813L0207l7489P3230o382j37134
$$ -165116 913 -110035 -153691 -38833 -86961 -94774 -64567 -102056 -28826 -35208 -172342
6670a72342J41985N2727j6110j03233j30794J2774N196j00777J49430l7136M1476
$$ -172342 -30357 22370 6260 -96973 -227767 -214993 -209797 -310574 -161144 -198280 -156804
6659a56804k0564L0288p5599J5688J2348Q7144r8320J23707K58127l6941j4674
$$ -156804 -177368 -147080 -222679 -206991 -194643 -107499 -205819 -82112 176015 139074 124400
6648A24400j14716L0005k0361P573p8295L9498r9472k7498J37520J7149q0840
$$ 124400 9684 39689 19328 26901 -51394 -11896 -111368 -138866 -1346 15803 -65037
6637f5037j25838r0303o614J5971l666K6425K4228O9493K2154M4970R4404j07847
$$ -65037 -190875 -281178 -287792 -271821 -275487 -249062 -224834 -155341 -133187 -88217 6187 -101660
6625a01660R0019N2985m7350j9626O8494M8921P7577K0843q642j23013j0823q574
$$ -101660 -11641 41344 -6006 -25632 42862 91783 169360 190203 181561 58548 47725 39151
6613C9151j29297l1630k6402P4068P5446n0562j11918m9909j8445J56633n8544
$$ 39151 -90146 -121776 -148178 -74110 1336 -49226 -161144 -211053 -229498 -72865 -131409
6602a31409J3121q308J19657L6613L8241r7425Q3370Q1294M8363r023k1868j2597
$$ -131409 -118288 -126596 -6939 29674 67915 -29510 53860 135154 183517 174494 152626 140029
6590A40029Q186q8813J8873J05413j12176j097r7971K716N3313n9469j09730O1893
$$ 140029 148215 59402 78275 183688 71512 70415 -27556 -24840 28473 -30996 -140726 -78833
6578g8833j7720J33973J2829R2143K3427K0973j3775j1855r757N4073N660l7598
$$ -78833 -96553 37420 50249 142392 165819 186792 173017 161162 151405 205478 211138 173540
6566A73540r367J17084p5381j06034n3327n8554m043P405J69941L2187P135J37897
$$ 173540 164173 281257 205876 99842 46515 -12039 -16082 -8677 161264 193451 200586 338483
6554C38483r4087j22580J5566J2554r798P8333J07761O8096j35074m9610m923
$$ 338483 244396 121816 137382 149936 140138 218471 326232 394328 259254 209644 204721
6543B04721m814J3829q6836m5733L5323J07521L733R943n6275o3226p3771n9407
$$ 204721 199907 213736 126900 81167 116490 224011 227744 237687 181412 118186 44415 -14992
6531a4992n5767J11274N0551K2365j12971P4885J23062j9752q6062K0777J06237
$$ -14992 -70759 40515 91066 113431 460 75345 198407 178655 92593 113370 219607
6520B19607N2023l4193P7639j4005j11827N0424L2692L8955L9012j434j05195
$$ 219607 271630 237437 315076 301071 189244 239668 272360 311315 350327 348893 243698
6509B43698P451k4013l854j13420m5160M2191N328J03176l7783L888J1468R353
$$ 243698 251149 227136 223282 109862 64702 106893 112221 215397 177614 181502 192970 202323
6497B02323j41713N5785M1932N3705M3143l565K7927O3064q5645L4849n7553l3853
$$ 202323 60610 116395 158327 212032 255175 251610 279537 342601 256956 291805 234252 200399
6485B00399P7566j5293n854L526q3781o625k8184l5122N0507m7695l990j7572
$$ 200399 277965 262672 256818 260344 176563 169938 141754 106632 157139 109444 105454 87882
6473H7882K3156q835P0544M7040L9034J1523J08232K5345K5965L5199Q1047k05425
$$ 87882 111038 102203 172747 219787 258821 270344 378576 403921 429886 465085 546132 340707
6461C40707M1244k6902m5564P6516P5955k5297J5351J0708J61474j42876r1227
$$ 340707 381951 355049 309485 386001 461956 436659 452010 462718 624192 481316 390089
6450C90089j3244O5506M9184k6989L7931M2237N324n6887P8623M1959n6004p13
$$ 390089 376845 442351 491535 464546 502477 544714 550038 493151 571774 613733 557729 557016
6438E57016O8300l0230K5235P6942O0462j1594m951J26349l6963p2850K3280j9378
$$ 557016 625316 595086 620321 697263 757725 746131 741180 867529 830566 757716 780996 761618
6426G61618L9360q3104O0316J76520P6022L9113M2805L8525J12940O9375P2236
$$ 761618 800978 717874 778190 954710 1030732 1069845 1112650 1151175 1264115 1333490 1405726
6415A405726n5320M6656J5239J11870j9770J6415K10101J26040l6720K8094M6971
$$ 1405726 1350406 1397062 1412301 1524171 1504401 1520816 1730917 1856957 1820237 1848331 1895302
6404A895302K3643L190N3446Q8497J20772J74460N8492P1917K11380J81441Q1702
$$ 1895302 1918945 1922135 1975581 2064078 2184850 2359310 2417802 2489719 2701099 2882540 2964242
6393B964242J46406J06845J97445L78825J33652J87666L06239M02435J77548J02346
$$ 2964242 3110648 3217493 3414938 3793763 3927415 4115081 4421320 4823755 5001303 5103649
6383E103649R4888K44830K38473K57263J37717J26060J83943J42737N035M7555
$$ 5103649 5198537 5443367 5681840 5939103 6076820 6202880 6386823 6529560 6534595 6582150
6373F582150J40634r7Q146o8733j49823j56630k1391j22760l14394j42521K1381
$$ 6582150 6722784 6722687 6730833 6662100 6512277 6355647 6334256 6211496 5897102 5754581 5775962
6362E775962l56848k45775j49475k55795k23987j66071k70747k36261k00711j46773
$$ 5775962 5419114 5173339 5023864 4768069 4544082 4378011 4107264 3871003 3670292 3523519
6352C523519k15120j81865j11640r9520j34716k13618k08331o6891J8766j40209
$$ 3523519 3308399 3126534 3014894 2915374 2780658 2567040 2358709 2291818 2310584 2170375
6342B170375r8108k8198j20652j25071j3600L097j11994q2274m7928l1373p7309
$$ 2170375 2072267 2044069 1923417 1798346 1784746 1787843 1675849 1593575 1545647 1514274 1436965
6331A436965o1201k2697m8524k6294r035L4607n8266j71097r042p9682j04322
$$ 1436965 1375764 1353067 1304543 1278249 1269214 1303821 1245555 1074458 1065416 985734 881412
6320H81412q4373J14188J43052n1538j26339Q6933L5884q9610J1693k4j17910
$$ 881412 797039 911227 1054279 1002741 876402 963335 999219 909609 921302 921278 803368
6309H03368M1840K8047L2270J6384r337L6086j13121j23030o1545L8467J21371
$$ 803368 845208 873255 905525 921909 912572 948658 835537 712507 650962 689429 810800
6298H10800k19623J201J97596j13640j26375r6624q942j40853J41375J12705m0567
$$ 810800 591177 592378 789974 676334 549959 453335 444393 303540 444915 557620 517053
6287E17053n4107m8856j05608N4277j01516N7097M7344K2492m7436j681L3923
$$ 517053 462946 414090 308482 362759 261243 318340 365684 388176 340740 339059 372982
6276C72982Q654l5687K7160l2356n7580l465P7143j3595j24415R2722J14711p5563
$$ 372982 381636 345949 373109 340753 283173 279708 356851 343256 218841 311563 426274 350711
6264C50711n0580O6530M3386K9177J6462P9112P844R3035m7800o0612R1522j00624
$$ 350711 300131 366661 410047 439224 455686 534798 542642 635677 587877 527265 618787 518163
6252E18163k8497Q8246r5160j16904m0760l3607r8456K020R7981J8499j38681
$$ 518163 489666 577912 482752 365848 325088 291481 193025 195045 293026 311525 172844
6241A72844P6958q473R325p2239K3189j08462J05713L332l0365M4215n138L4666
$$ 172844 249802 241329 250654 178415 201604 93142 198855 202187 171822 216037 210899 245565
6229B45565j26811j05179J12128L0730m3199M3983r2526M7151R082n6015p7266
$$ 245565 118754 13575 125703 156433 113234 157217 64691 111842 120924 64909 -12357
6218a2357o1556R884N7966L0729J32290L05j06901J7124r2658R4044J85837j34640
$$ -12357 -73913 -64029 -6063 24666 156956 157261 50360 67484 -25174 68870 254707 120067
6206A20067m3850N1170R6594J36870n2225j44385j58515L5635N2032j1718M2780
$$ 120067 76217 127387 223981 360851 308626 164241 5726 41361 93393 81675 124455
6195A24455M1462M2677q9892M6325m468l9483k6492p1562J0960N6670L9075L161
$$ 124455 165917 208594 118702 165027 160559 121076 94584 23022 33982 90652 129727 132888
6183A32888q1043j59493P9292M7336m4674R371K613J15064O925k538n409N401
$$ 132888 51845 -107648 -28356 18980 -25694 -16323 -13710 101354 108279 105741 100332 105733
6171A05733j8176j7339J8238J5594k2931n1550j8949N7023L7482L6333N3284M5611
$$ 105733 87557 70218 88456 104050 81119 29569 10620 67643 105125 141458 194742 240353
6159B40353o5726o0932M1725K3571p4322J0370J0090k2257N5993l4518N0773N4774
$$ 240353 174627 113695 155420 178991 104669 115039 125129 102872 158865 124347 175120 229894
6147B29894j3019l5292j04R031j13042K700P6040q329j34L581J4093n5739k2666
$$ 229894 216875 181583 181479 190510 77468 80168 156208 147879 147745 151326 165419 109680 87014
6134H7014j9878p0209J52579p3715l0941k60m7431J74506j1583J26308k7676l2330
$$ 87014 67136 -3073 149506 75791 44850 44590 -2841 171665 160082 286390 258714 226384
6122B26384M0001M0291J6623K4464l1366O7877j10855n1041J27727K9868L1554
$$ 226384 266385 306676 323299 347763 316397 384274 273419 222378 350105 379973 411527
6111D11527m7764N0611j1221j7353j00245q8765p308O9723J35138J08466J1149
$$ 411527 363763 414374 403153 385800 285555 196790 189482 259205 394343 502809 513958
6100E13958J26314R6569L7647J03727n0619J01761P0286J87580J39613R8243K96770
$$ 513958 640272 736841 774488 878215 827596 929357 999643 1187223 1326836 1425079 1721849
6089A721849K38452L15653N19509N45336P74847J099878R02285Q32311L34770
$$ 1721849 1960301 2275954 2795463 3340799 4115646 5215524 6117809 6950120 7284890
6080G284890o3486m93296r15707j098932r33856o60916m35476m13391l05065l99414
$$ 7284890 7221404 6728108 5812401 4713469 3779613 3118697 2683221 2269830 1964765 1565351
6070A565351j40558r1889k61699j43115q8325L8132j22556q9148j34110j24422
$$ 1565351 1424793 1332904 1071205 928090 839765 877897 755341 666193 532083 407661
6060D07661L2115J8765j19073j00278k4105J39423Q7034k6107j6379K9060l6393
$$ 407661 439776 458541 339468 239190 215085 354508 441542 415435 399056 428116 391723
6049C91723K0048p6086O0926L203L3018P3665N1787O4673j53133j02003j1299
$$ 391723 411771 335685 396611 399814 432832 506497 558284 622957 469824 367821 356522
6038C56522j36472r7979J39190N184j24063j42490R9098l8142O2455O3463j4812
$$ 356522 220050 122071 261261 266445 142382 -108 98990 60848 123303 186766 171954
6027A71954q977j3782k4109k1294o1813M8648R8618J24626P5502j05572k943j10700
$$ 171954 162977 149195 125086 103792 41979 90627 189245 313871 389373 283801 280858 170158
6015A70158k1314p2866k2730j9921K6600N8126R9668J8287M0095j16813J1215
$$ 170158 148844 75978 53248 33327 59927 118053 217721 236008 276103 159290 170505
6004A70505j1361m6734J4865N5818O8534j4861L6954J38265N388m6988k336r6432
$$ 170505 159144 112410 127275 183093 251627 236766 273720 411985 417373 370385 368049 271617
5992B71617N0890N4885n4743m32l1383n5797q801J2545N6117j19182k9157k6488
$$ 271617 322507 377392 322649 322217 290834 235037 226236 238781 294898 175716 146559 120071
5980A20071n0597M4865R6253j69636k1977J17943M7872p8661P8257K4284L7808
$$ 120071 69474 114339 210592 40956 18979 136922 184794 106133 184390 208674 246482
5969B46482n8243J50511M8555m1512o6523j58849j58994O717M2473J08665n7672
$$ 246482 188239 338750 387305 345793 279270 120421 -38573 -31856 10617 119282 61610
5958F1610j48834N0410N5987L9529q2208J8631J234K09213q8288Q2370M4571L1012
$$ 61610 -87224 -36814 19173 58702 -23506 -4875 -3641 205572 117284 199654 244225 275237
5946B75237k1537M8840k6291m897j8846J12458p6249j41618l0383M1557j3143
$$ 275237 253700 302540 276249 271352 252506 364964 288715 147097 116714 158271 145128
5935A45128m2164O8203M1060o944j6593J7751j25553q5855P5111j5496K9253M2461
$$ 145128 102964 171167 212227 205283 188690 206441 80888 -4967 70144 54648 83901 126362
5923A26362p1582R6233r7290m5955l7845O4707P9886Q500n3568j8958K2370j0316
$$ 126362 54780 151013 53723 7768 -30077 34630 114516 123016 69448 50490 72860 62544
5911F2544P1238O6360J714m1581P2219Q3000l4236r2030J48230M0986J26621J11965
$$ 62544 133782 200142 201856 160275 232494 315494 281258 189228 337458 378444 505065 617030
5899F17030N8465J03344P3951J39604M18553J77073J33312Q9560p7905J18959
$$ 617030 675495 778839 852790 992394 1410947 1588020 1721332 1810892 1732987 1851946
5889A851946j73763j20064q7768k07048r5133k3977K4523N333j17136J37294J63026
$$ 1851946 1678183 1558119 1470351 1263303 1168170 1144193 1168716 1174049 1056913 1194207 1357233
5878A357233J11841J90135K09096P0003J15618L01527J43132J16333K45226J23310
$$ 1357233 1469074 1659209 1868305 1938308 2053926 2355453 2498585 2614918 2860144 2983454
5868B983454K48545K25951K07773K25008Q1132K03661J46916J34193J48284L1900
$$ 2983454 3231999 3457950 3665723 3890731 3971863 4175524 4322440 4456633 4604917 4636817
5858D636817K34787Q9620L065j11466k75302j60874k5043j36186m2062j87576
$$ 4636817 4871604 4961224 4964289 4852823 4577521 4416647 4391604 4255418 4213356 4025780
5848D025780j59405k34698k89090l16965j59368j66321k36264j88404n1262j22712
$$ 4025780 3866375 3631677 3342587 3025622 2866254 2699933 2463669 2275265 2224003 2101291
5838B101291j63480j94679j50863j63661j66996q5426k05118k11304p9842Q2066
$$ 2101291 1937811 1743132 1592269 1428608 1261612 1176186 971068 759764 679922 761988
5828G61988j8582j35663q9215k4890j48932J428R8625l2269j03290k5359l6581
$$ 761988 743406 607743 518528 493638 344706 346134 444759 412490 309200 283841 247260
5817B47260N1625k3075k0048L1241P3182m8843M4139O6953K971q6320J566k3365
$$ 247260 298885 275810 255762 287003 360185 311342 355481 422434 425405 339085 340651 317286
5805C17286O1263J4620k0176K4761j23714l1367P2184o1499J6456J11865j9795
$$ 317286 378549 393169 372993 397754 274040 242673 314857 253358 269814 381679 361884
5794C61884m5696m8885Q8395l0077J18435J51905J518q4967M5819m3781O0149
$$ 361884 316188 267303 355698 325621 444056 595961 597479 512512 558331 514550 574699
5783E74699M9692L7218L3060J1107k0760j28414J9826o8856M2339n187L847R4548
$$ 574699 624391 661609 694669 705776 685016 556602 576428 507572 549911 544724 548571 643119
5771F43119p3701o3842Q2082j16213J05531k1692K2096q0751O5196P7313l9750
$$ 643119 569418 505576 587658 471445 576976 555284 577380 496629 561825 639138 599388
5760E99388R4750J24817l0071K5157q7906o0888J53821n843j02468p2199J15379
$$ 599388 694138 818955 788884 814041 726135 665247 819068 813225 710757 638558 753937
5749G53937m4005N7622j172j2876m8669k84M3580J7273k6956l5543k2725K7702
$$ 753937 709932 767554 766382 753506 704837 704553 748133 765406 738450 702907 680182 707884
5737G07884k7292j571J22535j546o0404j7375q0092K3878n5373l840M1777j05650
$$ 707884 680592 679021 801556 800010 739606 722231 642139 666017 610644 606804 648581 542931
5725E42931o7163J07930q5703j66964l1522N7340p9J6887j4638j16401j0424L398
$$ 542931 475768 583698 497995 331031 299509 356849 356770 373657 359019 242618 232194 235592
5713B35592L4874L7949J16009j54405l1477J4793N7313l5219O1074m7670L2155
$$ 235592 270466 308415 424424 270019 238542 253335 310648 275429 336503 288833 320988
5702C20988j0444K0491R2220n2339r3148l2095P6536O927j06580J10363N0661
$$ 320988 310544 331035 423255 370916 277768 245673 322209 329136 222556 332919 383580
5691C83580J12503l8606j21604Q594n8190M3486M3403O6424K3672k1167J36283
$$ 383580 496083 457477 335873 344467 286277 329763 373166 439590 463262 442095 578378
5680E78378k7877k4537Q9457n0873P7479p3903q7102Q6532l9537q0877M0546o2824
$$ 578378 550501 525964 615421 564548 642027 568124 481022 567554 528017 447140 487686 424862
5668D24862N9489j2956q7579l6730R0965P2428l6077M15R2178j0646J52107Q2207
$$ 424862 484351 471395 383816 347086 438051 510479 474402 474817 566995 556349 708456 790663
5656G90663J68495K4940J37276J20647M9223J20841l2962O0024K01397N3081J98894
$$ 790663 959158 984098 1121374 1242021 1291244 1412085 1379123 1439147 1640544 1693625 1892519
5645A892519J42117m4802N3415r2286Q0703M9021K7244J18826o610K4815K6364
$$ 1892519 2034636 1989834 2043249 1950963 2031666 2080687 2107931 2226757 2220147 2244962 2271326
5634B271326m2696j4042j19510J14592R8960o922J7660p2992j10102j32222M4954
$$ 2271326 2228630 2214588 2095078 2209670 2308630 2301708 2319368 2246376 2136274 2004052 2049006
5623B049006j64684j62300k7342j93028r2277J13318o6445q1294j44807j351j1365
$$ 2049006 1884322 1722022 1694680 1501652 1409375 1522693 1456248 1374954 1230147 1228796 1217431
5612A217431J3244j1485L1354o0570N7238n1039N7134l8842K0925J04396J612
$$ 1217431 1230675 1219190 1250544 1189974 1247212 1196173 1253307 1214465 1235390 1339786 1341398
5601A341398N0630J4151k2163j3055m8809l2304J23683J13933M6844K0006J50887
$$ 1341398 1392028 1406179 1384016 1370961 1322152 1289848 1413531 1527464 1574308 1594314 1745201
5590A745201p5038m5900N2128K8047M8830j52464m8961J06339J43326K8688j084
$$ 1745201 1670163 1624263 1676391 1704438 1753268 1600804 1551843 1658182 1801508 1830196 1829112
5579A829112l7321j56669N6819R3319m2741L0122J98164o8959K188n6017M5067
$$ 1829112 1791791 1635122 1691941 1785260 1742519 1772641 1970805 1901846 1904034 1848017 1893084
5568A893084p6860O4747r338k7447J67235j3999Q677J35026l1075o2238O8122
$$ 1893084 1816224 1880971 1871633 1844186 2011421 1997422 2006099 2141125 2110050 2047812 2115934
5557B115934l9630k4304P4507L3362l3357J52770J23534J82930M5348m2498m305
$$ 2115934 2076304 2052000 2126507 2159869 2126512 2279282 2402816 2585746 2631094 2588596 2584291
5546B584291l8192J97845O4747J0821J11272J07441M7435N6883M6076O6867l0593
$$ 2584291 2546099 2743944 2808691 2819512 2930784 3038225 3085660 3142543 3188619 3255486 3224893
5535C224893Q7147L7765M9889R0409Q1727k9457J79877K01191O8875J55385J59426
$$ 3224893 3312040 3349805 3399694 3490103 3571830 3542373 3722250 3923441 3992316 4147701 4307127
5524D307127P0009J20663J00196J14472N9266K52944J49476R0664O293J19299
$$ 4307127 4377136 4497799 4597995 4712467 4771733 5024677 5174153 5264817 5271110 5390409
5514E390409R5465J46632l0064J23269K13331J81788J23308L76072K65560J93454
$$ 5390409 5485874 5632506 5602442 5725711 5939042 6120830 6244138 6620210 6885770 7079224
5504G079224L48793L49697M41811M84007M51297O03394M75309N50444O76708O34388
$$ 7079224 7428017 7777714 8219525 8703532 9154829 9758223 10233532 10783976 11460684 12095072
5494A2095072P32649P75033R79827Q83991Q63067R53077J224870J175889J295120
$$ 12095072 12827721 13602754 14582581 15466572 16329639 17282716 18507586 19683475 20978595
5485B0978595J381979J461799J603396J717644J790617J927508J899822K169763
$$ 20978595 22360574 23822373 25425769 27143413 28934030 30861538 32761360 34931123
5477C4931123K198317K149871K032330K360167K452640K593946K578779K681089
$$ 34931123 37129440 39279311 41311641 43671808 46124448 48718394 51297173 53978262
5469E3978262K853124K920899K941607L044463K937882K994037K764010K774191
$$ 53978262 56831386 59752285 62693892 65738355 68676237 71670274 74434284 77208475
5461G7208475K610313K437361K179736K090760K036024K057027K014651K028524
$$ 77208475 79818788 82256149 84435885 86526645 88562669 90619696 92634347 94662871
5453I4662871J927721J644256J597893J503689J095616P44715N07672L11665M8757
$$ 94662871 96590592 98234848 99832741 101336430 102432046 103176761 103684433 103996098 104044855
5444A04044855k41932n79542m68999p91666r55259r54406r50296j169097j620929
$$ 104044855 103802923 103223381 102754382 101962716 101007457 100053051 99102755 97933658 96312729
5435I6312729j642986j844985k184474k259530k491348k631349k656227k716267
$$ 96312729 94669743 92824758 90640284 88380754 85889406 83258057 80601830 77885563
5427G7885563k696847k685011k596388k553486k313402k488408k407213k437239
$$ 77885563 75188716 72503705 69907317 67353831 65040429 62552021 60144808 57707569
5419E7707569k140114k240637k202588j968707k016374k065459j958310j815212
$$ 57707569 55567455 53326818 51124230 49155523 47139149 45073690 43115380 41300168
5411D1300168j727397j618245j205179j213866j318358j062590q83484r26747
$$ 41300168 39572771 37954526 36749347 35535481 34217123 33154533 32271049 31344302
5403C1344302p97606o24975n69169l25728l86151m14274j89216j36979j48530
$$ 31344302 30546696 29921721 29352552 29026824 28640673 28226399 28037183 27900204 27751674
5394B7751674P5664N8656J78433K71372L25473M20595L33132M78498M84802M71540
$$ 27751674 27827338 27885994 28064427 28335799 28661272 29081867 29414999 29893497 30378299 30849839
5384C0849839O49643P44534P71432R96383J129449J220623J553400J794491K076203
$$ 30849839 31499482 32244016 33015448 34011831 35141280 36361903 37915303 39709794 41785997
5375D1785997K608250K961626L542849M081234M586260N341438O235603P195400
$$ 41785997 44394247 47355873 50898722 54979956 59566216 64907654 71143257 78338657
5367G8338657Q229613R415181J0957964J2491558J4540357J6634951J8800462
$$ 78338657 86568270 95983451 106941415 119432973 133973330 150608281 169408743
5360A69408743K0667454K2022858K2521583K1740864J9702258J6311872J2248615
$$ 169408743 190076197 212099055 234620638 256361502 276063760 292375632 304624247
5353C04624247P743571L598103J50171k381756l866408m378277m257130l594909
$$ 304624247 312367818 315965921 316116092 313734336 309867928 305489651 301232521 297637612
5345B97637612k962521k717137k849273l746715n629734p856810j0403856j3157713
$$ 297637612 294675091 291957954 289108681 285361966 279732232 271875422 261471566 248313853
5337B48313853j5551357j7375279j8265925j8420125j7499751j6404486j4970432
$$ 248313853 232762496 215387217 197121292 178701167 161201416 144796930 129826498
5330A29826498j3364024j1703304j0214896q941713p743581o741280n948016n150261
$$ 129826498 116462474 104759170 94544274 85602561 77858980 71117700 65169684 60019423
5322F0019423m620272m112183l572399l167866k735622k478695k166231j774103
$$ 60019423 55399151 51286968 47714569 44546703 41811081 39332386 37166155 35392052
5314C5392052j664894j342621j197746j208035j011593r31258q99351r86129q86983
$$ 35392052 33727158 32384537 31186791 29978756 28967163 28035905 27136554 26150425 25263442
5305B5263442r60771q82910p74554n99289o98747o94062n73064n06858o42676
$$ 25263442 24302671 23419761 22645207 22045918 21347171 20653109 20080045 19573187 18930511
5296A8930511n68449o49157m48713m61601n25876l77894l92283m41440k05398
$$ 18930511 18362062 17712905 17264192 16802591 16276715 15898821 15506538 15065098 14859700
5287A4859700k53475n31032m37530l80102k35147l25328k25552j48717k86729
$$ 14859700 14606225 14075193 13637663 13257561 13022414 12697086 12471534 12322817 12036088
5278A2036088k97755j52585k26324k40630j97862j72259j62284k79564k12286
$$ 12036088 11738333 11585748 11359424 11118794 10920932 10748673 10586389 10306825 10094539
5269A0094539o0727j34351j08755l00204k88708j69992p8784j18772j51300j48840
$$ 10094539 10033812 9899461 9790706 9490502 9201794 9031802 8953018 8834246 8682946 8534106
5259H534106j5844j39733o8689k70632j82046q5612j06664j29134j19063r0844
$$ 8534106 8518262 8378529 8309840 8039208 7857162 7771550 7664886 7535752 7416689 7325845
5249G325845p6167K281m6827k05107k3350K0026k20710N0496j45125L6836o3006
$$ 7325845 7249678 7251959 7205132 7000025 6976675 6996701 6775991 6826487 6681362 6718198 6655192
5238F655192P2377J5056o0452j13358R9183j53102O7699j53303N4647J04434r2910
$$ 6655192 6727569 6742625 6682173 6568815 6667998 6514896 6582595 6429292 6483939 6588373 6495463
5227F495463n3790o0097m386J1840N2022P9996q8696P4707j7603k4411P3086k5007
$$ 6495463 6441673 6381576 6377190 6389030 6441052 6521048 6432352 6507059 6489456 6465045 6538131 6513124
5215F513124J07029M97K22529Q3401m0503K00889K13016j29346o1799k33141j34125
$$ 6513124 6620153 6620650 6843179 6926580 6886077 7086966 7299982 7170636 7108837 6875696 6741571
5204F741571k78915j10719q2029j68995K4811J27956j55822L110q4203O0383L7982
$$ 6741571 6462656 6351937 6269908 6100913 6125724 6253680 6097858 6100968 6016765 6077148 6115130
5193F115130R176j0017P0837J50236J05815L3473J07688J85563M2484O8894J37050
$$ 6115130 6124306 6114289 6185126 6335362 6441177 6474650 6582338 6767901 6810385 6879279 7016329
5182G016329R4853L21961N26222J79788L04489J80629J3772N5522M6925K7191
$$ 7016329 7111182 7433143 7959365 8139153 8443642 8624271 8638043 8693565 8740490 8767681
5172H767681N5694q1863N3334J07239J32999R9027J30728L14699K36544J21013
$$ 8767681 8823375 8741512 8794846 8902085 9035084 9134111 9264839 9579538 9816082 9937095
5162I937095K84847K38253K19587L23398L21048J93452J57409J90857K90082J63264
$$ 9937095 10221942 10460195 10679782 11003180 11324228 11517680 11675089 11865946 12156028 12319292
5152A2319292J22126L19431L34021K58343L32605K55718K93398J90641K14423
$$ 12319292 12441418 12760849 13094870 13353213 13685818 13941536 14234934 14425575 14639998
5143A4639998L61061L27959J99474K61354M02389N22025M85770N02178O27252
$$ 14639998 15001059 15329018 15528492 15789846 16192235 16714260 17200030 17702208 18329460
5134A8329460N49146O51018P46719P74635P41505J054059J181109J210308J441059
$$ 18329460 18878606 19529624 20276343 21050978 21792483 22846542 24027651 25237959 26679018
5125B6679018J819502K021628K190726K368400K850207L302786L711710M175120
$$ 26679018 28498520 30520148 32710874 35079274 37929481 41232267 44943977 49119097
5117D9119097M834415N642523O302009P193649Q366083R299926J0716883J1691474
$$ 49119097 53953512 59596035 65898044 73091693 81457776 90757702 101474585 113166059
5109A13166059J2408656J2904984J2715089J2008645J0929549R493628Q234847
$$ 113166059 125574715 138479699 151194788 163203433 174132982 183626610 191861457
5102A91861457P254397O690638O495613O899914P638916Q210200Q934952R212588
$$ 191861457 199115854 205806492 212302105 219202019 226840935 235051135 243986087 253198675
5094B53198675Q907032P844740O079826L601950O86683k171462m859401p387919
$$ 253198675 262105707 269950447 276030273 279632223 280318906 278147444 273288043 265900124
5086B65900124q904540r867925r894843r730865r152856p926750p200393o963004
$$ 265900124 256995584 247127659 237232816 227501951 218349095 210422345 203221952 196258948
5078A96258948p050992p561905q382863r474929j0498650j1028618j1299636j1137958
$$ 196258948 189207956 181646051 173263188 163788259 153289609 142260991 130961355 119823397
5070A19823397j0767540j0009003r014692q129252p120601o290924n531146m944537
$$ 119823397 109055857 99046854 90032162 81902910 74782309 68491385 62960239 58015702
5062E8015702m187494l801320l297812k953385k625361k239810j985962j923188
$$ 58015702 53828208 50026888 46729076 43775691 41150330 38910520 36924558 35001370
5054C5001370j532165j393196j446180j129515j040178q62422q70304q08871p76001
$$ 35001370 33469205 32076009 30629829 29500314 28460136 27597714 26727410 25918539 25142538
5045B5142538p35531p60789p21049p90318o10487p89727n49683m18380n18830
$$ 25142538 24407007 23646218 22925169 22134851 21524364 20734637 20184954 19766574 19247744
5036A9247744n68023l10922m99658m48258l61498m23293m94088n01959l84468
$$ 19247744 18679721 18368799 17869141 17420883 17059385 16636092 16142004 15640045 15255577
5027A5255577m12546l96867l49804k86474l68949l09046l03931l90958l46149
$$ 15255577 14843031 14446164 14096360 13809886 13440937 13131891 12827960 12437002 12090853
5018A2090853k35834k98433l61137k74866k65136l46762j86589j40979l26620
$$ 12090853 11855019 11556586 11195449 10920583 10655447 10308685 10122096 9981117 9654497
5009I654497k11489j81752k57348l25828j91418j36408k63474k07190j85520j88256
$$ 9654497 9443008 9261256 9003908 8678080 8486662 8350254 8086780 7879590 7694070 7505814
4999G505814k56313j50281k12304j15878j80973j40339j44680j31774j63835j9846
$$ 7505814 7249501 7099220 6886916 6771038 6590065 6449726 6305046 6173272 6009437 5989591
4989E989591j79994j14483N739j91067j22103p8247j18736p2592j28051j66196
$$ 5989591 5809597 5695114 5700853 5509786 5387683 5309436 5190700 5118108 4990057 4823861
4979D823861j74856j36257n4462j23722j0285K4938j36046j163r0914r8591j50697
$$ 4823861 4649005 4512748 4458286 4334564 4324279 4349217 4213171 4212008 4121094 4022503 3871806
4968C871806j08619r3724j22197m831p744q0290p8582j11627p5297j63885l2611
$$ 3871806 3763187 3669463 3547266 3542435 3534691 3454401 3375819 3264192 3188895 3025010 2992399
4957B992399n4679j70568m1173j01559j40675m8473p0741q3582j56578j09991
$$ 2992399 2937720 2767152 2725979 2624420 2483745 2435272 2364531 2280949 2124371 2014380
4947B014380p347j21660j10682q8515k7871K6660p9741p4189l2136k9738m6961
$$ 2014380 2007033 1885373 1774691 1686176 1658305 1684965 1605224 1531035 1498899 1469161 1422200
4936A422200l0113p2583k3281O9349k3243M1348j6378n9752k7238q93j23447L8485
$$ 1422200 1392087 1319504 1296223 1365572 1342329 1383677 1367299 1307547 1280309 1279416 1155969 1194454
4924A194454n7663l2192R928n1975L6483l6088J9924N8127l4634j05707L6086
$$ 1194454 1136791 1104599 1114527 1062552 1099035 1062947 1082871 1140998 1106364 1000657 1036743
4913A036743l1649J8860l1081l4882k8006L9114n9121j28945r8776k1808j343
$$ 1036743 1005094 1023954 992873 957991 929985 969099 909978 781033 682257 660449 659106
4902F59106p7539J0829o2773n0901J1131J34671K588J1978n6282m5993p2980j35583
$$ 659106 581567 592396 529623 478722 489853 624524 627112 639090 582808 536815 463835 328252
4890C28252j51K0955n9873M4139o2457j26830m0377l742N0381m7692k0785L2297
$$ 328252 328101 349056 289183 333322 270865 144035 103658 99916 150297 102605 81820 114117
4878A14117j0018J2152k650n039J1741J52722P5254J1746l9101J28515j7516M0870
$$ 114117 104099 116251 113601 108562 120303 273025 348279 360025 320924 449439 431923 472793
4866D72793j02716N2067K120O6640m7066M7836P3901J10429k4782K4551J1461
$$ 472793 370077 422144 424264 490904 443838 491674 565575 676004 651222 675773 687234
4855F87234j30719Q3440L6176K2735Q269L7663N2159n7400p2044J43789n7967
$$ 687234 556515 639955 676131 698866 707135 744798 796957 739557 667513 811302 753335
4844G53335k6004J0789J02479j21136R883N8607N9462j9817o1851o3541Q3478
$$ 753335 727331 738120 840599 719463 729346 787953 847415 827598 765747 702206 785684
4833G85684k6729j4463n2001l5891J35411l894J20042J28237O7397J71002L4416
$$ 785684 758955 744492 692491 656600 792011 788117 908159 1036396 1103793 1274795 1309211
4822A309211J2246L8009K3527J11756m4231q989K40604J28070r6834p306J52004
$$ 1309211 1321457 1359466 1382993 1494749 1450518 1441529 1682133 1810203 1713369 1706063 1858067
4811A858067J20921L2498o0963P5443Q7487K8791J46707M7720l5069o4648l0342
$$ 1858067 1978988 2011486 1950523 2025966 2113453 2142244 2288951 2336671 2301602 2236954 2206612
4800B206612L690M4586L2979o6378k5422K3851r705m297j0646j6537m2923l9440
$$ 2206612 2210302 2254888 2287867 2221489 2196067 2219918 2210213 2205916 2195270 2178733 2135810 2096370
4788B096370l9394o8942M7540o4859j69883j49085j36214j5800j11804j55728
$$ 2096370 2056976 1988034 2035574 1970715 1800832 1651747 1515533 1499733 1387929 1232201
4778A232201P723L1528J03262j00861q9492l6499J0531l7219k1577L6933P7449
$$ 1232201 1239924 1271452 1374714 1273853 1184361 1147862 1158393 1121174 1099597 1136530 1213979
4767A213979K7654j29892Q741J30610J35816J03273R3167J07770M8342m9380R2755
$$ 1213979 1241633 1111741 1120482 1251092 1386908 1490181 1583348 1691118 1739460 1690080 1782835
4756A782835J42377r823m5071k3543l4785j01093m698n5245l0543j30806j25308
$$ 1782835 1925212 1915389 1870318 1846775 1811990 1710897 1706199 1650954 1620411 1489605 1364297
4745A364297j49573L0178M7011N1493j3825J9317q0050J42481O860M4586O8493
$$ 1364297 1214724 1244902 1291913 1343406 1329581 1348898 1268848 1411329 1418189 1462775 1531268
4734A531268Q7592J21937J4507J21997J41692N2566J64882J01681k9807P5887
$$ 1531268 1618860 1740797 1755304 1877301 2018993 2071559 2236441 2338122 2308315 2384202
4724B384202J03702N3810j06247n9455j07611p6417j34338q7833j80336o9378
$$ 2384202 2487904 2541714 2435467 2376012 2268401 2191984 2057646 1969813 1789477 1720099
4714A720099r9848M1900n55p9452k55479l3664J7834n3923m8827L7820r6635k8912
$$ 1720099 1620251 1662151 1661596 1582144 1326665 1293001 1310835 1256912 1208085 1245905 1149270 1120358
4702A120358j16569j0748k2263l6879o4199p6555m5013J12109k4943p1416k21444
$$ 1120358 1003789 993041 970778 933899 869700 793145 748132 860241 835298 763882 542438
4691E42438p1315L6586R822k9866j13573R7970j6203n417k2008m7327l3508l1274
$$ 542438 471123 507709 517531 487665 374092 472062 455859 450442 428434 381107 347599 316325
4679C16325m4207o340n0272N0980J6879K049K0593L0993J03704m3766j64894j87
$$ 316325 272118 265778 215506 266486 283365 285414 306007 337000 440704 396938 232044 231857
4667B31857J18815L2236O3518j11379k4830L0750J54244L3924q3260o5645L7169
$$ 231857 350672 382908 446426 335047 310217 340967 495211 529135 445875 380230 417399
4656D17399m3203J23736P3970j06757j66674K8036P1923l8538k8645N1461n7887
$$ 417399 374196 497932 571902 465145 298471 326507 398430 359892 331247 382708 324821
4645C24821j73408j0117R2460O1083Q446J01343j8234O1725p1860l7986m0102
$$ 324821 151413 141296 233756 294839 303285 404628 386394 448119 376259 338273 298171
4634B98171P1680m4352k3477K7885P0479j18684j1181j00471J9498K75q092m6717
$$ 298171 369851 325499 302022 329907 400386 281702 270521 170050 189548 189823 181731 135014
4622A35014J7475J07196N1305j35915J8453J9216j9442M0289M0754m8224l4454
$$ 135014 152489 259685 310990 175075 193528 212744 193302 233591 274345 226121 191667
4611A91667R1136J21114n1128M8826J1541k907m8608j00692p7895R7341j137L289
$$ 191667 282803 403917 352789 401615 413156 410249 361641 260949 183054 280395 279258 282547
4599B82547J56264Q5481j08113p9638L8925k1189o5688Q9982L1575r0806j20803
$$ 282547 438811 524292 416179 336541 375466 354277 288589 378571 410146 319340 198537
4588A98537n1495j26678O2570J33947P654L6958j84487j8143M7383j104J1567
$$ 198537 147042 20364 82934 216881 224535 261493 77006 58863 106246 105142 116709
4577A16709l4663m3042j4132p9650Q1920o307O393k4476l0155l4196Q4015l9747
$$ 116709 82046 39004 24872 -54778 27142 20835 27228 2752 -27403 -61599 22416 -17331
4565a7331l5412J842J02525N9640r368k7342J74p6533o4063M993O944K5901J07700
$$ -17331 -52743 -50901 51624 111264 101896 74554 74728 -1805 -65868 -60875 -53931 -28030 79670
4552G9670M0752p966o5045N7869O1530l2090n3575L9286n2351J14839j09065o2906
$$ 79670 120422 112456 47411 105280 166810 134720 81145 120431 68080 182919 73854 10948
4540A0948r477N5670k3494j8255l6138O4936j9k7836l8692j11238J20118J20569
$$ 10948 1471 57141 33647 15392 -20746 44190 44171 16335 -22357 -133595 -13477 107092
4528A07092n6499l9880L746o2138n1995Q7185l0306R0966M1422p7701L5382m4230
$$ 107092 50593 10713 14459 -47679 -99674 -12489 -42795 48171 89593 11892 47274 3044
4516C044J58p7813L2385J40098l5330K7359Q2733r0040J19180m6447m6353P7325
$$ 3044 3202 -74611 -42226 97872 62542 89901 172634 82594 201774 155327 108974 186299
4504A86299N8099k3479j04223k4095l358m0682Q6401l3254j4499M0971P3877j27238
$$ 186299 244398 220919 116696 92601 89243 48561 134962 101708 87209 128180 202057 74819
4492G4819k4219O4004N3436j7362N1452j49690O8606Q3561J4456r2329l2892N4688
$$ 74819 50600 114604 168040 150678 202130 52440 121046 204607 219063 126734 93842 148530
4480A48530J1295J878O7583q2274R8565R6328j34256j6605K2726r337n900M2929
$$ 148530 159825 161703 229286 147012 245577 341905 207649 191044 213770 204433 198533 241462
4468B41462l0711j9532J9519J0313O528J17742r925L0262n7244M4069O7358k1007
$$ 241462 210751 191219 210738 221051 227579 345321 335396 365658 308414 352483 419841 398834
4456C98834j7175l180j1047M7958k6161K1483n3013J4702O6814j08764M2936N0484
$$ 398834 381659 378479 367432 415390 389229 410712 357699 372401 439215 330451 373387 423871
4444D23871l456j1448J22173j7150j9394j19391k960p9308l1569O2824M1133L1351
$$ 423871 420415 408967 531140 513990 494596 375205 372245 292937 261368 324192 365325 396676
4432C96676J13651j8480q5914p5908j3060J08394m7622K444K1342J16419p4744
$$ 396676 510327 491847 405933 330025 316965 425359 377737 380181 401523 517942 443198
4421D43198p8443K2953J84876P0845J477k5091p9740M9656J14607O6928o8518
$$ 443198 364755 387708 572584 643429 644906 619815 540075 589731 704338 771266 702748
4410G02748L3245J193M5991o5331J959P5876k035K6973K6528J58860m0429j57482
$$ 702748 735993 737186 783177 717846 719805 795681 793646 820619 847147 1006007 965578 808096
4398H08096J929J3670O1177J6219R7931J10482l5087k3978o5003K9353L2682L5024
$$ 808096 810025 823695 884872 901091 999022 1109504 1074417 1050439 985436 1014789 1047471 1082495
4386A082495l7420J00317R8623J87715J63214j9968q8020J2508r8148k29099j32179
$$ 1082495 1045075 1145392 1244015 1431730 1594944 1574976 1486956 1499464 1401316 1172217 1040038
4375A040038m8418j13142P266n8460n2755o5050R6460q4231p3066J7155K3394
$$ 1040038 991620 878478 885744 827284 774529 709479 805939 721708 648642 665797 689191
4364F89191j63268j02069M9818k4514q2016R5638J29717J15553n2341n5749k2114
$$ 689191 525923 423854 473672 449158 367142 462780 592497 708050 655709 599960 577846
4353E77846n3554J4264O5309M778L8748N8992k0140l8062j16011J6487l7332p7856
$$ 577846 524292 538556 603865 608643 647391 706383 686243 648181 532170 548657 511325 433469
4341D33469k3549L5423M6831m6062j05081j65294J8375j2442N091L1668P510j49276
$$ 433469 409920 445343 492174 446112 341031 175737 194112 181670 186761 218429 225939 76663
4329G6663n9698L3508J146O3237j3822K3452p0847J05647m433j3849r6661j0343
$$ 76663 16965 50473 51619 114856 101034 124486 53639 159286 154853 141004 44343 34000
4317C4000N4227o5004r7888J23818M7526k1024O587J7963l7195o6513j7580K691
$$ 34000 88227 23223 -74665 49153 96679 75655 82242 100205 63010 -3503 -21083 -18392
4305a8392J6822R4223j7099n1695k2662J06916L2901P1921r143K5266j39896j8453
$$ -18392 -1570 92653 75554 23859 1197 108113 141014 212935 203792 229058 89162 70709
4293G0709m7133N5765K8982L1178j6935O1999j2198j47544o7993o027J7827Q2247
$$ 70709 23576 79341 108323 139501 122566 184565 172367 24823 -43170 -49197 -31370 50877
4281E0877J5529n3255j0619J14335O3925m1359m7005P569q4742k423P2223l3479
$$ 50877 66406 13151 2532 116867 180792 139433 92428 99997 15255 12832 85055 51576
4269E1576R9452r6849m440O8406k5451J7180r0037M877o772N2491O3934j0455
$$ 51576 151028 54179 49739 118145 92694 109874 19837 24714 17942 70433 134367 123912
4257A23912j23863M8857N7411l0115q7804j4662P9873j8210M435j1245J02268
$$ 123912 49 48906 106317 76202 -11602 -26264 53609 35399 39834 28589 130857
4246A30857n4493O389p943J7759L7350k717m5360m0906L2460Q9097J8073o1347
$$ 130857 76364 82753 74810 92569 129919 127202 81842 40936 73396 162493 180566 119219
4234A19219M597m1670q0781M9198N9158l1991N2083j12193l9049R217J33030J06148
$$ 119219 123816 82146 1365 50563 109721 77730 129813 17620 -21429 -12212 120818 226966
4222B26966j78531M4565m3538p346r9470L1325l5208J46034m1082J3451j08964
$$ 226966 48435 93000 49462 42116 -57354 -26029 -61237 84797 43715 57166 -51798
4211e1798K7808j177N4035K1535L1014j3605P998j1442N1777J3181L6813n3557
$$ -51798 -23990 -25167 28868 50403 81417 67812 75810 64368 116145 129326 166139 112582
4199A12582J0064l7151L5883M0404P1592O2044j6399j45009l6669k9681K8793
$$ 112582 122646 85495 121378 161782 233374 295418 279019 134010 97341 67660 96453
4188I6453O996l91M3392m4792N0223r2140n5141j59741O1032R1752N6003j44656
$$ 96453 103449 103058 146450 101658 151881 59741 4600 -155141 -94109 -2357 53646 -91010
4176i1010Q6158j3719J4780n891J8741k0424l7519K3491M5954n715j4994j10467
$$ -91010 -4852 -18571 -3791 -9682 9059 -11365 -48884 -25393 20561 14846 -148 -110615
4164a10615J3590J438l2222O6175Q9815J5555n1040K4518p229M4640p258k7585
$$ -110615 -97025 -95587 -127809 -61634 28181 43736 -7304 17214 9985 54625 47367 19782
4152A9782L05n0694k1930L5440m377J6790l2573j7924L1632k5249P0434j8247
$$ 19782 20087 -30607 -52537 -17097 -21474 -4684 -37257 -55181 -23549 -48798 21636 3389
4140C389Q8147K0854q580k1335L4852O5768J599K6494K7089m8136n7151l7602
$$ 3389 91536 112390 103810 82475 117327 183095 184694 211188 238277 190141 132990 95388
4128I5388n2989j9038j42494J7628K5485j9949K066J23335Q7610l8681r4697l3776
$$ 95388 42399 23361 -119133 -101505 -76020 -95969 -93903 29432 117042 78361 -16336 -50112
4116e0112m8677L7912R960O0458l3223o7403J4114M1644J0040m9222O0469O9140
$$ -50112 -98789 -60877 -50917 9541 -23682 -91085 -76971 -35327 -25287 -74509 -14040 55100
4104E5100N330m3886J2239k2734j3959J9756L826k7561O9381o6180j0311M8747
$$ 55100 60430 16544 28783 6049 -7910 11846 15672 -11889 57492 -8688 -18999 29748
4092B9748j0365j24801P6170l6583Q233l8749Q3093M9973r752K0339J15760j41811
$$ 29748 19383 -105418 -29248 -65831 -57598 -96347 -13254 36719 26967 47306 163066 21255
4080B1255p3660N434J4173N7925R147n0009n0718j7231P6863p4446J34565m696
$$ 21255 -52405 -46971 -32798 25127 34274 -15735 -66453 -83684 -6821 -81267 53298 48602
4068D8602j11954J6390R5157q2184m4490M7701M130m1123m5425K5602Q5518O8232
$$ 48602 -63352 -46962 48195 -33989 -78479 -30778 -26648 -67771 -113196 -87594 -2076 66156
4056F6156l4941l4898j41921O4132j0254J05329j09321k1635k2023M0636L0345
$$ 66156 31215 -3683 -145604 -81472 -91726 13603 -95718 -117353 -139376 -98740 -68395
4045f8395Q4974n6052k323L4672k031j50575m0279P610O4649O5134m5925L8434
$$ -68395 16579 -39473 -41796 -7124 -9155 -159730 -200009 -192399 -127750 -62616 -108541 -70107
4033g0107m5371L3843l979j59499J1911P1658P1072l996N4308n0498K6654M1222
$$ -70107 -115478 -81635 -85614 -245113 -233202 -161544 -90472 -94468 -40160 -90658 -64004 -22782
4021b2782K313j20657M3825m2339q5350j35954J53374l5016m7012L4014M4240
$$ -22782 -20469 -141126 -97301 -139640 -224990 -360944 -207570 -242586 -289598 -255584 -211344
4010b11344m7544k8388P8045N3686k304p776l9466J01487J66885o7572k5094j018
$$ -211344 -258888 -287276 -209231 -155545 -157849 -165625 -205091 -103604 63281 -4291 -29385 -30403
3998c0403L1732j49171k4492n8986J5053Q3579L2571o5588n2279M0954P0301m9741
$$ -30403 1329 -147842 -172334 -231320 -216267 -132688 -100117 -165705 -217984 -177030 -106729 -156470
3986a56470m5345K8400Q6630n8357j08908O103P2442J02669J1783J1542J0432
$$ -156470 -201815 -173415 -86785 -145142 -254050 -247947 -175505 -72836 -61053 -49511 -39079
3975c9079j09571j6609K6020M3777L9981N7911m0521j09567o6301J51041j17314
$$ -39079 -148650 -165259 -139239 -95462 -55481 2430 -38091 -147658 -213959 -62918 -180232
3964a80232r0570J14928J1693j4424N8731L4614q4038J17799m820j8126K962j26540
$$ -180232 -270802 -155874 -144181 -158605 -99874 -65260 -149298 -31499 -36319 -54445 -51483 -178023
3952a78023j9838J5410j898J44928j9681k0627O9356k4086k1118M123O2952L6401
$$ -178023 -197861 -182451 -184349 -39421 -59102 -79729 -10373 -34459 -55577 -51454 11498 47899
3940D7899o3204r5275Q2679Q3512N0774m8622m256M48P5518n9120k0872o8782
$$ 47899 -15305 -110580 -27901 55611 106385 57763 53507 53955 129473 70353 49481 -19301
3928a9301J38526R2905j81029k8332R3524q4542l698n8184N1982J7682N9588J02856
$$ -19301 119225 212130 31101 2769 96293 11751 8053 -50131 1851 19533 79121 181977
3916A81977n8701p6723m0249p807R1901l1508O668O9342O9815j35856K9915J03050
$$ 181977 123276 46553 6304 -1503 90398 58890 65558 134900 204715 68859 98774 201824
3904B01824j22722J1704n199J0018O9173j0646Q9911l0804k30246J39890j0641
$$ 201824 79102 90806 85607 95625 164798 154152 244063 213259 -16987 122903 112262
3893A12262M9153j04577j40482j8928J41147j05266J14410J8134o1078l7801J30720
$$ 112262 161415 56838 -83644 -102572 38575 -66691 47719 65853 4775 -33026 97694
3882I7694K4937q5704J8822K3759L7113m9593J75824l1427K2836m489q438L513
$$ 97694 122631 36927 55749 79508 116621 67028 242852 211425 234261 229772 221334 224847
3870B24847k6040j42726N3640k9946r075O211o4499m4786l8807n8J09168k5799
$$ 224847 198807 56081 109721 79775 70700 76911 12412 -32374 -71181 -71239 37929 12130
3858A2130o7427J03717j11965M4905L7220j7282n4602j8607N1209l6074J2922
$$ 12130 -55297 48420 -63545 -18640 18580 1298 -53304 -71911 -20702 -56776 -43854
3847d3854K07913Q1034O0588m939L0321J4768j5034q6951o9130q0226r5433l0234
$$ -43854 164059 245093 305681 300742 331063 345831 330797 243846 174716 94490 -943 -31177
3835c1177J9399j29136p4014M186J3197j28506K9797J99419O0933j08469J10742
$$ -31177 -11778 -140914 -214928 -210742 -197545 -326051 -296254 -96835 -35902 -144371 -33629
3824c3629K1958k0199l5145r8872k0658O3301N3394o4298J9953L0417l6166j20504
$$ -33629 -11671 -31870 -67015 -165887 -186545 -123244 -69850 -134148 -114195 -83778 -119944 -240448
3812b40448N7330M3104j16359n268M3310j17423J21208O0426n7941n7023O3192
$$ -240448 -183118 -140014 -256373 -261641 -218331 -335754 -214546 -154120 -212061 -269084 -205892
3801b05892O2672n7616l4708K2325q5500P474k0314J0178R6872N7339q4845k024
$$ -205892 -143220 -200836 -235544 -213219 -298719 -291245 -311559 -301381 -204509 -147170 -232015 -234039
3789b34039k8417j7258j1656k1797K3919J41745o440J3500j3103r7569k6258j09638
$$ -234039 -262456 -279714 -291370 -313167 -289248 -147503 -153943 -140443 -153546 -251115 -277373 -387011
3777c87011O2849J52219N7291n0501n5963m2818J59060k4660k7345l1588J9525
$$ -387011 -324162 -171943 -114652 -165153 -221116 -263934 -104874 -129534 -156879 -188467 -168942
3766a68942J7378M0994J2807k434j7627j713L2729r0005L0621P6294p2341l9098
$$ -168942 -151564 -110570 -97763 -100197 -117824 -119537 -86808 -176813 -146192 -69898 -142239 -181337
3754a81337R6685j18958Q6113j1935m1030l0554O0209M5920O9221k397l7190j01117
$$ -181337 -84652 -203610 -117497 -129432 -170462 -201016 -140807 -94887 -25666 -28063 -65253 -166370
3742a66370M4038R6668O3424O2938l3994j03599N6342M5627k7643K1395j3900
$$ -166370 -122332 -25664 37760 100698 66704 -36895 19447 65074 37431 58826 44926
3731D4926j04357J0057l4131k6299P738l5720J55837L9101o2375k4l14l0558K3108
$$ 44926 -59431 -49374 -83505 -109804 -102066 -137786 18051 57152 -5223 -5247 -5561 -36119 -13011
3718a3011J03853J30352r1936n858j2954O1746p1907J32937j5809k9573l0558
$$ -13011 90842 221194 129258 123400 110446 172192 100285 233222 217413 187840 157282
3707A57282L0345m9817k4065n661M3933N0065k1502n8601j16631O4762q899l742
$$ 157282 187627 137810 113745 108084 152017 202082 180580 121979 5348 70110 61211 57469
3695E7469J34208M3438j14986P0098M1388R781O0022j5564P085r9270r853N0445
$$ 57469 191677 235115 120129 190227 231615 241396 301418 285854 292939 193669 183816 234261
3683B34261J02557j481j6817k1167N6504p9405j641j40846K8760N1332M8637J36161
$$ 234261 336818 335337 318520 297353 353857 274452 272811 131965 160725 212057 260694 396855
3671C96855j44202J8256j4437l9227j5328J06415P2811K5225l8541J10732m5827
$$ 396855 252653 270909 256472 217245 201917 308332 381143 406368 367827 478559 432732
3660D32732J14887m7949r3488K9254p683l2963m9467R9346r5152r3200M0687p2932
$$ 432732 547619 499670 406182 435436 427753 394790 345323 444669 349517 256317 297004 224072
3648B24072L5143L299l3014J10810o0833m0927J41995q9933j7493M5219P9295
$$ 224072 259215 262514 229500 340310 279477 238550 380545 290612 273119 318338 397633
3637C97633P2746J2085Q8316O6167N8458k2516K7246k6477j14301m7496n3900
$$ 397633 470379 482464 570780 636947 695405 672889 700135 673658 559357 511861 457961
3626D57961o7106m7088k4951O2391q5370L4527J64643n5380J19524J76570L1182
$$ 457961 390855 343767 318816 381207 295837 330364 495007 439627 559151 735721 766903
3615G66903K49696M2913q586J32698j11K18042Q1423M4472J5831J6563k3178P8402
$$ 766903 1016599 1059512 1050926 1183624 1183513 1401555 1482978 1527450 1543281 1559844 1536666 1615068
3603A615068J1751J48058m6227K2095J08111K41189J73577K80301K97984N00278
$$ 1615068 1626819 1774877 1728650 1750745 1858856 2100045 2273622 2553923 2851907 3352185
3593C352185O72190N66813O93419O01289P87455P13320Q03939R69103J483603
$$ 3352185 4024375 4591188 5284607 5885896 6673351 7386671 8190610 9159713 10643316
3584A0643316J701861K276612L119747M232344N276206O445573O078545M384155
$$ 10643316 12345177 14621789 17741536 21973880 27250086 33695659 39774204 44158359
3576D4158359J725252m28011l060854n861194o158168n274061m325915l493577
$$ 44158359 45883611 45455600 42394746 36533552 30375384 25101323 20775408 17281831
3568A7281831l004784k122644j401886j116638r51226p98546p44643p28029o08720
$$ 17281831 14277047 12154403 10752517 9635879 8684653 7886107 7141464 6413435 5804715
3559E804715o90692o75651o80877n27552k78808j90696j48596j699j61147Q3332
$$ 5804715 5114023 4438372 3757495 3229943 2951135 2760439 2611843 2610144 2448997 2532329
3549B532329j23465l3476o8094q1171j3217q9347n7313m1996j24491n0217o0938
$$ 2532329 2408864 2375388 2307294 2226123 2212906 2123559 2066246 2024250 1899759 1849542 1788604
3538A788604j30126j13271j00541k98326j07774L011j47816L9382j8222l1866
$$ 1788604 1658478 1545207 1444666 1146340 1038566 1041577 893761 933143 914921 883055
3528H83055J24538j9364q6179M2495J6374l4660J7821J77926r4222p5547O5175
$$ 883055 1007593 988229 902050 944545 960919 926259 944080 1122006 1027784 952237 1017412
3517A017412r4560j14600M5284p2496j00468q5222k9750j15513P0882N1588j17810
$$ 1017412 922852 808252 853536 781040 680572 595350 565600 450087 520969 572557 454747
3506D54747o1548l2521N1566P0586m179M0882r6862m7323N3971O1853Q4466K8872
$$ 454747 393199 360678 412244 482830 478651 519533 422671 375348 429319 491172 575638 604510
3494F04510N2629m0092J6929l3061j22068p7327J027K0315Q5200p4210r4800p5212
$$ 604510 657139 617047 633976 600915 478847 401520 402547 422862 508062 433852 339052 263840
3482B63840m6582j0444j8930r264K9739P0070o523j33872M9692M7840n1550J88067
$$ 263840 217258 206814 187884 178620 208359 278429 271906 138034 187726 235566 184016 372083
3470C72083K9678o161k3924n2814m9456m8769K9601J0488L4923K1854l0420K1395
$$ 372083 401761 395600 371676 318862 269406 220637 250238 260726 295649 317503 287083 308478
3458C08478m8184k3102Q0658o3652l3616m2990l4453k4418j497l1838M6889L9613
$$ 308478 260294 237192 317850 254198 220582 177592 143139 118721 117224 85386 132275 171888
3446A71888P2262j04861j25319K2197J3579P4050o9896J5475k0842p301p677P9111
$$ 171888 244150 139289 13970 36167 49746 123796 53900 69375 48533 41232 33555 112666
3434A12666Q964J8262p1371j12145j47612P6190N1931j3720o2237O8071P9950
$$ 112666 121630 139892 68521 -43624 -191236 -115046 -63115 -76835 -139072 -71001 8949
3423H949Q4816j17294R023m2900m4863m0231J3649J1772J23581J46243o2959j07364
$$ 8949 93765 -23529 -14506 -57406 -102269 -142500 -128851 -117079 6502 152745 89786 -17578
3411a7578O714R4324m0614N0184j30056Q5282J5879o1165j31300P6637O6837O0381
$$ -17578 -10864 83460 42846 93030 -37026 48256 64135 2970 -128330 -51693 15144 75525
3399G5525K1956M5783j86303M3716l7919J2146N3424J11852K4095l333r4396N522
$$ 75525 97481 143264 -43039 677 -37242 -25096 28328 140180 164275 160942 66546 72068
3387G2068q2865O0543r4074n2127N9738j830J8801P0123o873J5777q6753n4607
$$ 72068 -10797 49746 -44328 -96455 -36717 -38547 -19746 50377 43504 59281 -27472 -82079
3375h2079K025j02777O8029k286k5239Q3749J01356r5845L334k8485R899n1406
$$ -82079 -80054 -182831 -114802 -117088 -142327 -58578 42778 -53067 -49733 -78218 -68319 -119725
3363a19725M9940J0458L6577J7444N0559k3463o409r875l5395P7010M5324o2150
$$ -119725 -69785 -59327 -22750 -5306 45253 21790 15381 5506 -29889 47121 92445 30295
3351C0295Q2654r3015k01898O9795P3564j09260J00787Q4099K8535m5702p696
$$ 30295 112949 19934 -181964 -112169 -38605 -147865 -47078 37021 65556 19854 12158
3340A2158L2402q7172R3098P9883r9395J219l9906R9479j6609l0484O0055p8334
$$ 12158 44560 -42612 50486 130369 30974 32193 -7713 91766 75157 44673 104728 26394
3328B6394K1311L939p9647j236L3316m7131q8081J46171J0012l94O2770M845q1092
$$ 26394 47705 51644 -28003 -29239 4077 -43054 -131135 15036 25048 24654 87424 92269 11177
3315A1177n1056P6244J3877o581R8229P0465J11080J30531r3725N4836p4389j42640
$$ 11177 -39879 36365 50242 43661 141890 212355 323435 453966 360241 415077 340688 198048
3303A98048O8721j14607j10451n2620J17131Q0466j20293l7180O086j1178o4138
$$ 198048 266769 152162 41711 -10909 106222 186688 66395 29215 35301 24123 -40015
3292d0015j6295J00621M2017l1937n519L0326j09507j03669J3195J23572L292
$$ -40015 -56310 44311 86328 54391 48872 79198 -30309 -133978 -120783 2789 6081
3281F081n4025m8906Q9393r2337Q2632J04906j22801j183N1581K8228k5899J9484
$$ 6081 -47944 -96850 -7457 -99794 -17162 87744 -35057 -36240 15341 43569 17670 37154
3269C7154o3622p0283p2593J28467P0595K1351r5405N733j6875K7316q1025M0011
$$ 37154 -26468 -96751 -169344 -40877 29718 51069 -44336 -38603 -55478 -28162 -109187 -69176
3257f9176K4141J2413k319O9773r7423l6927R1082L288p620j6246L4481q9744
$$ -69176 -45035 -32622 -34941 34832 -62591 -99518 -8436 -5148 -12768 -29014 5467 -84277
3245h4277r8158M4108M1774o4408M3806O923N8974k6226m4857J08684o0255p7346
$$ -84277 -182435 -138327 -96553 -160961 -117155 -110232 -51258 -77484 -122341 -13657 -73912 -151258
3233a51258J0060M8838P9552n1203O289l8659j61884Q3253j7566Q168l8514l8032
$$ -151258 -141198 -92360 -12808 -64011 -57722 -96381 -258265 -175012 -192578 -184410 -222924 -260956
3221b60956L9295J3535Q3239j9741L0128J6966q256R5863j0791o6275k4482O0490
$$ -260956 -221661 -208126 -124887 -144628 -114500 -97534 -105790 -9927 -20718 -86993 -111475 -50985
3209e0985P3046p3444K0194j04870j11882N2408O5587O5727J38939n5948p2238
$$ -50985 22061 -51383 -31189 -136059 -247941 -195533 -129946 -64219 74720 18772 -53466
3198e3466j09709j15456J01066J64163R9686r3542m3165k5912k7171j1715J06253
$$ -53466 -163175 -278631 -177565 -13402 86284 -7258 -50423 -76335 -103506 -115221 -8968
3187h968L3339j20469n5370Q4449L1664k6206o3695o6651O6634O3232L9932k8899
$$ -8968 24371 -96098 -151468 -67019 -35355 -61561 -125256 -191907 -125273 -62041 -22109 -51008
3175e1008l1509O6455M9394o2135k5316o9526l2132J9314m0457K701R8811M6593
$$ -51008 -82517 -16062 33332 -28803 -54119 -123645 -155777 -136463 -176920 -174219 -75408 -28815
3163b8815k965m3931r3332J9267K1796j9534K3326J2576O1108k7157J16502P1056
$$ -28815 -31780 -75711 -169043 -149776 -127980 -147514 -124188 -111612 -50504 -77661 38841 109897
3151A09897q5857o2085r66M2647N6834p8927K8000O0609O309r3363n9501N0591
$$ 109897 24040 -38045 -39011 3636 60470 -18457 9543 70152 76461 -16902 -76403 -25812
3139b5812L6824j2048m0313n3667l8910K9145R2449l2057L2124J05424J1436l1511
$$ -25812 11012 -1036 -41349 -95016 -133926 -104781 -12332 -44389 -12265 93159 104595 73084
3127G3084j2008K125l9803q5266M0384Q3298p5449J01236P4252L4247j53757j20055
$$ 73084 61076 63201 23398 -61868 -21484 61814 -13635 87601 161853 196100 42343 -77712
3115g7712p1821N1641o310M029K7972J14r7003J18228M5649R0255N701n731j16406
$$ -77712 -149533 -97892 -104202 -100173 -72201 -72087 -169090 -50862 -5213 85042 90743 85012 -31394
3102c1394r9709L0230J53795o832r264R426p4076Q7712q8809l8755q4500n0545
$$ -31394 -131103 -100873 52922 46090 36826 46252 -27824 59888 -28921 -67676 -152176 -202721
3090b02721r084J57436O1166Q3329J8021k2986j026J3809k6050L5177r0079L2898
$$ -202721 -211805 -54369 6797 90126 108147 85161 84135 97944 71894 107071 16992 49890
3078D9890j9995m1857m462p3181n0190m8986L3083J45234n2323j2308n5604k5003
$$ 49890 29895 -11962 -16424 -89605 -139795 -188781 -155698 -10464 -62787 -75095 -130699 -155702
3066a55702p860J12440J5462o1366l4977M6659L8706l9984m06J23582J3073q8679
$$ -155702 -163562 -51122 -35660 -97026 -132003 -85344 -46638 -86622 -87028 36554 49627 -39052
3054c9052l4740l1670J07155o7978K9979J6879o934o3706L3603o1357J59039k7301
$$ -39052 -73792 -105462 1693 -66285 -36306 -19427 -26361 -90067 -56464 -117821 41218 13917
3042A3917P6885l1186j32186j04120J03249R3261o6326P8449J8667k7862q4444
$$ 13917 90802 59616 -72570 -176690 -73441 19820 -46506 31943 50610 22748 -61696
3031f1696q596j11414k5563l2921J29441O7693O025q834j5513m3784O4177n9059
$$ -61696 -70292 -181706 -207269 -240190 -110749 -43056 -37031 -45865 -61378 -105162 -40985 -100044
3019a00044M5310k2043l2939L9950j29205N5783L0058o355L5957l401m3852K0370
$$ -100044 -54734 -76777 -109716 -69766 -198971 -143188 -113130 -119485 -83528 -86929 -130781 -110411
3007a10411L8033J6393j18417K4113J02003J9671n1377k8923k2095R713N8242
$$ -110411 -72378 -55985 -174402 -150289 -48286 -28615 -79992 -108915 -131010 -121297 -63055
2996f3055K516q304j2539R1883J4357M2054l3936j1823J5677M7061n2863j19651
$$ -63055 -60539 -68843 -81382 10501 24858 66912 32976 21153 36830 83891 31028 -88623
2984h8623j0222n1446l3598R8105J5771j6367L3824k2910l258k0700j0893l4428
$$ -88623 -98845 -150291 -183889 -85784 -70013 -86380 -52556 -75466 -78724 -99424 -110317 -144745
2972a44745j0371P5530N9967l5737j3668J06784j6675p3914J7438k1020q3583
$$ -144745 -155116 -79586 -19619 -55356 -69024 37760 21085 -52829 -35391 -56411 -139994
2961a39994o8450k245m5146L6585R7483J64467n4907p6286n9219M0664L0986N3720
$$ -139994 -208444 -210689 -255835 -219250 -121767 42700 -12207 -88493 -147712 -107048 -76062 -22342
2949b2342L8994l773O798n501k587l3667N719R5165r3742O522p5387j08661l2474
$$ -22342 16652 12879 19677 14176 11589 -22078 -16359 78806 -14936 -8414 -83801 -192462 -224936
2936b24936O1943Q2523L712N8501M9664n0838P7929r54J8889j62289p8931J82124
$$ -224936 -162993 -80470 -76758 -18257 31407 -19431 58498 57544 76433 -85856 -164787 17337
2924A7337j0132o5399J5795K9858k5982j09790J09320O7233k23607K2233P2768
$$ 17337 7205 -58194 -42399 -12541 -38523 -148313 -38993 28240 -195367 -173134 -100366
2913a00366R8863p4643m8324N2414j9953p8924J03003L7486p011q1584P0472n7329
$$ -100366 -1503 -76146 -124470 -72056 -92009 -170933 -67930 -30444 -37455 -119039 -48567 -105896
2901a05896j398Q5679J02901q8977o3471p0475J02840J8306l7762n2790O1022
$$ -105896 -107294 -21615 81286 -7691 -71162 -141637 -38797 -20491 -58253 -111043 -50021
2890e0021N4397M8020J51189q5367j39579L6968j7529j59673J3102l519J05199
$$ -50021 4376 52396 203585 118218 -21361 15607 -1922 -161595 -148493 -152012 -46813
2879d6813j02174Q4850K3032j2978M3474p3352M0784j8371j25381J49163L8771
$$ -46813 -148987 -64137 -41105 -54083 -10609 -83961 -43177 -61548 -186929 -37766 1005
2868A005o8245l457j2315l5837k7504M5028L5529j88875P0278J94739J35401n0942
$$ 1005 -67240 -70697 -83012 -118849 -146353 -101325 -65796 -254671 -184393 10346 145747 94805
2856I4805j14286K4827l2216L3560L223j4p8968l1679l6808K4486k7905O1770
$$ 94805 -19481 5346 -26870 6690 9913 9899 -69069 -100748 -137556 -113070 -140975 -79205
2844g9205p7921J22362p4045Q0064Q3008o6798j47269J11909M7534L2523j2102
$$ -79205 -157126 -34764 -108809 -28745 54263 -12535 -159804 -47895 -361 32162 20060
2833B0060l6967k8731p7213P1112K4419M9368p1285n5850O057J20136n0057K410
$$ 20060 -16907 -45638 -122851 -51739 -27320 22048 -49237 -105087 -99030 21106 -28951 -26541
2821b6541p1241r72o0294P7716n2157J7773J31047N9937m7291m3855k036M9399
$$ -26541 -97782 -98754 -159048 -81332 -133489 -115716 15331 75268 27977 -15878 -17914 31485
2809C1485l0348j21637Q866M841N232q7803Q711M9184O0698K0419l9665L6994
$$ 31485 1137 -120500 -111634 -106793 -101561 -189364 -180653 -131469 -70771 -50352 -90017 -53023
2797e3023J34984L92p4847K9020o0298p3565J11825K3428o8768J3221j4632K9876
$$ -53023 81961 82353 7506 36526 -23772 -97337 14488 37916 -30852 -17631 -32263 -2387
2785b387j7367k2907k5486O3497J1036j249N9509j26648m1915N6288J4624n2295
$$ -2387 -19754 -42661 -68147 -4650 6386 5137 64646 -62002 -103917 -47629 -33005 -85300
2773h5300o7200J45145n7437r8419n256P773N7442O9562j10335m3838k5662J61738
$$ -85300 -152500 -7355 -64792 -163211 -168467 -160694 -103252 -33690 -144025 -187863 -213525 -51787
2761e1787K536q6713m6314J29648J16407o1852k7281O3240M9073k592o4018n9026
$$ -51787 -49251 -135964 -182278 -52630 63777 1925 -25356 37884 86957 84365 20347 -38679
2749c8679Q8876J8559K1434J428j21329p4299Q5231J3999m1350L9638J4320j29082
$$ -38679 50197 68756 90190 91618 -29711 -104010 -18779 -4780 -46130 -6492 7828 -121254
2737a21254K2060M7166m6902M8629Q9217q5354j9041O2993j00355n4405J75068
$$ -121254 -99194 -52028 -98930 -50301 38916 -46438 -65479 -2486 -102841 -157246 17822
2726A7822J436J5893l6524p3999L4930r1253J7675O7429N3823o1682j23443J6214
$$ 17822 19258 35151 -1373 -75372 -40442 -131695 -114020 -46591 7232 -54450 -177893 -161679
2714a61679Q0978O3790J48796n1081j23182n384m1139L1723m8637N3778k9410
$$ -161679 -80701 -16911 131885 80804 -42378 -47762 -88901 -57178 -105815 -52037 -81447
2703h1447K5600l195j2674n1679j30880L6294L3704L9030J70270j59817m6779
$$ -81447 -55847 -59042 -71716 -123395 -254275 -217981 -184277 -145247 25023 -134794 -181573
2692a81573R8885N0783R7015o0170k5890j4735k6835P0454K7989K8472j4146j05597
$$ -181573 -82688 -31905 65110 4940 -20950 -35685 -62520 7934 35923 64395 50249 -55348
2680e5348K8473K6062K534l0999j5983p3177j54862O4163R4929j1640M7717m5090
$$ -55348 -26875 -813 1721 -29278 -45261 -118438 -273300 -209137 -114208 -125848 -78131 -123221
2668a23221N635J29262k4144K954j12111L2423K2368M220P7307m6467O3668l3766
$$ -123221 -117586 11676 -12468 -9514 -121625 -89202 -66834 -62614 14693 -31774 31894 -1872
2656a872o4843L6406p8824J7274J14007j9080M2822q7191J0306M6667j78933j0670
$$ -1872 -66715 -30309 -109133 -91859 22148 3068 45890 -41301 -30995 15672 -163261 -173931
2644a73931J52405J28419j46637L2372K0950q2669p2698K4498N8411Q0713j25574
$$ -173931 -21526 106893 -39744 -7372 13578 -69091 -141789 -117291 -58880 21833 -103741
2633a03741Q4647k934K0035l7981q7096Q2196p8276l4098J02433P374o0799P5294
$$ -103741 -19094 -22028 -1993 -39974 -127070 -44874 -123150 -157248 -54815 -47441 -108240 -32946
2621c2946N2593m4092j65615P5914J8243j05474M291K13083J360j05909l4212
$$ -32946 19647 -24445 -190060 -114146 -95903 -201377 -197086 15997 17357 -88552 -122764
2610a22764L3528m4124P2903j797O6433k0861J5302j13275j09637O6179J88826
$$ -122764 -89236 -133360 -60457 -62254 4179 -16682 -1380 -114655 -224292 -158113 30713
2599C0713n1511m9866O3133J6630n7612n5405m568R2960p887Q7420l0016r3809
$$ 30713 -20798 -70664 -7531 9099 -48513 -103918 -108486 -15526 -23413 64007 33991 -59818
2587e9818N3270j7661N1822J0531m8791M3009n0835r8360O8711M806j17066K3465
$$ -59818 -6548 -24209 27613 38144 -10647 32362 -18473 -116833 -48122 -43316 -160382 -136917
2575a36917Q8233n240m7437P7991n16o708K0117M6263q7410o843Q97j46592N3496
$$ -136917 -48684 -53924 -101361 -23370 -23886 -30594 -10477 35786 -51624 -58467 -57570 -204162 -150666
2562a50666J30287K7422J7338l7056p1879j8165m6656J8679K225O118J0181P4196
$$ -150666 -20379 7043 24381 -12675 -84554 -102719 -149375 -130696 -128471 -122353 -112172 -37976
2550c7976k9031j5104k856M3215m7275O9643n7839K3031j1675L4698L4815J09833
$$ -37976 -67007 -82111 -84967 -41752 -89027 -19384 -77223 -54192 -65867 -31169 3646 113479
2538A13479p2645K2559j5686m5269m1580p508R0496M2530j62758n8589J09876
$$ 113479 40834 63393 47707 2438 -39142 -46650 43846 86376 -76382 -134971 -25095
2527b5095R5071j10275q344Q1463r8053p3090J07859N6305l1104J36473m0144
$$ -25095 69976 -40299 -48643 32820 -65233 -138323 -30464 25841 -5263 131210 91066
2516I1066m3411R505q6187o8472o5623L7944O3702K3943L6473j17279N148p018
$$ 91066 47655 57160 -29027 -97499 -163122 -125178 -61476 -37533 -1060 -118339 -113191 -120209
2504a20209R973j6930J20006M430m4381L4650O2857N5827L9379l0239Q3968r6326
$$ -120209 -110236 -127166 -7160 -2730 -47111 -12461 50396 106223 145602 115363 199331 103005
2492A03005j23116n6442k0338O568K1458l6491R2374n8799O4832J927k5189n206
$$ 103005 -20111 -76553 -96891 -90323 -68865 -105356 -12982 -71781 -6949 -5022 -30211 -35417
2480c5417o1048O3190J02594k6264q0144R400p5975K7403J14182L5225j9144j5073
$$ -35417 -96465 -33275 69319 43055 -37089 -27689 -103664 -76261 37921 73146 54002 38929
2468C8929j4961K8628r6242M2701n5700l9359j27523M1064j6994J12719J10096
$$ 38929 23968 52596 -43646 -945 -56645 -96004 -223527 -182463 -199457 -86738 23358
2457B3358p7612l3339N9191P844o1528l5677O8511j3257M1434J45923j3010j15392
$$ 23358 -54254 -87593 -28402 -20558 -82086 -117763 -49252 -62509 -21075 124848 111838 -3554
2445c554K3439p523j6937p498l4900o4026L5226J46037l6868q2959L1428Q5218
$$ -3554 19885 12362 -4575 -12073 -46973 -110999 -75773 70264 33396 -49563 -18135 67083
2433F7083L5340j4154p9982j4219p7568o7804J10043j4542N0724Q0697n7505l1115
$$ 67083 102423 88269 8287 -5932 -83500 -151304 -41261 -55803 -5079 75618 18113 -13002
2421a3002m6411L5893n6K1497m9572n346j8857n7914K8206j3310l1117J6144L0158
$$ -13002 -59413 -23520 -23576 -2079 -51651 -56997 -75854 -133768 -105562 -118872 -149989 -133845 -103687
2408a03687Q6968p2350n7641R5450K5100K2346j27733j149J6029q8077J09208
$$ -103687 -16719 -89069 -146710 -51260 -26160 -3814 -131547 -132696 -116667 -204744 -95536
2397i5536Q2594K0557k0526k9551m9814l2337J03712Q2751j29955L1699q9133
$$ -95536 -12942 7615 -12911 -42462 -92276 -124613 -20901 61850 -68105 -36406 -125539
2386a25539J640K6668J11171N29P205n369m0244l6233Q1839k361j01367p210k6662
$$ -125539 -123899 -97231 13940 14469 21674 16305 -23939 -60172 21667 19306 -82061 -89271 -115933
2373a15933P5270n1008j02741J20706Q3219R3247j18756o2197J00179j26373M0661
$$ -115933 -40663 -91671 -194412 -73706 9513 102760 -15996 -78193 21986 -104387 -63726
2362f3726P302k4659m3346J0374l537M8154m3942Q6448j7569j2867q5201m7053
$$ -63726 -56424 -81083 -124429 -114055 -117592 -69438 -113380 -26932 -44501 -57368 -142569 -189622
2350a89622Q8706Q0332R5234o2413L8420k9290p2958O3192j48265o8296J41933
$$ -189622 -100916 -20584 74650 12237 50657 21367 -51591 11601 -136664 -204960 -63027
2339f3027J3977N896m9147M2684N3647J0457n3276l7649Q1620R7287o7694m3269
$$ -63027 -49050 -43154 -92301 -49617 4030 14487 -38789 -76438 5182 102469 34775 -8494
2327h494o2101q6548Q4343M9031j0613k5145R0148O5726n5574k1818m1918j38011
$$ -8494 -70595 -157143 -72800 -23769 -34382 -59527 30621 96347 40773 18955 -22963 -160974
2315a60974M1526J12436j4134j20505L7419N0005J0742l199L2399l897K4478j93434
$$ -160974 -119448 -7012 -21146 -141651 -104232 -54227 -43485 -46684 -14285 -18182 6296 -187138
2303a87138k4211Q9284N4526M2296j3582N409k6870n0540N7041j01685K6858M4072
$$ -187138 -211349 -122065 -67539 -25243 -38825 -33416 -60286 -110826 -53785 -155470 -128612 -84540
2291h4540O5250l548k8666m7710J53949L3306R224M780j04111r4633n7234J56585
$$ -84540 -19290 -22838 -51504 -99214 54735 88041 97265 102045 -2066 -96699 -153933 2652
2279B652L0494J9811r9915J44320J8987l0445q7703n4751k9597K5503M1501R0347
$$ 2652 33146 52957 -46958 97362 116349 85904 -1799 -56550 -86147 -60644 -19143 71204
2267G1204l3243m8576o0207r5977K2859J26040K2301o2006n3736L401J49923L1595
$$ 71204 37961 -10615 -70822 -166799 -143940 -17900 4401 -57605 -111341 -107940 41983 73578
2255G3578J1847j8218k8630J9221o425N2780j33537r2954O697o434K1379J21648
$$ 73578 85425 67207 38577 57798 51373 104153 -29384 -122338 -115641 -122075 -100696 20952
2243B0952n9629L2854m3148L6301j7726K8692j2126J2789p9403Q5648M5033J2588
$$ 20952 -38677 -5823 -48971 -12670 -30396 -1704 -13830 -1041 -80444 5204 50237 62825
2231F2825m6289J6246j4878N3936O7550q5608q9653o798N315o4241N169R0652
$$ 62825 16536 32782 17904 71840 139390 53782 -35871 -42669 -37354 -101595 -96426 -5774
2219e774K8506J7080M9685q0429P4809r0884o5954m5852K5304L2375Q110J9379
$$ -5774 22732 39812 89497 9068 83877 -7007 -72961 -118813 -93509 -61134 -53024 -33645
2207c3645J10087k6159Q6833r257r7614j09914p9620p0174O7149O3761P7676k663
$$ -33645 76442 50283 137116 127859 30245 -79669 -159289 -229463 -162314 -98553 -20877 -23540
2195b3540O6396L7308m8990n8747j7361L7263J1577l2089k0094O2781j2597l5827
$$ -23540 42856 80164 31174 -27573 -44934 -7671 3906 -28183 -48277 14504 1907 -33920
2183c3920Q7634O3620j9189L3339o7461q8240l0497M2290P1877L0456m5537P748
$$ -33920 53714 117334 98145 131484 64023 -24217 -54714 -12424 59453 89909 44372 52120
2171E2120O5241l6743r219j50343O8619K4148K2405j0067o8563o2690J05473N7482
$$ 52120 117361 80618 71399 -78944 -10325 13823 36228 26161 -42402 -105092 381 57863
2159E7863r0236q3549L7832J00674k1015q2827k2511J01011j8520r0353O1699
$$ 57863 -32373 -115922 -78090 22584 1569 -81258 -103769 -2758 -21278 -111631 -49932
2148d9932K4115J7628n0446M6813j7663m2484Q9882J07760r3710j24920P9036
$$ -49932 -25817 -8189 -58635 -11822 -29485 -71969 17913 125673 31963 -92957 -13921
2137a3921o814n8908n628j766K3527J6581J031J6901p2033o1763O4943J39939
$$ -13921 -20735 -79643 -85271 -87037 -63510 -46929 -45898 -28997 -101030 -162793 -97850 42089
2125D2089J347p7532n299N2806j4796J463K3758j6468J8519P2628j15624L4408
$$ 42089 43436 -34096 -39395 13411 -1385 78 23836 7368 25887 98515 -17109 17299
2113A7299J1692j7638Q2910p2151l1960o1523m5958J69808j13291k6760K3437
$$ 17299 28991 11353 94263 22112 -9848 -71371 -117329 52479 -60812 -87572 -64135
2102f4135K6538n2690m9886K3492J03307o6292k4380n3974k4793N0114J37894
$$ -64135 -37597 -90287 -140173 -116681 -13374 -79666 -104046 -158020 -182813 -132699 5195
$$ [...]
##END NTUPLES=NMR SPECTRUM
##END=
