##TITLE=1H_CA-9455-1
 200.13Hz, DMSO-d6.
 8 sc
 
 24.4.2026
##JCAMPDX= 6.0         $$ Bruker NMR JCAMP-DX V2.0
##DATA TYPE= NMR SPECTRUM
##DATA CLASS= NTUPLES
##ORIGIN= UXNMR, Bruker Analytische Messtechnik GmbH
##OWNER= pz
$$ XWIN-NMR		Version 3.5
$$ Fri Apr 24 13:33:39 2026 Russian Standard Time (UT+4h)  she@DPX200
##.OBSERVE FREQUENCY= 200.131
##.OBSERVE NUCLEUS= ^1H
##.ACQUISITION MODE= SIMULTANEOUS
##.ACQUISITION SCHEME= undefined
##.AVERAGES= 8
##.DIGITISER RES= 18
##SPECTROMETER/DATA SYSTEM= spect
##.PULSE SEQUENCE= zg30
##.SOLVENT NAME= DMSO
##.SHIFT REFERENCE= (INTERNAL, DMSO, 0, 16.5733)
##AUDIT TRAIL= $$ (NUMBER, WHEN, WHO, WHERE, WHAT)
$$ ##TITLE= Audit trail, XWIN-NMR		Version 3.5
$$ ##JCAMPDX= 5.01
$$ ##ORIGIN= Bruker BioSpin GmbH
$$ ##OWNER= she
$$ F:/spectra/data/she/nmr/H-C/1/pdata/1/auditp.txt
$$ ##AUDIT TRAIL=  $$ (NUMBER, WHEN, WHO, WHERE, WHAT)
(   1,<2026-04-24 13:31:59.26 +0400>,<she>,<DPX200>,
      <created by zg, POWCHK disabled, PULCHK disabled
       configuration hash MD5:
       00 E9 B6 7A A2 85 ED C7 34 08 36 98 17 FE 4E 26
       data hash MD5: 16K
       E0 7E D4 AF 7F CA 30 E1 00 18 49 62 2C D9 5B 97>)
(   2,<2026-04-24 13:32:01.82 +0400>,<she>,<DPX200>,
      <Start of raw data processing
       efp BC_mod = 2 LB = 0.25 FT_mod = 6 PKNL = 1 PHC0 = -4061.823 PHC1 = 9.792291 SI = 16K 
       data hash MD5: 16K
       A2 F3 2E A3 4C 83 5E 79 72 57 07 B6 BD BA A7 15>)
(   3,<2026-04-24 13:32:21.35 +0400>,<she>,<DPX200>,
      <pk PHC0 = -3.410099 PHC1 = 5.2 
       data hash MD5: 16K
       E9 6E 0A 36 22 A0 F5 F3 BC 4D 45 D9 5E AE 6E D8>)
(   4,<2026-04-24 13:32:25.12 +0400>,<she>,<DPX200>,
      <abs ABSG = 5 
       data hash MD5: 16K
       B2 A6 EE 64 AA 32 64 4E 3E DA 54 60 66 B7 74 6F>)
$$ ##END=
$$ 
$$ hash MD5
$$ AB 83 06 58 0D 08 56 2B DB 85 16 DB 8E 00 CE B7
##$RELAX= 
##$RELAX= 
##$RELAX= 
##$RELAX= 
##$RELAX= 
##$RELAX= 
$$ Bruker specific parameters
$$ --------------------------
##$DU= <F:/spectra>
##$EXPNO= 1
##$NAME= <H-C>
##$PROCNO= 1
##$TYPE= <nmr>
##$USER= <she>
##$AMP= (0..31)
100 100 100 100 100 100 100 100 100 100 100 100 100 100 100 100 100 100 
100 100 100 100 100 100 100 100 100 100 100 100 100 100 
##$AQSEQ= 0
##$AQ_mod= 1
##$AUNM= <au_zg>
##$AUTOPOS= <>
##$BF1= 200.13
##$BF2= 200.13
##$BF3= 200.13
##$BF4= 200.13
##$BF5= 200.13
##$BF6= 200.13
##$BF7= 200.13
##$BF8= 200.13
##$BYTORDA= 1
##$CFDGTYP= 0
##$CFRGTYP= 5
##$CHEMSTR= <none>
##$CNST= (0..31)
1 1 145 1 1 1 1 1 1 1 1 1 1 1 1 1 1 1 1 1 1 1 1 1 1 1 1 1 1 1 1 1 
##$CPDPRG= <>
##$CPDPRG1= <>
##$CPDPRG2= <>
##$CPDPRG3= <>
##$CPDPRG4= <mlev>
##$CPDPRG5= <mlev>
##$CPDPRG6= <mlev>
##$CPDPRG7= <mlev>
##$CPDPRG8= <mlev>
##$CPDPRGB= <>
##$CPDPRGT= <>
##$D= (0..31)
0 0.7 0 0 0 0 0 0 0 0 0 0.03 0 0 0 0 0 0 0 0 0 0 0 0 0 0 0 0 0 0 0 0 
##$DATE= 1777023118
##$DBL= (0..7)
120 120 120 120 120 120 120 120 
##$DBP= (0..7)
150 150 150 150 150 150 150 150 
##$DBP07= 0
##$DBPNAM0= <>
##$DBPNAM1= <>
##$DBPNAM2= <>
##$DBPNAM3= <>
##$DBPNAM4= <>
$$ [...]
##$SUBNAM3= <"">
##$SUBNAM4= <"">
##$SUBNAM5= <"">
##$SUBNAM6= <"">
##$SUBNAM7= <"">
##$SUBNAM8= <"">
##$SUBNAM9= <"">
##$SW= 18.0517599122864
##$SWIBOX= (0..15)
0 0 2 0 0 0 0 0 0 0 0 0 0 0 0 0 
##$SW_h= 3612.71676300578
##$TD= 16384
##$TD0= 1
##$TE= 0
##$TE2= 300
##$TE3= 300
##$TEG= 300
##$TL= (0..7)
0 120 120 120 120 120 120 120 
##$TP= (0..7)
150 150 150 150 150 150 150 150 
##$TP07= 0
##$TPNAME0= <>
##$TPNAME1= <>
##$TPNAME2= <>
##$TPNAME3= <>
##$TPNAME4= <>
##$TPNAME5= <>
##$TPNAME6= <>
##$TPNAME7= <>
##$TPOAL= (0..7)
0.5 0.5 0.5 0.5 0.5 0.5 0.5 0.5 
##$TPOFFS= (0..7)
0 0 0 0 0 0 0 0 
##$TUNHIN= 0
##$TUNHOUT= 0
##$TUNXOUT= 0
##$USERA1= <user>
##$USERA2= <user>
##$USERA3= <user>
##$USERA4= <user>
##$USERA5= <user>
##$V9= 5
##$VALIST= <valist>
##$VCLIST= <CCCCCCCCCCCCCCC>
##$VD= 0
##$VDLIST= <DDDDDDDDDDDDDDD>
##$VPLIST= <PPPPPPPPPPPPPPP>
##$VTLIST= <TTTTTTTTTTTTTTT>
##$WBST= 1024
##$WBSW= 4
##$XGAIN= (0..3)
0 0 0 0 
##$XL= 0
##$YL= 0
##$YMAX_a= 352733
##$YMIN_a= -725332
##$ZGOPTNS= <>
##$ZL1= 120
##$ZL2= 120
##$ZL3= 120
##$ZL4= 120
##$ABSF1= 16.32427
##$ABSF2= -1.727621
##$ABSG= 5
##$ABSL= 3
##$ALPHA= 0
##$AQORDER= 0
##$ASSFAC= 0
##$ASSFACI= 0
##$ASSFACX= 0
##$ASSWID= 0
##$AUNMP= <proc_1d>
##$AZFE= 0.1
##$AZFW= 0.1
##$BCFW= 0
##$BC_mod= 2
##$BYTORDP= 0
##$COROFFS= 0
##$CY= -3
##$DATMOD= 1
##$DC= 0
##$DFILT= <>
##$DTYPP= 0
##$F1P= 0
##$F2P= 0
##$FCOR= 1
##$FTSIZE= 16384
##$FT_mod= 6
##$GAMMA= 0
##$GB= 0
##$INTBC= 1
##$INTSCL= 3.241238e-09
##$ISEN= 128
##$LB= 0.25
##$LEV0= 0
##$LPBIN= 0
##$MAXI= 10000
##$MC2= 0
##$MEAN= 0
##$ME_mod= 0
##$MI= 1.114404
##$NCOEF= 0
##$NC_proc= -4
##$NLEV= 6
##$NOISF1= 3.799351
##$NOISF2= 2.8
##$NSP= 0
##$NTH_PI= 0
##$NZP= 0
##$OFFSET= 16.57328
##$PC= 1
##$PHC0= -4065.233
##$PHC1= 14.99229
##$PH_mod= 1
##$PKNL= yes
##$PPARMOD= 0
##$PSCAL= 0
##$PSIGN= 0
##$REVERSE= no
##$SF= 200.129489556309
##$SI= 16384
##$SIGF1= 3
##$SIGF2= 2
##$SINO= 0.751879
##$SIOLD= 32768
##$SREGLST= <19F.Aceton>
##$SSB= 0
##$STSI= 16384
##$STSR= 0
##$SW_p= 3612.71676300579
##$SYMM= 0
##$S_DEV= 0
##$TDeff= 16384
##$TDoff= 0
##$TI= <>
##$TILT= no
##$TM1= 0
##$TM2= 0
##$TOPLEV= 0
##$USERP1= <user>
##$USERP2= <user>
##$USERP3= <user>
##$USERP4= <user>
##$USERP5= <user>
##$WDW= 1
##$XDIM= 16384
##$YMAX_p= 485416158
##$YMIN_p= -160280
$$ End of Bruker specific parameters
$$ ---------------------------------
##NTUPLES= NMR SPECTRUM
##VAR_NAME=  FREQUENCY,     SPECTRUM/REAL,   SPECTRUM/IMAG
##SYMBOL=    X,             R,               I
##VAR_TYPE=  INDEPENDENT,   DEPENDENT,       DEPENDENT
##VAR_FORM=  AFFN,          ASDF,            ASDF
##VAR_DIM=   16384,         16384,           16384
##UNITS=     HZ,            ARBITRARY UNITS, ARBITRARY UNITS
##FACTOR=    0.220516191357248, 1,           1
##FIRST=     3316.80213361163, 0,            0
##LAST=      -295.914629394163, 0,           0
##MIN=       -295.914629394163, -160280,     0
##MAX=       3316.80213361163, 485416158,    0
$$ Real data points
##PAGE= N=1
##DATA TABLE= (X++(R..R)), XYDATA
$$ [...]
7726A8389388Q1505Q0883J26651R6986Q4552J29912J59158J02598P9514J02619
7716A9433766J25213Q5862J36241P5840N6973P5538J16593Q8000P9767Q5863L1380
7705B0391036Q7222J03319J34324L6931P3479N9516Q0640Q9227R6002N0686P4472
7694B1276854P0707J00739O8122O0315P8674P7031O5654N5775N2935Q2967L4763
7683B2024536N7139L6791N0550M3758K9104M0454N4139P939K2149L7028M8924
7672B2452511M3495L8738K9905j3145K1633J8641K3369l4999M0356j5921r967
7661B2594616j4604l1076J7474K2260p1643n8917j8450q439j9648k259o8893k8594
7649B2311827k863k0483k9799q4756j01110n3287J1454j09589o6047r1237n4041
$$ plain form
7726 18389388 18470893 18551776 18678427 18775413 18859965 18989877 19149035 19251633 19331147 19433766
7716 19433766 19558979 19644841 19781082 19856922 19913895 19989433 20106026 20194026 20273793 20359656 20391036
7705 20391036 20478258 20581577 20715901 20752832 20826311 20885827 20966467 21055694 21151696 21202382 21276854
7694 21276854 21347561 21448300 21516422 21576737 21655411 21732442 21798096 21853871 21906806 21989773 22024536
7683 22024536 22081675 22118466 22169016 22212774 22241878 22282332 22336471 22344410 22366559 22403587 22452511
7672 22452511 22496006 22534744 22564649 22551504 22573137 22591778 22615147 22580148 22620504 22604583 22594616
7661 22594616 22580012 22548936 22566410 22588670 22517027 22458110 22439660 22431221 22411573 22409314 22340421 22311827
7649 22311827 22308964 22288481 22258682 22173926 22072816 22019529 22030983 21921394 21855347 21764110 21710069
7638B1710069k0677r8320n5787r7968r6955o4054r7179r5040p4956n7272p7958
7627B0873903j33820r5817j28071j24372p5957o1347j30560p5182j05291j20862
7617A9822624j02721j43206j14876j14339q6868q0482q9754j18669j56755j60074
7607A8654880j29464j04583j15534q7241j22069j12716j12303j63076j39582j11437
7597A7456875r7819j05370j49831j79360j52821q7026j51005j30475r2319j81186
7587A6129663q9387r1644j47367j37890j53242j11426j19957j42828j03401j02769
7577A4929752j41919q2258j37457j10837r3040j30690j48003j22716j03711j33228
7567A3725893j13872j30130q3869j22104j22140j37502j08982r3780j30803j15809
$$ plain form
7638 21710069 21689392 21591072 21535285 21437317 21340362 21276308 21179129 21084089 21009133 20951861 20873903
7627 20873903 20740083 20644266 20516195 20391823 20315866 20254519 20123959 20048777 19943486 19822624
7617 19822624 19719903 19576697 19461821 19347482 19260614 19180132 19090378 18971709 18814954 18654880
7607 18654880 18525416 18420833 18305299 18218058 18095989 17983273 17870970 17707894 17568312 17456875
7597 17456875 17359056 17253686 17103855 16924495 16771674 16684648 16533643 16403168 16310849 16129663
7587 16129663 16040276 15948632 15801265 15663375 15510133 15398707 15278750 15135922 15032521 14929752
7577 14929752 14787833 14705575 14568118 14457281 14364241 14233551 14085548 13962832 13859121 13725893
7567 13725893 13612021 13481891 13398022 13275918 13153778 13016276 12907294 12813514 12682711 12566902
7557A2566902j00874p4088j32477j11886p7456j10234r2927j23455j28366q1192
7547A1533947o8977j39773j20760r1196r1864j28125q8595q3630p9859p4244j23997
7536A0442927p7855p2438j03276q8234j01837n8031p6761j04711j07736o9422
7526I582626l8859n7559j00133j03607p2469r1940l4973m1277r9399p8352p1489
7515H792569o7482o0492j12630q5111m9849m9231m2150p0873n5880n8895q1046
7504H058930r3478p2507o3423p6292j06607o9091m7913o9383o6192p2038q0776
7493G241230q7807o9799l0218o9200n0258m0771n6393l6038m3029k8521p5781
7482F653415m9304o9926n5610l094j7533k6810q8072l8313k9903m2554j7985p2168
$$ plain form
7557 12566902 12466028 12391940 12259463 12147577 12070121 11959887 11866960 11743505 11615139 11533947
7547 11533947 11464970 11325197 11204437 11113241 11021377 10893252 10804657 10721027 10641168 10566924 10442927
7536 10442927 10365072 10292634 10189358 10101124 9999287 9941256 9864495 9759784 9652048 9582626
7526 9582626 9543767 9486208 9386075 9282468 9209999 9118059 9083086 9041809 8942410 8864058 8792569
7515 8792569 8725087 8664595 8551965 8466854 8417005 8367774 8325624 8254751 8198871 8139976 8058930
7504 8058930 7965452 7892945 7829522 7753230 7646623 7577532 7529619 7460236 7394044 7322006 7241230
7493 7241230 7153423 7083624 7053406 6984206 6933948 6893177 6836784 6800746 6757717 6729196 6653415
7482 6653415 6604111 6534185 6478575 6475481 6457948 6431138 6343066 6304753 6274850 6232296 6214311 6142143
7470F142143k5915k9794O015o455m5976k6159l8077N229K7697P0726J03714J94342
7458F377490K91570L18617L06046J97185J1330j77133k51738k75981l38953k61803
7448F196630k44215k63238k09732j63729j14423j55761r4072r9199k6885p6459
7438D748917o1601l8915r9764n8627o1641m6531J5393n8784j7155m5390r6308
7427D179594m8550j6221k5385m2299o4997n4495r904o6214m334o9199m3122j8041
7415C716833J8149m5741l1882m2294n3768j1378k5240m2688k5717j5109l7027
7404C404138R723q2258j8512M955n7711o4923p310k776o554L22q2942k9153j2797
7391C054202j2329J9776l7411m5220l9504l7739J9984n6131k0815k016q112J5377
$$ plain form
7470 6142143 6116228 6086434 6092449 6085994 6040018 6013859 5975782 5981011 6008708 6079434 6183148 6377490
7458 6377490 6669060 6987677 7293723 7490908 7502238 7325105 7073367 6797386 6458433 6196630
7448 6196630 5952415 5689177 5479445 5315716 5201293 5045532 4951460 4852261 4825376 4748917
7438 4748917 4687316 4648401 4548637 4490010 4428369 4381838 4397231 4338447 4321292 4275902 4179594
7427 4179594 4131044 4114823 4089438 4047139 3982142 3927647 3917743 3851529 3847195 3777996 3734874 3716833
7415 3716833 3734982 3689241 3657359 3615065 3561297 3549919 3524679 3481991 3456274 3441165 3404138
7404 3404138 3413861 3331603 3313091 3318046 3260335 3195412 3188102 3185326 3178772 3179094 3096152 3066999 3054202
7391 3054202 3041873 3061649 3024238 2979018 2939514 2901775 2921759 2865628 2844813 2842797 2834685 2850062
7379B850062q8716l3296q834m8418k1641M6394n292l3101k2026k9409n4765r659
7367B541299M767n0959r413j1146k9895j4799m0226l2028K4816l9567o803j5600
7355B320446K6223m9058N928j3968m3148j9185k847P469n3061J7193k0572q033
7343B167387k2278j7431K4999m8969j5864L8090l1566m2289j6161k7038p311j4686
7331A986883K5218O802n9275j8773k2399k0268k2670m4690m0585K7091J2367K0400
7319A850101o821l3903m0754n8907q398M1677k0373l8088m676j4394k8316L8581
7307A675729N3062n24o3966o087j7458j1722O2625n0755k8282K354k4711l326
7295A586939n4563J307K1378L3573m8037p427m4624J9036l7628o1228J3936j1553
$$ plain form
7379 2850062 2761346 2728050 2719216 2670798 2649157 2695551 2690259 2657158 2635132 2605723 2550958 2541299
7367 2541299 2546066 2495107 2485694 2474548 2444653 2429854 2389628 2357600 2382416 2342849 2336046 2320446
7355 2320446 2346669 2297611 2303539 2289571 2246423 2227238 2224391 2231860 2178799 2195992 2175420 2167387
7343 2167387 2145109 2127678 2152677 2103708 2087844 2125934 2094368 2052079 2035918 2008880 2001569 1986883
7331 1986883 2012101 2018903 1959628 1940855 1918456 1898188 1875518 1830828 1790243 1817334 1829701 1850101
7319 1850101 1843280 1809377 1768623 1709716 1701318 1742995 1722622 1684534 1679858 1665464 1637148 1675729
7307 1675729 1728791 1728267 1664301 1658214 1640756 1629034 1691659 1640904 1612622 1614976 1590265 1586939
7295 1586939 1532376 1533683 1555061 1588634 1540597 1533170 1488546 1507582 1469954 1408726 1422662 1411109
7283A411109p464k8297j2790K0972O099j2270Q944j4071k3849k3176K7318l1461
7271A321064J254k8301j5259N137K7505j0501K1877j9632l4173M226K9392k0035
7259A282554n3144l0782Q448J0084J2143k0330K2973l1214k7188q053p095J1534
7247A169930l977k3883k5681J8953k152k4716L142L839j5680Q033j4671m236j3628
7234A075273k289K6807J467j8797m6401k2956j4546J7109J4851j6870J0442l7527
7222I86563o015N741j6179m0608K0269J6737o677m2944l303J4921J6298J7245
7210I62048o547m7607j5713j2245J2825K1967m5756l6540M067J093J3706J1322
7198H62620p873K2192l6267M99k8838m060J354m526N396l8773k4544K468K1348
$$ plain form
7283 1411109 1403645 1375348 1362558 1383530 1389629 1377359 1386303 1372232 1348383 1325207 1352525 1321064
7271 1321064 1322318 1294017 1278758 1283895 1311400 1300899 1322776 1303144 1268971 1273197 1302589 1282554
7259 1282554 1229410 1198628 1207076 1217160 1229303 1208973 1231946 1200732 1173544 1165491 1158396 1169930
7247 1169930 1165953 1142070 1116389 1135342 1133190 1108474 1111616 1115455 1099775 1107808 1093137 1088901 1075273
7234 1075273 1072984 1099791 1101258 1082461 1036060 1013104 998558 1015667 1030518 1013648 1024090 986563
7222 986563 980548 986289 970110 929502 949771 966508 959831 916887 913584 928505 944803 962048
7210 962048 955501 907894 892181 879936 892761 914728 868972 832432 836499 837592 851298 862620
7198 862620 854747 876939 840672 841171 812333 808273 809627 805101 810497 771724 747180 749648 770996
7185G70996J7818j245m8952K9602K9038j8496k9371J1482k9812R409M2404L041
7173G85914J2647k9089m9239j927L4908k0312K0851j5805j1655k3549J0189J7031
7161G29964J8462k4781l1208J0132k6294J0551J8861K3513J2516l2940r810j309
7149F97657l3306K2413J0277m3584j9829J2162N7649L83q9753j2573M0457q570
7137F33383j3928K4496n5476j2559O295J2364N53k360M119k7524k1297q473J727
7124E41320O212M4634J3045l2884J342O619l4104j2105J3456M3407O093k1808
7112E75227l1732O677L4321j1229J368l1251k3776N2742j3748k5930L8197J3165
7100E84031o6168n2151L559q816k9672L534J1642o529L9638K9744P156K5315k7353
$$ plain form
7185 770996 788814 787569 738617 768219 797257 778761 749390 760872 731060 740469 782873 785914
7173 785914 798561 769472 720233 718306 753214 732902 753753 737948 726293 702744 712933 729964
7161 729964 748426 723645 692437 702569 676275 686826 705687 729200 741716 708776 698966 697657
7149 697657 664351 686764 697041 653457 633628 645790 703439 703822 614069 601496 641953 633383
7137 633383 619455 643951 588475 575916 582211 594575 595128 592768 596887 569363 548066 539593 541320
7124 541320 547532 592166 605211 572327 573669 580288 546184 534079 547535 590942 597035 575227
7112 575227 543495 550172 584493 573264 574632 543381 519605 572347 558599 532669 570866 584031
7100 584031 517863 465712 469271 460455 430783 434317 445959 439430 479068 508812 515968 541283 513930
7087E13930p482l380k0374P671j90j1727Q099K1483j4519l1250O287K102k0012
7074D50638L985k6719K9283j2827m235K7710P631m2013K8400k8940m824K5369
7062D53458o1071n649O5017m947K7078k3323o2085M537J0909L6589k637k9163
7050D08713J8997L290o9323J5899R664j2330m233K2381L321o295K3792J8927l1587
7037D01216o1247k734K0629n308J3046K5460m925j9372N599J7978Q989l1757m068
7024C63506l4485k127j0547L42R353l790k2960K9683n2224J4230L185j4444J7954
7011B97676L7838L7200q656m5645m2739j4150p481K5104o964L8625j212K760K5322
6998C37678l2092j7016j4273L3056M4784M402l8116N696p30J6540p2549l7279
$$ plain form
7087 513930 506448 503068 482694 490365 490175 478448 486547 508030 493511 462261 468548 470650 450638
7074 450638 454623 427904 457187 444360 440125 467835 475466 433453 461853 432913 428089 453458
7062 453458 392387 386738 451755 446808 473886 450563 388478 393015 403924 440513 437876 408713
7050 408713 427710 431000 361677 377576 387240 374910 370677 393058 396379 390084 413876 432803 401216
7037 401216 339969 337235 357864 352556 365602 391062 386137 366765 372364 390342 399331 367574 363506
7024 363506 329021 326894 316347 316689 326042 322252 299292 328975 276751 290981 294166 279722 297676
7011 297676 335514 372714 364058 318413 275674 261524 254043 279147 272183 310808 309596 312356 337678
6998 337678 305586 288570 274297 307353 352137 356539 318423 324119 323389 339929 267380 230101
6986B30101N2983R698K1624k3772l4390J4597J3812L357J3277M713j1851j5647
6974B78502N278k8211l4705K5646N4339J9538J1099l6676k5721j0133N0435o965
6962C02426m499j2236L045n1993q036J8132P175L8446k8350m1480l717M5178j1278
6949B52813j7428N265k6949k0027J0750K2240O358J2385m6377L1686J9328J9715
6937B69759l8751l2547l436j5693M4379m2k444L7972k1738K7339m1215m4592K7207
6924B06198K8227k5758J733K6804J5116L2755n2914m3214k805J6092J0257K8073
6912B40564L0221j3255j9526k7893J4775k1503m8184K2371K5874J6273o253j931
6900B11533Q14l0059J1290J5195j005j7927j3884J4415M8510J4005k8356R58m1874
$$ plain form
6986 230101 283084 292782 314406 290634 256244 270841 284653 288010 301287 306000 294149 278502
6974 278502 283780 255569 220864 246510 300849 320387 331486 294810 269089 258956 309391 302426
6962 302426 297927 285691 288736 236743 228707 246839 254014 292460 264110 222630 218913 264091 252813
6949 252813 235385 240650 213701 193674 204424 226664 233022 245407 199030 230716 250044 269759
6937 269759 231008 198461 195025 179332 223711 223669 221225 259197 237459 264798 223583 178991 206198
6924 206198 234425 208667 210400 237204 252320 285075 232161 188947 186142 202234 212491 240564
6912 240564 270785 257530 238004 210111 224886 203383 155199 177570 203444 219717 213464 211533
6900 211533 212347 182288 193578 208773 207768 189841 175957 190372 238882 252887 224531 225489 183615
6887A83615K040j577k3601j3642O727K2143j1261l7764o970L2665J9708J3312
6875A85395L0336m3188j969k2206l138k409k8820J0571M6597Q941q164k2902l701
6862A45343M209N81J559J427l853M937O8682l8110p5423M6566J5128O911j888
6849A76069j1804n6079O9709j1147K7703O568k2259K084j537j7869j1661m468
6837A45309L006l7222r450K8742N62K2448p364j0878j4253j9700M0849R698L849
6824A55596J054k9170k167j1045M1434n1401L5599J2467k9932J401J1343L098
6812A38277j6213j2410L7408R434m6013n4975N8471j2841N7797L8290l2494k2259
6800A42472j1555l7188J9466J0271j6784q174k7676J0183O4226K3476l0336m2151
$$ plain form
6887 183615 185655 184078 160477 146835 153562 175705 164444 126680 119710 152375 172083 185395
6875 185395 215731 172543 170574 148368 145230 142821 114001 124572 171169 180110 171946 149044 145343
6862 145343 149552 150133 151692 153119 149266 154203 222885 184775 109352 155918 171046 177957 176069
6849 176069 164265 108186 177895 166748 194451 201019 178760 180844 179307 161438 149777 145309
6837 145309 148315 111093 101643 130385 130947 153395 146031 135153 120900 101200 142049 151747 155596
6824 155596 156650 127480 125313 114268 155702 104301 139900 152367 122435 123836 135179 138277
6812 138277 122064 109654 147062 156496 110483 55508 113979 101138 158935 197225 164731 142472
6800 142472 130917 93729 113195 123466 106682 98508 70832 81015 145241 168717 138381 96230
6788I6230Q723n5j2735K3369J3289O687k9141L1390J5541K300n9225J4736N2392
6775A63501m1430J7107J9132p457k059O658q755J5095J9066k6799O324J3099J7697
6762A91179k079K8489n004j4855o2617k776j3187K1145M7160o329j3745j0004
6750A57377j3457K0835L700l6273l499k0570K0614K2081J7614L4235N0556l1340
6738B21873K8905N1812L8365M4030n1666j5195J1459k9254j9898o662m12l1838
6726B41519j6767n771k4254n1803k504l25l4237o738L1791J9576k5838m6761N7136
6713A35024R859K6538J6790K3468m7l3689L8210M9016J6847L7981J5558q346K7145
6700C54354l1279p2980l5050J6314r555k6920j5372j6160J1706j9611m8650r711
$$ plain form
6788 96230 104953 104898 92163 115532 128821 135508 106367 137757 153298 155598 96373 111109 163501
6775 163501 122071 139178 158310 150853 148794 155452 146697 161792 180858 154059 160383 173482 191179
6762 191179 189100 217589 212585 197730 135113 132337 119150 140295 187455 181126 167381 157377
6750 157377 143920 164755 168455 132182 128683 108113 128727 150808 168422 202657 253213 221873
6738 221873 250778 302590 340955 384985 333319 318124 329583 300329 280431 273769 273357 241519
6726 241519 224752 218981 194727 142924 140420 140095 105858 99120 130911 150487 124649 77888 135024
6713 135024 144883 171421 188211 211679 211632 177943 216153 265169 282016 319997 335555 327209 354354
6700 354354 323075 250095 215045 231359 221804 194884 179512 163352 175058 155447 106797 97086
6688I7086K1019k0987p199K2346j5939K2281j6546j7130n27R041Q513q247L2092
6675A25803O8278J447L2780J5385m7982m8752J5545j5026J2963n391l9503L140
6663A18687L716p015o069k7974J518l4671L268j7568n165N0382J5660k0315n8640
6650A5814K6899L4041M224M212j6145M565j9044K2259l6044j876J5012K1019l2961
6637D1975n0117K3593J0800Q691L9941j7285j5190j2605j2072J7136K4868j8002
6625D1733J697m0865K0750N7042n615k9345q833o898j1955j125j4527J6688L1081
6612D9828k4564j3316L0884K2940l9487o2981N4158j658j5867L7863j241q006
6600B8553J2319n1248K8063m441J4727j5830J7687m4737L6496J1043j1698l5641
$$ plain form
6688 97086 118105 97118 89919 112265 96326 118607 102061 84931 84404 93445 101958 93711 125803
6675 125803 194081 195528 228308 243693 195711 146959 162504 147478 160441 155050 115547 118687
6663 118687 122403 115388 109319 81345 82863 48192 51460 33892 28727 79109 94769 74454 15814
6650 15814 42713 76754 80978 85190 69045 73610 54566 76825 40781 38905 53917 74936 41975
6637 41975 -8142 15451 26251 34942 74883 57598 42408 29803 17731 34867 59735 41733
6625 41733 43430 2565 23315 80357 74742 45397 36564 29666 17711 16586 2059 18747 49828
6612 49828 25264 11948 42832 65772 26285 -36696 17462 15804 -63 37800 36559 28553
6600 28553 40872 -10376 17687 13246 27973 12143 29830 -14907 21589 32632 20934 -14707
6588a4707K5535J5743L6333J6713k1226j4007j3544k4779K5889M5870l5967J3562
6576E5415j6065j3710j2962k729M5381j990k6078J3960J3588k1901K2473j9904
6564C5478J1142m0470J3684J4914L304O433J9223n4855l6755J3063J278L9112
6552B5551J6804j1275l2541L2546k0928R069l0510p054l227M2p447M384J2938
6539a1648M5377j9039l0887K8460R644j2767K5147J3654O918l9605L3466L7815
6527H6535L899l9137k0198l5848L7102L8285m5084k1063k0468o2098N1230P4k500
6514b9271N1637J5848k3891J4028M0568m1776k8519j6967J959l6964K2130L5608
6502D390j9879k7661P2707O404l2618K4511l357j3139o895P503k8214J1336j0000
$$ plain form
6588 -14707 10828 26571 62904 79617 58391 44384 30840 6061 31950 77820 41853 55415
6576 55415 39350 25640 12678 9949 55330 53340 27262 41222 54810 32909 55382 35478
6564 35478 46620 6150 19834 34748 38052 44485 63708 8853 -27902 -14839 -13561 25551
6552 25551 42355 31080 -1461 31085 10157 19226 -11284 -18338 -21565 -21523 -28970 -24586 -11648
6539 -11648 33729 14690 -16197 12263 21907 9140 34287 47941 54859 15254 48720 86535
6527 86535 90434 51297 31099 -4749 32353 70638 25554 4491 -15977 -78075 -26845 -26771 -29271
6514 -29271 22366 38214 14323 28351 68919 27143 -1376 -18343 -16384 -53348 -31218 4390
6502 4390 -15489 -43150 29557 35961 3343 27854 24497 11358 4463 11966 -16248 -4912 -14912
6489a4912L4492J1058l4957J6467j0125J321L365J8167j6736k1449M582L5204
6477B6477L9476m5559k9555q203J3941J9172L992j1046k0697J5163J2086j3606
6465A641J1615n787K647J8300m1345j0048j3377n899j4956K1573Q434R987K4794
6452G579K0226K46k4096r722l103J5567l6111L6348q459k3326K9671M963K2490
6439C2273j0078k5808m669J0746P911L433l6990K561q580L8258J771K1362N01
6426C2691k1434j5325N0q348p599P794j4003K370P911J0266k3511M5867j2108
6413D621j4650J2506P022k7623P838l336q318M3984l814m2497K8918k297K821
6400E175N444j8740j9737l1319k043J4485q902J7397L8361J1405j9328n402R570
$$ plain form
6489 -14912 19580 30638 -4319 12148 2023 3344 6709 24876 8140 -13309 -8727 26477
6477 26477 65953 20394 -9161 -17364 -3423 15749 19741 8695 -12002 3161 15247 1641
6465 1641 13256 7469 10116 28416 -12929 -22977 -36354 -42253 -57209 -35636 -27202 -17215 7579
6452 7579 27805 28051 3955 -5767 -8870 6697 -29414 6934 -1525 -24851 4820 9783 32273
6439 32273 22195 -3613 -8282 2464 10375 13808 -23182 -20621 -29201 9057 10828 32190 32691
6426 32691 11257 -4068 -4018 -12366 -19965 -12171 -26174 -23804 -15893 -5627 -29138 16729 4621
6413 4621 -10029 2477 9499 -18124 -10286 -13622 -21940 22044 18230 -24267 4651 2354 5175
6400 5175 10619 -8121 -27858 -59177 -61220 -46735 -55637 -38240 121 11526 -7802 -13204 -3634
6387c634l8848J9737K8341L3201l7281j2350K2540k3195l6290K9351q011q086
6375c4525L806O159P281L5833j1097K3231l0903k0346l2059R03L6042J2017J5554
6362A1896n0798K225K3384K22j2648K5803J7503n0128j4065K1953K0543p470l6158
6349d7738M628L0682j1502j7294M7748j4701R380k0111M758k5191r73K0211J1887
6336h216l7758m242L2644j318l5036R174K1653P503l1456O362j3491o839M7716
6323a3304r062J798j0411k2102m325o23K6444l27k2607M4001j2859j4283k0776
6310e8436K1092K8994k4825M091J1086K1381m370k2125K800l9006J4321L5782
6298i215Q2n59n0177M436J1919L1084m658L0354J9552q830O24n0760K2903r657
$$ plain form
6387 -3634 -42482 -22745 5596 38797 1516 -10834 11706 -11489 -47779 -18428 -26439 -34525
6375 -34525 -30719 -24560 -17279 18554 7457 30688 -215 -20561 -52620 -51717 -15675 -3658 11896
6362 11896 -38902 -36677 -13293 -13071 -25719 84 17587 -32541 -46606 -24653 -4110 -11580 -47738
6349 -47738 -43110 -12428 -23930 -41224 6524 -8177 1203 -18908 -14150 -39341 -40314 -20103 -8216
6336 -8216 -45974 -50216 -17572 -18890 -53926 -44752 -23099 -15596 -47052 -40690 -54181 -61020 -13304
6323 -13304 -22366 -20568 -30979 -53081 -57406 -58029 -31585 -31912 -54519 -10518 -23377 -37660 -58436
6310 -58436 -37344 -8350 -33175 -29084 -17998 3383 -987 -23112 -20312 -59318 -44997 -9215
6298 -9215 -9133 -9692 -59869 -55433 -43514 -12430 -17088 13266 32818 23988 24612 -26148 -3245 -12902
6284a2902K3273K1429j0400j2801k707j7119K1447L8679l06k2955k4988j7773
6272a7123J0124K0944l3892q628K4764K8201j3964M891j3232j6439j7209J276
6260c0287K9557N535J3208n992l1350J4541l298k2035J5241q709K3419l8089L2229
6247f030n694k1796j6414k1317O788M089p739Q238M6652j1375o948J404q734p742
6233d6618Q289M2122J7854J1021l2148J0949l1413l7041J5126j3573L2882l3832
6221e6382J9482N921K7387m036j6654j3792q579K1051N1227Q380k8278r227J2240
6208H740k525m8126p270q35K8210O754j5464q919J0205j2001p005K809q582J3541
6194d0468j4185j2198Q082L5334Q304j8075N648M7396j8541l8726j3226j3058
$$ plain form
6284 -12902 10371 31800 21400 8599 5892 -11227 10220 48899 48593 25638 650 -17123
6272 -17123 -6999 13945 -19947 -28575 -3811 24390 10426 15317 2085 -14354 -31563 -30287
6260 -30287 -730 4805 18013 12021 -19329 -4788 -8086 -30121 -14880 -23589 -170 -38259 -6030
6247 -6030 -11724 -33520 -49934 -71251 -64463 -60374 -68113 -59875 -13223 -24598 -31546 -30142 -38876 -46618
6233 -46618 -38329 3793 21647 32668 520 11469 -19944 -56985 -41859 -55432 -22550 -56382
6221 -56382 -36900 -30979 -3592 -7628 -24282 -38074 -46653 -25602 25625 34005 5727 -3500 8740
6208 8740 6215 -41911 -49181 -50016 -21806 -15052 -30516 -39435 -29230 -41231 -48236 -45427 -54009 -40468
6194 -40468 -54653 -66851 -58769 -23435 -15131 -33206 -27558 19838 1297 -37429 -50655 -63713
6182f3713j0013J4721J9174k2311o001M0765j5005O073k3368J5479L8542M4012
6170C8355j3537l8671J9103j794o2349R238L526N82J5651j6569L8961j2923n806
6157b6233m65L0526J2143L1553l5534j3031J715K1410n7368R909N0471o6327j8875
6144f0106K9363l288O034j7802j5839K2738R029J2357j1371o2555M6325L4832
6132a0283L7243j3515j3135L139o0557L5912O7322l0905l6462J8139M0809m2181
6120d474n8070K9541j0994L2962K1509k1266k6548K5345L640r719r01j3999k545
6107c5519R55r877o381O3504j0782k5352J4180j4093J401j3169o19j6092k555
6094e4399J7958L1344o973l5414J1530J6295M066j2547l2047M1956M8553k0024
$$ plain form
6182 -63713 -73726 -59005 -39831 -62142 -68143 -27378 -42383 -36310 -59678 -44199 -5657 38355
6170 38355 24818 -13853 5250 3456 -58893 -49655 -46129 -45547 -29896 -46465 -7504 -20427 -26233
6157 -26233 -26698 3828 15971 47524 11990 -1041 674 22084 -35284 -25375 25096 -41231 -60106
6144 -60106 -30743 -34031 -27997 -45799 -61638 -38900 -29871 -17514 -28885 -91440 -45115 -10283
6132 -10283 26960 13445 310 3449 -57108 -21196 46126 15221 -21241 -3102 37707 -4474
6120 -4474 -62544 -33003 -43997 -11035 10474 -10792 -37340 -11995 -8355 -18074 -18975 -32974 -35519
6107 -35519 -34564 -44441 -50822 12682 1900 -23452 -9272 -23365 -21964 -35133 -35752 -51844 -54399
6094 -54399 -36441 -5097 -12070 -47484 -35954 -19659 -15593 -28140 -60187 -18231 30322 10298
6082A0298k2379J1908j5041l4412k0815K3121J9580k889j8736j7829J8078l2384
6070h1500K5854J5635M437Q346J7530m7149n519j0972n1986o347M6815l219l732
6057i1807L6682R441N030Q539K7058n3844j2299J5071j60L5627l1794m8400K2288
6044g8568J8192k606Q25L6783k5418L901J4963L497P346N592j3581k5131l1945
6031h6150L1937J3254M6334k5132j9420k5689Q706K6395l706m9140M710J9350
6019e8551j9864l6689n840N5984M880J005j0446k3642L7870L561M1996K6595j0435
6006F424Q619j9938j5585j2782r46o35J1868N067l4752J3459J6847l2393j7918
5993g2665n6790J2073J1480O855L4486P1k2214L1438N66J5373l8047J2212M6427
$$ plain form
6082 10298 -12081 -173 -15214 -49626 -70441 -47320 -27740 -30629 -49365 -67194 -49116 -81500
6070 -81500 -55646 -40011 -35574 -27228 -9698 -56847 -62366 -73338 -125324 -131671 -84856 -88075 -91807
6057 -91807 -55125 -45684 -40654 -32115 -5057 -58901 -71200 -56129 -56289 -20662 -52456 -100856 -78568
6044 -78568 -60376 -62982 -62157 -25374 -50792 -46891 -31928 -28431 -21085 -15493 -29074 -54205 -86150
6031 -86150 -54213 -40959 5375 -19757 -39177 -64866 -56160 -29765 -33471 -82611 -77901 -58551
6019 -58551 -78415 -115104 -120944 -64960 -60080 -59075 -69521 -93163 -55293 -51732 -9736 16859 6424
6006 6424 15043 -4895 -20480 -33262 -34208 -34843 -22975 -17908 -52660 -39201 -22354 -54747 -72665
5993 -72665 -129455 -117382 -105902 -99047 -64561 -64490 -86704 -55266 -54700 -39327 -77374 -65162 -18735
5980a8735J4018l8082n7405J9420M5812K5067k6089k6773K1316p874j1151o197
5968f6673q968K3111P110M2865K4276n6719R787K0249j8668k8052J5201l2266
5956f8747J4869K9361j4091J3796N300l2332K0804L3417m6225J701J6134P835
5944a8178K287m59Q184l8611J9724M2284q847k3130j2927J6062K6194l7010k0853
5931d5280r763N7442K9246m6071j9530K977k1038j0871O040L1005l2430k4306
5919h2579j211M7298L2727m2995l1784j8792m369K0464K4244j2877L5874j4436
5907d8436P903J6705k0573j3073K2056j3452J2402J6360l3603L794r320J2509
5895d6728J4974P771n384j7577n405q506L1047l5122n339K9514N983l3295k020
$$ plain form
5980 -18735 -4717 -42799 -100204 -80784 -34972 -9905 -35994 -62767 -41451 -49325 -60476 -66673
5968 -66673 -75641 -52530 -45420 -2555 21721 -34998 -25211 -4962 -23630 -51682 -36481 -68747
5956 -68747 -53878 -24517 -38608 -24812 -19512 -51844 -31040 2377 -43848 -42147 -26013 -18178
5944 -18178 -15891 -16350 -8166 -46777 -27053 15231 6384 -16746 -29673 -13611 12583 -24427 -45280
5931 -45280 -55043 2399 31645 -14426 -33956 -30979 -52017 -62888 -56848 -25843 -58273 -82579
5919 -82579 -83790 -36492 -3765 -46760 -78544 -97336 -101705 -81241 -56997 -69874 -34000 -48436
5907 -48436 -40533 -23828 -44401 -57474 -35418 -48870 -36468 -20108 -53711 -49917 -59237 -46728
5895 -46728 -31754 -23983 -29367 -46944 -52349 -60855 -29808 -64930 -70269 -40755 -34772 -68067 -70087
5882g0087l1993J9310J0929l8336n274N4463J343j3303P627J3859P477j9288l7499
5869a00772n142K9371K4596J8057L010l8705j5311M0332l2041K0922J3775o0676
5857a02584K3717L7880j3500k835M402L0605P042J8591j8843r880k464O574Q235
5844a3060k0243N390l6267J3492J1432q120p340k1907K717J9908j0381N337j4823
5831g3865L6722O5872O305l9478n0439l4319K1984N4391k1098k3822K604k2979
5819g8122n922M5454K4990l3530J3495j0882n3152p512K0883J8374N701N385o047
5806f0885K9495j3271k619m406j0224L2165j6471j7728L5344j8192j30J0591n431
5793d1762r557j32J601N006J7951n7972M754N0926K5034o1091N210N2134k2688
$$ plain form
5882 -70087 -102080 -82770 -71841 -110177 -115451 -60988 -59645 -72948 -65321 -51462 -43985 -63273 -100772
5869 -100772 -105914 -76543 -51947 -33890 -30880 -69585 -84896 -44564 -76605 -55683 -41908 -102584
5857 -102584 -78867 -40987 -54487 -57322 -52920 -22315 -15273 3318 -15525 -25405 -27869 -21295 -13060
5844 -13060 -33303 -27913 -64180 -50688 -39256 -47376 -54716 -76623 -73906 -53998 -64379 -59042 -73865
5831 -73865 -37143 28729 35034 -4444 -54883 -89202 -67218 -12827 -33925 -57747 -55143 -78122
5819 -78122 -84044 -38590 -13600 -47130 -33635 -44517 -97669 -105181 -84298 -65924 -60223 -54838 -60885
5806 -60885 -31390 -44661 -47280 -51686 -61910 -29745 -46216 -63944 -28600 -46792 -46922 -36331 -41762
5793 -41762 -51319 -51451 -49850 -44844 -26893 -84865 -80111 -29185 -4151 -65242 -60032 -7898 -30586
5780c0586j7785j4574M544Q347l0875M4567k7365k0649L9377o337J5454j4936
5768e0818K1780l865J4159o1562m8868L8640O0778n891j5150k5865N775l314J6043
5755e8158J4161k4568j4548R900N47L2849J889K6253l233j4124l1383J3441J3687
5742c3287L6805j4401n8548p275L2563J1784j4435K9865m3354n759J666P812k1423
5729g7987J8297p337K0448j2658l6836o471J4138P7474o806q109j5340j7939k5110
5716h4236k2036J0592L1793L7247k5151O064J0781K7888j0359k1412j595J9902
5704b0522J9041K7459n0360j9000k0555k0154J8346J1333j0837k0260J2389J6611
5692e6509P485j0611j7975J334K0171J9237J9198k2374J0500p480k5264j1560
$$ plain form
5780 -30586 -48371 -62945 -58401 -50054 -80929 -36362 -63727 -84376 -44999 -51336 -35882 -50818
5768 -50818 -29038 -32903 -18744 -80306 -129174 -90534 -29756 -35647 -50797 -76662 -70887 -74201 -58158
5755 -58158 -43997 -68565 -83113 -73213 -72666 -39817 -37928 -11675 -14908 -29032 -60415 -46974 -33287
5742 -33287 3518 -10883 -69431 -76706 -44143 -32359 -46794 -16929 -60283 -66042 -64376 -56564 -77987
5729 -77987 -59690 -67027 -46579 -59237 -96073 -102544 -88406 -10932 -17738 -25847 -41187 -59126 -84236
5716 -84236 -106272 -95680 -63887 -26640 -51791 -45727 -34946 -7058 -17417 -38829 -40424 -20522
5704 -20522 -1481 25978 -24382 -43382 -63937 -84091 -65745 -54412 -65249 -85509 -73120 -56509
5692 -56509 -49024 -59635 -77610 -76276 -56105 -36868 -17670 -40044 -29544 -37024 -62288 -73848
5680g3848k608N3469K5562o024o052L907o4372o287K715Q586k3438k0988K9403
5667g9975L1111k2503J4458J0871n357k9182L7771J1939j6046L2949l6230l6467
5655h6661Q836J8867K6128L8455k2007J3125k6702p517k8582m877J0551J3108
5643d7276l3143J1422K0856l933l1573K2623q940K9665k5710J6140l133J9370
5631c3632J6472n8412J2217J7503P934j757o352j7872J527j2332L2849K339j7503
5618e7019J1256R042j8624j1338M734l2001Q344J8392m8850l0984O0506p09K9009
5605e8242M378P145M6273j8094R447n069k3598k0184J1625M672J1121m4466K3680
5592e1312k2373n90p433K4695J287L9246k0296M29j2804j5112l1667j7507M6750
$$ plain form
5680 -73848 -76456 -22987 2575 -3449 -9501 -5594 -69966 -76253 -73538 -64952 -88390 -109378 -79975
5667 -79975 -48864 -71367 -56909 -46038 -51395 -80577 -42806 -30867 -46913 -13964 -50194 -86661
5655 -86661 -77825 -58958 -32830 5625 -16382 -3257 -29959 -37476 -66058 -70935 -60384 -47276
5643 -47276 -80419 -68997 -48141 -52074 -83647 -61024 -69964 -40299 -66009 -49869 -53002 -33632
5631 -33632 -17160 -75572 -63355 -45852 -37918 -39675 -46027 -63899 -62372 -74704 -41855 -39516 -57019
5618 -57019 -45763 -36721 -55345 -66683 -61949 -93950 -85606 -67214 -116064 -147048 -86542 -87251 -58242
5605 -58242 -53864 -46719 -446 -18540 -9093 -14162 -37760 -57944 -46319 -41647 -30526 -74992 -51312
5592 -51312 -73685 -74275 -81708 -57013 -55726 -16480 -36776 -36347 -49151 -64263 -95930 -113437 -66687
5579f6687k213o207M968J7445J8679K5209j2098k0944j8487m330K8645O139r641
5566c9522l2614j5544J7567L2667o165O962K5024m0417l0046j8642L8246R227
5554e3257J8653J5370Q24n5815j3309m532J3387P192R986K0351m756k8224Q537
5541f5593N293N093P458j3305j5520P377J107L1361J3477j8504k9175K4204j543
5528d8270J385J5491k2246R64k0260k6443L1805K4882k6885K6624K274P006j4749
5515d8422M019j942n0826L4370L8696k7757K9755J7133k6726m9529R643Q569J011
5502f2006J1806J8835J0955r410j8226k3584L8675J9881R132l4984q545K8601
5490a8870k4010J8514o893l0227j6347M384M9811J7858N00l0420k6377k9349J662
$$ plain form
5579 -66687 -68900 -75107 -70139 -52694 -34015 -8806 -20904 -41848 -60335 -64665 -36020 -29881 -39522
5566 -39522 -72136 -87680 -70113 -37446 -43611 -36649 -11625 -52042 -82088 -100730 -62484 -53257
5554 -53257 -34604 -19234 -18410 -74225 -87534 -92066 -78679 -71487 -61501 -41150 -45906 -74130 -65593
5541 -65593 -60300 -55207 -47749 -61054 -76574 -69197 -68090 -36729 -23252 -41756 -70931 -46727 -48270
5528 -48270 -46885 -31394 -53640 -52676 -72936 -99379 -67574 -42692 -69577 -42953 -40679 -33673 -48422
5515 -48422 -44403 -46345 -97171 -62801 -24105 -51862 -22107 -4974 -31700 -81229 -71586 -63017 -62006
5502 -62006 -50200 -31365 -20410 -29820 -48046 -71630 -32955 -13074 -3942 -38926 -47471 -18870
5490 -18870 -42880 -24366 -31259 -61486 -77833 -73449 -23638 -5780 -5280 -35700 -62077 -91426 -89764
5477h9764j8980L4660N4555R955l7511j703j7385L0511M4108o1024K6922J6363
5465i293o49l3613L7500j1250p1343M6283J0446l363l7983l063N8205n145L5162
5452A1894j1793n878M4939k8036m1718j9116l3540M4243J3467J6519J8750J1100
5440B0831k8752m8334L6549J2575o369j0649P739M959k080l0657P396k2411M7567
5427a1636j118l8325J0871K6120k5692j0162K0887n258J3418K1129K5635q843
5415A7026m1244m1877K8566j8807L7667J7844k2889k86j3490q690r918j5648J7998
5402e3748J9902j4827k626L3959P447J1974J0698J0710j7710k9888m7857J8880
5390e3086K5678j2985l5992m910O2386J7833l0176O611j3079l818P178K835L4766
$$ plain form
5477 -89764 -108744 -74084 -19529 -9574 -47085 -48788 -66173 -35662 8446 -52578 -25656 -9293
5465 -9293 -9942 -43555 -6055 -17305 -88648 -42365 -31919 -35282 -73265 -76328 -18123 -23268 11894
5452 11894 101 -5777 39162 11126 -30592 -49708 -83248 -39005 -25538 -9019 9731 20831
5440 20831 -7921 -56255 -19706 -7131 -13500 -24149 -16410 -11451 -13531 -44188 -36792 -59203 -11636
5427 -11636 -12754 -51079 -40208 -14088 -39780 -49942 -29055 -34313 -20895 234 25869 17026
5415 17026 -24218 -66095 -37529 -56336 -18669 -825 -23714 -24000 -37490 -46180 -56098 -71746 -53748
5402 -53748 -33846 -48673 -51299 -17340 -9893 2081 12779 23489 5779 -24109 -71966 -53086
5390 -53086 -27408 -40393 -76385 -81295 -18909 -1076 -31252 -24641 -37720 -41538 -34360 -31525 3241
5377C241l8862r594K9133L2694k8728l0227K8925K534L5796K8528N138Q454n953
5364F1079P098J5342K3055n2060m4055K2376l3386m6465M1526J8035K6766p979
5352C1332p52J333j2411m5473L1675J1855K1735l2433o3251N1502J3539j8459
5340i808J7411j7660j9871K5717j6853l1674r2L0519q624K394k8487K7943l492
5327c2577L7529m9011J805j5803L3922K2340o3573L4367p105l2210J6294K8574
5315b5448j6377K3637O180l483J1299R903j6038M48l7389L3250J7719k9855J1466
5302a4688m443n297k66M5962l9692J4229J5033j3643O490l1412K0320r224J5768
5289h63J0429k8938K4292P317n7149K713j1609J191P106J4026J5613J0633j1441
$$ plain form
5377 3241 -35621 -45215 -16082 16612 -12116 -42343 -13418 -10884 24912 53440 58578 67032 61079
5364 61079 68177 83519 106574 54514 10459 32835 -551 -47016 -5490 12545 39311 31332
5352 31332 30580 31913 19502 -25971 5704 17559 39294 6861 -56390 -4888 8651 -9808
5340 -9808 7603 -10057 -29928 -4211 -21064 -52738 -52830 -22311 -30935 -28541 -57028 -29085 -32577
5327 -32577 4952 -44059 -42254 -58057 -24135 -1795 -65368 -31001 -38106 -70316 -54022 -25448
5315 -25448 -41825 -18188 -12008 -15491 -4192 5711 -10327 -9879 -47268 -14018 3701 -26154 -14688
5302 -14688 -19131 -24428 -24694 21268 -18424 -4195 10838 -2805 3685 -27727 -7407 -16631 -863
5289 -863 9566 -19372 4920 12237 -44912 -42199 -53808 -52617 -45511 -31485 -15872 -5239 -16680
5276a6680K3476j0915m0464o478K5486n033J3146j0982j993j2199j4353L4056
5264b2933l6232M8623j0573k1474J4681j9039J2103M6690J1262j9839m74J863
5252D658j1544k9117k9616j0205M2221j0843J7726L3265K9524r320p3538K2379
5240b4410L8674p392j6114J4379J1532K434K253l3369j5732j2347K9823j0675
5228b0944q715K8250k7662j1689L8127M2282k1372L442K7196J6708j1422J0482
5216F4683j1219n7884N0828l747J42L5307k8700k3424J7193J6734k1767l7526
5204F20l0304P294K4518M6999j8324O913j1837l0644K708L643K7301J675J1793
5191D2355r105J4674K4475j4876J7938K9059K8423k5937m6630k1020K4143M5851
$$ plain form
5276 -16680 6796 -4119 -44583 -51061 -25575 -30608 -17462 -28444 -30437 -42636 -56989 -22933
5264 -22933 -59165 -10542 -21115 -42589 -27908 -46947 -34844 11846 23108 3269 2795 4658
5252 4658 -6886 -36003 -65619 -75824 -33603 -44446 -26720 6545 36069 26749 -46789 -24410
5240 -24410 14264 6872 -9242 5137 16669 19103 21356 -12013 -27745 -40092 -10269 -20944
5228 -20944 -29659 -1409 -29071 -40760 -2633 39649 18277 21719 48915 65623 54201 64683
5216 64683 53464 -4420 46408 42661 42803 78110 49410 25986 43179 59913 38146 620
5204 620 -29684 -22390 2128 49127 30803 37716 25879 -4765 -2057 1586 28887 30562 42355
5191 42355 33250 47924 72399 57523 75461 104520 132943 107006 60376 39356 63499 109350
5179A09350L0392m2633j3364j0453N939p178k4260J6499K5938n1403J8795M2915
5167A00537l1840J3403k050K6163J0321j2927j0139J6623L2613j5374k211L5195
5155A60314N5442k8132J1366O5665J2782m920K1289k2002J5849O4947p395j485
5143C43720P902J2413n1806l1739l0926k1460k0764k0124m3466m3021J3342M7786
5131A61857n0602n5523K2095K8027K1982K565l1557J3231O0283j705j2606P747
5119A65794j2514l0846J211j4416J0795j0435J5815J3557n8285j820j4772p347
5107E6737K5323P943o661q554J2756o847l1403j792R897k827J2350r219k8118
5094B9585K6965M5028k363j9563m1773J9765K9737P878r687p2981J9785K5890
$$ plain form
5179 109350 139742 97109 83745 73292 79231 72053 47793 64292 90230 38827 57622 100537
5167 100537 68697 82100 80050 106213 116534 103607 93468 110091 142704 127330 125119 160314
5155 160314 215756 187624 198990 264655 277437 272517 293806 271804 287653 352600 345205 343720
5143 343720 351622 364035 312229 280490 249564 228104 207340 187216 143750 100729 114071 161857
5131 161857 111255 55732 77827 105854 127836 130401 98844 112075 172358 170653 158047 165794
5119 165794 153280 122434 123645 109229 120024 109589 125404 138961 80676 78856 64084 56737
5107 56737 82060 90003 83342 74788 87544 80697 49294 47502 57399 54572 66922 57703 29585
5094 29585 56550 101578 99215 79652 37879 57644 87381 95259 85572 12591 32376 58266
5082E8266m6157J5319J6865Q135Q267P400L4298k6645m5218j884P319j7198N0663
5069F9430j0362J6056K2647j5479j2780j8670n573j4422O5337k6326k2801J5413
5057F2470J0329J994k1146K3232k924P459j3378K0619j2391k8724p24K2679l4479
5044C5016k7244J7259J3334J4936l3908K8171j3981L5381K2691J890m0853J1924
5032F4616j1645p47L1164j3486j5030l5046M7805j9756K5073r579j9164K7442
5020G1647k1192M0233O852m086L5840K823n4881j2384M549j0315j3921k385K695
5007D5475M877Q265o858J0539L485K0196k4005j0234M5704K1784Q785l473k8302
4994I6238J9474L521L6908l9346J2223J5428l7671l0653J6908K2537j5043J0356
$$ plain form
5082 58266 12109 27428 44293 52428 60695 68095 102393 75748 30530 28646 35965 18767 69430
5069 69430 59068 75124 97771 82292 69512 50842 45269 30847 96184 69858 47057 62470
5057 62470 72799 74793 53647 76879 73955 81414 68036 88655 76264 47540 46816 69495 35016
5044 35016 7772 25031 38365 53301 19393 47564 33583 68964 91655 93545 52692 64616
5032 64616 52971 52224 83388 69902 54872 19826 67631 47875 72948 63369 44205 71647
5020 71647 50455 90688 97540 93454 129294 132117 77236 64852 69401 59086 45165 42780 45475
5007 45475 50352 58617 51759 62298 65783 85979 61974 51740 97444 119228 128013 124540 96238
4994 96238 115712 119233 156141 116795 129018 144446 106775 76122 93030 115567 100524 110880
4982A10880r674J8456l4790J9970J345P141L0088l2813M924J7137N322k036J0272
4969A46222J8274j1090m182N5001L4730Q745l7219M4359O5044L239K9176K8281
4957C80580Q9160N2786P5171P8213J92025J92375J93691J78477P2621j7793p7251
4946A410055j22867j38205j31190j72372q0015j29838j20237l3870p3263o4400
4936C43798l7559p566j3413m5235J5633O971r078l6120m5327k737J2042R97j428
4923A80978M377o5450l5659O580R499q913j2003L492J9546L9586j7775k3846J1074
4910A11486l0542p150K249J4242j3904K1752j889j2136P10j4865l052J6830J4105
4897I7836q591L730j4743k2995K6306r357l9974R051j2905L8596l5170K032L1835
$$ plain form
4982 110880 101206 119662 84872 104842 106187 113328 143416 110603 115527 132664 137986 135950 146222
4969 146222 164496 153406 149224 204225 238955 247700 210481 254840 319884 323123 352299 380580
4957 380580 469740 522526 597697 675910 867935 1060310 1254001 1432478 1505099 1487306 1410055
4946 1410055 1287188 1148983 1017793 845421 765406 635568 515331 481461 408198 343798
4936 343798 306239 298673 285260 240025 255658 262629 253551 217431 172104 169367 181409 182406 180978
4923 180978 185355 119905 84246 90826 100325 91412 79409 82901 102447 142033 124258 100412 111486
4910 111486 80944 73794 76043 90285 76381 98133 96244 84108 84818 69953 66901 83731 97836
4897 97836 89245 92975 78232 55237 81543 72186 32212 41263 28358 66954 31784 33816 65651
4884F5651k1032N5471R301L3152r601p1532K7458n969K0743N89L1625K0007k7355
4871A28508l1476L0354K037k2865L5929J5131J0642R390k7801k0479M9427j3789
4859A65008j1676N27j9338L694J9601J3386R821k0900k0721M7343L8306k4431
4847B00620M467j2903R876q824k7603m424J5911L107L1462P14J1019p530j1013
4834B04879j6110l467O915j5203N3519j0263k3944M6154N0982K5326J1673l2871
4822B97590R347K807N2280m0992k9834P8179l1338n412J5594N665K8881j4460
4810C68307J2049J4522K8976O985q546k1005M9725L4067P475o647Q445L1368M3342
4797E69063L3544M5487o131Q190O5335K4983P1444P525M6336P8082L9401P8985
$$ plain form
4884 65651 44619 100090 109391 142543 132942 61410 88868 82899 103642 104231 135856 155863 128508
4871 128508 97032 127386 129423 106558 142487 157618 168260 177650 149849 129370 178797 165008
4859 165008 153332 153859 134521 138215 157816 171202 181023 160123 139402 186745 225051 200620
4847 200620 205087 192184 202060 193236 165633 161209 177120 180227 211689 212403 223422 215892 204879
4834 204879 188769 185302 192217 177014 230533 220270 196326 242480 293462 318788 330461 297590
4822 297590 306937 309744 362024 321032 291198 369377 338039 332627 348221 353886 382767 368307
4810 368307 380356 394878 423854 430839 422293 401288 451013 485080 492555 485908 494353 525721 569063
4797 569063 602607 648094 641963 650153 715488 740471 811915 819440 865776 943858 983259 1062244
4785A062244R5221Q1729P5844J14618R4104Q0445P7522K9881L7493P5961k9107
4774A795955n9195j6851K967L041N608N6523M3920O9640L6151N4270J30074J78686
4762B300789J70341K00537K89151L43383M82316O94208J074660J458412J690293
4753H704090J503809R22093J12762m17082n11282o65564o00543l81771k15487
4744H451025j00719j29556j94882k37443k99014k39859j34080k5596K55311M96321
4734G841508N86710M11316O910l70899o36649o96133p54694p41853p06640o09351
4724D330225n20502m53412m12736k53125k50560j59120j25644j13539q0543p4917
4714A886127L2144m2173q1203o5944j19722p5299j00813r4978k5166r0507o8968
$$ plain form
4785 1062244 1157465 1239194 1315038 1429656 1523760 1604205 1681727 1711608 1749101 1825062 1795955
4774 1795955 1736760 1719909 1722876 1725917 1731525 1788048 1831968 1901608 1937759 1992029 2122103 2300789
4762 2300789 2471130 2671667 2960818 3304201 3786517 4480725 5555385 7013797 8704090
4753 8704090 10207899 11129992 11242754 10825672 10314390 9648826 9048283 8666512 8451025
4744 8451025 8350306 8220750 8025868 7788425 7489411 7249552 7115472 7089876 7345187 7841508
4734 7841508 8428218 8839534 8846444 8475545 7838896 7142763 6388069 5646216 4939576 4330225
4724 4330225 3809723 3356311 2943575 2690450 2439890 2280770 2155126 2041587 1961044 1886127
4714 1886127 1918271 1876098 1794895 1728951 1609229 1533930 1433117 1338139 1312973 1222466 1153498
4703A153498o3010l1977o5697q0102p1867M506K0958k0834q226o069j7306m4801
4691G69073k7467J204k6255k8830k2157m3497j2078m559K384l8817o288q7K548
4678E65174n716J7081r017l4142l7827r988q716k7426K5403m0875K913R479l4419
4665D11924K7989k9125l618K8037R217o632J1654o5079j3155L2548J3560p665
4653D09655J0714K5874m6210N6898J6306O779k4154j3787K76r144M4918k6158
4641D51967l8861L4665M5292k6110J0996K481l2881J3503M2816L0407k7327M947
4629E11895L5179N9476N3402P9974N7947P3227O8310J37812N8826M5162L7998
4618A219208P310J7190L7732l935n845L5030K7766L8673R753L4002J05827J82871
$$ plain form
4703 1153498 1090488 1058511 992814 912712 840845 845351 866309 845475 837249 831180 813874 769073
4691 769073 741606 742810 716555 687725 665568 622071 609993 605434 607818 569001 562713 562626 565174
4678 565174 559458 576539 567522 533380 495553 485565 476849 449423 474826 433951 436864 446343 411924
4665 411924 439913 410788 407170 435207 444424 437792 449446 384367 371212 403760 417320 409655
4653 409655 420369 446243 400033 456931 473237 480016 455862 442075 442351 433207 478125 451967
4641 451967 413106 447771 493063 466953 477949 480430 447549 461052 503868 534275 506948 511895
4629 511895 547074 606550 659952 739926 797873 871100 939410 1077222 1136048 1181210 1219208
4618 1219208 1226518 1243708 1281440 1277505 1271660 1306690 1334456 1373129 1382882 1416884 1522711 1705582
4606A705582K60596L41076L95781L12170Q7428j13047k07223k88928k31008k54422
4596B008005k28310k47723j88941j28264j16005j14526q6777r8823j5703n9099
4586G23834m4128k1723o7620p083j1474j5092M758p269o4174M6074J2034j1288
4574E36849l1470o719n5037N037m020j4838k266o825M2038j3006K5983n42l2289
4561D42895M1530k358J243M1175J7145j2751m3306q91L7899m0702N903l059Q411
4548D93134L1180O021m0133r547j8525o03L597n0075j3799O2419N788K2153P340
4535D98950k8857K6635k648J0245q630l8499j8793J5268K6630N4164O170o3659
4523D76976P912p429j2789n66J481k305N4398q040R970K0848j1006J2932N7252
$$ plain form
4606 1705582 1966178 2307254 2703035 3015205 3102633 2989586 2782363 2493435 2262427 2008005
4596 2008005 1779695 1531972 1343031 1214767 1098762 984236 897459 798636 782933 723834
4586 723834 679706 657983 590363 583280 571806 556714 561472 554203 490029 536103 548137 536849
4574 536849 505379 498660 443623 448660 444640 429802 427536 420711 462749 449743 475726 475184 442895
4561 442895 484425 482067 483310 524485 541630 528879 485573 484682 522581 481879 487782 484723 493134
4548 493134 524314 530335 490202 480655 462130 461527 465124 415049 401250 463669 469457 491610 498950
4535 498950 470093 496728 494080 504325 495695 457196 438403 453671 480301 534465 540635 476976
4523 476976 484888 477459 464670 464104 465585 463280 517678 509638 519608 540456 529450 542382 599634
4510E99634M288L6362K3336K235K9775k4763K275q039j6969j5709J4229o777n123
4497F34754N1616m794O670L626l5898J3719K8073n987J6531l282j2520j6377K7389
4484G03520M2318j5474N979j877O874M955J373j3568P712J6425J4877k1603k146
4471G49365M0837M4029k2689l2923K7081O7144k1868L1075Q5461N5745l788j0424
4459A009045O5004n445l4841N7034P720Q513L6631P503K6006j7263P857K4547
4447A192311K019O2257K7927J826R802K8196q475L4607P123k0211K7537N6897
4435A421816J0929M1367J1070j7999L2249L9450r746K2955m100J9896J9898k788
4423A584997Q681O4497k0885l362N7659R5484O4565J9053M633l965K0768O9197
$$ plain form
4510 599634 603922 640284 663620 665855 695630 670867 673142 665103 648134 632425 646654 639877 634754
4497 634754 686370 681576 688246 691872 655974 669693 697766 691779 708310 705028 692508 676131 703520
4484 703520 745838 730364 736343 734466 741340 746295 747668 734100 741812 758237 773114 751511 749365
4471 749365 790202 834231 811542 778619 805700 872844 850976 882051 967512 1023257 1019469 1009045
4459 1009045 1074049 1068604 1033763 1090797 1098517 1107030 1143661 1151164 1177170 1159907 1167764 1192311
4447 1192311 1194330 1256587 1284514 1286340 1296142 1324338 1315863 1350470 1357593 1337382 1364919 1421816
4435 1421816 1432745 1474112 1485182 1467183 1499432 1538882 1529136 1552091 1547991 1567887 1587785 1584997
4423 1584997 1593678 1658175 1637290 1633928 1691587 1787071 1851636 1870689 1875322 1871357 1892125 1961322
4411A961322K8935L9629M3522M9525P2153J1287O6657O4877J9699L0226M5165
4400B432997N4445O3015J8052K5566J8606L9499K5347L4287J4349O1841M3283
4389B831287M3753O7845M3544N2209N8950O8090L3699M8871Q9873K9552P2262
4378C439935M3022P9639O2942Q7546N1038P0447J11877P3713O6623J46213R6120
4367D329115J40380J04613J16743J01196J13182J44002J23309R0939J48865J29482
4357E541826J34281J57297J71246J39539J88972J49410J52232J30944J31253J74874
4347G071874J65989J85433J99205K31098K83307L09029K40650K67458K89688K41902
4337I485633K67919L21138L46233L77838L68192M40859M73140M64019N31594M84742
$$ plain form
4411 1961322 1990257 2029886 2073408 2122933 2195086 2206373 2273030 2337907 2357606 2387832 2432997
4400 2432997 2487442 2550457 2568509 2594075 2612681 2652180 2677527 2711814 2726163 2788004 2831287
4389 2831287 2875040 2942885 2986429 3038638 3097588 3165678 3199377 3248248 3338121 3367673 3439935
4378 3439935 3482957 3562596 3625538 3713084 3764122 3834569 3946446 4020159 4086782 4232995 4329115
4367 4329115 4469495 4574108 4690851 4792047 4905229 5049231 5172540 5263479 5412344 5541826
4357 5541826 5676107 5833404 6004650 6144189 6333161 6482571 6634803 6765747 6897000 7071874
4347 7071874 7237863 7423296 7622501 7853599 8136906 8445935 8686585 8954043 9243731 9485633
4337 9485633 9753552 10074690 10420923 10798761 11166953 11607812 12080952 12544971 13076565 13561307
4327A3561307N17762N18854N20013N39157O07703P01206O92179P71826Q80918
4318A9310925Q74392Q78585R58021R94126J132363J217901J374091J526941J738774
4309C0006119J982785K287115K530338K842743L121601L491228M148408M885443
4301E5295780N688702O861316Q303967J0193533J2722700J6678386K2290963L0923451
4293A68958798M4106340O1813372P5333679P2576686M9323405J3303878j8983621
4286D66432537l3772155m2868140m9364776m7919148m4034371l9199782l4290137
4279A74984028k7802394k1587959j6767281j3062116j0285315q700282p240818
4272F9537863n973031n089556m540201m005258l591457l240429k870012k383353
$$ plain form
4327 13561307 14079069 14597923 15117936 15657093 16264796 16966002 17658181 18430007 19310925
4318 19310925 20185317 21063902 22021923 23016049 24148412 25366313 26740404 28267345 30006119
4309 30006119 31988904 34276019 36806357 39649100 42770701 46261929 50410337 55295780
4301 55295780 60984482 67845798 76149765 86343298 99065998 115744384 138035347 168958798
4293 168958798 213065138 274878510 350212189 422788875 472112280 485416158 466432537
4286 466432537 432660382 389792242 340427466 292508318 248473947 209274165 174984028
4279 174984028 147181634 125593675 108826394 95764278 85478963 76778681 69537863
4272 69537863 63564832 58475276 53935075 49929817 46338360 43097931 40227919 37844566
4264C7844566k020640j824039j659471j542135j604082j439028j248819j241428
4256B5264924j146201j035637r32526q23798q09895p05217p16006o90862p08988
4247A7695794o92862p73114o83701o53311n07075m24135m51566l39224l02987
4238A2867819l67661l22697l13990k84939k98968l61051l15201l49357k68788
4229I985167k77471k28219k25595k21196j82512j57445k19230k63323k26275k49453
4219G734448j97593j84752j74389j73258j75775j35488j83189j74561j61638j23408
4209F050397j23421j63434j34455j22140j25944j51089j44709j53233j06247l2408
4199D793317j47931q7240j33881p9111o6800j38049o1592n8239n2882o3829j5073
$$ plain form
4264 37844566 35823926 33999887 32340416 30798281 29194199 27755171 26506352 25264924
4256 25264924 24118723 23083086 22150560 21326762 20516867 19811650 19095644 18404782 17695794
4247 17695794 17002932 16229818 15546117 14892806 14385731 13961596 13510030 13170806 12867819
4238 12867819 12500158 12177461 11863471 11578532 11279564 10918513 10603312 10253955 9985167
4229 9985167 9707696 9479477 9253882 9032686 8850174 8692729 8473499 8210176 7983901 7734448
4219 7734448 7536855 7352103 7177714 7004456 6828681 6693193 6510004 6335443 6173805 6050397
4209 6050397 5926976 5763542 5629087 5506947 5381003 5229914 5085205 4931972 4825725 4793317
4199 4793317 4645386 4558146 4424265 4345154 4278354 4140305 4078713 4020474 3967592 3903763 3888690
4188C888690r7390j17854j44314o6717n0550j09335p9768q6392k8370m3469q4694
4177B979837j04560j6271k8216o4343p0632k8808n8769o0875q0969q4652l1662
4166B350080l6101l7793k6755k4009J1126n2602m8402j003m5969q7975l4107R480
4154A975970m0465o0111l2356j771k9467o2004k9896k4205j8594j2230k0534o5603
4142A578734l8557p0102j1367J5844m4266n9040n4139m0631P570q945j6156n822
4130A253123J004l7525K456L8065n1453l6758l0619o8244o3595n289J8300k0870
4118I98595O983j3247j8374j491j8570L396K457k7285k2633K0039L2278J2629
4106I74777m1027l9041j0649l7904m671J0339o9729l0077l3086q153k0677N321
$$ plain form
4188 3888690 3791300 3673446 3529132 3462415 3411865 3302530 3222762 3136370 3108000 3064531 2979837
4177 2979837 2875277 2859006 2830790 2766447 2695815 2667007 2608238 2547363 2466394 2381742 2350080
4166 2350080 2313979 2276186 2249431 2225422 2236548 2183946 2135544 2134541 2088572 2000597 1966490 1975970
4154 1975970 1935505 1875394 1843038 1841267 1811800 1749796 1719900 1695695 1677101 1664871 1644337 1578734
4142 1578734 1540177 1470075 1458708 1474552 1430286 1371246 1317107 1276476 1284046 1275101 1258945 1253123
4130 1253123 1254127 1216602 1219058 1257123 1205670 1168912 1138293 1070049 1006454 1001165 1019465 998595
4118 998595 1005578 992331 973957 972466 953896 957292 959749 932464 909831 929870 962148 974777
4106 974777 933750 894709 884060 846156 841485 851824 782095 752018 718932 710779 690102 695423
4094F95423J3881j7588m4279j6293j050j3868l9333K3823k6886J5127K0105N443
4082F14505n3884m6358L750m316j2123k5514m097j2092n669k823m5898J2120L926
4069D21527O007J5981K949j8714k4317J8778R390J1879J8300J5722m7624m392
4057D25486n882p525P51j7158k102O263k74j3085j6580j4182K7237q740m0896
4044C33313J6734q930k7675j1673o697N155L7727j3892J3567P202l0331k3610
4032B90890P831Q784L1646o8868k3198N497K6924J4636k4495k6905m0521n677
4020A96544q002J9897J7049J321N600L2242K4018L1029K9861p939O973J5580O9916
4007D34089O2868p466J1004O839m5477j1074j7734l0592l2799l6624J4323R791
$$ plain form
4094 695423 709304 691716 647437 631144 630094 616226 576893 600716 573830 588957 609062 614505
4082 614505 560621 514263 518013 513697 501574 476060 471963 459871 454202 451379 405481 417601 421527
4069 421527 427534 443515 446464 427750 403433 422211 431601 443480 461780 477502 429878 425486
4057 425486 419604 412079 412830 395672 393570 399833 399559 386474 369894 355712 382949 374209 333313
4044 333313 350047 341117 313442 301769 295072 300227 337954 324062 337629 344831 314500 290890
4032 290890 298721 307505 339151 270283 247085 252582 279506 294142 269647 242742 202221 196544
4020 196544 188542 208439 225488 226809 232409 264651 288669 319698 349559 341620 348593 364173 434089
4007 434089 496957 489491 500495 507334 461857 450783 433049 402457 369658 333034 347357 357148
3995C57148J7562Q534k4496L522M1482Q255K4175j5501J1458L394J3223J8353
3983D67109N027J9749N7848R5025P3773M8062J23555J68430K49261M09703M30057
3972B147599L44202K23280K3544r9194j93187k85333k81212k53605k12933k03460
3962A209701k09445j06463r8443j39094n0504P83n7011m7621k4543q6778k8428
3951C62154m036j1012j9301m6234J1957N653m6596m4091M232N1679n692l2871
3939B25842j4224K9962J4663q971n632k8958J4260l162N158l5699l6120o109L075
3926A54085L1424J7525M8276j2256l0398l3712l1205J0841K0884j0769o0408K286
3914A06573J9213l5236K5661J5350j1263Q371q776N612L932n165L519K2374J5853
$$ plain form
3995 357148 374710 383244 358748 362270 403752 412007 436182 420681 432139 435533 448756 467109
3983 467109 472136 491885 549733 644758 718531 766593 890148 1058578 1307839 1717542 2147599
3972 2147599 2491801 2715081 2738625 2639431 2446244 2160911 1879699 1626094 1413161 1209701
3962 1209701 1000256 893793 795350 656256 605752 606535 549524 501903 477360 390582 362154
3951 362154 358118 347106 327805 281571 293528 299181 252585 208494 212726 264405 258713 225842
3939 225842 211618 241580 256243 247272 241640 212682 226942 223780 228938 193239 157119 151010 154085
3926 154085 185509 203034 251310 239054 208656 174944 143739 154580 175464 164695 104287 106573
3914 106573 125786 90550 116211 131561 120298 128669 119893 125505 129437 124272 127791 150165 166018
3901A66018L1123J1362o1957m799N065k7563K8290L4514r369l1859M7195K4142
3889B12162k8919M3157K1704j5210L6298P6323m939J6411N0840K5343j8034k1280
3877C93856n760j3016j8624n8032k5948k9822J3491K1111j2853j1464l4420J0920
3865B29439j6732j0516J4589L0508J2504O7927K1809l6118l8798l8947j22Q8551
3853C24094L6668p41O5609j2211K9147L4637L6834K3758M0502M1777L0203L7924
3841F88201J13347Q2778O0441R1021J04159J43720J75921K56043K93963M70366
3831B479960P55110J029250J144295R64490M45986j27536m64669n44637o52546
3822E029703o96162o98827o04470m96843l85389l27183k82564j97018r5836j45571
$$ plain form
3901 166018 197141 208503 146546 141747 146812 119249 147539 182053 172684 140825 188020 212162
3889 212162 183243 226400 248104 232894 269192 345515 340576 356987 407827 433170 415136 393856
3877 393856 388096 375080 356456 298424 272476 242654 256145 277256 264403 252939 218519 229439
3865 229439 212707 202191 216780 247288 259792 327719 349528 313410 274612 235665 235543 324094
3853 324094 360762 360021 425630 413419 442566 477203 514037 537795 578297 620074 650277 688201
3841 688201 801548 884326 944767 1035788 1139947 1283667 1459588 1715631 2009594 2479960
3831 2479960 3235070 4264320 5408615 6373105 6819091 6691555 6226886 5682249 5029703
3822 5029703 4333541 3634714 3030244 2533401 2148012 1820829 1538265 1341247 1245411 1099840
3812A099840j44401p7247l2085k3710r2556m9762p2470r106m6045l3677k5515
3801D93266k0445r347J5574p1179l8745r633q474K0937k4402j2353l3960Q966
3789C10205p559j0422j197j0886l8067j0659J7406j4778J3514j7024l1045L4274
3777B33762K6288j0157j9296l8969P584K7972K0270k3607m7496m133N0479j7444
3765B05253j6155r265L3955k5988O619k1307m0224k6878Q685K3505J9607L6287
3753A94094J6185p251p705l5755q913P611q009J4793o451K1238J6946N951j5051
3740A87683J5704J4027j6959p084p865k9703M2009L3035j5912j6697O59L7249
3728B36146j0862J9314L3224j0939m2936j427L8545J9501l425k0024k212k3026
$$ plain form
3812 1099840 955439 878192 846107 822397 729841 680079 607609 598503 552458 518781 493266
3801 493266 472821 463474 479048 407869 369124 359491 351017 371954 347552 335199 301239 310205
3789 310205 302646 292224 291027 280141 242074 231415 248821 234043 247557 230533 199488 233762
3777 233762 260050 249893 230597 191628 199212 227184 247454 223847 176351 172218 222697 205253
3765 205253 189098 179833 213788 187800 194419 173112 132888 106010 114695 138200 157807 194094
3753 194094 210279 203028 195323 159568 150655 158266 150257 165050 158599 179837 196783 202734 187683
3740 187683 203387 217414 200455 193371 185506 155803 197812 230847 214935 198238 198897 236146
3728 236146 225284 244598 277822 266883 223947 222520 261065 280566 277141 257117 254905 231879
3716B31879M6321J7728R146J3618L073Q757K1133P537M6172j0231M6267K1504
3704D62904N0954M796N468O4960N2392N5538Q6653J25660J62772J85175K61206
3693A518478K24240J69280O0503j7552q5236j25202l5553q4572l4576n8498r1883
3682A439429J1018K5315J17583J18939J28198J07050J34187J68596J44507J62757
3672B557579J89044J67198K50624K20922K03680J93996J02279J48338N6034J34402
3662D224096J34925J48652J55223R2846m0778l0142n7838j29059p6158o7376j03208
3651D251183r2956j50270k09353k29576k03202j97306j26882k03259k01108j65166
3641B472105j72675j84605j79465k16276j66918j46844j06222j31224j21990n3996
$$ plain form
3716 231879 278200 295928 305074 318692 321765 330522 351655 359192 405364 395133 441400 462904
3704 462904 513858 518654 524122 589082 641474 697012 783665 909325 1072097 1257272 1518478
3693 1518478 1742718 1911998 1972501 1954949 1869713 1744511 1708958 1624386 1589810 1531312 1439429
3682 1439429 1450447 1475762 1593345 1712284 1840482 1947532 2081719 2250315 2394822 2557579
3672 2557579 2746623 2913821 3164445 3385367 3589047 3783043 3885322 4033660 4089694 4224096
3662 4224096 4359021 4507673 4662896 4755742 4714964 4684822 4626984 4497925 4421767 4354391 4251183
3651 4251183 4158227 4007957 3798604 3569028 3365826 3168520 3041638 2838379 2637271 2472105
3641 2472105 2299430 2114825 1935360 1719084 1552166 1405322 1299100 1167876 1045886 991890
3631I91890j12858p3016k4468J071j05576q0411j0975n4434j2152k8445j1496
3620D79130J6908o2282O377k9086q5603j3284j3108j4483M3517j576n0591p799
3608B68120J750L40k6669k1297j3149j6729K9061j3172K0013Q208J1551p830j7962
3595B22235o1756l158P270j1322J1997k0522R980M0073O983k6682n1514o11N995
3582A28968K2676n050n3485k7568j6209L9880L8621o330j6634j0488j4439k0941
3570E9001K4793l202j4961J6549j8787K5203K4446P648m2633j0159m11J0555J5934
3557I3976l0876r877j1942L5n268m1741J1413K7520K5578k3379j5836L271m3381
3544b0507K637K794o173R998K4292k184R88K0219j3357O836J1923K0366k2311
$$ plain form
3631 991890 879032 806016 781548 782619 677043 596632 585657 531223 519071 490626 479130
3620 479130 496038 433756 440133 411047 325444 312160 299052 284569 328086 326510 275919 268120
3608 268120 269870 270210 243541 222244 209095 192366 221427 208255 228268 236476 248027 240197 222235
3595 222235 160479 157321 164591 153269 165266 144744 154724 194797 201780 175098 123584 122973 128968
3582 128968 151644 146594 93109 65541 49332 89212 127833 121503 104869 94381 79942 59001
3570 59001 83794 80592 65631 82180 63393 88596 113042 120690 78057 67898 67487 78042 93976
3557 93976 63100 53223 41281 41316 36048 -5693 5720 33240 58818 35439 19603 22874 -20507
3544 -20507 -17870 -15076 -21249 -11251 13041 10857 11845 32064 18707 25543 37466 57832 35521
3531C5521J0624k766k1210k4567K6895k2485L7096q727J7215K476L2700P071n2713
3518C7130L888p563k311K2278J5064l834J7837k3160k5804o326j2928j8735K1335
3505A6871O324J9852m3624k7281j1279L2140J7290r582j0638l837N4671M0426
3493H1333R878r273j0156J3785n819k9405j8603K6693m5245k8606K2880K6645
3481C4107l1000Q847J764Q066k2768l4287j8435n898L260L3001l79K4288M1020
3468D1586k487j2816m310L899j5187J1833J0019N224l1199N76R301l7302R261
3455a1602k5654K1400M6899j2035N709J6445k8217n2849J0447L3316m6906q001
3443e1048L5259m2463J1273l20k5708N7363K6881l483n4864R31M6753L794M074
$$ plain form
3531 35521 46145 43379 22169 -2398 24497 2012 39108 30381 47596 50072 82772 89843 37130
3518 37130 41018 33455 31144 53422 68486 64652 82489 59329 33525 27199 14271 -4464 16871
3505 16871 23195 43047 -577 -27858 -39137 -6997 10293 711 -9927 -13764 40907 81333
3493 81333 91211 81938 71782 85567 79748 50343 31740 58433 13188 -15418 7462 34107
3481 34107 3107 11954 13718 21784 -984 -35271 -53706 -59604 -56344 -23343 -23722 566 41586
3468 41586 39099 26283 21973 25872 10685 22518 32537 37761 6562 7138 16439 -20863 -11602
3455 -11602 -37256 -15856 31043 19008 24717 41162 12945 -39904 -29457 3859 -43047 -51048
3443 -51048 -15789 -58252 -46979 -47299 -73007 -15644 11237 7754 -47110 -46179 574 4368 8442
3430H442Q410j0639J1170J842k5199j6748p561j0797k8055O6320K5057J698p959
3417A5981l5028j2196N418j5591M2950M5376k036K0075n647r082k5740R256P33
3404C4469j8464L0476l3225j2803M673k2855J2564M0126P871j2519o6301L9853
3392C865P621j6347R214K7241J4592l0304J2421J1392r454j4050R50m7459J6973
3379a3345M1898n878J5633k138J4790l2834o361L213k4800l1926M7034K5864K525
3366C3675j847p262Q568j811j5458K1754p997j5287K5175L5319J8082l4569n3742
3353D600N1436j6575j1833N0784n6624J0268j5708K0616j7010r84M8233K3406
3341I0609l6677m661p743j1288j6155J9383R581j6792K8359p800J241k3165j9497
$$ plain form
3430 8442 16852 6213 17383 19225 -5974 -22722 -30283 -41080 -69135 -2815 22242 23940 15981
3417 15981 -19047 -31243 -25825 -41416 1534 46910 44874 64949 59302 50220 24480 33736 34469
3404 34469 16005 46481 13256 453 5126 -17729 -5165 34961 42832 30313 -35988 3865
3392 3865 11486 -4861 4353 31594 46186 15882 28303 39695 30241 16191 17141 -30318 -13345
3379 -13345 28553 22675 38308 36170 50960 18126 11765 14978 -9822 -41748 5286 31150 33675
3366 33675 31828 24566 33134 31323 15865 37619 29622 14335 39510 74829 92911 58342 4600
3353 4600 56036 39461 27628 78412 21788 32056 16348 36964 19954 18970 67203 90609
3341 90609 53932 49271 41528 30240 14085 33468 43049 26257 54616 46816 48057 24892 5395
3328E395J6186M820R962J1042J41r867p886O430j6939l907R251j0095J1239N921
3314C1693n14l2633k3204K8781M5391k9871l4857J5769J975O1875k5486o1267
3302b2348j3841k4753Q0802L2036L2764l2780k6947M6177J3243l4465l7435J2632
3290B5085K3444k7292l2194Q317N371R247J6584K2511J2813k5390p1383J5714
3278a7173j2322n896L8408K0589K4045m3224N033O679P450O076l2294M1161l510
3265C5022L260m669n506L2528M148M394j6919j6478j1773J131l3654K713J8404
3252A2601J2107p413k5511K7120l267j0480J9887j0819k743K7310K5686o063J0045
3239F8460j5587j650o801O671r204k0928O377p345j4143K1945K6340j1023p309
$$ plain form
3328 5395 21581 26401 36363 47405 47546 37679 29793 36223 19284 15377 24628 14533 25772 31693
3314 31693 31179 -1454 -24658 4123 49514 19643 -15214 555 2530 64405 38919 -22348
3302 -22348 -36189 -60942 19860 51896 84660 51880 24933 71110 84353 49888 12453 25085
3290 25085 48529 21237 -10957 -2640 2731 11978 28562 51073 63886 38496 -32887 -17173
3278 -17173 -29495 -35391 3017 23606 47651 4427 9460 16139 23589 29665 -2629 38532 35022
3265 35022 38282 33613 28107 60635 64783 69177 52258 35780 24007 25138 -8516 -5803 12601
3252 12601 24708 17295 -8216 18904 15637 5157 25044 14225 11482 38792 64478 58415 68460
3239 68460 52873 51223 44422 51093 41889 20961 27338 19993 5850 27795 54135 43112 35803
3226C5803j9099Q534l2205K9870J7597l069l5027L7864P0977L4606L5826j6829
3214A64848M42L9088j1064m2842j9067l5174k0043N590Q818l1804N77K255O326
3201F7950m3642N447K6690m0976J1014k9222n777K4705j1360K6879j1528k4916
3189d736k0092K1632l330k4563J2177J1138L3444k8913q928k0274Q1727r627m7016
3176g361M892j1090l0329N9777L1626n0365J6296p492J3959K5476P340j2291P264
3163D7702j5829K3903m482j9626K1758K5448l6678j8256k1248L1761l9167j003
3151e717L0937l1184L5420O7267J7927q9463J564j2862k7888K409j419m544J7367
3138a86r747L4649m5642k0186R406n803O5134K3170j6248N1998l458m9030j1373
$$ plain form
3226 35803 16704 25238 -6967 22903 40500 37431 2404 40268 111245 145851 181677 164848
3214 164848 165290 204378 193314 150472 131405 96231 76188 81778 90596 58792 59369 61624 67950
3201 67950 24308 29755 56445 15469 26483 -2739 -8516 16189 4829 31708 20180 -4736
3189 -4736 -24828 -3196 -6526 -31089 -18912 -7774 25670 -3243 -12171 -32445 49282 39655 -7361
3176 -7361 -2469 -13559 -43888 15889 47515 -2850 13446 5954 19913 45389 52729 40438 47702
3163 47702 31873 55776 51294 31668 53426 78874 42196 23940 2692 34453 -4714 -5717
3151 -5717 25220 -5964 29456 96723 114650 25187 26751 13889 -13999 -11590 -13009 -17553 -186
3138 -186 -9933 24716 -20926 -41112 -31706 -37509 27625 50795 34547 86545 83087 34057 22684
3125B2684J7956j5244j9450k7777m662K9626M022k407K2227O879j0012J3566j7091
3112B0317R062k4832k1996k955L5733J1161L601J5163k9572m4434L5550J0583
3100A7381N4830L2342k2573K6003L4889L8084N8534N6279Q3811J02064J20576
3089F02220O7132M176m7182k0946l7323m0995o8678r0120n5024p8375j7245M8313
3077B65953j6494n8065n2369L8519k4474n0069J2220M715K1420k262Q704k1634
3065A26164j9598K2603l0870n8105k7816j8777N3360M805j5020L2185J6265l0637
3053E4559n344k2570r738M0295r881p199n890J1719Q495j8043J3121m1690j5991
3040h157k79k3798L2173M7772P675j0964r327K5389j4019l9912K0276N5289m4355
$$ plain form
3125 22684 40640 25396 5946 -21831 -26493 3133 7155 4748 26975 33854 23842 37408 20317
3112 20317 29379 4547 -17449 -20404 15329 26490 30091 45254 15682 -28752 6798 17381
3100 17381 72211 104553 81980 107983 142872 180956 239490 295769 379580 481644 602220
3089 602220 669352 673528 626346 605400 568077 527082 458404 368284 313260 234885 217640 265953
3077 265953 249459 191394 139025 177544 153070 103001 115221 119936 141356 139094 147798 126164
3065 126164 106566 129169 98299 40194 12378 -6399 46961 51766 36746 68931 85196 54559
3053 54559 49215 26645 16907 57202 47321 40122 34232 45951 54446 36403 49524 7834 -8157
3040 -8157 -8436 -32234 -61 47711 55386 44422 35095 60484 46465 6553 26829 82118 37763
3027C7763Q9J6009k6166k4741L979J1433K9429O783L157J2676R531M346l004K3443
3013A04727m5672k8529L1313N0539p4785j2452J4389Q938J7686m3830R778K3405
3001E5507j2214Q74R630J9858q56q09j4166J8570J2035n03J0963j7831J3081j6195
2987G7944K74J3376k2776l301J4287N2570j3192j3794K7764k5550J2118N465J8482
2974A43667n594K2481J6931k4987M3161K200O317J8476N4303J11315J03532J45181
2962F36983J70849J54933R0719K3975l0269o6553j29533r4528j07947r0035q8703
2951D69891q7213m8350k0414j6707l8566m104J009j2901j4321P185P330j6095
2939B26744l3717N7669K5824R170M7926O7967R1543J15723J61155J51627J19688
$$ plain form
3027 37763 37852 53861 27695 2954 6933 18366 47795 54578 57735 70411 79942 84288 81284 104727
3013 104727 59055 30526 61839 112378 37593 25141 39530 48468 66154 22324 32102 55507
3001 55507 43293 44167 53797 73655 72799 71990 57824 76394 88429 87926 98889 81058 94139 77944
2987 77944 78218 91594 68818 65517 79804 132374 119182 105388 133152 107602 119720 125185 143667
2974 143667 138073 160554 177485 152498 195659 197859 204176 222652 276955 388270 491802 636983
2962 636983 807832 962765 1053484 1077459 1047190 980637 851104 756576 648629 558594 469891
2951 469891 382678 334328 313914 297207 258641 254537 255546 242645 228324 235509 242839 226744
2939 226744 193027 250696 276520 285690 333616 401583 493126 608849 770004 921631 1041319
2928A041319M3865l1116p9908j01982j18459j06885o7789q1425j10650n0011m0417
2917B96542n2309m1827R008l4398m3884p502j5886j8646r045L9139k2569l1687
2905F6936J222l864j7066j0815K1418l0962J7859l3372k785J6826J8082J9470
2893F2949n4122j2008j3261M2332k6881j9922j1601j026L706J05Q397L3860J1538
2880B4066J1165M4746j6376l1822Q829O40k3856K4005J0623J4731q528r27m712
2867E2584J9877l5128K796M0965l1198p601K8099K9490l6847L5264j7205q900
2855G2196n8N034m0393j2976L8548J0211L5037j0823J1251l932J631j7559k6356
2842F1811O8038j2030m556J6572l4978k272L1609K0402j8097k7207K0388K6783
$$ plain form
2928 1041319 1085184 1054068 974160 872178 753719 646834 579045 497620 386970 336959 296542
2917 296542 244233 202406 211414 177016 133132 125630 109744 91098 82053 121192 98623 66936
2905 66936 68158 64294 47228 36413 57831 26869 44728 11356 8571 25397 43479 62949
2893 62949 8827 -3181 -16442 25890 -991 -20913 -32514 -33540 -29834 -29729 -21332 12528 24066
2880 24066 35231 79977 63601 31779 40608 41248 17392 41397 52020 66751 58223 57296 52584
2867 52584 72461 37333 40129 81094 49896 42295 70394 99884 63037 98301 81096 72196
2855 72196 72138 77172 36779 23803 62351 72562 107599 96776 108027 104095 105726 88167 61811
2842 61811 129849 117819 113263 129835 94857 92585 124194 144596 126499 99292 119680 146463
2830A46463k3296j3259J171k8142J2853k1597k2361N3800L4048n2185p3914j4075
2818d94K4027J4146k2390N524M588J0928k1885J5594l5258R671N8698O985l7939
2805C2195l6883J5604j2497J1058j3493J8382j7366J6653K7112K5697j4478m442
2793D7542K5269l5777l2149q348l46l306J5435J519j8579r333K1187M716J398
2780I228M2800L0746l6453n822n6043K8539j3077R146r117j1307j3226J9902L8516
2767C3832l1001J5410j879k3898J4519J1461K619J6932k130o320m138k8476m128
2754g197l8886n684J9895K9708J0024k9080Q766L4884m7425m1209J4812R561M2695
2741H64J2530M94j5783j4749P981Q546j1142L3533K6883j829k8705l5792q401
$$ plain form
2830 146463 123167 109908 111079 82937 95790 74193 51832 105632 139680 87495 13581 -494
2818 -494 23533 37679 15289 20813 25401 36329 14444 30038 -5220 4451 63149 70134 32195
2805 32195 -4688 10916 -1581 9477 -4016 14366 -3000 13653 40765 66462 51984 47542
2793 47542 72811 37034 4885 -3463 -3809 -7115 8320 9839 -8740 -18073 3114 7830 9228
2780 9228 52028 82774 46321 40499 -15544 12995 -82 9064 -53 -11360 -24586 -4684 33832
2767 33832 2831 18241 16362 -7536 6983 18444 21063 37995 35865 29545 25407 -3069 -7197
2754 -7197 -46083 -51767 -31872 -2164 7860 -21220 -12454 22430 -24995 -66204 -51392 -41831 864
2741 864 13394 13888 -1895 -16644 -8663 -117 -11259 22274 49157 47328 18623 -17169 -25570
2728b5570J5170K2948j4026r781R778j5032l1215L5234K4018p526K2509l5605
2716i098m779J2881r992p761N468o379L174N2108j4369k8935j1469m618N3523
2703B9754l0535J6078m784n619M5708L4282l9674j1326o580J1720j1044N741J7123
2690E0844m0535L6772J3661J2318l3739K504r940k065M4067n4916J1584n866k387
2677B2302J9821K0615l7243K2575Q82J5037j5401k8902J2999j7911O882N06l8916
2664a6754N022M1738N892m049j4259k6491j469J9768j334K669K5282N682O760
2651D8457J780n452L0596N137l1324J9380L4499j8418L549m3767k3622q372o2
2638A2381j5106M7859L4566k1849L5840M218l0336j8351j9094L8746J7701K2007
$$ plain form
2728 -25570 -10400 12548 -1478 -11259 -1481 -16513 -47728 -12494 11524 3998 26507 -9098
2716 -9098 -13877 -996 -10988 -18749 -13281 -19660 -16486 35622 21253 -7682 -19151 -23769 29754
2703 29754 -781 15297 10513 4894 50602 84884 45210 33884 27304 39024 27980 33721 50844
2690 50844 10309 47081 60742 73060 39321 41825 31885 29820 73887 18971 30555 24689 22302
2677 22302 42123 62738 25495 48070 48952 63989 48588 19686 32685 14774 21656 22162 -16754
2664 -16754 -11732 30006 35898 31849 17590 -8901 -10370 9398 8064 10733 36015 41697 48457
2651 48457 50237 44785 75381 80518 49194 68574 103073 84655 88204 44437 20815 12443 12381
2638 12381 -2725 45134 79700 57851 93691 97909 67573 49222 30128 68874 86575 108582
2626A08582n691R606k4439m1189O54L0107L6046O75j1179j2198k5230J7631L9797
2613A23172m4443l9872O1755L1133J3600k8967k712p421Q970j6401J6711n2144
2601F3381N900J0680L636M3026j8902j1648j5586J9015K7931l7911K021j0385
2589H1158P8638o134n4942N4517J942K0603j6047k0272k404K2642J4152K3946
2577A97799M381l922k0306j3446K4779L0225k0384N329J2107K8393J2006j4140
2565B42821l6824O9230j3628m6928K0236p705j1386L5934l7486J9770K0759L7433
2553B92226K4109m1312R907q625n763J6743R63j051K6402M7873J0103o612L0284
2540C95247k4149k4244L4276L5485Q860K4779L2525K9458J852M6872K761l8962
$$ plain form
2626 108582 102891 112497 88058 46869 47523 77630 113676 114351 103172 90974 65744 83375 123172
2613 123172 78729 38857 100612 131745 145345 116378 113666 106245 115215 98814 115525 63381
2601 63381 69281 79961 83597 126623 107721 96073 80487 99502 127433 89522 91543 81158
2589 81158 159796 153662 98720 153237 155179 175782 159735 139463 137059 159701 173853 197799
2577 197799 202180 198258 177952 164506 189285 219510 199126 204455 216562 244955 256961 242821
2565 242821 205997 275227 261599 214671 234907 227202 215816 251750 214264 234034 254793 292226
2553 292226 316335 275023 284930 276305 270542 287285 288248 287197 313599 361472 371575 364963 395247
2540 395247 371098 346854 381130 416615 425475 450254 482779 512237 514089 560961 563722 524760
2528E24760j8178l8893K2795k1718k0470J1210j8368L2086J7957l0288J133L5392
2516D97418M0269r555k4154M1885q625m0346J1007N0840O082K1917O0344j4924
2504F32158N2610O5963M5852K9658l728R924J3782M3586L0144n8839l1439J3758
2492H43429N5491n414q334P5452M7366j9560o573K9259L2024m846l6597k0890
2480I80807k5816n788n9069n2275k0510l2040J9175l2669n4020o735k6223L1300
2468G16137j3210m2878j8176n0949j3310k7893p0679l9697k5982j3469j7452j5888
2456C66554l436n3638k1477p697k1319J5392l6203r031p213R833k0048M838l498
2443B13057K1262k3103k133L10l7887m219k6729l9969M463j400j1245R397k0938
$$ plain form
2528 524760 506582 467689 490484 468766 448296 459506 441138 473224 491181 460893 462026 497418
2516 497418 537687 528132 503978 545863 537238 496892 507899 558739 564821 586738 647082 632158
2504 632158 684768 750731 796583 826241 822513 832437 846219 889805 919949 861110 829671 843429
2492 843429 898920 893506 885172 960624 1007990 988430 981857 1011116 1043140 1038294 1001697 980807
2480 980807 954991 949203 890134 837859 817349 785309 804484 771815 717795 711060 684837 716137
2468 716137 702927 660049 641873 590924 577614 549721 479042 439345 413363 399894 382442 366554
2456 366554 363118 309480 288003 280306 258987 274379 238176 229145 221932 231765 211717 216555 213057
2443 213057 234319 211216 209083 209393 171506 167287 140558 100589 105052 103652 92407 101804 80866
2430H0866L1147K80K9302r741k9m043o971m262k0750K6958L4614l7759q2509J1484
2416D8587L1194L248k4130k8563l511M9293r288J6687J0261m9102k241O847j5229
2403C4053n837O1019M9327j5706n87j4030m6464J5183M4339k7443j1818j3011
2391F9025O6100j6150l5837M1022J2828Q980j8024k0298j8594M7541n214m3280
2379H8099J2015L3153k1418P91l3977Q601K0838j0019m0838p047L9366L2731j6225
2366A06070r471l4125l5L5199n4505J3594K7268J3293k010J8471p2939K668L8943
2353H2421L6952L8015m8632M4m232j9503k6269J9160k7391M5983m3665j4452N8389
2340I6820j6438k1898m948M0743o930l3668R689k3032j4775m80m6673J3148L5642
$$ plain form
2430 80866 112013 112293 141595 131854 131825 127782 120811 116549 95799 122757 157371 119612 37103 48587
2416 48587 79781 83029 58899 30336 26825 76118 66830 83517 93778 44676 42435 49282 34053
2403 34053 28216 89235 138562 122856 122269 108239 61775 76958 121297 93854 82036 69025
2391 69025 135125 118975 83138 124160 136988 145968 127944 107646 89052 136593 131379 88099
2379 88099 100114 133267 111849 112640 78663 87264 108102 98083 57245 50198 89564 122295 106070
2366 106070 96599 62474 62439 97638 43133 56727 83995 97288 95278 113749 40810 43478 82421
2353 82421 119373 157388 108756 108800 104568 85065 58796 77956 50565 96548 52883 38431 96820
2340 96820 80382 58484 53536 94279 87349 53681 63370 40338 25563 25083 -21590 -8442 27200
2327B7200K6097m4354L806N7301j6192Q439j2107N815L2120J9393m4740k9341
2315C3437M3988l8687J0480r071k0004p186K9423j4322J3016L2385o548m9432
2303A7479j9307J9227P893J6849j7238K5608J5264n7177j7577O794N178K1566
2291B4559k8704K0608j7529j7235K4408M9440l1087k5559J2872k5369M799N867
2279b930O381N0608J5644l8851J0678J1160r536l7260l8825K8796L6438l789K704
2266C1218l1980n3870J5148J1559K8230k8298P920K6590k5089K5740l2031K2820
2254b043L4818m3299l964L9312m243k9663N285J6237K102n5511K3043K3150M2370
2241D7594R46r243k4766l8552J2469J817K9641n881j2648j1795k0742L9404N97
$$ plain form
2327 27200 53297 8943 12749 70050 53858 62297 50190 56005 88125 107518 62778 33437
2315 33437 77425 38738 49218 40147 20143 12957 42380 28058 41074 73459 66911 17479
2303 17479 -1828 17399 25292 42141 24903 50511 65775 8598 -8979 -2185 2993 24559
2291 24559 -4145 16463 -1066 -18301 6107 55547 24460 -1099 11773 -13596 -8797 -2930
2279 -2930 3451 54059 69703 30852 41530 52690 43154 5894 -32931 -4135 32303 28514 31218
2266 31218 -762 -54632 -39484 -27925 305 -27993 -20073 6517 -18572 7168 -24863 -2043
2254 -2043 32775 -10524 -14488 24824 20581 -9082 -3797 12440 14542 -40969 -17926 5224 47594
2241 47594 48540 39297 14531 -24021 -11552 -9735 19906 14025 1377 -10418 -31160 8244 8841
2228H841n521J0362r014K4707K775K3314L376l5099n747J2873k9657k4372K5462
2215B300M3230l2571L6605J0105j1631o2850K2358L1468L756J0963o647j679P019
2202E2426j2101p475J4057j9599M98j4054Q360J4307o580j5771J1869j4203J9096
2189C0830N798j1050l2917M3763K8908J651J8009k8076l8414K1730J0985j8917
2177C2300J6264j1024R015j214J8395o334L752J7839K8547p974l0909k751K5512
2164I1418N285q999J9171L0584p460j3758k3359k4731L8541M5000j5157L9372
2152A75907J2302j2486j4115K1381l8893J1345K8204k7387q576J5226L444j3282
2140A53070o967J5590M467n1755M0305J8476p070o0529J0672N1063m732r41K5091
$$ plain form
2228 8841 3320 13682 4668 29375 32150 55464 58840 23741 17994 30867 1210 -23162 2300
2215 2300 45530 12959 49564 59669 48038 -14812 7546 39014 42770 53733 47086 45407 52426
2202 52426 40325 32850 46907 27308 27806 13752 22112 36419 29839 14068 25937 11734 30830
2189 30830 36628 25578 -7339 36424 65332 66983 84992 56916 18502 40232 51217 32300
2177 32300 48564 37540 46555 45341 63736 57402 61154 78993 107540 99566 68657 65906 91418
2164 91418 96703 87704 106875 137459 129999 116241 92882 68151 106692 151692 136535 175907
2152 175907 188209 175723 161608 182989 144096 155441 183645 156258 147682 162908 166352 153070
2140 153070 146103 161693 166160 114405 154710 173186 166116 105587 116259 167322 162590 161649 186740
2127A86740p731K9886j5652L4320j1232j865N1296J05364K453j848M1630j0861
2115D02500P966k3187k0178j3645l1417N010j2279p7232p2545K1709l2785l4507
2103A19410R604k5348N46m098K5542q367k0089J7847J1948K0765j0389m0013j7163
2090H0195j7498o045n175Q763k7937k225J7701L1986l9158K4048l6873J1209j4178
2077B4813k2687J3169J4013r296k5171M1630j3229J6261l6992j6339k6624J3914
2065b6538J2067l601L934m3510l362j0756O118M8383j0493j1825j4358L2568L302
2052a8071K0396r006k7734J2410r824n7018J6739M4881l8949r693j963r929J0727
2039g7034J5436J9002K1895k8322R459k082j4646Q218J2271J1778j6271j5768
$$ plain form
2127 186740 179009 208895 193243 227563 216331 214466 265762 371126 373579 371731 413361 402500
2115 402500 410466 387279 367101 353456 322039 327049 314770 237538 164993 186702 153917 119410
2103 119410 129014 103666 104212 100114 125656 117289 97200 115047 126995 147760 137371 97358 80195
2090 80195 62697 56652 51477 60240 32303 30078 47779 79765 40607 64655 27782 38991 24813
2077 24813 2126 15295 29308 20012 -5159 36471 23242 39503 2511 -13828 -40452 -26538
2065 -26538 -14471 -18072 -14138 -57648 -61010 -71766 -65648 -17265 -27758 -39583 -53941 -21373 -18071
2052 -18071 2325 -6681 -34415 -22005 -31829 -88847 -72108 -27227 -66176 -75869 -77832 -87761 -77034
2039 -77034 -61598 -42596 -20701 -49023 -39564 -41646 -56292 -48074 -35803 -24025 -40296 -56064
2027e6064m1270Q007N2729k3398o039j4644N6306J8248R71J1268k4525K2945j2924
2014h390k2304L1796l082k5755l6675j4904r191L0016J2523m3219M889J1936L6
2001g2324M0902l938k617m7048l1161L5422M1490R73n044l5184O411L5778K8519
1988g821J8462l7757j6487k4757K1802L5454o0760j6660K6501J6564O026l4899
1976g4332L5630L3655r710m9297J2681o151P018m4238J8815L5082k5340k8790
1964i4977J1378N482k6566M506l985j7873j00q536J518Q194L0977n947r003l199
1950a08131l6463L6964L5510J6316j3417L6943p724l0042K4701j2489l1285j9634
1938a08751L1873R457m8413J6309K5177j3815L596j3042J2118L1842j708j8737
$$ plain form
2027 -56064 -97334 -89327 -36598 -59996 -66035 -80679 -24373 -6125 -5154 6114 -18411 4534 -8390
2014 -8390 -30694 1102 -1980 -27735 -64410 -79314 -88505 -58489 -45966 -89185 -84296 -72360 -72324
2001 -72324 -31422 -35360 -37977 -85025 -116186 -80764 -39274 -38301 -43345 -78529 -72118 -36340 -7821
1988 -7821 10641 -27116 -43603 -68360 -46558 -11104 -71864 -88524 -62023 -45459 -39433 -74332
1976 -74332 -38702 -5047 -14757 -64054 -51373 -57524 -50506 -94744 -75929 -40847 -66187 -94977
1964 -94977 -83599 -78117 -104683 -100177 -104162 -122035 -122135 -130671 -129153 -120959 -89982 -95929 -104932 -108131
1950 -108131 -144594 -107630 -72120 -55804 -69221 -32278 -40002 -70044 -45343 -57832 -89117 -108751
1938 -108751 -76878 -67421 -115834 -99525 -74348 -88163 -84567 -97609 -85491 -53649 -55357 -74094
1926g4094J1350m401O614N892m5464K1775k2755m99J7018m9876K5161K1808N756
1913h1715m006m5874J3203O5660k1232K0844J0131N42R959l8502O114j6380j0446
1900i1702l7993j2543P782k5824M3140K2603M733J1631j1144o318j0209K9026
1888g6818L8428j0031K9837q0385K5440N8363k3611K3814k9168K1841J2275l5828
1876d5843l9713k5959j8125L1842J0658J200j8948J5952m049q592J6984K0277
1864f4316m3005O564K3837K2763l322K5901j2957M869L856l7705k6477L387L0105
1851f6500J4312k3193m374k4742L521Q013j5594N4640L897J7087k4180K3154m7662
1838h1621j0841L3109o159m718K9302r089q808L0197j4989j4977M4085m0316j086
$$ plain form
1926 -74094 -62744 -67145 -60531 -54639 -100103 -78328 -101083 -101582 -84564 -134440 -109279 -87471 -81715
1913 -81715 -85721 -131595 -118392 -52732 -73964 -53120 -42989 -42447 -32488 -70990 -64876 -81256 -91702
1900 -91702 -129695 -142238 -134456 -160280 -117140 -94537 -89804 -78173 -89317 -95635 -105844 -76818
1888 -76818 -38390 -48421 -18584 -98969 -73529 -15166 -38777 -14963 -44131 -22290 -10015 -45843
1876 -45843 -85556 -111515 -129640 -97798 -87140 -85940 -104888 -88936 -92985 -101577 -84593 -64316
1864 -64316 -107321 -100757 -76920 -54157 -57479 -31578 -44535 -39666 -35810 -73515 -99992 -96605 -66500
1851 -66500 -52188 -75381 -79755 -104497 -100976 -92963 -108557 -53917 -50020 -32933 -57113 -33959 -81621
1838 -81621 -92462 -59353 -65512 -70230 -40928 -50017 -58825 -28628 -43617 -58594 -14509 -54825 -55911
1825e5911k5586l525p378J037L8258O22k4831k998M629J2227J0159j2089k9422
1812i4808m2100L6370J6244K5788K4090j2415j3676k733K2348j3922l2006r340
1800i6160j3739J0380N0405j072k4167Q017K1885j661j567M5074n2648Q239n592
1787e2606l0498k4483K7685J4919L0553M85l8929l475J6561J2426J1943r061j9863
1774f4343j1839j9709L035N881k9764R626J7161J6355k0227l3168L140M6397J1614
1761f5841k5509O293m0584R713K9401K9O45L1725J8320J3593Q670n2345k6162
1748i2052M1282j0164m099J9409k6944l1507p959n095m464l1707K1479J0469K2301
1735i9051k018j0830M299J8019j615M32J0683L124k808K7816J1070l6647k1368
$$ plain form
1825 -55911 -81497 -85022 -92400 -91363 -53105 -52483 -77314 -80312 -75683 -63456 -53297 -65386 -94808
1812 -94808 -136908 -100538 -84294 -58506 -34416 -46831 -60507 -63240 -40892 -54814 -86820 -96160
1800 -96160 -109899 -99519 -49114 -50186 -74353 -66336 -44451 -46112 -47679 -2605 -55253 -47014 -52606
1787 -52606 -83104 -107587 -79902 -64983 -34430 -33945 -72874 -76349 -59788 -47362 -35419 -44480 -64343
1774 -64343 -76182 -95891 -92856 -86975 -116739 -107113 -89952 -73597 -93824 -126992 -123852 -77455 -65841
1761 -65841 -91350 -85057 -125641 -115928 -86527 -86498 -85853 -54128 -35808 -22215 -13545 -65890 -92052
1748 -92052 -50770 -60934 -65033 -45624 -72568 -104075 -112034 -117129 -121593 -153300 -131821 -121352 -99051
1735 -99051 -101069 -111899 -107600 -89581 -91196 -90764 -80081 -76957 -79765 -51949 -40879 -77526 -98894
1722i8894k5335r216J0444j0L0255M0765m2945J7216O7953M365k6167J0379j2661
1709c3851K013m1182J208K3746l6677L1846J8996m2610j0708J0465R793q21l5366
1696a03148j2541M2868K8080j1084J6284n5821k2723K9291R420K4562k6935k9928
1684a11675r655K2713N8419j4149m9183L9431J1872l2419j0302j172j973J6442
1672h1651L3264j3446J8687m763l2043K4188P289l183o0447O457K7957M896j773
1659g4568Q666J8612j3070j3125k6087K5550J3279j6537O30o841j2784P436j4296
1646a03135J0660m1048J0651M5520J3640l1602n5554M5876M5786J2879j3406n8965
1634a18698L0375N6570J8241l1257n2474p223J7056l756j8812N554K0446r235
$$ plain form
1722 -98894 -124229 -133445 -123001 -123011 -92756 -51991 -94936 -77720 -9767 -5402 -31569 -21190 -33851
1709 -33851 -31838 -73020 -71812 -48066 -84743 -52897 -33901 -76511 -87219 -76754 -66961 -67782 -103148
1696 -103148 -115689 -72821 -44741 -55825 -39541 -95362 -118085 -88794 -79374 -54812 -81747 -111675
1684 -111675 -121330 -98617 -40198 -54347 -103530 -64099 -52227 -84646 -94948 -96120 -98093 -81651
1672 -81651 -48387 -61833 -43146 -47909 -79952 -55764 -48475 -51658 -112105 -105648 -77691 -72795 -74568
1659 -74568 -65902 -47290 -60360 -73485 -99572 -74022 -60743 -77280 -76650 -83491 -96275 -88839 -103135
1646 -103135 -92475 -133523 -122872 -77352 -63712 -95314 -150868 -104992 -59206 -46327 -59733 -118698
1634 -118698 -88323 -31753 -13512 -44769 -97243 -104466 -87410 -91166 -109978 -104424 -83978 -93213
1622i3213L3298K5588n623N540m2491K8062O5183L5146q055j0015J1551O7267
1610A12238K3182M2880M959n9026N590j1300j7521l0641j2933k1996j6007n768
1598A3657J8668j9218j1475K6331j2035k1720k4418Q839Q668k2109l4089L3486
1586c5415j9473J3318O7566O526J52n646m9901J1681m915J1844l5824k9914J8362
1573e1639j5796q415K2060K1020j5841j9168L3440k0809j3350L9211q931j9561
1561e7779k1391m955M6384L006J4363N018J0770p592j7951J1042n0450N2403l585
1548b0717m09K246q06r347m238P189J2533j3693m070j3392J2029l0457J1951M7727
1534c454m2946j2554J5294L0577q213J63K8012K712L3710m9426r4477N7238j051
$$ plain form
1622 -93213 -59915 -34327 -39950 -34410 -76901 -48839 16344 51490 43435 33420 44971 112238
1610 112238 135420 178300 183259 124233 129823 118523 101002 70361 57428 35432 19425 13657
1598 13657 32325 13107 1632 27963 15928 -5792 -30210 -21371 -12703 -34812 -68901 -35415
1586 -35415 -54888 -41570 25996 32522 32674 27028 -22873 -11192 -16107 -4263 -40087 -70001 -51639
1573 -51639 -67435 -75850 -53790 -32770 -48611 -67779 -34339 -55148 -68498 -29287 -38218 -57779
1561 -57779 -79170 -84125 -37741 -34735 -20372 -15354 -4584 -12176 -30127 -19085 -69535 -17132 -20717
1548 -20717 -21126 -18880 -19686 -29033 -33271 -26082 -13549 -27242 -31312 -44704 -32675 -63132 -51181 -3454
1534 -3454 -46400 -58954 -43660 -13083 -21296 -21133 6879 9591 43301 -6125 -100602 -43364 -44415
1521d4415k523L5451k0827j2495J9759L1448k9981k3167M1352J592M6731O018
1509D8943l7201J2585k2508L6403k1450J8038k7577k2992L6075J7173M6092R285
1497I2866j1170O919l7872m3162L9321r660k0225j5794k8240J2063j718K2843
1485F171m46k6743M047L9445M1286j8271k7528L5990j5103J0764K1428j7121j3596
1472D0323L4355K952k7824K6648K0173L562m2361m3242K6962J5076Q744O4655
1460A30023J2756m308K369j8331l9587J3958k3587K5887J1337L896k026J5961
1448A28348K2688P550K0292l4487k3769l310j1148L0185K882J4079J8762j7013
1436A55059J7553L9421k6197n821k9390K039K0217L2220N4325J3992j1037j9443
$$ plain form
1521 -44415 -46938 -11487 -32314 -44809 -25050 6398 -23583 -46750 -5398 -3806 42925 48943
1509 48943 11742 24327 1819 38222 16772 34810 7233 -15759 20316 37489 83581 92866
1497 92866 81696 88615 50743 7581 46902 37242 17017 1223 -27017 -14954 -16672 6171
1485 6171 5725 -21018 -16971 22474 63760 45489 17961 53951 38848 49612 71040 53919 40323
1472 40323 74678 77630 49806 76454 96627 100189 57828 14586 41548 56624 65368 130023
1460 130023 142779 138471 140840 122509 82922 96880 73293 99180 110517 114413 112387 128348
1448 128348 151036 158586 178878 144391 120622 117312 106164 136349 139231 153310 172072 155059
1436 155059 172612 212033 185836 180015 150625 152664 172881 205101 259426 273418 262381 242938
1424B42938k1076P086j2112K3573K7963P702q579J8945N532j2271L5546K0846
1412C36093k830L6915L9576K0036j1153k8118J4984J647N3359l907L3014j7701
1400D71915L9925j428J5797M1328n40K0524N4008N2126M9120p627j2784M4555
1388G66919M401P3621L4287K5473K8952L874N0556P8954M9303M1279P8548N8314
1376A294481M8998M5837O5725Q1412L6779Q1797J12943P0396O9103M4755J62563
1365B114789J58524J49659K01676K76079K83024L25808M13789M48983M27523L50116
1355E149970M02532M37054N32143O52261Q31773J124912J578549K149358L045205
1346A5903757M603571O411840P343281O200182L157224n50798k731314l484699
$$ plain form
1424 242938 221862 228948 216836 240409 268372 276074 267495 286440 291972 279701 315247 336093
1412 336093 333263 370178 409754 429790 418637 390519 405503 407150 460509 456602 489616 471915
1400 471915 511840 510412 526209 567537 566997 587521 641529 693655 742775 735148 722364 766919
1388 766919 771320 844941 879228 904701 933653 937527 988083 1067037 1116340 1157619 1236167 1294481
1376 1294481 1343479 1389316 1455041 1536453 1573232 1655029 1767972 1838368 1907471 1952226 2114789
1365 2114789 2273313 2422972 2624648 2900727 3183751 3509559 3923348 4372331 4799854 5149970
1355 5149970 5552502 5989556 6521699 7173960 8005733 9130645 10709194 12858552 15903757
1346 15903757 20507328 26919168 34262449 40462631 43619855 43069057 40337743 36853044
1338C6853044m351869m471183m138089l684719l256660k714313k063588j535612
1330A0637011j165536q30766o68292n75784n63109n57940n01248m86155m27340
1321D860841l90112l56658l48864k97235k24382j43340j60236j56413j52298j14408
1311B516895j46166q0412j00215j04209p7575o9814p4641o4995q0016q6212k8269
1300A604371n3969r3967n5596n8445n6017n9095m3454j8455l9590j4983q672j8854
1288A083274j7455l4918k5201l8353l6420n3778k7505k1605l9479j4818j0085
1277G63657K4635n64r27l2964L420l8019k1252M303k7836L895k8360j2337o4398
1264E73253O566j6896k0694J7325j3186j1114l1818k3761n6143k7654J2571K0565
$$ plain form
1338 36853044 32501175 28029992 23891903 20207184 16950524 14236211 12172623 10637011
1330 10637011 9471475 8640709 7972417 7396633 6833524 6275584 5774336 5288181 4860841
1321 4860841 4470729 4114071 3765207 3467972 3243590 3100250 2940014 2783601 2631303 2516895
1311 2516895 2370729 2290317 2190102 2085893 2008318 1938504 1863863 1798868 1718852 1632640 1604371
1300 1604371 1550402 1456435 1400839 1342394 1286377 1227282 1183828 1165373 1125783 1110800 1102128 1083274
1288 1083274 1065819 1030901 1005700 967347 930927 877149 849644 828039 788560 773742 763657
1277 763657 788292 787728 786801 753837 757257 719238 697986 702289 674453 678348 649988 637651 573253
1264 573253 579819 562923 542229 559554 546368 535254 503436 479675 423532 395878 408449 429014
1252D29014o548n463J9980j823n8471k7562K0035J2303K8894l2395m2556k1895
1240C13513j13K1454j9168J2433J862k2690j7426m22j5432m002j390M0443m832
1227C04230n1134m9988L0607N7780l8887n8497K0541L8432m1903n3851j0841L5947
1215A82436J6113m77q670j5992m435N434k6791j9959P868K2942l4113L2226N5895
1202B12477l5413k3667k9773j7529K278K1462j0051q920K1867l5860R455J2328
1190A18654n6719j320k9578o636k553J5120M0680j1104j0552J0162J434j8846
1178D8742j8950K3285J2370l5735j6628N5875r058Q804Q554n77r212j4006L176
1165E6640q214r590N6537j3799l129J5897j9989j3197K8392R559p5937j6498M9060
$$ plain form
1252 429014 422466 417003 436983 435160 376689 349127 369162 381465 410359 377964 335408 313513
1240 313513 313400 334854 315686 328119 329981 307291 289865 289443 274011 270009 268619 309062 304230
1227 304230 253096 203108 233715 291495 252608 194111 214652 253084 211181 157330 146489 182436
1215 182436 198549 198072 189402 173410 168975 174409 147618 127659 135527 158469 124356 156582 212477
1202 212477 177064 153397 123624 106095 108373 129835 119784 110864 132731 96871 106326 118654
1190 118654 61935 60615 31037 24401 21848 36968 77648 66544 55992 66154 67588 48742
1178 48742 29792 53077 65447 29712 13084 68959 59901 68705 77259 76682 67470 53464 56640
1165 56640 48426 38836 95373 81574 78445 94342 74353 61156 89548 99107 23170 6672 55732
1152E5732J4800k6121k6814k721m215n80N5809L229m2678J6732J4430n117K1731
1139G4217n7120l347m502K0408J9286M071k8577K0606r164J0104r901j4845K3174
1126D4410J7368O638j0427o0273J4010l172N57L8016l0072l5026J9335M6868l5241
1113A2991l1929K4544j4533k89M1440K340l1183k3654N9111j0287o3106J5899
1101a8656J6907j7468J4967J9308l1765K7768R828j3142n445J1780o123J3598
1089B1557o640J8632Q239J0311P265j4501K5797j974k0922N25K2393L8547N2911
1076A62140K0497l8076L0265J4686P728M674m499p61j4154k0941l0435N16m7232
1063H4408k7965J3216k27n6595J6900o334l0639R528j403k1872L7047K2258M204
$$ plain form
1152 55732 70532 44411 17597 14876 10661 10081 65890 69119 26441 43173 57603 52486 74217
1139 74217 17097 13750 9248 29656 48942 53013 24436 45042 35878 45982 36081 21236 44410
1126 44410 61778 68416 57989 -2284 11726 8554 9111 47127 17055 -17971 1364 48232 12991
1113 12991 -18938 5606 -8927 -9216 32224 34564 3381 -20273 38838 28551 -34555 -18656
1101 -18656 -1749 -19217 -4250 15058 -16707 11061 20889 7747 2302 14082 7959 21557
1089 21557 14917 33549 41788 52099 59364 44863 70660 68686 47764 48289 70682 109229 162140
1076 162140 182637 144561 174826 189512 197240 201914 197415 196654 182500 161559 131124 131640 84408
1063 84408 56443 69659 69432 12837 29737 23403 -7236 2292 889 -20983 16064 38322 42526
1050D2526k9411k2474M4704L6445o5722J233j2575P579J5285k126r733J288M865
1037A1884P1602m0872k1971N995n4166M264M0010j6115k6853j0732J0341P261
1025a9352q752M748J5736o520K6008n236k8621j3119K0268M1671n2121k6262M0296
1012a1256J3393p148J9717l2251J9722k2696l2112j932N913M944J8281L1093o129
999d61q481k5963J525J6219K7615K074L7389l2042j8559J5118k9471J3046j9375
986b1366N6586l1471l0299j0137M0136l8228j2796N3275K0863P197l542k7126
974C092l6131q239L3027J7452j4854k2258J791P59J0644j6004P676M785l0507
961d8767J7513J726J1012j9406m102n1394J0899M1531K6505J0612j1005J0035
$$ plain form
1050 42526 13115 -9359 35345 71790 6068 7301 -5274 2305 17590 15464 5731 7019 11884
1037 11884 83486 42614 20643 26638 -27528 -23264 16746 631 -26222 -36954 -26613 -19352
1025 -19352 -28104 -23356 -7620 -14140 11868 6632 -21989 -35108 -14840 26831 -25290 -51552 -11256
1012 -11256 2137 -5011 14706 -17545 2177 -20519 -52631 -54563 -48650 -43706 -25425 5668 -461
999 -461 -8942 -34905 -33380 -17161 10454 12528 49917 17875 -684 14434 -15037 -1991 -21366
986 -21366 35220 3749 -26550 -36687 3449 -34779 -47575 5700 26563 33760 30218 3092
974 3092 -33039 -41278 -8251 9201 -5653 -27911 -26120 -25361 -14717 -30721 -23045 -18260 -48767
961 -48767 -31254 -29528 -18516 -37922 -42024 -93418 -82519 -40988 -14483 -3871 -14876 -4841
949d841J7178M1172k1918n408j6526J4133P314n1867k511M36r708j3497K0834
936b5209K4240j0449L5669k727m1755j3983O3544n030j0424M621j5584m7643J5318
923b9412L8201K9118j2350J1052j7588l3082J1802o181J5350j8560M0663j404
911B7609k8006p202K5743l0296j361J9610K9115L1212k2242n9591l7348L9829
899a2928l434o6480J321p991J8942K3562K106Q735J7667K817k9142J582J6169
886b7074M0084J4446l0426j2485M3130J9741J1773l4137k4191N514M87k278l8947
873c4363n384L9233N0427k4338k7086j8118j5487L310N621J7784j6984j8469K5994
860a7860J246l8331m1781M8245J6635K2956j363K450j1997J186M5371k4203p127
$$ plain form
949 -4841 12337 53509 31591 26183 9657 23790 31104 -20763 -23274 -22838 -32546 -46043 -25209
936 -25209 -969 -11418 24251 21524 -20231 -34214 29330 24300 13876 18497 2913 -44730 -29412
923 -29412 8789 37907 25557 36609 19021 -14061 -2259 -8440 6910 -11650 29013 27609
911 27609 -397 -7599 18144 -12152 -13513 6097 35212 66424 44182 -15409 -52757 -12928
899 -12928 -16362 -82842 -81521 -89512 -70570 -47008 -44902 -36167 -18500 -15683 -44825 -43243 -27074
886 -27074 13010 27456 -2970 -15455 27675 47416 59189 25052 861 6375 6862 4584 -34363
873 -34363 -39747 -514 49913 25575 -1511 -19629 -35116 -31806 -26185 -8401 -25385 -43854 -17860
860 -17860 -16614 -54945 -96726 -48481 -31846 -8890 -10253 -7803 -19800 -18614 26757 2554 -4573
847d573l201m4148n741K8005K0648j8747J1413N3938l1276k1447p285j0956M319
834b9051M8824J646n704M046R237l5657m5998J2964K6095L4221j6458l663j3253
821a2751k2186m997M4554K805k1334p811j3962k937J678K3915j5454J439r703
$$ plain form
847 -4573 -7774 -51922 -57663 -29658 -9010 -27757 -16344 37594 6318 -15129 -22414 -33370 -29051
834 -29051 19773 21419 15715 19761 28998 -6659 -52657 -39693 -13598 20623 4165 502 -12751
821 -12751 -34937 -39934 4620 7425 -13909 -21720 -35682 -38619 -36941 -13026 -28480 -27041 -36744
$$ [...]
##END NTUPLES=NMR SPECTRUM
##END=
