##TITLE=1H_CA-9454-3
 200.13Hz, DMSO-d6.
 8 sc
 
 23.4.2026
##JCAMPDX= 6.0         $$ Bruker NMR JCAMP-DX V2.0
##DATA TYPE= NMR SPECTRUM
##DATA CLASS= NTUPLES
##ORIGIN= UXNMR, Bruker Analytische Messtechnik GmbH
##OWNER= pz
$$ XWIN-NMR		Version 3.5
$$ Thu Apr 23 15:22:35 2026 Russian Standard Time (UT+4h)  she@DPX200
##.OBSERVE FREQUENCY= 200.131
##.OBSERVE NUCLEUS= ^1H
##.ACQUISITION MODE= SIMULTANEOUS
##.ACQUISITION SCHEME= undefined
##.AVERAGES= 8
##.DIGITISER RES= 18
##SPECTROMETER/DATA SYSTEM= spect
##.PULSE SEQUENCE= zg30
##.SOLVENT NAME= CDCl3
##.SHIFT REFERENCE= (INTERNAL, CDCl3, 0, 16.1304)
##AUDIT TRAIL= $$ (NUMBER, WHEN, WHO, WHERE, WHAT)
$$ ##TITLE= Audit trail, XWIN-NMR		Version 3.5
$$ ##JCAMPDX= 5.01
$$ ##ORIGIN= Bruker BioSpin GmbH
$$ ##OWNER= she
$$ F:/spectra/data/she/nmr/H-C/1/pdata/1/auditp.txt
$$ ##AUDIT TRAIL=  $$ (NUMBER, WHEN, WHO, WHERE, WHAT)
(   1,<2026-04-23 15:21:06.17 +0400>,<she>,<DPX200>,
      <created by zg, POWCHK disabled, PULCHK disabled
       configuration hash MD5:
       00 E9 B6 7A A2 85 ED C7 34 08 36 98 17 FE 4E 26
       data hash MD5: 16K
       62 FA 67 A5 7C 5F C6 EE 7E 73 45 87 48 94 31 B8>)
(   2,<2026-04-23 15:21:09.60 +0400>,<she>,<DPX200>,
      <Start of raw data processing
       efp BC_mod = 2 LB = 0.25 FT_mod = 6 PKNL = 1 PHC0 = -4060.88 PHC1 = 7.79229 SI = 16K 
       data hash MD5: 16K
       6D D1 B8 07 E1 ED F8 48 B5 67 C3 DE 08 56 D5 39>)
(   3,<2026-04-23 15:21:30.79 +0400>,<she>,<DPX200>,
      <pk PHC0 = -10.81328 PHC1 = 12.2 
       data hash MD5: 16K
       3A 45 CF 1B 38 AA 42 48 93 35 EF 5C D1 D3 0F 48>)
(   4,<2026-04-23 15:21:35.14 +0400>,<she>,<DPX200>,
      <abs ABSG = 5 
       data hash MD5: 16K
       D6 1C 78 71 9E 79 83 0A 45 DA D7 CA CB BA 9B 51>)
$$ ##END=
$$ 
$$ hash MD5
$$ DE 74 41 63 4B 82 9A 5D D2 BA D6 1B 48 7C B9 90
##$RELAX= 
##$RELAX= 
##$RELAX= 
##$RELAX= 
##$RELAX= 
##$RELAX= 
$$ Bruker specific parameters
$$ --------------------------
##$DU= <F:/spectra>
##$EXPNO= 1
##$NAME= <H-C>
##$PROCNO= 1
##$TYPE= <nmr>
##$USER= <she>
##$AMP= (0..31)
100 100 100 100 100 100 100 100 100 100 100 100 100 100 100 100 100 100 
100 100 100 100 100 100 100 100 100 100 100 100 100 100 
##$AQSEQ= 0
##$AQ_mod= 1
##$AUNM= <au_zg>
##$AUTOPOS= <>
##$BF1= 200.13
##$BF2= 200.13
##$BF3= 200.13
##$BF4= 200.13
##$BF5= 200.13
##$BF6= 200.13
##$BF7= 200.13
##$BF8= 200.13
##$BYTORDA= 1
##$CFDGTYP= 0
##$CFRGTYP= 5
##$CHEMSTR= <none>
##$CNST= (0..31)
1 1 145 1 1 1 1 1 1 1 1 1 1 1 1 1 1 1 1 1 1 1 1 1 1 1 1 1 1 1 1 1 
##$CPDPRG= <>
##$CPDPRG1= <>
##$CPDPRG2= <>
##$CPDPRG3= <>
##$CPDPRG4= <mlev>
##$CPDPRG5= <mlev>
##$CPDPRG6= <mlev>
##$CPDPRG7= <mlev>
##$CPDPRG8= <mlev>
##$CPDPRGB= <>
##$CPDPRGT= <>
##$D= (0..31)
0 0.7 0 0 0 0 0 0 0 0 0 0.03 0 0 0 0 0 0 0 0 0 0 0 0 0 0 0 0 0 0 0 0 
##$DATE= 1776943265
##$DBL= (0..7)
120 120 120 120 120 120 120 120 
##$DBP= (0..7)
150 150 150 150 150 150 150 150 
##$DBP07= 0
##$DBPNAM0= <>
##$DBPNAM1= <>
##$DBPNAM2= <>
##$DBPNAM3= <>
##$DBPNAM4= <>
$$ [...]
##$SUBNAM3= <"">
##$SUBNAM4= <"">
##$SUBNAM5= <"">
##$SUBNAM6= <"">
##$SUBNAM7= <"">
##$SUBNAM8= <"">
##$SUBNAM9= <"">
##$SW= 18.0517599122864
##$SWIBOX= (0..15)
0 0 2 0 0 0 0 0 0 0 0 0 0 0 0 0 
##$SW_h= 3612.71676300578
##$TD= 16384
##$TD0= 1
##$TE= 0
##$TE2= 300
##$TE3= 300
##$TEG= 300
##$TL= (0..7)
0 120 120 120 120 120 120 120 
##$TP= (0..7)
150 150 150 150 150 150 150 150 
##$TP07= 0
##$TPNAME0= <>
##$TPNAME1= <>
##$TPNAME2= <>
##$TPNAME3= <>
##$TPNAME4= <>
##$TPNAME5= <>
##$TPNAME6= <>
##$TPNAME7= <>
##$TPOAL= (0..7)
0.5 0.5 0.5 0.5 0.5 0.5 0.5 0.5 
##$TPOFFS= (0..7)
0 0 0 0 0 0 0 0 
##$TUNHIN= 0
##$TUNHOUT= 0
##$TUNXOUT= 0
##$USERA1= <user>
##$USERA2= <user>
##$USERA3= <user>
##$USERA4= <user>
##$USERA5= <user>
##$V9= 5
##$VALIST= <valist>
##$VCLIST= <CCCCCCCCCCCCCCC>
##$VD= 0
##$VDLIST= <DDDDDDDDDDDDDDD>
##$VPLIST= <PPPPPPPPPPPPPPP>
##$VTLIST= <TTTTTTTTTTTTTTT>
##$WBST= 1024
##$WBSW= 4
##$XGAIN= (0..3)
0 0 0 0 
##$XL= 0
##$YL= 0
##$YMAX_a= 239613
##$YMIN_a= -246333
##$ZGOPTNS= <>
##$ZL1= 120
##$ZL2= 120
##$ZL3= 120
##$ZL4= 120
##$ABSF1= 16.41792
##$ABSF2= -1.633974
##$ABSG= 5
##$ABSL= 3
##$ALPHA= 0
##$AQORDER= 0
##$ASSFAC= 0
##$ASSFACI= 0
##$ASSFACX= 0
##$ASSWID= 0
##$AUNMP= <proc_1d>
##$AZFE= 0.1
##$AZFW= 0.1
##$BCFW= 0
##$BC_mod= 2
##$BYTORDP= 0
##$COROFFS= 0
##$CY= -3
##$DATMOD= 1
##$DC= 0
##$DFILT= <>
##$DTYPP= 0
##$F1P= 0
##$F2P= 0
##$FCOR= 1
##$FTSIZE= 16384
##$FT_mod= 6
##$GAMMA= 0
##$GB= 0
##$INTBC= 1
##$INTSCL= 3.241238e-09
##$ISEN= 128
##$LB= 0.25
##$LEV0= 0
##$LPBIN= 0
##$MAXI= 10000
##$MC2= 0
##$MEAN= 0
##$ME_mod= 0
##$MI= 1.114404
##$NCOEF= 0
##$NC_proc= -7
##$NLEV= 6
##$NOISF1= 3.799351
##$NOISF2= 2.8
##$NSP= 0
##$NTH_PI= 0
##$NZP= 0
##$OFFSET= 16.13035
##$PC= 1
##$PHC0= -4071.693
##$PHC1= 19.99229
##$PH_mod= 1
##$PKNL= yes
##$PPARMOD= 0
##$PSCAL= 0
##$PSIGN= 0
##$REVERSE= no
##$SF= 200.129578198035
##$SI= 16384
##$SIGF1= 3
##$SIGF2= 2
##$SINO= 0.751879
##$SIOLD= 32768
##$SREGLST= <19F.Aceton>
##$SSB= 0
##$STSI= 16384
##$STSR= 0
##$SW_p= 3612.71676300579
##$SYMM= 0
##$S_DEV= 0
##$TDeff= 16384
##$TDoff= 0
##$TI= <>
##$TILT= no
##$TM1= 0
##$TM2= 0
##$TOPLEV= 0
##$USERP1= <user>
##$USERP2= <user>
##$USERP3= <user>
##$USERP4= <user>
##$USERP5= <user>
##$WDW= 1
##$XDIM= 16384
##$YMAX_p= 493440233
##$YMIN_p= -1959548
$$ End of Bruker specific parameters
$$ ---------------------------------
##NTUPLES= NMR SPECTRUM
##VAR_NAME=  FREQUENCY,     SPECTRUM/REAL,   SPECTRUM/IMAG
##SYMBOL=    X,             R,               I
##VAR_TYPE=  INDEPENDENT,   DEPENDENT,       DEPENDENT
##VAR_FORM=  AFFN,          ASDF,            ASDF
##VAR_DIM=   16384,         16384,           16384
##UNITS=     HZ,            ARBITRARY UNITS, ARBITRARY UNITS
##FACTOR=    0.220516191357248, 1,           1
##FIRST=     3228.16016428431, 0,            0
##LAST=      -384.556598721477, 0,           0
##MIN=       -384.556598721477, -1959548,    0
##MAX=       3228.16016428431, 493440233,    0
$$ Real data points
##PAGE= N=1
##DATA TABLE= (X++(R..R)), XYDATA
$$ [...]
6153b64119M13037q812l19476o441K13194l13743j6524J4629j98428N15668J04850
$$ -264119 148918 140106 -179370 -185811 27383 -286360 -302884 -288255 -486683 28985 133835
6142A33835k83369k66551J65690k30675K02577L94470K33234n42384k9855R7865
$$ 133835 -149534 -416085 -250395 -481070 -278493 115977 349211 -193173 -223028 -125163
6132a25163o75713K34458K33153k69287J26519J79391l24115J71647J11568J18759
$$ -125163 -800876 -566418 -333265 -602552 -476033 -296642 -620757 -449110 -337542 -218783
6122b18783q7487L4729J46539j70806k42176l88289K16010J76445n28585O3221
$$ -218783 -306270 -271541 -125002 -295808 -537984 -926273 -710263 -533818 -1062403 -999182
6112i99182L02473N01398N9943k80729l41247j0806n71345n942K52602J55839
$$ -999182 -696709 -195311 -135368 -416097 -757344 -768150 -1339495 -1345437 -1092835 -936996
6102i36996M15062j41454o6588j68553k7192r3948L11736K91832l94850J72306
$$ -936996 -521934 -663388 -729976 -898529 -925721 -1019669 -707933 -416101 -810951 -638645
6092f38645J79281J06799L45718j06119l61910L15922m33942K10790J67449k5296
$$ -638645 -459364 -352565 -6847 -112966 -474876 -158954 -592896 -382106 -214657 -239953
6082b39953O47549m45461n1899J22464j69857J42441M46175n73150n48326J29779
$$ -239953 407596 -37865 -89764 32700 -137157 5284 451459 -121691 -670017 -540238
6072e40238K69199K72243l09087n20266L70424j46931q88977M18274N42507k15238
$$ -540238 -271039 1204 -307883 -828149 -457725 -604656 -1493633 -1075359 -532852 -748090
6062g48090L20945M05491n4853K4846K69381j15896l51229j00384k40668m17299
$$ -748090 -427145 -21654 -76507 -51661 217720 101824 -249405 -349789 -590457 -1007756
6052a007756j75361r9355L41726n4614j15195K87425k67528k81302P02725M19676
$$ -1007756 -1183117 -1282472 -940746 -995360 -1110555 -823130 -1090658 -1371960 -669235 -249559
6042b49559n28909J11743O99007k00782K65591P2913l81797P8344R1589m60690
$$ -249559 -778468 -666725 32282 -168500 97091 170004 -211793 -133449 -41860 -502550
6032e02550j76001J88593L17133L87424l07437J11982j76658n43604L04444j13212
$$ -502550 -678551 -489958 -172825 214599 -92838 19144 -157514 -701118 -396674 -509886
6022e09886o58798L89991M14599n36508j15762M53808J14222J11570N5428k55126
$$ -509886 -1168684 -778693 -364094 -900602 -1016364 -562556 -448334 -336764 -281336 -536462
6012e36462k28872K4472M98850K3581m20132N50240Q8278j035562R3186L43474
$$ -536462 -765334 -740862 -242012 -218431 -638563 -88323 -45 -1035607 -942421 -598947
6002e98947J60977m98701L0374K32858k74632K79777L50500J53666J6505j3705
$$ -598947 -437970 -936671 -906297 -673439 -948071 -668294 -317794 -164128 -147623 -161328
5992a61328N9642o3466k74428Q9663L49536J9200m02099o3024L62877k76164N6822
$$ -161328 -101686 -165152 -439580 -349917 -381 18819 -383280 -446304 -83427 -359591 -302769
5981c02769K69548J13857j14084j65798M26713j25703j42695J3654O0502l5197
$$ -302769 -33221 80636 -33448 -199246 227467 101764 -40931 -27277 33225 -1972
5971a972k84404J68121j62396M0976K55135k71674q5261j20352L53593n15083
$$ -1972 -286376 -118255 -280651 -239675 15460 -256214 -341475 -461827 -108234 -623317
5961f23317l45801L64787J43818p12447j43547N00889M16727j77855K65603K30805
$$ -623317 -969118 -604331 -460513 -1172960 -1316507 -815618 -398891 -576746 -311143 -80338
5951h0338k00396O2479o1p32j53010M17899r4842j93980N83566k26795l64258
$$ -80338 -280734 -218255 -218316 -219048 -372058 45841 -49001 -242981 340585 113790 -250468
5940b50468M1751l127l0361k22527r8776l86084J93366P25260n82256K68871K06240
$$ -250468 -208717 -211844 -242205 -464732 -563508 -949592 -756226 -30966 -613222 -344351 -138111
5929a38111j51634k62346J61548P4695J36241K76753J61402k06029L08025k1112
$$ -138111 -289745 -552091 -390543 -315848 -179607 97146 258548 52519 360544 339432
5919C39432m15852P0741m04839K32252l15712n820k40469K88492K86097n69168
$$ 339432 -76420 -5679 -410518 -178266 -493978 -499798 -740267 -451775 -165678 -734846
5909g34846n2761O06161k93156q4971J70081j00218J00546k08330N38639k4451
$$ -734846 -787607 -181446 -474602 -559573 -389492 -489710 -389164 -597494 -58855 -83306
5899h3306K00403k01978l4977L81416k86211q0815k49280M8082J21825m47588
$$ -83306 117097 -84881 -119858 261558 -24653 -105468 -354748 -306666 -184841 -632429
5889f32429K3462N89202k92927J497r8658j94956K90713o9979R6825k97810M75317
$$ -632429 -608967 -19765 -312692 -311195 -409853 -604809 -314096 -384075 -287250 -585060 -109743
5878a09743M48473q26130N61328r3567m46521K63138R1257k37301K00222N2777
$$ -109743 338730 -487400 73928 -19639 -466160 -203022 -111765 -349066 -148844 -96067
5868i6067j83393o292j2448n49315k63288P09594m17483O59663J99045l1358L959
$$ -96067 -279460 -285752 -298200 -847515 -1110803 -401209 -818692 -159029 40016 8658 12617
5857A2617l32333m8527k32123N29576l67961P621K91161M11546n47587K65892
$$ 12617 -319716 -368243 -600366 -70790 -438751 -431130 -139969 271577 -276010 -10118
5847a0118J98623l96113m7732N0910m38890r9075J003428j19368j26083M94471
$$ -10118 188505 -207608 -255340 -204430 -643320 -742395 261033 141665 15582 510053
5837E10053n1710m61600K93635l8746n45775J85024o442l63532k43582K19552
$$ 510053 458343 -3257 290378 251632 -294143 -109119 -115561 -479093 -722675 -503123
5827e03123n40242l47120O39089K36194n16121O33458M84382n29887M19705o937
$$ -503123 -1043365 -1390485 -751396 -515202 -1031323 -397865 86517 -443370 -23665 -30602
5817c0602n78546K10671J13449J39825L00304L45772p1265l89024k72794R8582
$$ -30602 -609148 -398477 -285028 -145203 155101 500873 429608 40584 -232210 -133628
5807a33628L03792l18538J11333K16497l69136K36425K83582o41069J88825K24298
$$ -133628 170164 -148374 -37041 179456 -189680 46745 330327 -310742 -121917 102381
5797A02381o04808J2362j05046p6498J68439K19101L31804m42557L3139N2362
$$ 102381 -502427 -490065 -595111 -671609 -503170 -284069 47735 -394822 -361683 -309321
5787c09321j16816R2796O3908m43218j14178J16576K45607J85982J39090Q8790
$$ -309321 -426137 -333341 -269433 -712651 -826829 -710253 -464646 -278664 -139574 -50784
5777e0784j32195R3104m94231j70448J95162J31129M00292j91376K91137j30468
$$ -50784 -182979 -89875 -584106 -754554 -559392 -428263 -27971 -219347 71790 -58678
5767e8678M3122k65326r5475j06541k61394j50607M10091M18831m150K70923K35982
$$ -58678 -15556 -280882 -376357 -482898 -744292 -894899 -484808 -65977 -70127 200796 436778
5756D36778J709m28620J04625K23120o56072J20523O32416k86591l73453K56832
$$ 436778 438487 9867 114492 337612 -318460 -197937 434479 147888 -225565 31267
5746C1267J37930k54130k53930J22116Q0780K098o0594j9895J36351P4381k89
$$ 31267 169197 -84933 -338863 -216747 -135967 -133869 -194463 -214358 -78007 -3626 -3915
5735c915k36838J28914r3132m4089K13123j19273m01820K99758j7838m15772j35201
$$ -3915 -240753 -111839 -204971 -249060 -35937 -155210 -557030 -257272 -275110 -690882 -826083
5724h26083J64175J56839m22666Q0698O49731L1948k75390J2223O15230l67240
$$ -826083 -661908 -505069 -927735 -847037 -197306 -165358 -440748 -428525 186705 -180535
5714a80535l02391K78878J19112K38984o3347l81216r5116O85773p26894j34163
$$ -180535 -482926 -204048 -84936 154048 90701 -290515 -385631 300142 -426752 -560915
5704e60915N25535O4852n57029L18411N96752q23856P75554K63798m01362k46883
$$ -560915 -35380 29472 -527557 -209146 387606 -436250 339304 603102 201740 -45143
5694d5143K78493m84936n68445k18388M81811M0736n01481R02904J12100k91828
$$ -45143 233350 -251586 -820031 -1038419 -556608 -515872 -1017353 -114449 -2349 -294177
5684b94177L94524J06038j99399l98142J53255J91222l8567L85938j92819J16610
$$ -294177 100347 206385 6986 -391156 -237901 -46679 -85246 300692 107873 224483
5674B24483j09766q8424O55365m88928n51889O25393k71778p54427L80460K01814
$$ 224483 114717 26293 681658 192730 -359159 266234 -5544 -759971 -379511 -177697
5664a77697m03335q3558K62557l62848J56067L72040o43385P50412L89584n33898
$$ -177697 -581032 -664590 -402033 -764881 -608814 -236774 -880159 -129747 259837 -274061
5654b74061o0549J60908j26295J57418L39171L149n09418k87643L42467k24938
$$ -274061 -334610 -173702 -299997 -142579 196592 199741 -309677 -597320 -254853 -479791
5644d79791Q694M31501j88401k71949M69657K66115l58612L90919j02415k59266
$$ -479791 -471097 -39596 -227997 -499946 -30289 235826 -122786 268133 165718 -93548
5634i3548N16791k42866r0455M2326l47585j66368L85230Q0096R5205q9847n3224
$$ -93548 423243 180377 89922 132248 -215337 -381705 3525 83621 178826 88979 35755
5623C5755m4647m68172Q479O540l94200j48100L68223L21247L38411J77718p6507
$$ 35755 -8892 -477064 -468585 -462045 -856245 -1004345 -636122 -314875 23536 201254 124747
5612A24747L61264L21541o08036K0192J85862l14301k67009j90222M86711j86719
$$ 124747 486011 807552 199516 219708 405570 91269 -175740 -365962 120749 -65970
5602f5970o6024N8650m2757p5560p4184k43424J42567N56315m46691L40907k62679
$$ -65970 -131994 -73344 -116101 -191661 -265845 -509269 -366702 189613 -257078 83829 -178850
5591a78850l144R665M3744l45380M36952K81863r3710N87437j87559k0m99095
$$ -178850 -181994 -172329 -128585 -473965 -37013 244850 151140 738577 551018 550998 51903
5580E1903P3507L33092K2977j48175P87707j55458n89503K90352m44816l02725
$$ 51903 125410 458502 481479 333304 1121011 965553 376050 666402 221586 -81139
5570h1139L76297J25047j87484l46785l97953l1726L00528m12507J12376L07957
$$ -81139 295158 420205 232721 -114064 -512017 -543743 -243215 -655722 -543346 -235389
5560b35389o0059l83841J1984M1522K40650J53589l8146N81285p0392j91281L58835
$$ -235389 -295448 -679289 -667305 -625783 -385133 -231544 -269690 311595 241203 49922 408757
5549D08757L15061l04730j8906j76945k21902R1725m33928j298M6824M85519k58537
$$ 408757 723818 419088 400182 223237 1335 93060 -340868 -342166 -295342 190177 -68360
5538f8360p1416M14714O3335J93653j14092l61159K43632L34824m25047J11827
$$ -68360 -139776 274938 338273 531926 417834 56675 300307 635131 210084 321911
5528C21911q4772k84096m19237J2755J20725J07712N65104j5141R6726M04339
$$ 321911 237139 -46957 -466194 -453439 -332714 -225002 340102 324961 421687 826026
5518H26026l66239j94430M3208j36525o4991K44000L37446n7731m00109K29976
$$ 826026 459787 265357 308565 172040 107049 351049 688495 630764 230655 460631
5508D60631l02540m57599j52781k93456K02362k03054M58110L66422j49607M80850
$$ 460631 158091 -299508 -452289 -745745 -543383 -746437 -288327 78095 -71512 409338
5498D09338N2889J89531m84048k3981M03467m23627o40852K08239q8668j06867
$$ 409338 462227 651758 167710 143729 547196 123569 -517283 -309044 -397712 -504579
5488e04579q6970K8164K88128J96081J04888R5821j3083P5244J22691N6155l24677
$$ -504579 -591549 -563385 -275257 -79176 25712 121533 108450 183694 306385 362540 37863
5477C7863j35388M16869J84748K28401o4972O35938m5888q64878K42391j73779
$$ 37863 -97525 319344 504092 732493 667521 1303459 1257571 392693 635084 461305
5467D61305k99132M5279j32793l33980O7310l10630J91767K57779J79096l50148
$$ 461305 162173 207452 74659 -259321 -192011 -502641 -310874 -53095 126001 -224147
5457b24147k16638L35569n78591j49793M50801K53472m6140J49220Q0721K71458
$$ -224147 -440785 -105216 -683807 -833600 -382799 -129327 -175467 -26247 54474 325932
5447C25932k16395l18144m35102O13692j37354q04007M07168J51752j63648j9950
$$ 325932 109537 -208607 -643709 -30017 -167371 -971378 -564210 -412458 -576106 -596056
5437e96056J52974K95978K94588j31894L23753J43794k22435l29489N0128k4092
$$ -596056 -443082 -147104 147484 15590 339343 483137 260702 -68787 -18659 -42751
5427d2751k69320M94802K0772O23843M05655m64412j01588N77491o75735k67047
$$ -42751 -312071 182731 203503 827346 1233001 768589 667001 1244492 568757 301710
5417C01710M02850n0288j44242m18304m19311j63307m60876k61383l9758J83189
$$ 301710 704560 654272 510030 91726 -327585 -490892 -951768 -1213151 -1252909 -1069720
5407a069720J33159j37162O18763O07553q8744q5317Q34544J10571o35628J17581
$$ -1069720 -936561 -1073723 -454960 152593 63849 -21468 813076 923647 288019 405600
5397D05600M49230n58876l02837k25187m49485L71475l12699L27149r3719M18446
$$ 405600 854830 295954 -6883 -232070 -681555 -310080 -622779 -295630 -389349 29097
5387B9097K25638N0163N77060J79118j98382P7047k05306l23450K19411l61671
$$ 29097 254735 304898 881958 1061076 862694 939741 734435 410985 630396 268725
5377B68725j84500J49422K63638l08847j56706N02727j70001j77278O41487L16527
$$ 268725 84225 233647 497285 188438 31732 534459 364458 187180 828667 1145194
5367A145194m83835k54704r1964m08480j24113J83467j24561K08983L23310l04392
$$ 1145194 661359 406655 314691 -93789 -217902 -34435 -158996 49987 373297 68905
5357F8905k42825L22567L2770j00980K80550M50588m89140m46312K55679K46792
$$ 68905 -173920 148647 181417 80437 360987 811575 322435 -123877 131802 378594
5347C78594j29153l13421o7446J81198J08520Q5224N18000j77488K58267k01549
$$ 378594 249441 -63980 -131426 49772 158292 243516 761516 584028 842295 640746
5337F40746K36362l4064J61553o21935j29275R8861J98598p22444j1026P60645
$$ 640746 877108 843044 1004597 382662 253387 352248 550846 -171598 -182624 578021
5327E78021n21817k48794Q9789J48658j82213M02664J73185K92464j52767j91194
$$ 578021 56204 -192590 -102801 45857 -136356 266308 439493 731957 579190 387996
5317C87996J66034m71303r033j5258j43988L00853K85185l73692j11585J798O8184
$$ 387996 554030 82727 73694 58436 -85552 215301 500486 126794 15209 17007 85191
5306H5191l19423J30774M62615q8074l06939k27833j7703m5840K10250m1842R0884
$$ 85191 -234232 -103458 359157 271083 -35856 -263689 -281392 -327232 -116982 -158824 -67940
5295f7940L27631J30693l58420K4050M43452J6526l38023N25365o7684m18745
$$ -67940 259691 390384 31964 56014 499466 515992 177969 703334 635650 216905
5285B16905J00011l32546j35519L053l44391M47909N49006n60156J59394K63218
$$ 216905 316916 -15630 -151149 -148096 -492487 -44578 504428 -55728 103666 366884
5275C66884n51050J67332K04250j62857L37919J52160P167J69232k87638J66117
$$ 366884 -184166 -16834 187416 24559 362478 514638 521805 691037 403399 569516
5265E69516j9128K8719M86339l27924k85600O28127k25107n46086J53219M9317
$$ 569516 550388 579107 1065446 737522 451922 1080049 854942 308856 462075 511392
5255E11392k23056l00106k77559L22239j08364J51363J74095o3897K25867L10882
$$ 511392 288336 -11770 -289329 32910 -75454 75909 250004 186107 411974 722856
5245G22856j07518k74131K8742n16524l27967N82016m9760l10167K93680K16504
$$ 722856 615338 341207 369949 -146575 -474542 107474 57714 -252453 41227 257731
5235B57731R1928n47271j35453L10980l29887M53831K25284N39303J80105m37321
$$ 257731 349659 -197612 -333065 -22085 -351972 101859 327143 866446 1046551 609230
5225F09230L03716L75717p22909N38533K91346l90801N61879k20080k69802j3981
$$ 609230 912946 1288663 565754 1104287 1395633 1004832 1566711 1346631 1076829 1062848
5215A062848Q60189p82186K78713R17920l29494m30059M54069K47596m73840O03552
$$ 1062848 1923037 1140851 1419564 2337484 2007990 1577931 2032000 2279596 1805756 2409308
5205B409308N62275n1546j11915L67877l19630K35991L86612K86932r0718K68333
$$ 2409308 2971583 2920037 2808122 3175999 2856369 3092360 3478972 3765904 3675186 3943519
5195C943519P32523J1032O14356L09528M76124R39519O72413K37790J690777J136877
$$ 3943519 4676042 4687074 5301430 5610958 6087082 7026601 7699014 7936804 9627581 10764458
5185A0764458P49122K230413J656103K004449M109792L703181M137085N335050
$$ 10764458 11513580 13743993 15400096 17404545 21514337 25217518 29354603 34689653
5177C4689653K653299m63990k108697k453807l364943m343292l601450l344556
$$ 34689653 37342952 36878962 34770265 32316458 28951515 24608223 21006773 17662217
5169A7662217k821166k558934j513234j276318j304748o45709k02891n06265m94584
$$ 17662217 14841051 12282117 10768883 9492565 8187817 7542108 7339217 6832952 6338368
5160F338368n84420l52545m51321o61860m40730l63058L52872m91659q45792L08470
$$ 6338368 5753948 5401403 4950082 4288222 3847492 3484434 3837306 3345647 2499855 2808325
5150B808325j23498r81029J2855L54941j36406j54328O72969l80866k68130L09162
$$ 2808325 2684827 1703798 1716653 2071594 1935188 1780860 2453829 2072963 1804833 2113995
5140B113995j19584m46399m5618k57930m06251J78450k06560Q1409L82950k25229
$$ 2113995 1994411 1548012 1502394 1244464 838213 1016663 810103 891512 1274462 1049233
5130A049233l28930M64501n42007n67181J05494K2652J23846K9855J81492o0994
$$ 1049233 720303 1184804 642797 75616 181110 203762 327608 357463 538955 477961
5120D77961k51085K70216N88074o00404q488Q11655n18680n36993P69554k16738
$$ 477961 226876 497092 1085166 484762 476274 1287929 769249 232256 1001810 785072
5110G85072n06790J70356N09506k57921K56327l6151l66464J75193m04887k46320
$$ 785072 278282 448638 958144 700223 956550 920399 553935 729128 324241 77921
5100G7921N27469l21133J25662N36253k64796L05200l30242n04556J51805k58215
$$ 77921 605390 284257 409919 946172 681376 986576 656334 151778 303583 45368
5090D5368n90215M74107K36290n06680M32154M96497p10501j98998P50300k69273
$$ 45368 -544847 -70740 165550 -341130 91024 587521 -122980 -321978 428322 159049
5080A59049q0634L05603P10117o17109k43468Q04059j78086m30919l45607M46223
$$ 159049 78415 384018 1094135 477026 233558 1037617 859531 428612 83005 529228
5070E29228l60319k00732q7263j00953J39234M49849j14921K62019J5946l37252
$$ 529228 168909 -31823 -119086 -220039 -80805 369044 254123 516142 532088 194836
5060A94836m56941J24164q7603m57914K56836L00909j35690l44371P380m07760
$$ 194836 -262105 -137941 -225544 -683458 -426622 -125713 -261403 -605774 -598394 -1006154
5050a006154j99132K44345K94184O5578L61898N99724k56756k7351p8528J45360
$$ -1006154 -1205286 -960941 -666757 -601179 -239281 360443 103687 76336 -2192 143168
5040A43168M12047J22060j35451K54390K87693m74492k22472M86511l98432k0605
$$ 143168 555215 677275 541824 796214 1083907 609415 386943 873454 475022 454417
5030D54417L59900l21654n41263O39386J33947o28836K83028J81249J04908n02981
$$ 454417 814317 492663 -48600 590786 724733 95897 378925 560174 665082 162101
5020A62101R276L06327m53157j90201N68534L3139K9318K89426k37199j34055
$$ 162101 171377 477704 24547 -165654 402880 436019 465337 754763 517564 383509
5010C83509K81394j7858q791r160k46658j64914R7705k91512J04064n0556o01641
$$ 383509 664903 647045 638254 629094 382436 217522 315227 23715 127779 77223 -524418
4999e24418J93575K55896l88330k50816L48703J68493J3470k49497L31410R0200
$$ -524418 -330843 -74947 -463277 -714093 -365390 -196897 -183427 -432924 -101514 -11314
4989a1314L52721M2812n79530o5414j80032R9823m9873K06806O0961l10224l08999
$$ -11314 341407 384219 -195311 -260725 -440757 -340934 -390807 -184001 -123040 -433264 -742263
4978g42263N72764j43950L3788N98470l6136P6022L0210J9428j48067J48409J44938
$$ -742263 -169499 -313449 -279661 318809 282673 358695 388905 408333 260266 408675 553613
4967E53613q9277L86971j12762o82063K61159Q2664K59494q2868j84902L51641
$$ 553613 464336 851307 738545 56482 317641 400305 659799 576931 392029 743670
4957G43670m05846L19097j03364j35856p4524J26752l09762L0692j10904M28020
$$ 743670 337824 656921 553557 417701 343177 469929 160167 190859 79955 507975
4947E07975j01860M6826J35651q54006K92095n73795N41868j83976r1484J039213
$$ 507975 406115 452941 588592 -265414 26681 -547114 -5246 -189222 -280706 758507
4937G58507l4414n96503L57734K60210q05897k7420k25172j5401n0547K28235
$$ 758507 724093 127590 485324 745534 -60363 -87783 -312955 -328356 -378903 -150668
4927a50668L84499M18872j71131l78052Q1623p72239j15744J08422l81020N82832
$$ -150668 233831 652703 481572 103520 185143 -587096 -702840 -594418 -975438 -392606
4917c92606L8570M0292P38164n7334J3128Q5048k37205l40001L78315L34176k21391
$$ -392606 -354036 -313744 424420 367086 380214 465262 228057 -111944 266371 600547 379156
4906C79156J50379J55338r7146k13413l5094J96882J9313l37403K70974R3124
$$ 379156 529535 684873 587727 374314 339220 536102 555415 218012 488986 582110
4896E82110j09894Q3808l55701j69286r3520m1972m01228L18770K7935n08599
$$ 582110 472216 556024 200323 31037 -62483 -104455 -505683 -186913 -158978 -667577
4886f67577Q9160M25500o35946K64294J035218p30339m955N44406l68062N2743
$$ -667577 -578417 -152917 -788863 -524569 510649 -219690 -224645 319761 -48301 4442
4876D442L7388P67K92381L7221k26812M65944P3597m46848j97676M11505J13522
$$ 4442 41830 42597 334978 372199 145387 611331 684928 238080 40404 451909 565431
4865E65431m45041L76160N78912n88324n08631N64356k94130o46295L36365K36184
$$ 565431 120390 496550 1075462 487138 -21493 542863 248733 -397562 -61197 174987
4855A74987l50569N56688j69051j21766L59671l18087L30347J09789o10093j22188
$$ 174987 -175582 381106 212055 90289 449960 131873 462220 572009 -38084 -160272
4845a60272M45898k43756L04186P2447M29988k62818o33708O08567j44179l55966
$$ -160272 285626 41870 346056 418503 848491 585673 -48035 560532 416353 60387
4835F0387N0180J18936n97643K23012n5978o5904M74205K5264J5074J56180j52364
$$ 60387 110567 229503 -368140 -145128 -201106 -267010 207195 232459 247533 403713 251349
4824B51349m11574R9388m4069J4766J07934k8971L22501Q8677K03749n3702o9214
$$ 251349 -160225 -60837 -104906 -90140 17794 -11177 311324 400001 603750 550048 480834
4813D80834j94982j0203k21256j03978N07529j8354j82717L64167K53779n85468
$$ 480834 285852 275649 54393 -49585 457944 439590 256873 621040 874819 289351
4803B89351p4993N0395k82475N79430J06665m60946L21519Q04260l24238K58902
$$ 289351 214358 264753 -17722 561708 668373 207427 528946 1333206 1008968 1267870
4793A267870K0624m84766j74362j23798q5152m13322K78784J9631m41206l39234
$$ 1267870 1288494 803728 629366 505568 420416 7094 285878 305509 -135697 -474931
4783d74931M73669J37766m27743n6764N37769P7967n89184J58340N77754k41909
$$ -474931 -1262 136504 -291239 -348003 189766 267733 -321451 -163111 414643 172734
4773A72734L7576K86262J90186p6477l67034N3272N06280r3422k63903l86455
$$ 172734 210310 496572 686758 610281 243247 296519 802799 709377 445474 59019
4763E9019J22481J46776j17653k55242M62203K25920l50673K01341k61961J36704
$$ 59019 181500 328276 210623 -44619 417584 643504 292831 494172 232211 368915
4753C68915O20701m44777n94544K52861J86893N4024r5288L30023K60330l55604
$$ 368915 989616 544839 -49705 203156 390049 444073 348785 678808 939138 583534
4743E83534j68026l72010j01717j28982m37509j82666K38707q5411M1530L69948
$$ 583534 415508 43498 -58219 -187201 -624710 -807376 -568669 -654080 -612550 -242602
4733b42602P049K20441M42440l67977o8165M91711l25902k5217R3695L15666K7607
$$ -242602 -235553 -15112 427328 59351 -8814 482897 156995 131778 225473 541139 568746
4722E68746J57574J53163n24088j81403K96024l39157o14259M43635M23607n63341
$$ 568746 726320 879483 355395 173992 470016 130859 -483400 -39765 383842 -179499
4712a79499k3019O47281r2102j41606J65191J59477K29397J39823R7828l22064
$$ -179499 -202518 444763 352661 211055 376246 535723 765120 904943 1002771 680707
4702F80707J80870K26636k29097k7322J57677L8662m68034l87236M99006k36631
$$ 680707 861577 1088213 859116 831794 989471 1028133 560099 172863 671869 435238
4692D35238m22365R8008O01575l52824P265K76027j42518j98963N28509m1915
$$ 435238 12873 110881 712456 359632 366897 642924 500406 301443 829952 788037
4682G88037l8531K92818j09332M742l16815J43362o0171K17900N38998K13582
$$ 788037 749506 1042324 932992 937734 620919 764281 704110 922010 1461008 1674590
4672A674590j31798L86731K88875o71869m60001O93404J17539o3831M43198r0735
$$ 1674590 1542792 1929523 2218398 1546529 1086528 1779932 1897471 1833640 2276838 2186103
4662B186103o8933M9931l38844N72679L84325K19730Q25616P34655J311018J189437
$$ 2186103 2117170 2167101 1828257 2400936 2785261 3004991 3830607 4565262 5876280 7065717
4652G065717O46313J212175J038913o18333r19688l85526q25482p64075r67380
$$ 7065717 7712030 8924205 9963118 9344785 8425097 8039571 7214089 6450014 5482634
4643E482634n40623q2538k50456p76015L8804l40717o38763k17399n65307j27941
$$ 5482634 4942011 4859473 4609017 3833002 3871806 3531089 2892326 2674927 2109620 1981679
4633A981679j44763l51380k18058j55631o63736J20666j28636m38548N62168L62046
$$ 1981679 1836916 1485536 1267478 1111847 448111 568777 440141 1593 563761 925807
4623I25807q9521M88077l09694k2712K86638p3762j4788M13361l66991o38406
$$ 925807 836286 1324363 1014669 991957 1278595 1204833 1190045 1603406 1236415 598009
4613E98009N92296o39126l38323N60007j47379j64404J46489r0396j82501j2789
$$ 598009 1190305 551179 212856 772863 625484 461080 607569 517173 334672 321883
4603C21883J92912J16564k1944j59346L048m02071k12400k21853L0568R1831Q00521
$$ 321883 514795 631359 609415 450069 453117 51046 -161354 -383207 -352639 -260808 539713
4592E39713j44023k40453N98421m02762m33241m30028K43693L39860k49780l44908
$$ 539713 395690 155237 753658 350896 -82345 -512373 -268680 71180 -178600 -523508
4582e23508O68693L45991n79253M71258L68803l78558m68151O79410k05200j45611
$$ -523508 145185 491176 -88077 383181 751984 373426 -94725 584685 379485 233874
4572B33874M93945k47547n07972k4100M77136m88311j89554P64774l81534r06222
$$ 233874 727819 480272 -27700 -51800 425336 -62975 -252529 512245 130711 -775511
4562g75511J026728K1153l72720M50742K92533K4105P3239q9099n55669K36252
$$ -775511 251217 272370 -100350 350392 642925 667030 740269 651170 95501 331753
4552C31753j72820l71926k35762J62138o0325j17378K12625M91854k83961k476
$$ 331753 158933 -212993 -448755 -286617 -346942 -464320 -251695 240159 -43802 -46278
4542d6278N25378l62781r6715k58236K23854j38668j73845K47058M11171j32823
$$ -46278 479100 116319 19604 -238632 -14778 -153446 -327291 -80233 330938 198115
4532A98115J08339j44507n79187N82056K19366m9633M1072J83268j50309n96866
$$ 198115 306454 161947 -417240 164816 384182 334549 375621 558889 408580 -188286
4522a88286k09170K40111k16188o70030O08845K72067m15660m82248K90706M55330
$$ -188286 -397456 -157345 -373533 -1043563 -434718 -162651 -578311 -1060559 -769853 -314523
4512c14523m19475M9350M55478J4845J98174J99185M03285J78220p9863K9998
$$ -314523 -733998 -684648 -229170 -214325 -16151 183034 586319 764539 684676 714674
4502G14674l62990j80761J85250k93910l79815K37333L04518l18531M77281N36214
$$ 714674 351684 170923 356173 62263 -317552 -80219 224299 -94232 383049 919263
4492I19263l2542J11868j35826q98620j27333j65277m3979J58621m38830J88940
$$ 919263 886721 998589 862763 -35857 -163190 -328467 -372446 -213825 -652655 -463715
4482d63715m259m89010n2370M70042k67721L52163N84065j45726J27705L61392
$$ -463715 -467974 -956984 -1009354 -539312 -807033 -454870 129195 -16531 111174 472566
4472D72566J46532l12159j11384J36684j19803l83214K96028n3134N992L22111
$$ 472566 619098 306939 195555 332239 212436 -170778 125250 72116 78108 400219
4462D00219n080m2168j92764q1360j872Q576l18536J95755p6391L32960K98029
$$ 400219 395139 352971 160207 78847 76975 85551 -232985 -37230 -113621 219339 517368
4451E17368m18449k5413K02163q98035o38372M26882L52292N41369P0799j02043
$$ 517368 98919 73506 275669 -622366 -1260738 -833856 -481564 59805 130604 28561
4441B8561M7705J37314j58328J77049O9494M09001K85645o46156L87749P12802
$$ 28561 76266 213580 55252 232301 301795 710796 996441 350285 738034 1450836
4431A450836k24670l27968L37647k68453j95238j29978P86509L03499m85151J82873
$$ 1450836 1226166 898198 1235845 967392 772154 642176 1428685 1732184 1247033 1429906
4421A429906P2449l22036k74324L2463m39348j21004K52392l87233l10731L44620
$$ 1429906 1502355 1180319 905995 938458 499110 378106 630498 243265 -67466 277154
4411B77154J36117r1666J25536n21293k6974L38052l91261M85312L17883l69967
$$ 277154 413271 321605 447141 -74152 -101126 236926 -154335 330977 648860 278893
4401B78893L13874k39554n24715k6676P2385k92486j64296N8373L21544K60554
$$ 278893 592767 353213 -171502 -198178 -125793 -418279 -582575 -524202 -202658 57896
4391E7896l2351j9401K71057l57628L4760J34363l04459O46626J73380k39160
$$ 57896 25545 6144 277201 -80427 -45667 88696 -215763 430863 604243 365083
4381C65083L03135m45502m41446Q5072J38632J00196P0438M50780J96594p3531
$$ 365083 668218 222716 -218730 -133658 4974 105170 175608 626388 822982 749451
4371G49451K89495o943K22126k92716j16653M31866p15248L6191L68601l05110
$$ 749451 1038946 1032003 1254129 961413 844760 1276626 561378 597569 966170 661060
4361F61060k99181J75650j17877k69708K37770l80237k57179o946l3021q643K35648
$$ 661060 361879 537529 419652 149944 387714 7477 -249702 -256648 -289669 -298312 -62664
4350f2664K15327L02759L1474j8114K77953l26440j05964K4383N58868k48861
$$ -62664 152663 455422 486896 468782 746735 420295 314331 338714 897582 648721
4340F48721j23125N4020m4908l01332K25342J78548j33544J98264j61313j33594
$$ 648721 525596 579616 534708 233376 458718 637266 503722 701986 540673 407079
4330D07079J87331o1513q6939K20455K08113k69890j52263q8972K8359m16904
$$ 407079 594410 532897 445958 666413 874526 604636 452373 363401 391760 -25144
4320b5144L60450L52018k29010j5290m565J9929m4349M05519m8941m2501L44041
$$ -25144 335306 687324 458314 443024 438459 458388 414039 819558 770617 728116 1072157
4309A072157j76416j65675K0532l608l21999J91454L95437m06694J73286M18920
$$ 1072157 895741 730066 750598 746990 424991 616445 1011882 605188 778474 1197394
4299A197394k79324q859k1439N7577L91644K31640k60440p0686R6558k9278j14439
$$ 1197394 918070 909211 887772 945349 1336993 1568633 1308193 1237507 1334065 1304787 1190348
4288A190348r911K10171k99242J72067L28301K47599j4596N29083J9517m23983
$$ 1190348 1180437 1390608 1091366 1263433 1591734 1839333 1824737 2353820 2373337 1949354
4278A949354M92281m3348l78998L74102O77969j36531j92648K29514K40088J65830
$$ 1949354 2441635 2398287 2019289 2393391 3071360 2934829 2742181 2971695 3211783 3377613
4268C377613l77454K60308P40329K53354J39469N98058Q16615P29029o155R47167
$$ 3377613 3000159 3260467 4000796 4254150 4393619 4991677 5808292 6537321 6531166 7478333
4258G478333J008252J292822J206303J658971K669189K346500K260288L683717
$$ 7478333 8486585 9779407 10985710 12644681 15313870 17660370 19920658 23604375
4250B3604375K343326k01472r29927j478251k532513k619142k381850k410322
$$ 23604375 25947701 25746229 24816302 23338051 20805538 18186396 15804546 13394224
4242A3394224j976171j427383r67270j116859j196002m43582o76054r48388m86688
$$ 13394224 11418053 9990670 9023400 7906541 6710539 6266957 5590903 4642515 4155827
4233D155827l96124m50813M6485l92371L9169O73317p97360K0954N8755o15434
$$ 4155827 3759703 3308890 3355375 2963004 3002173 3675490 2878130 2899084 2957839 2342405
4223B342405j54981j31055o59761m6161J71389j71504R4586k0415k65163k40676
$$ 2342405 2187424 2056369 1396608 1350447 1521836 1350332 1444918 1424503 1159340 918664
4213I18664k24743L37827m93525M79708O11824m97793j32706O94371k35948j089581
$$ 918664 693921 1031748 538223 1017931 1629755 1131962 999256 1693627 1457679 368098
4203C68098J70482K08982j3431j11111L41985J71805L0450M19878n76761j00944
$$ 368098 538580 747562 734131 623020 965005 1136810 1167260 1587138 1010377 909433
4193I09433L76584n8342n81115L72068L40989o19663L6299K38859k60164l5532
$$ 909433 1286017 1227675 646560 1018628 1359617 739954 776253 1015112 754948 719416
4183G19416L1703K55377Q9433k48127J63081K28025j02663p5136j21878j28196
$$ 719416 751119 1006496 1095929 847802 1010883 1238908 1136245 1061109 939231 811035
4173H11035l5804j55102k73909L82599J57143J35716q135J68753k58101l2714
$$ 811035 775231 620129 346220 728819 885962 1021678 1013543 1182296 924195 891481
4163H91481l1949k92356l19065k81533K06186k8140j76549J54009Q34888o428
$$ 891481 859532 567176 248111 -33422 172764 144624 -31925 122084 956972 950544
4153I50544r6284J58527L86081l44760l656J51164N1358L112Q7870l33871k25734
$$ 950544 854260 1012787 1398868 1054108 1050452 1201616 1252974 1256086 1343956 1010085 784351
4142G84351O5017m55667K98589r3857j25422M92604P2416j28963M78123J60459
$$ 784351 849368 393701 692290 598433 473011 965615 1038031 909068 1387191 1547650
4132A547650n95047K71752r3283k14523l033L16630L01561k28799J32513L79494
$$ 1547650 952603 1224355 1131072 916549 913516 1230146 1531707 1302908 1435421 1814915
4122A814915n82692K9118j21184l25821K15574K07188q3559j96468L7197J39894
$$ 1814915 1232223 1261341 1140157 814336 1029910 1237098 1153539 957071 994268 1134162
4112A134162k58544o74238L96863M12913o46766L23867L85823l7j45500N24415
$$ 1134162 875618 201380 598243 1011156 364390 688257 1074080 1074043 928543 1452958
4102A452958P9848j47461M59601n2446l51074n08351K54531j87967j88830L42548
$$ 1452958 1532806 1385345 1844946 1792500 1441426 933075 1187606 999639 810809 1153357
4092A153357N4692j79021K08836J36947k49366M99257M56287q9205j87614M53651
$$ 1153357 1208049 1029028 1237864 1374811 1125445 1624702 2080989 1991784 1804170 2257821
4082B257821K1648l77000L69907K62372m3286J79181O54551K7801K11512L66854
$$ 2257821 2279469 1902469 2272376 2534748 2491462 2670643 3325194 3352995 3564507 3931361
4072C931361J4647O6483L05624Q9594K27565Q24693J246804N81843J166105J308480
$$ 3931361 3946008 4012491 4318115 4407709 4635274 5459967 6706771 7288614 8454719 9763199
4062I763199Q2839l86149k60199j59547r08298n21952k55734o71577k67622Q43600
$$ 9763199 9846038 9459889 9199690 9040143 8131845 7609893 7354159 6682582 6414960 7258560
4052G258560M37950j11558O65137N20895L65704O8650M35122R52875J136452k11715
$$ 7258560 7696510 7584952 8250089 8770984 9136688 9205338 9640460 10593335 11729787 11518072
4042A1518072P65175J203628L33189N92259J057934P99720M85321N04017M9105
$$ 11518072 12283247 13486875 13820064 14412323 15470257 16269977 16755298 17259315 17308420
4033A7308420O13448M68381J80446N95147P15955J61864p75493L80465J99870
$$ 17308420 17921868 18390249 18570695 19165842 19881797 20043661 19268168 19648633 19848503
4024A9848503j365029n29644j62828q92207p80954o78539p28463m21514o09515
$$ 19848503 18483474 17953830 17791002 16898795 16117841 15439302 14710839 14289325 13679810
4015A3679810l71656l85734o97494m67578m52010q18861r94318n71778p81948
$$ 13679810 13308154 12922420 12224926 11757348 11305338 10486477 9492159 8920381 8138433
4006H138433m64976o47847l42416K80086m93841j042776k5277n52986q66075L57683
$$ 8138433 7673457 7025610 6683194 6963280 6469439 5426663 5401386 4848400 3982325 4340008
3996D340008m37838j76111J76858j33176k40036k3211K20308J66388j4061k0232
$$ 4340008 3902170 3726059 3902917 3769741 3529705 3506494 3726802 3893190 3879129 3858897
3986C858897R5140N09214j90487k55896M65973K50066l74568N63360L25832k68750
$$ 3858897 3954037 4463251 4272764 4016868 4482841 4732907 4358339 4921699 5247531 4978781
3976D978781J72474N18408J81055m28029Q21647R10122J28296M66870O87952m19656
$$ 4978781 5151255 5669663 5850718 5422689 6244336 7154458 7282754 7749624 8437576 8017920
3966H017920p69061J20317J53248j263521n36140P01982j386264q95138L92238
$$ 8017920 7248859 7369176 7522424 6258903 5722763 6424745 5038481 4143343 4535581
3957D535581J21602p53317N86559J88362q95612L43627L83352q40538m82380O64141
$$ 4535581 4657183 3903866 4490425 4678787 3783175 4126802 4510154 3669616 3187236 3851377
3947C851377j94815J578O1720O6906n01581r5797K67587o26114j0202O17455j53136
$$ 3851377 3656562 3658140 3719860 3786766 3285185 3189388 3456975 2830861 2820659 3438114 3284978
3936C284978l43897R59678m55657j86451K68949k77195m15826k03016M7123J8753
$$ 3284978 2941081 3900759 3445102 3258651 3527600 3250405 2834579 2631563 2678686 2697439
3926B697439n76267R9868N74230k4847m02681K52021J92544q25802K35122p5706
$$ 2697439 2121172 2221040 2795270 2770423 2367742 2619763 2812307 1986505 2221627 2145921
3916B145921j87804K76657K18304n99615R415R4770l24838j65987M66941J0308
$$ 2145921 1958117 2234774 2453078 1853463 1862878 1957648 1632810 1466823 1933764 1944072
3906A944072K97635N32090l59062l01314j43044M04976l01609m07541L58958J28456
$$ 1944072 2241707 2773797 2414735 2113421 1970377 2375353 2073744 1666203 2025161 2153617
3896B153617k15226l05671J56310l9818k11722J41335L4021L7273M50237M082
$$ 2153617 1938391 1632720 1789030 1749212 1537490 1678825 1712846 1750119 2200356 2204438
3886B204438P52003j70077P7647N69172m26000k43593J57317m61042k15502K60577
$$ 2204438 2956441 2786364 2864011 3433183 3007183 2763590 2920907 2459865 2244363 2504940
3876B504940K53270p00983O44205K54071r30991N64564l12079o4392N99566L35903
$$ 2504940 2758210 2057227 2701432 2955503 2024512 2589076 2276997 2212605 2812171 3148074
3866C148074m2624m5870Q0745L90821m35727M08351K96541k07857L7613k97382
$$ 3148074 3105450 3059580 3140325 3531146 3095419 3503770 3800311 3592454 3630067 3332685
3856C332685N74284o57478J5194L52564l77044j13351M39323P6252k96334r63
$$ 3332685 3906969 3249491 3264685 3617249 3240205 3126854 3566177 3642429 3346095 3345132
3846C345132J98758N5136l3681q1383k77435Q48896j30620m17326J60263P3468
$$ 3345132 3543890 3599026 3565345 3483962 3206527 4055423 3924803 3507477 3667740 3741208
3836C741208k34207j45914L0239J2960n0768J99847Q0878m1183J57479M70224
$$ 3741208 3507001 3361087 3391326 3404286 3353518 3553365 3634243 3593060 3750539 4220763
3826D220763l9303J8371J74314Q2992J5163j45313K75669J32985m4017j74453
$$ 4220763 4181460 4199831 4374145 4457137 4472300 4326987 4602656 4735641 4691624 4517171
3816D517171k11465K68301r369K46475L55134K92450m31220N09200k8808j66788
$$ 4517171 4305706 4574007 4564638 4811113 5166247 5458697 5027477 5536677 5507869 5341081
3806E341081j3316O31967J35873m25004l0910K1445M4077j12616o96422O57855
$$ 5341081 5327765 5959732 6095605 5670601 5639691 5661136 5705213 5592597 4896175 5554030
3796E554030L13773m55138M04592P38307n38496m02931K41267k41517N42898j43755
$$ 5554030 5867803 5412665 5817257 6555564 6017068 5614137 5855404 5613887 6156785 6013030
3786F013030J46223K07013N66743l93019K37174R9811M75005j98660L1024L97425
$$ 6013030 6159253 6366266 6933009 6539990 6777164 6876975 7351980 7153320 7184344 7581769
3776G581769L6229L41989K97555J81626J40523O23002k45166l35681J53598P4488
$$ 7581769 7617998 7959987 8257542 8439168 8579691 9202693 8957527 8621846 8775444 8849932
3766H849932N4969K04351N14865N23842L02322n62386J13498k07352J9655m03156
$$ 8849932 8904901 9109252 9624117 10147959 10450281 9887895 10001393 9794041 9813696 9410540
3756I410540K33698J13081K85126O27516N09083O4257M14043L6627P3945N91124
$$ 9410540 9644238 9757319 10042445 10669961 11179044 11243301 11657344 11693971 11767916 12359040
3746A2359040K62285L61673M47363K26281k07334Q70716J82552j08371O46581
$$ 12359040 12621325 12982998 13430361 13656642 13449308 14320024 14502576 14394205 15040786
3737A5040786Q33451K72901M01423P78685P70538L56330M59724O83026L10824
$$ 15040786 15874237 16147138 16548561 17327246 18097784 18454114 18913838 19596864 19907688
3728A9907688P44536O99384J77361Q35167J657401J122571J220088J384052J475909
$$ 19907688 20652224 21351608 21528969 22364136 24021537 25144108 26364196 27748248 29224157
3719B9224157Q62219J547069J553183J099985J945470J563259K049990K535213
$$ 29224157 30086376 31633445 33186628 34286613 36232083 37795342 39845332 42380545
3711D2380545K685431K182783K407904J726034K723587K832972K244476L041196
$$ 42380545 45065976 47248759 49656663 51382697 54106284 56939256 59183732 62224928
3703F2224928L698375L317438K885119M081211L708376L315516L507974L251868
$$ 62224928 65923303 69240741 72125860 76207071 79915447 83230963 86738937 89990805
3695H9990805L852254L882737M103173L980349M397112M879210M339060L933547
$$ 89990805 93843059 97725796 101828969 105809318 110206430 115085640 119424700 123358247
3687A23358247M470588L688079L740538L783210L988186L487607L201132L222676
$$ 123358247 127828835 131516914 135257452 139040662 143028848 146516455 149717587 152940263
3679A52940263L153136K602434K325996K302026K219049J772751J662466J904365
$$ 152940263 156093399 158695833 161021829 163323855 165542904 167315655 168978121 170882486
3671A70882486O35933M46542J85597m813p66060j386388n22518r42589j573587
$$ 170882486 171518419 171964961 172150558 172145745 171379685 169993297 169470779 168528190 166954603
3662A66954603j398541j359486j774491j833419k133257k438064k543691k798039
$$ 166954603 165556062 164196576 162422085 160588666 158455409 156017345 153473654 150675615
3654A50675615l588009k729338k796432m069920l162868k706047l087846l507397
$$ 150675615 147087606 144358268 141561836 137491916 134329048 131623001 128535155 125027758
3646A25027758l523811k858225l014547l560910k654013k607414l259465l109291
$$ 125027758 121503947 118645722 115631175 112070265 109416252 106808838 103549373 100440082
3638A00440082k372861l511067l051232k277366k780338k859869k476908k152561
$$ 100440082 98067221 94556154 91504922 89227556 86447218 83587349 81110441 78957880
3630G8957880k473634k570524k596714k371014k378254j664250k559562j889758
$$ 78957880 76484246 73913722 71317008 68945994 66567740 64903490 62343928 60454170
3622F0454170j776643k272542j910752j672377j637007j942277j619919j705137
$$ 60454170 58677527 56404985 54494233 52821856 51184849 49242572 47622653 45917516
3614D5917516j125326j796622j253520j027527j080994q85515q22428p35184j316007
$$ 45917516 44792190 42995568 41742048 40714521 39633527 38748012 37925584 37190400 35874393
3605C5874393r71483k59901r30491r45363k40180o93973q04412N1866K97780j88531
$$ 35874393 34902910 34643009 33712518 32767155 32526975 31833002 31028590 31080456 31378236 31189705
3595C1189705l13971J196506O23070K91663N14636O87364N47193R31058R50031
$$ 31189705 30875734 32072240 32695310 32986973 33501609 34188973 34736166 35667224 36617255
3586C6617255J189801K362971K159085J504895K339320K443740K414798L030297
$$ 36617255 37807056 40170027 42329112 43834007 46173327 48617067 51031865 54062162
3578E4062162L676115L889619M995152M656919O121948O888955O703346P931983
$$ 54062162 57738277 61627896 66623048 71279967 77401915 84290870 90994216 98926199
3570I8926199Q185973P589468P369055N926715M256541L673736J878073L90306
$$ 98926199 107112172 114701640 122070695 127997410 132253951 135927687 137805760 138196066
3562A38196066l18898j099235j605009k155974k070123j442608j576201k106698
$$ 138196066 137877168 136777933 135172924 133016950 130946827 129504219 127928018 125821320
3554A25821320k369870k178877l194455l786217m317330n462109o116555n985104
$$ 125821320 123451450 121272573 118078118 114291901 109974571 104512462 98395907 92410803
3546I2410803o339732n767232o217571n810281n311047m624767l884575l934521
$$ 92410803 86071071 80303839 74086268 68275987 62964940 58340173 54455598 50521077
3538E0521077k751900k113949k768553k207353j610313k073067j870072q80404
$$ 50521077 47769177 45655228 42886675 40679322 39069009 36995942 35125870 34245466
3530C4245466j316113j549916j147858m17804j388954p53851m35115J53812o37353
$$ 34245466 32929353 31379437 30231579 29813775 28424821 27670970 27235855 27389667 26752314
3521B6752314n22561K87551r74262o48040j24972k94926q74606j04800k22481
$$ 26752314 26229753 26517304 25543042 24895002 24770030 24475104 23600498 23495698 23273217
3512B3273217m48708l48481l13375j7493l6365l01221k55913K06191n11539N87231
$$ 23273217 22824509 22476028 22162653 22145160 22108795 21807574 21551661 21757852 21246313 21833544
3502B1833544K5692l41012J90172Q7641p91502K14256O82541p94635j03693M63200
$$ 21833544 21859236 21518224 21708396 21796037 21004535 21218791 21901332 21106697 21003004 21466204
3492B1466204j00923L06853O73493M11755K83740j22117L26395R22896N00672
$$ 21466204 21365281 21672134 22345627 22757382 23041122 22919005 23245400 24168296 24668968
3483B4668968K23592P57645O95120K6022K71850N09124L60053P83149R06438Q53589
$$ 24668968 24892560 25650205 26345325 26371347 26643197 27152321 27512374 28295523 29201961 30055550
3473C0055550L07461O07573O63331O98284O64666O72134J327622J217808R40096
$$ 30055550 30363011 30970584 31633915 32332199 32996865 33668999 34996621 36214429 37154525
3464C7154525J833127J675937J533717J352489J686437J874729J647874J565701
$$ 37154525 38987652 40663589 42197306 43549795 45236232 47110961 48758835 50324536
3456E0324536L091815K593851K251290L379987L269216K417482L881353L969466
$$ 50324536 53416351 56010202 58261492 61641479 64910695 67328177 71209530 75178996
3448G5178996L879954M750873M755593N778216O333010O887660P573624P992777
$$ 75178996 79058950 83809823 88565416 94343632 100676642 107564302 115137926 123130703
3440A23130703Q207556R275951J0669300J1473745J2889536J4498829J5732978
$$ 123130703 131338259 140614210 151283510 162757255 175646791 190145620 205878598
3433B05878598J6751112J8207745J9865841K0468541K1671039K1901459K0841285
$$ 205878598 222629710 240837455 260703296 281171837 302842876 324744335 345585620
3426C45585620J9577881J7113176J3825064J2274658Q531767N293789M303505
$$ 345585620 365163501 382276677 396101741 408376399 416908166 422201955 426505460
3419D26505460J635771K76675j163194j617666j750524l551820m517363n362680
$$ 426505460 428141231 428417906 427254712 425637046 423886522 420334702 415817339 410454659
3411D10454659q157723j0003219j2258195j4575609j7106571j8507394j9927642
$$ 410454659 402296936 392293717 380035522 365459913 348353342 329845948 309918306
3404C09918306k0384724j9342791j9635166j8703842j6766357j5706875j5069498
$$ 309918306 289533582 270190791 250555625 231851783 215085426 199378551 184309053
3397A84309053j3408352j1541717j0474384j0204078p942535p473558p604773
$$ 184309053 170900701 159358984 148884600 138680522 130737987 123264429 115659656
3390A15659656n604736n311755n640073m908229l920721m495152m301024k741416
$$ 115659656 110054920 104743165 99103092 94194863 90274142 85778990 81477966 78736550
3382G8736550k497988k919588j778348j089376k691630k752565j862104j843812
$$ 78736550 76238562 73318974 71540626 70451250 67759620 65007055 63144951 61301139
3374F1301139k649942j543358j096237j663435j577170j183768j259401j562189
$$ 61301139 58651197 57107839 56011602 54348167 52770997 51587229 50327828 48765639
3366D8765639j272514j170402q86842p84019o98876k51310n61410o74383q37165
$$ 48765639 47493125 46322723 45435881 44651862 43952986 43701676 43140266 42465883 41628718
3357D1628718k63257p02372m38887J08984j08172N5270K05550K78593L84898K14839
$$ 41628718 41365461 40663089 40224202 40333186 40225014 40280284 40485834 40764427 41149325 41364164
3347D1364164L22281r849k23067r9314k5575L68577K78688n91159l09697L82740
$$ 41364164 41686445 41676596 41453529 41354215 41328640 41697217 41975905 41384746 41075049 41457789
3337D1457789q22873q57023P37337Q44705k07850Q17006J476999N81900n2652
$$ 41457789 40634916 39777893 40515230 41359935 41152085 41969091 43446090 44027990 43975338
3328D3975338N79482J242966K80080P86651J517244L40773J032996J417991L28981
$$ 43975338 44554820 45797786 46077866 46864517 48381761 48722534 49755530 51173521 51502502
3319E1502502R79407J735797M31485J199330K460576J518936J773227K695307
$$ 51502502 52481909 54217706 54649191 55848521 58309097 59828033 61601260 64296567
3311F4296567K269163K161678K556434L015066L056871L386778L803510L960916
$$ 64296567 66565730 68727408 71283842 74298908 77355779 80742557 84546067 88506983
3303H8506983M544911N056449N594799O087550O814288P588968Q107025Q989258
$$ 88506983 93051894 98108343 103703142 109790692 116604980 124193948 132300973 141290231
3295A41290231J0266512J1559493J2079283J3087814J4784819J6027531J7134277
$$ 141290231 151556743 163116236 175195519 188283333 203068152 219095683 236229960
3288B36229960J7800690J8382802J8930449J8037919J7223419J6937547J5103177
$$ 236229960 254030650 272413452 291343901 309381820 326605239 343542786 358645963
3281C58645963J4017071J3572925J2353512J2445966J1681402J1599371J2499814
$$ 358645963 372663034 386235959 398589471 411035437 422716839 434316210 446816024
3274D46816024J1761783J0666164R944917P215109M824725K211511j565997m935035
$$ 446816024 458577807 469243971 479188888 486403997 491228722 493440233 491874236 486939201
3266D86939201p185691r360916j1698343j3255504j3308984j3239188j4189111
$$ 486939201 479753510 470392594 458694251 445438747 432129763 418890575 404701464
3259D04701464j3571745j3068089j3936519j4453985j4733544j6054155j6608886
$$ 404701464 391129719 378061630 364125111 349671126 334937582 318883427 302274541
3252C02274541j6447428j7412293j7744445j6648122j6185572j5619086j4450728
$$ 302274541 285827113 268414820 250670375 234022253 217836681 202217595 187766867
3245A87766867j3226168j2878331j1712494j0068816r354909q691815p492103
$$ 187766867 174540699 161662368 149949874 139881058 130526149 121834334 114342231
3238A14342231o520669o690015o157989m727522m402139n068231l405228l213180
$$ 114342231 107821562 101131547 94973558 90246036 85843897 80775666 77370438 74157258
3230G4157258l901979l261113l018173k571747k468841k092007k207455j566748
$$ 74157258 70255279 66994166 63975993 61404246 58935405 56843398 54635943 53069195
3222E3069195k235476k153938j799708j941734k061255j229798j301921j418570
$$ 53069195 50833719 48679781 46880073 44938339 42877084 41647286 40345365 38926795
3214C8926795l80010q73695j217945j149121n10125j356762j473726j264190q82930
$$ 38926795 38546785 37673090 36455145 35306024 34795899 33439137 31965411 30701221 29818291
3205B9818291m98707j249331o20807k59572p53595o70731n07339r08815n71385
$$ 29818291 29319584 28070253 27449446 27189874 26436279 25765548 25258209 24349394 23778009
3196B3778009p65831p59453j88572k44855o16312m55710P807p27706r29638j3867
$$ 23778009 23012178 22252725 22064153 21819298 21202986 20747276 20755083 20027377 19097739 19083872
3186A9083872o95320p92609L21360L84890m86300k51606J6390m99310l8775K79102
$$ 19083872 18388552 17595943 17917303 18302193 17815893 17564287 17580677 17081367 17042592 17321694
3176A7321694p13215N55868n2503j088342O25129M3096r00488j54908l34588m32975
$$ 17321694 16608479 17164347 17111844 16023502 16648631 16691727 15791239 15636331 15301743 14868768
3166A4868768l37300o02482o3807n11077k97922K36500o81888M762K3845q07841
$$ 14868768 14531468 13928986 13865179 13354102 13056180 13292680 12610792 12615554 12639399 11831558
3156A1831558j9484m15439j98880n1300j94914K53619q8940m96818J7080n72222
$$ 11831558 11812074 11396635 11197755 11146455 10951541 11205160 11116220 10619402 10636482 10064260
3146A0064260J60079M10523l78712j40334P28076m72853o69417M78306k60401
$$ 10064260 10224339 10634862 10256150 10115816 10843892 10371039 9701622 10179928 9919527
3137I919527k10114K18347q9338M818k58525j1870P85543q69938m9488Q40943
$$ 9919527 9709413 9927760 9838422 9843240 9584715 9572845 10358388 9488450 9438962 10279905
3127A0279905r15496j71904J16343m32500L30163o1837l31751K35303j7262J74251
$$ 10279905 9364409 9192505 9308848 8876348 9206511 9144674 8812923 9048226 9030964 9205215
3117I205215j000798m28063L55142J6681q75577K19834J94224j86579j83805p95034
$$ 9205215 8204417 7776354 8131496 8148177 7272600 7492434 7686658 7500079 7316274 6521240
3107F521240k77260O4546n60053j78019L44807p42389l61227n55595r750K552
$$ 6521240 6243980 6308526 5748473 5570454 5915261 5172872 4811645 4256050 4246300 4248852
3097D248852l50986k65243N43719K92030l63087r1983k12947L03894k09189m24411
$$ 4248852 3897866 3632623 4176342 4468372 4105285 4013302 3800355 4104249 3895060 3470649
3087C470649n1828K63362O27p56841j63591N89709K3690n16608K99699m96664
$$ 3470649 3418821 3682183 3682810 2925969 2762378 3352087 3375777 2859169 3158868 2662204
3077B662204K6418K98224l07277P3608J94055K2310K26989k83869j46836K26400
$$ 2662204 2688622 2986846 2679569 2753177 2947232 2969542 3196531 2912662 2765826 2992226
3067B992226k649k31113J22708k54552M1329M3283j36890m05187K0321J87854
$$ 2992226 2989577 2758464 2881172 2626620 2667949 2711232 2574342 2169155 2189476 2377330
3057B377330k30443M97443l86597J32285K33797p75026k62105K58999R3912n25815
$$ 2377330 2146887 2644330 2257733 2390018 2623815 1848789 1586684 1845683 1939595 1413780
3047A413780M80899K10043l08605p2055R5550k26637m65148k64481K13285l2793
$$ 1413780 1894679 2104722 1796117 1724062 1819612 1592975 1127827 863346 1076631 1043838
3037A043838o03300L68882K44005R2702N45558J39004k48348O34642J99547q13365
$$ 1043838 440538 809420 1053425 1146127 1691685 1830689 1582341 2216983 2416530 1603165
3027A603165l83488N44826n9147k02247L5595N96476q0051o12124L35718m82342
$$ 1603165 1219677 1764503 1705356 1503109 1538704 2135180 2055129 1443005 1778723 1296381
3017A296381k83923P33779l72915l40585Q83599j90419n05535K43612l5182m07089
$$ 1296381 1012458 1746237 1373322 1032737 1916336 1725917 1220382 1463994 1428812 1021723
3007A021723j24397P68231k90547p2269K67380J24520L92432J41988k47224K29813
$$ 1021723 897326 1665557 1375010 1302741 1570121 1694641 2087073 2229061 1981837 2211650
2997B211650J97903n24863l8725M81522K5286l19056M45788K2302n2078K18340
$$ 2211650 2409553 1884690 1845965 2327487 2352773 2033717 2479505 2501807 2449729 2668069
2987B668069k02811O82514N2572k43401Q91233N02863j97357j4613L75l21289
$$ 2668069 2465258 3147772 3200344 2956943 3848176 4351039 4153682 4139069 4139444 3818155
2977C818155M5868P5131P2381Q5490J54168K75583k28193k07597K3593l63870
$$ 3818155 3864023 3939154 4011535 4097025 4251193 4526776 4298583 4090986 4114579 3750709
2967C750709m02327J36654r847m70651j56073K8907r0046o27502l12131K51169
$$ 3750709 3348382 3485036 3475189 3004538 2848465 2877372 2787326 2159824 1847693 2098862
2957B098862k93430j62587N93594j33109O739J91678q0735p2434q6455j5515M7429
$$ 2098862 1805432 1642845 2236439 2103330 2110069 2301747 2221012 2148578 2062123 2046608 2094037
2946B094037o51765j11839P1650n1904J50805m5935O3385M2603L05536J36535
$$ 2094037 1442272 1330433 1402083 1350179 1500984 1455049 1518434 1561037 1866573 2003108
2936B003108j53231l8865J62645l97810m9760J84036m1474k75401R5187J26331
$$ 2003108 1849877 1811012 1973657 1575847 1526087 1710123 1668649 1393248 1488435 1614766
2926A614766n88117N97107J00951n27716L41002j50308m3628N5032K47285K70036
$$ 1614766 1026649 1623756 1724707 1196991 1537993 1387685 1344057 1399089 1646374 1916410
2916A916410K33950K4439J94007p26960L16492j06198m42040K75938k9635J13771
$$ 1916410 2150360 2174799 2368806 1641846 1958338 1852140 1410100 1686038 1656403 1770174
2906A770174J19973L24185k3469l92443K03946L55016n05223k47576k46814N74507
$$ 1770174 1890147 2214332 2190863 1798420 2002366 2357382 1852159 1604583 1357769 1932276
2896A932276m87872j58265M28770k3112N78715l53181j37478J25148k78707n95692
$$ 1932276 1444404 1286139 1714909 1691797 2270512 1917331 1779853 1905001 1626294 1030602
2886A030602N4171J91121j08614m9576K51633l40038k51486N77713J57579K99109
$$ 1030602 1084773 1275894 1167280 1117704 1369337 1029299 777813 1355526 1513105 1812214
2876A812214m42991R66575L66561n13317J91801J33313o34621L64945L11824n44325
$$ 1812214 1369223 2335798 2702359 2189042 2380843 2514156 1879535 2244480 2556304 2011979
2866B011979J27287K32306m09204l36213k84653n44895J93885k5792n02561j68327
$$ 2011979 2139266 2371572 1962368 1626155 1341502 796607 990492 964700 462139 293812
2856B93812J67065P8478j74875L49300K81197K80432j1576q67402K25015m22556
$$ 293812 460877 539355 364480 713780 994977 1275409 1263833 396431 621446 198890
2846A98890p99778O06799K93531l2717O49310j84449n68681J81456l97743P2070
$$ 198890 -600888 5911 299442 266725 916035 731586 162905 344361 -53382 18688
2836A8688K64521L23432J46986k44727N02899r8238l92527l7851J40173o61690
$$ 18688 283209 606641 753627 508900 1011799 913561 521034 483183 623356 -38334
2826c8334l02762J73466K34548J04005L68657J8634o19136L23870L14250k96592
$$ -38334 -341096 -167630 66918 170923 539580 558214 -60922 262948 577198 280606
2816B80606k47018J27114O00021J12989j87955L90001K64482m24126l18696P157
$$ 280606 33588 160702 760723 873712 685757 1075758 1340240 916114 597418 604575
2806F04575l85035k6118M82897l94788K00099N72787q06250j93358L03929l60411
$$ 604575 219540 193422 676319 281531 481630 1054417 248167 54809 358738 -1673
2796a673k4768N07500N24956j87852k50193J12152k5970o03097L27551L90226
$$ -1673 -26441 481059 1006015 818163 567970 680122 654152 51055 378606 768832
2786G68832r9092J64288l31272k0871N12969j31083j29505K6385j78290N4912
$$ 768832 669740 834028 502756 481885 994854 863771 734266 760651 582361 637273
2776F37273k68513K81908Q7715j099575M47859Q02814o85598K859Q90392m40160
$$ 637273 368760 650668 738383 -361192 86667 889481 203883 206742 1097134 656974
2766F56974n06120O25906J12039k86948K82402L80797k21870n25003J82713M20685
$$ 656974 150854 776760 888799 601851 884253 1265050 1043180 518177 700890 1121575
2756A121575j049611J95853P25081q60580K42969N05846j53071L94938N13657
$$ 1121575 71964 267817 992898 132318 375287 881133 728062 1123000 1636657
2747A636657l22867k89454L52314j40087q16488k97456K39188l37448K23671L1387
$$ 1636657 1313790 1024336 1376650 1236563 420075 122619 361807 24359 248030 279417
2737B79417M00084k70574l70638K89520m36700l84629O22641M57992K6736J73119
$$ 279417 679501 408927 38289 327809 -108891 -493520 129121 587113 613849 786968
2727G86968J37214l82788o69821K04822l73634K43446N43734k01926q7702L24732
$$ 786968 924182 541394 -128427 76395 -297239 -53793 489941 288015 200313 525045
2717E25045J0871j88413J79846K36303P7321q51295M00224L07386o51682k04885
$$ 525045 535916 347503 527349 763652 840973 -10322 389902 697288 45606 -159279
2707a59279R62307k56584q12301N55723l3406k56037J49420L82160j94816m97345
$$ -159279 803028 546444 -265857 289866 256460 423 149843 532003 337187 -160158
2697a60158L54843n35067k14440M61286q1999l29109j90132L76164j34477K09482
$$ -160158 194685 -340382 -554822 -93536 -175535 -504644 -694776 -318612 -453089 -243607
2687b43607K52482n44475J53638N69927l17855N20377K14161k30533J64984n30236
$$ -243607 8875 -535600 -381962 187965 -129890 390487 604648 374115 539099 8863
2677H863p871q5992K71523K58292m29755K91085l26856k00243M89621q7064j65623
$$ 8863 992 -85000 186523 444815 15060 306145 -20711 -220954 268667 181603 15980
2666A5980K18664j85829j61632k61149J35521k1490q2739J95920L2349k8584m174
$$ 15980 234644 48815 -112817 -373966 -238445 -259935 -342674 -146754 -114405 -142989 -147163
2655a47163L07247k69893j09598P62681m96101l07508J94190l93564N4613n2967
$$ -147163 160084 -109809 -219407 543274 47173 -260335 -66145 -459709 -405096 -458063
2645d58063j90458Q8400k22282j35687M74977q9237J77634M26553k82167K28845
$$ -458063 -648521 -560121 -782403 -918090 -443113 -532350 -354716 71837 -210330 18515
2635A8515M63565l3122J6241J56776l40060j81882n48159j56068M16843m55583
$$ 18515 482080 448958 465199 621975 281915 100033 -448126 -604194 -187351 -642934
2625f42934K73912K85571n95899k32152L90892L87453l96759J21226P0229o37401
$$ -642934 -369022 -83451 -679350 -911502 -520610 -133157 -529916 -408690 -338461 -975862
2615i75862j77793L63996k47762l6931L95063K0617j96087J73574M33638l08176
$$ -975862 -1153655 -789659 -1037421 -1074352 -679289 -658672 -854759 -681185 -247547 -555723
2605e55723M6070K89075j23844l3291L24051O37016l98214J58899K10702r79830
$$ -555723 -509653 -220578 -344422 -377713 -53662 583354 185140 344039 554741 -425089
2595d25089L74105L53439q83624M84008J48004l28968K05368j94089p1923k0018
$$ -425089 -50984 302455 -581169 -97161 50843 -278125 -72757 -266846 -338769 -358787
2585c58787L66611j10883j72110j05390m637j51821L80683M0243j20645j13418
$$ -358787 7824 -103059 -275169 -380559 -385196 -537017 -156334 -116091 -236736 -350154
2575c50154L08143L56269k85227j72651J74917L87515j43346o79275k52766M90285
$$ -350154 -42011 314258 29031 -143620 31297 418812 275466 -403809 -656575 -166290
2565a66290j64046j58407K24999K29280l58419l17933J3490j6888L15024J20096
$$ -166290 -330336 -488743 -263744 -34464 -392883 -710816 -697326 -714214 -399190 -279094
2555b79094J34849j84830m7564L7339N30476j22719n34289K13232J94624j20333
$$ -279094 -144245 -329075 -376639 -339300 191176 68457 -465832 -252600 -57976 -178309
2545a78309m5395L12681O41697m45647r4717O73036l62074n1780N5336j78250
$$ -178309 -223704 88977 730674 285027 190310 863346 501272 449492 504828 326578
2535C26578k28184k39991l5302o7716K00435R2663j33735M55872K81901k8722
$$ 326578 98394 -141597 -176899 -244615 -44180 48483 -85252 370620 652521 623799
2525F23799j24623J71559Q00300o28391k91491K40544r54359K59115N55857o33825
$$ 623799 499176 670735 1471035 842644 551153 791697 -162662 96453 652310 18485
2515A8485L02465L11180n10274J04488N6409J08924j0729K88245J34443K26926
$$ 18485 320950 632130 121856 226344 282753 391677 380948 669193 803636 1030562
2505A030562k32783n46156L9990j75817k48542L65599j80945j57820o9315j8334
$$ 1030562 797779 251623 291613 115796 -132746 232853 51908 -105912 -175227 -193561
2495a93561L34020j02607L36047Q1571j95032j35583k9669m62644k22620k46712
$$ -193561 140459 37852 373899 455470 260438 124855 95186 -367458 -590078 -836790
2485h36790J40919J94584m44801m176J8741J23940L92107K81339o22674L28944
$$ -836790 -695871 -501287 -946088 -950264 -931523 -807583 -415476 -134137 -756811 -427867
2475d27867l99639J39971M46104o70678L71838N9713k39750J91318J4486J68757
$$ -427867 -827506 -687535 -241431 -912109 -540271 -480558 -720308 -528990 -514504 -345747
2465c45747L24087k62237j17454K43684N9775M11603O29526j24842j51202K78196
$$ -345747 -21660 -283897 -401351 -157667 -97892 313711 943237 818395 667193 945389
2455I45389r47745j58493M36117m50649M05849j55887l27951J49791N9740L56209
$$ 945389 -2356 -160849 275268 -175381 230468 74581 -253370 -103579 -43839 312370
2445C12370o2306J18937K28922m57560K88295l2530m23975L94785k77173n12390
$$ 312370 250064 369001 597923 140363 428658 396128 -27847 366938 89765 -422625
2435d22625R7133j64860l02546K81985L65882k54449p0174m8557L56082L8949
$$ -422625 -325492 -490352 -792898 -510913 -145031 -399480 -469654 -518211 -162129 -123180
2425a23180p09157L20192K29949n33149m3592o4823L55220J56786k07059l82206
$$ -123180 -832337 -512145 -282196 -815345 -858937 -923760 -568540 -411754 -618813 -1001019
2415a001019L808L11020K11627j04160N01333O63466k12217M4875j05834k51321
$$ -1001019 -997211 -686191 -474564 -578724 -77391 586075 373858 418733 312899 61578
2405F1578o23231J89230j87880n27496L20838L644N0353J89868Q2348M6186j09061
$$ 61578 -561653 -372423 -560303 -1087799 -766961 -763317 -712964 -523096 -440748 -394562 -503623
2394e03623j95939J81241k31720L05509j04260j22400K92627l41379L74704J70173
$$ -503623 -699562 -518321 -750041 -444532 -548792 -671192 -378565 -719944 -345240 -175067
2384a75067l44693K48711j79763m61921N6466L5700M2894r7857J22411K99233
$$ -175067 -519760 -271049 -450812 -912733 -856267 -820567 -777673 -875530 -753119 -453886
2374d53886k38962o3751L43326J92573L62470m31008K69220Q61378k35289m80777
$$ -453886 -692848 -756599 -413273 -220700 141770 -289238 -20018 841360 606071 125294
2364A25294M30324M90839q24073L2451M5621p92580N42390o161r67159O6275M81778
$$ 125294 555618 1046457 222384 254835 300456 -492124 50266 44105 -923054 -856779 -375001
2353c75001n66880l0283L32370N6850k50771j7091n7514j21846K16721N4938j50035
$$ -375001 -941881 -972164 -639794 -582944 -833715 -850806 -908320 -1030166 -813445 -758507 -908542
2342i08542o4584Q3070q9250M8948L64391K51040j57834P6573J77074L0882m51436
$$ -908542 -973126 -890056 -979306 -930358 -565967 -314927 -472761 -396188 -219114 -188232 -639668
2331f39668k97872N83163J70229m37296m49528P45941J75402j09846L54310Q5400
$$ -639668 -937540 -354377 -184148 -621444 -1070972 -325031 -149629 -259475 94835 180235
2321A80235l80046J0903j41426l30794N83417m854K13121j34490J01747k22746
$$ 180235 -199811 -188908 -330334 -661128 -77711 -82565 130556 -3934 97813 -124933
2311a24933M00607j61429o07742n7771l88544L61113j41655J58175P40635k60765
$$ -124933 275674 114245 -493497 -551268 -939812 -578699 -720354 -562179 178456 -82309
2301h2309l34353J32518l3224J72150k15113K9684K32937n63077K90847L39035
$$ -82309 -416662 -284144 -317368 -145218 -360331 -330647 -97710 -660787 -369940 -30905
2291c0905l27561r1300j6043k77987l05510M15442K85038m75375N57883P18246
$$ -30905 -358466 -449766 -465809 -743796 -1049306 -633864 -348826 -824201 -266318 451928
2281D51928l60847q21757M07752L67304n01167k5809R07465J76331j89503l69898
$$ 451928 91081 -730676 -322924 44380 -456787 -482596 424869 601200 411697 41799
2271D1799m31694K75219l4299j10513m50062M99718O11834l58128l9015J56496
$$ 41799 -389895 -114676 -148975 -259488 -709550 -209832 402002 43874 4859 161355
2261A61355Q0397m80808n80554p9463M9157J55324K69832l43251N46539J84558
$$ 161355 241752 -239056 -819610 -899073 -849916 -694592 -424760 -768011 -221472 -36914
2251c6914l49385k291L51356M8206k44869l97170L37561O33158r8339J88680L74149
$$ -36914 -386299 -388590 -37234 10972 -233897 -631067 -293506 339652 241313 429993 804142
2240H04142j24281r63754O81775k05739J6164L11052l29697J30273l68964P1241
$$ 804142 679861 -283893 397882 192143 208307 519359 189662 319935 -49029 22212
2230B2212K26879o25269J88446N87406p19880k65284O72811L06060j45116r3694
$$ 22212 249091 -376178 -187732 399674 -320206 -585490 87321 393381 248265 154571
2220A54571J25362k86961N8254l47174l96173N77343L02153l57472j59726q5101
$$ 154571 279933 -7028 51226 -295948 -692121 -114778 187375 -170097 -329823 -414924
2210d14924L15783o62200N3756J33220j74188K23693Q1944j7684p8275M33650
$$ -414924 -99141 -761341 -707585 -574365 -748553 -524860 -442916 -460600 -538875 -105225
2200a05225k31626m80945L22544L18435l22664K98401N12598J18182n9214j16835
$$ -105225 -336851 -817796 -495252 -176817 -499481 -201080 311518 429700 370486 253651
2190B53651j6937j53373j02128K06028k45859j9576M07208J8836R461l86763k09616
$$ 253651 236714 83341 -18787 187241 -58618 -78194 329014 347850 357311 -29452 -239068
2179b39068k35303j15833k08536J77777R41018m35441l34868O60970n12365n75523
$$ -239068 -474371 -590204 -798740 -620963 320055 -115386 -450254 210716 -301649 -877172
2169h77172M13400k23375M035L93155J84905Q8405J97059j94075n06047j65922
$$ -877172 -463772 -687147 -683112 -289957 -105052 -16647 180412 -13663 -519710 -685632
2159f85632P0743K5400J2154J2088k42477J08270K14687k69799K28853M06255
$$ -685632 -614889 -589489 -577335 -565247 -807724 -699454 -484767 -754566 -525713 -119458
2149a19458J4081K77991L30800j64181J50560l6436n11714l31301N93017p7580
$$ -119458 -105377 172614 503414 339233 489793 453357 -58357 -389658 203359 125779
2139A25779o55899j66877M87601N0356l95986Q22510O47442p98459J60796L91927
$$ 125779 -530120 -696997 -209396 -159040 -555026 267484 914926 116467 277263 669190
2129F69190n24223n29526L61949K53570n5491j23395N5575J42223j80993l93635
$$ 669190 144967 -384559 -22610 230960 175469 52074 107649 249872 68879 -324756
2119c24756q477q6708J05778K96782k11458N41435n1263q6451J62900l00256Q1094
$$ -324756 -333233 -419941 -314163 -17381 -228839 312596 261333 174882 337782 37526 118620
2108A18620j08133p23332j80205M81923n9993r7963O21303K46410k0385l63939
$$ 118620 10487 -712845 -893050 -411127 -471120 -569083 52220 298630 278245 -85694
2098h5694J28215j9482o5785l80325R06607j1657q78045j70814P3629M29330o20852
$$ -85694 42521 23039 -42746 -423071 483536 471879 -406166 -576980 -503351 -74021 -694873
2087f94873K93767N79294j99390M506L20877k64098m15375P4782j54489k20001
$$ -694873 -401106 178188 -21202 -16696 304181 40083 -375292 -300510 -454999 -675000
2077f75000K72944K05202L89888J65797l36229K09984M59483o33581K05241N87797
$$ -675000 -402056 -196854 193034 358831 22602 232586 692069 58488 263729 851526
2067H51526k13174l4556L67513j43312j01722J80679p54304j00230k19635j77100
$$ 851526 638352 603796 971309 827997 726275 906954 152650 52420 -167215 -344315
2057c44315Q3426L26577L2196l07071M9688K83204l91860o23222N29456J16061
$$ -344315 -260889 65688 97884 -209187 -159499 123705 -268155 -891377 -361921 -245860
2047b45860q1764R0905O83901q7890L3666L45406J92347J29135k98367L24371
$$ -245860 -327624 -236719 447182 359292 392958 738364 930711 1059846 761479 1085850
2037A085850j531n83449k52658J55681p65460K26225l65057j17660K89193K30927
$$ 1085850 1084319 500870 248212 403893 -361567 -135342 -500399 -618059 -328866 -97939
2027i7939K89501n70872N69670K84041p97783O1737O69455m35381L17056L37736
$$ -97939 191562 -379310 190360 474401 -323382 -261645 407810 -27571 289485 627221
2017F27221j17856O23986k04958n85785K13418j26870k52982N72437m9518J60587
$$ 627221 509365 1133351 928393 342608 556026 429156 176174 748611 699093 859680
2007H59680N7958l40011R0664k12414k81528K20439L1044m30177P4042K44771
$$ 859680 917638 577627 668291 455877 174349 394788 425832 -4345 69697 314468
1997C14468o69730Q6416M42114l37398j22250K75141L04824j59300K06062L5502
$$ 314468 -355262 -268846 173268 -164130 -286380 -11239 293585 134285 340347 375849
1987C75849J6026m14848Q34p1222J15806j93248l8123L01226j33535L08981j50748
$$ 375849 391875 -22973 -22139 -93361 22445 -170803 -208926 92300 -41235 267746 116998
1976A16998j15257K5272R1832N1404K7690K6640p596J08349M2413M12657k02956
$$ 116998 1741 27013 118845 170249 197939 224579 216983 325332 367745 780402 577446
1965E77446l47380M141k08726P4261M04769m97502L42733o5250l21715K70170
$$ 577446 230066 234207 25481 99742 504511 7009 349742 284492 -37223 232947
1955B32947O0649j74734o0425j68130M2567K02479k16084M30065J44624Q9184
$$ 232947 293596 118862 58437 -109693 -67126 135353 -80731 349334 493958 583142
1945E83142j39201j43343j59226M46685n6841j62318k4141k55398m06364m4426
$$ 583142 443941 300598 141372 588057 531216 368898 344757 89359 -317005 -361431
1935c61431o1923q4061k04392O0603N19202k5000J04236K81915M75596Q0033l96474
$$ -361431 -423354 -507415 -711807 -651204 -132002 -157002 -52766 229149 704745 784778 388304
1924C88304J59057K84010o17544L3711N35766n67394K70027Q0473j72348L91338
$$ 388304 547361 831371 213827 247538 783304 215910 485937 566410 394062 785400
1914G85400K9057n93975J54446r8797j64693O0662K95964K17294n5842J68243
$$ 785400 814457 220482 374928 276131 111438 172100 468064 685358 629516 797759
1904G97759q29981K36219J33086n47688O05948M33640l28575M57275J49039j54589
$$ 797759 -32222 203997 337083 -210605 395343 828983 500408 957683 1106722 952133
1894I52133j3287j99248l1568l98580L39248L00751o83145J75074Q16623r3871
$$ 952133 938846 739598 708030 309450 648698 949449 266304 441378 1258001 1164130
1884A164130o46121N82876K83960q04486M12719J68289l34245J75694R0611j98078
$$ 1164130 518009 1100885 1384845 580359 993078 1161367 827122 1002816 1093427 895349
1874H95349k77863k1685j50118N638M42384R1704j82502L74764L02369n41200
$$ 895349 617486 595801 445683 451321 893705 985409 802907 1177671 1480040 938840
1864I38840J49479j14660n35129K07281l29424R6312L36181M15583n05769n5791
$$ 938840 1088319 973659 438530 645811 316387 412699 748880 1164463 658694 602903
1854F02903N4556j68478K57804J14884m5901q774R43702m65246K56646L26228
$$ 602903 657459 488981 746785 861669 815768 806994 1750696 1285450 1542096 1868324
1844A868324l83311p5826K11525l2118n53756K03528l64989L62713N0544O33418
$$ 1868324 1485013 1409187 1620712 1588594 1034838 1238366 873377 1236090 1286634 1920052
1834A920052m25973p1151M06691n02857l23078M0819L38737k45771M10769j31110
$$ 1920052 1494079 1422928 1829619 1326762 1003684 1044503 1383240 1137469 1548238 1417128
1824A417128L75157j42093j95645N33806L0233n36708J60792N85836n21882K124
$$ 1417128 1792285 1650192 1454547 1988353 2018586 1481878 1642670 2228506 1706624 1708748
1814A708748J44570K17647m11609J53055L57906l10638l37649O29116j0024M845
$$ 1708748 1853318 2070965 1659356 1812411 2170317 1859679 1522030 2151146 2141122 2145967
1804B145967N80954L5642M58883m502l79598L29816N00449n36173k77769M6434
$$ 2145967 2726921 2762563 3221446 3216944 2837346 3167162 3667611 3131438 2853669 2900103
1794B900103K55487m65660n0966O69543m0382L38877Q20651K13551K61175O18850
$$ 2900103 3155590 2689930 2638964 3308507 3268125 3607002 4427653 4641204 4902379 5521229
1784E521229N12056N61L09064j99729N74490K29026N07844P71656j8821L41079
$$ 5521229 6033285 6033846 6342910 6143181 6717671 6946697 7454541 8226197 8207376 8548455
1774H548455Q13889M19777L60188J182938O27502P88588J040137J640109J423394
$$ 8548455 9362344 9782121 10142309 11325247 11952749 12741337 13781474 15421583 16844977
1765A6844977J259233J699224K180227K321296K311002K932366K305287K497657
$$ 16844977 18104210 19803434 21983661 24304957 26615959 29548325 31853612 34351269
1757C4351269K851681L112948L587559M649320O026586P899178Q473263J0573290
$$ 34351269 37202950 40315898 43903457 48552777 54579363 62478541 70951804 81525094
1749H1525094J2988178J6642030K1530222K1815083J5786272J448564q251303
$$ 81525094 94513272 111155302 132685524 154500607 170286879 171735443 163484140
1742A63484140j1525693j4425437j6985088j7126055j5401091j2308735j0179311
$$ 163484140 151958447 137533010 120547922 103421867 88020776 75712041 65532730
1735F5532730r068278p086394n214411l394288l794645k521089k269277k806930
$$ 65532730 56464452 49378058 44163647 40769359 36974714 34453625 32184348 29377418
1727B9377418k925775j987010j349915j951184j454516o27012r68838j567678
$$ 29377418 26451643 24464633 23114718 21163534 19709018 19082006 18113168 16545490
1719A6545490m76552r46770j209937p04508j177126m02769j60897r83333m10108
$$ 16545490 16068938 15122168 13912231 13207723 12030597 11627828 11466931 10483598 10073490
1710A0073490J79518r89089q81752K13379o44101p17046l52355k72483j30941
$$ 10073490 10253008 9263919 8382167 8595546 7951445 7234399 6882044 6609561 6478620
1701F478620M10131n85735l05142l51460q19988k02804l93789J1400K52920J29268
$$ 6478620 6888751 6303016 5997874 5646414 4826426 4623622 4229833 4241233 4494153 4623421
1691D623421K5958k08924m21181k75954k91806m09030l96211J15796k46548m24198
$$ 4623421 4649379 4440455 4019274 3743320 3451514 3042484 2646273 2762069 2515521 2091323
1681B091323R86086m28028L15594P23960l86225l74992J80082k90922l18616L83796
$$ 2091323 3077409 2649381 2964975 3688935 3302710 2927718 3107800 2816878 2498262 2882058
1671B882058j93657k28579R5567L13209l76354L5824k09322j98569n2562J90519
$$ 2882058 2688401 2459822 2555389 2868598 2492244 2528068 2318746 2120177 2067615 2258134
1661B258134o3906l62652j02042j08612M3783l47333R5475K3398L52777L61491
$$ 2258134 2194228 1831576 1729534 1620922 1664705 1317372 1412847 1436245 1789022 2150513
1651B150513m5229K68458K47690j36999n8235L3654O2585k08250j74764k09550
$$ 2150513 2105284 2373742 2621432 2484433 2426198 2459852 2522437 2314187 2139423 1929873
1641A929873k45367J58674n29959m3399M51927n37942m52647J11492J91535L63143
$$ 1929873 1684506 1843180 1313221 1269822 1721749 1183807 731160 842652 1034187 1397330
1631A397330j99138L83505K07105K80434n02217j08603J20262p96632J09317K71084
$$ 1397330 1198192 1581697 1788802 2069236 1567019 1458416 1578678 782046 891363 1162447
1621A162447o30766K28174O00135l66059j06102L28272K0584m48699J86060J62050
$$ 1162447 531681 759855 1359990 993931 887829 1216101 1236685 787986 974046 1136096
1611A136096k97343K27454j65205m67624L09497L0677K05504m38722o5070L22588
$$ 1136096 838753 1066207 901002 433378 742875 773552 979056 540334 475264 797852
1601G97852m14397N38674J89528M69477N3842l99135K30594O7278q73121N67141
$$ 797852 383455 922129 1111657 1581134 1634976 1235841 1466435 1533713 660592 1227733
1591A227733J48481n76586M8966O9775q3276o79112L75270l23054j59713Q2034
$$ 1227733 1376214 799628 848594 918369 835093 155981 531251 208197 48484 130518
1581A30518M16323k1705r8000p1460k41975L22951k46057j56386J18029M3021
$$ 130518 546841 525136 427136 355676 113701 436652 190595 34209 152238 195259
1571A95259l6795P65544k12014m81959P21802l47552m07981Q36263K45560n55719
$$ 195259 158464 924008 711994 230035 951837 604285 196304 1032567 1278127 722408
1561G22408L26225L16494l6317k28612k35328k64452m37688o05709j30714j06530
$$ 722408 1048633 1365127 1328810 1100198 864870 600418 162730 -442979 -573693 -680223
1551f80223M77776L23792n87361L4635K75505P6288l61826K47802O41942J18124
$$ -680223 -202447 121345 -466016 -431381 -155876 -79588 -441414 -193612 448330 566454
1541E66454j39152J11265j3778l49517K62998J5416m53794L33059O77409n54304
$$ 566454 427302 538567 524789 175272 438270 453686 -108 332951 1010360 456056
1531D56056m44444J72675j03721m54347N721O06450l16502l761N70674Q6006o14388
$$ 456056 11612 184287 80566 -373781 -368060 238390 -78112 -81873 488801 574807 -39581
1520c9581j63506L84388l21870O080j62211l75268L96414J29256m2834M29824
$$ -39581 -203087 181301 -140569 -134489 -296700 -671968 -275554 -146298 -189132 240692
1510B40692M98454J09238k26922J7694J67770k14362j86153J34791p2465m3612
$$ 240692 739146 848384 621462 639156 806926 592564 406411 541202 468737 425125
1500D25125k9688J42216k86460O1595L95071l76894l50202O4439n0328m85684
$$ 425125 395437 537653 251193 312788 707859 330965 -19237 45202 -5126 -490810
1490d90810L77013J58433m10089J02450Q62578K87473q09131N40968J05255k98247
$$ -490810 -113797 44636 -365453 -263003 599575 887048 77917 618885 724140 425893
1480D25893j58633M06953P7122o3882M82329k84559j22549Q5634J026m76759Q554
$$ 425893 267260 674213 751335 687453 1169782 885223 762674 848308 849334 372575 381129
1469C81129j40679j33704q2776l81431k8279J5968K67203K39939L825j87999q2947
$$ 381129 240450 106746 23970 -357461 -385740 -369772 -102569 137370 141195 -46804 -129751
1458a29751J1818k30998k39203j65576R2104N59814j43995J6378P54360L62244
$$ -129751 -117933 -348931 -588134 -753710 -661606 -101792 -245787 -229409 524951 887195
1448H87195l26072j68386M12126l52971O4210J10887Q2508j6189j64090L09835
$$ 887195 561123 392737 804863 451892 516102 626989 709497 693308 529218 839053
1438H39053k0187q31417J34035K08581n91622m2335M24872J16964J05136L44528
$$ 839053 818866 -12551 121484 330065 -261557 -303892 120980 237944 343080 687608
1428F87608K4998M6578J94745k60113p6822j99996J2416Q2312K58312l26538k64737
$$ 687608 712606 759184 953929 693816 616994 416998 429414 511726 770038 443500 178763
1417A78763K406K23214k82958l08756P16216J14112l56415m8691k3717q08592
$$ 178763 181169 404383 121425 -187331 528885 642997 286582 237891 214174 -594418
1407e94418k39894k9803j641q6410j06685P47842j49220k43442J74191l90408
$$ -594418 -834312 -864115 -865756 -952166 -1058851 -311009 -460229 -703671 -529480 -919888
1397i19888J91280K51753k06154J57113M78690L57387M5949J60226J33834k11626
$$ -919888 -728608 -476855 -683009 -525896 -47206 310181 356130 516356 650190 438564
1387D38564J97128m54242k57055N88335k23755p7276K34301M4624P3252k26916
$$ 438564 635692 181450 -75605 512730 288975 211699 446000 490624 563876 336960
1377C36960k92817M162l20815p15778M18582L27593l78553K95370P75125l36544
$$ 336960 44143 48305 -272510 -988288 -569706 -242113 -620666 -325296 449829 113285
1367A13285J66972O12790k94030k52402O7067n2700n04923q4704N42724l14942
$$ 113285 280257 893047 599017 346615 413682 360982 -143941 -228645 314079 -863
1357h63K12389O28683L63349j49050m80732m38850J60924k63489l43844K33578
$$ -863 211526 840209 1203558 1054508 573776 134926 295850 32361 -311483 -77905
1347g7905k92920L17523K7790p85138J53566l9480j72910O7971L1332l1719K59829
$$ -77905 -370825 -53302 -25512 -810650 -657084 -696564 -869474 -801503 -770171 -801890 -542061
1336e42061r9314Q8056l15924J92182K33496j53779o6635N21213J74085l95115
$$ -542061 -641375 -553319 -869243 -677061 -443565 -597344 -663979 -142766 31319 -363796
1326c63796L58351J98176r3056n58934M90181J59666o5090M50920O94949m69943
$$ -363796 -5445 192731 99675 -459259 30922 190588 125498 576418 1271367 801424
1316H01424k49885M44121j190430o41926J87189J66220j22755N80131L16056l7026
$$ 801424 551539 995660 -194770 -836696 -649507 -483287 -606042 -25911 290145 253119
1306B53119n864k21665j64750m18111L61579l4736p0949O61035M77362l71966
$$ 253119 247255 25590 -139160 -557271 -195692 -230428 -301377 359658 837020 465054
1296D65054K78038j52317l17175M6884l79316j04805J02035j86995K10410J47730
$$ 465054 743092 590775 273600 320484 -58832 -163637 -61602 -248597 -38187 109543
1286A09543J43543l81623K25704L56913m74539k35339L87869m84388q5136J26075
$$ 109543 253086 -128537 97167 454080 -20459 -255798 132071 -352317 -437453 -311378
1276c11378j22907J72594o8826r4461J98071r2387L54764J91815K06054r0252
$$ -311378 -434285 -261691 -330517 -424978 -226907 -319294 35470 227285 433339 343087
1266C43087l76684O830p4158l02722K08730O29123k99847J09961O88096q10186
$$ 343087 -33597 -26767 -100925 -403647 -194917 434206 134359 244320 932416 122230
1256A22230l65081O12611o69826l46384O51277k04477N43723J67426l4808L42900
$$ 122230 -242851 369760 -300066 -646450 4827 -199650 344073 511499 476691 819591
1246H19591j42944J71040n48398j18896j49902L58002m84368P1349P54739n3209
$$ 819591 676647 847687 299289 180393 30491 388493 -95875 -24526 730213 677004
1236F77004J66199J68423l50881m73414K40765l53913O7124M65127o039k74767
$$ 677004 843203 1011626 660745 187331 428096 74183 141307 606434 600395 325628
1226C25628K56457K88655m40350j77395p5122L34007k82937J82887q1988J15742
$$ 325628 582085 870740 430390 252995 177873 511880 228943 411830 329842 445584
1216D45584n7410K4045l98931Q4363K06791K14656j89006p90o6032m93604J52804
$$ 445584 388174 412219 13288 97651 304442 519098 330092 329302 263270 -230334 -77530
1205g7530n79375M2222K40308m44971j73599O09934L67263J23042j12805L73282
$$ -77530 -656905 -614683 -374375 -819346 -992945 -383011 -15748 107294 -5511 367771
1195C67771r5908o05650M2562j29953J11466q7374M35403L07515P030l4914r6037
$$ 367771 271863 -333787 -291225 -421178 -309712 -397086 38317 345832 352862 317948 221911
1184B21911J58317p8884o74627K22959J92725l91131Q7998P39830K00656o09461
$$ 221911 380228 301344 -373283 -150324 42401 -348730 -260732 479098 679754 70293
1174G0293M41767K56406o63839o28585J67949K01537j32846l88809Q89223K63313
$$ 70293 512060 768466 104627 -523958 -356009 -154472 -287318 -676127 213096 476409
1164D76409r86883R5642L74621j70693k70154N35146M5707j43130J53768K50819
$$ 476409 -510474 -414832 -40211 -210904 -481058 54088 99795 -43335 110433 361252
1154C61252J46050p20660Q8790L61856n13271k78850J027943M1086o11234k33433
$$ 361252 507302 -213358 -124568 237288 -275983 -554833 473110 514196 -97038 -330471
1144c30471M5332l04287P6197J59105Q6533K61777j5272l377K63989J82889n82999
$$ -330471 -285139 -589426 -513229 -354124 -267591 -5814 -21086 -24463 239526 422415 -160584
1133a60584J74318l76696l34335L03163j62101K55445m4168k61631k44512m7333
$$ -160584 13734 -362962 -697297 -394134 -556235 -300790 -344958 -606589 -851101 -898434
1123h98434p99461O61154K00301n78903M50989M58640M8622l41159L25132L01625
$$ -898434 -1697895 -1036741 -836440 -1415343 -964354 -505714 -457092 -798251 -473119 -171494
1113a71494k04034l78206O50040n53042L70158N04913o14499J82192k17790j95
$$ -171494 -375528 -753734 -103694 -656736 -286578 218335 -396164 -213972 -431762 -431957
1103d31957J64789j35721j7894Q71929k58108l02451J90013J19252j79216n665
$$ -431957 -267168 -402889 -420783 451146 193038 -109413 80600 199852 20636 14971
1093A4971j69894j67934L44595k52888K52206l72281K40291L57760m89709k89570
$$ 14971 -154923 -322857 21738 -231150 21056 -351225 -110934 246826 -242883 -532453
1083e32453L38178n46859L12250P64208k36024o02109k86132M55053k54331l66026
$$ -532453 -194275 -741134 -428884 335324 99300 -502809 -788941 -333888 -588219 -954245
1073i54245K72081M47542j70212J95977K47991j03963M07659m59968k11353J73465
$$ -954245 -682164 -234622 -404834 -208857 39134 -64829 342830 -117138 -328491 -155026
1063a55026J00589n47072j41947K62657q9752J8353K97999M32613m18598L66421
$$ -155026 -54437 -601509 -743456 -480799 -570551 -552198 -254199 178414 -240184 126237
1053A26237M26443k16637p24324J84603J8497n09386N17437j10270P9027P4252
$$ 126237 552680 336043 -388281 -203678 -185181 -694567 -177130 -287400 -208373 -134121
1043a34121K97127M1948l31650J32j29050K89317l02623K07869J82273P286k64441
$$ -134121 163006 204954 -126696 -126564 -255614 33703 -268920 -61051 121222 128508 -135933
1032a35933K36723m85888j46163K95303k79207L98594p1890k162m42125K26223
$$ -135933 100790 -385098 -531261 -235958 -515165 -116571 -188461 -190623 -632748 -406525
1022d06525O2324k08160P3942M67568o5049O9756M38740l5969k37370j47908K58715
$$ -406525 -344201 -552361 -478419 -10851 -75900 -6144 432596 396627 159257 11349 270064
1011B70064o98673K52825L87458r8060J83014J44141l50964P9211K17026m52189
$$ 270064 -428609 -175784 211674 113614 296628 440769 89805 169016 386042 -66147
1001f6147L1860o1460k79177l1942M14559J68851L35754n16514j7456M16669n94501
$$ -66147 -34287 -95747 -374924 -406866 7693 176544 512298 -4216 -21672 394997 -199504
990a99504J8991K90330L56272r6089k65803J32778k36298l00043K30568L76541
$$ -199504 -180513 109817 466089 370000 104197 236975 677 -299366 -68798 307743
980C07743J32106J18045j68286n71229N5159j9016n0704N7998J12168l7092L34581
$$ 307743 439849 557894 389608 -181621 -126462 -145478 -196182 -138184 -26016 -63108 271473
969B71473m19699L28375R1487q89117l52355L09095N2432j95292O49592k3757
$$ 271473 -148226 180149 271636 -617481 -969836 -660741 -608309 -803601 -154009 -177766
959a77766k51169M6558l23814k63913N09400J2429p04452K00897M85605o7546
$$ -177766 -428935 -382377 -706191 -970104 -460704 -448275 -1152727 -951830 -466225 -533771
949e33771j23104O05472L13890k24341n56750J65902M93614l85533J96668K43372
$$ -533771 -656875 -51403 262487 38146 -518604 -352702 140912 -244621 -47953 195419
939A95419q7869K9856L3125m10564q4034K82690J16217k16299L13080L26969L0217
$$ 195419 107550 137406 170531 -240033 -324067 -41377 74840 -141459 171621 498590 528807
928E28807m80594l18861L15856j88461j63867q5196q9863J56768O8610R1796k02472
$$ 528807 48213 -270648 45208 -143253 -307120 -392316 -482179 -325411 -256801 -165005 -367477
917c67477L88777j33024J41965k24234L56069M077m95061o3730L15778n15321
$$ -367477 21300 -111724 30241 -193993 162076 166153 -328908 -392638 -76860 -592181
907e92181q7271L48330l35890m30778j25968N5341p476P05648M0223J13513L34053
$$ -592181 -679452 -331122 -667012 -1097790 -1223758 -1168417 -1175893 -470245 -430022 -316509 17544
896A7544K35057p60j98366r1204k28602J41183J20715O7495K4024N73136j34049
$$ 17544 252601 251841 53475 -37729 -266331 -125148 -4433 63062 87086 660222 526173
885E26173o19312J74511r5205q10766k59157M88188k32553p8777N47019N3928
$$ 526173 -93139 81372 -13833 -824599 -1083756 -595568 -828121 -906898 -359879 -305951
875c05951p54528J086979L58560j017497J79518L06679j44082r6716j5287Q56423
$$ -305951 -1060479 26500 385060 -632437 -452919 -146240 -290322 -387038 -402325 454098
865D54098N1592p06690L89184j24383n39283O28546l6038J92677L03891n76480
$$ 454098 505690 -201000 188184 63801 -475482 153064 117026 309703 613594 37114
855C7114o43178O89205j18682j035281R46814K66645p83560J14803P56648N0369
$$ 37114 -606064 83141 -35541 -1070822 -124008 142637 -640923 -526120 230528 280897
845B80897m20909M29951J60542k90504j82417M72923l23984K58320j66698n62266
$$ 280897 -140012 289939 450481 159977 -22440 450483 126499 384819 218121 -344145
835c44145k03955K07772J74769m63143K32249K19578l00169o3209K27040o1827
$$ -344145 -548100 -340328 -165559 -628702 -396453 -176875 -477044 -540253 -313213 -375040
825c75040O51373L49185r60234K80170L06379l75433j95360J41019M03955l27379
$$ -375040 276333 625518 -334716 -54546 251833 -123600 -318960 -177941 226014 -101365
815a01365j57752L02646j9627J26082j9734O3107P9238k68647l29277L74019J40408
$$ -101365 -259117 43529 23902 149984 130250 193357 272595 3948 -325329 48690 189098
804A89098J4344K20136k28343O6285m2282j00929K0295M58166l55983j03624n54736
$$ 189098 203442 423578 195235 261520 219238 118309 138604 596770 240787 137163 -417573
793d17573n10059J152969k05416l27093P33952m29563k75945L70379j45499J14123
$$ -417573 -927632 225337 19921 -307172 426780 -2783 -278728 91651 -53848 60275
783F0275O82451m89176J1188K28715K99339q082n42143L99847r314k34181k29661
$$ 60275 742726 253550 264738 493453 792792 784710 242567 642414 633100 398919 169258
772A69258l94761p4369N3877n3139m77571K37266J26038J24844n6041p3052m77026
$$ 169258 -225503 -299872 -245995 -299134 -776705 -539439 -413401 -288557 -344598 -417650 -894676
761h94676J90006j80104J42991K95672M39712J62809m19966l93794K8549J48076
$$ -894676 -704670 -884774 -741783 -446111 -6399 156410 -263556 -657350 -628801 -480725
751d80725j44293J38191N63105n9496r33351K86454M67735K09459k11497N00143
$$ -480725 -625018 -486827 76278 16782 -916569 -630115 -162380 47079 -164418 335725
741C35725Q4231o29552L15363L9358P400j40207j82642k29778J69390l4218M4776
$$ 335725 419956 -209596 105767 145125 152525 12318 -170324 -400102 -230712 -264930 -220154
730b20154l3324o7393N70151o54214n10555K89913K89089K25293P936j25186J11266
$$ -220154 -253478 -320871 249280 -404934 -915489 -625576 -336487 -111194 -103258 -228444 -117178
719a17178L33236m55340J3464L97606l00375j09359o75817k4390p9501M22620
$$ -117178 216058 -239282 -225818 171788 -128587 -237946 -913763 -938153 -1017654 -595034
709e95034p5483L87053k46410L25418K47688m66771N30502m851K47224m5962L44460
$$ -595034 -670517 -283464 -529874 -204456 43232 -423539 106963 102112 349336 303374 647834
698F47834j807n59189k66755N75444l76782o07684O18675J34234n77514k90684
$$ 647834 646027 86838 -179917 395527 18745 -588939 29736 163970 -413544 -704228
688g04228L60572m51951K93511q153J6809J68898J34676j29322j06p0724k42601
$$ -704228 -343656 -795607 -502096 -510249 -493440 -324542 -189866 -319188 -319294 -390018 -632619
677f32619K20525k9757j17094M98870M6454j04064K64972R5427L95346K5889K4847
$$ -632619 -412094 -441851 -558945 -60075 -13621 -117685 147287 242714 638060 663949 688796
666F88796j49819n98739j20290J27080j85099J69870P97343k9215J09537L80547
$$ 688796 538977 -59762 -180052 -52972 -238071 -68201 729142 699927 809464 1190011
656A190011p45845j56414J87576q47952l57868K34074k37815N14489q3614j13276
$$ 1190011 444166 287752 475328 -372624 -730492 -496418 -734233 -219744 -303358 -416634
646d16634K51668l52084K3588n4178n2359L36798l27770O57822K35663n96091
$$ -416634 -164966 -517050 -493462 -547640 -599999 -263201 -590971 66851 302514 -293577
636b93577k22940N99334n48767n24435L67041n85l47694J82326K75907L02706
$$ -293577 -516517 82817 -465950 -990385 -623344 -623929 -971623 -789297 -513390 -210684
626b10684K72091j92716j04625j41507K78886K79501j55817J40023O06199n58111
$$ -210684 61407 -131309 -235934 -377441 -98555 180946 25129 165152 771351 213240
616B13240n00031J40750l66838k93631J02529J75069K72364M03062k37804k7384
$$ 213240 -286791 -146041 -512879 -806510 -703981 -528912 -256548 146514 -91290 -118674
606a18674k58749j54868K15887R9180K49297J12819M00654p2145L01945J69894
$$ -118674 -377423 -532291 -316404 -217224 32073 144892 545546 473401 775346 945240
596I45240l97261k81614N53583k71160r90160P66051M21531p93533M4578M61024
$$ 945240 547979 266365 819948 548788 -441372 324679 746210 -47323 -2745 458279
586D58279k66406k24409K10043N24753l72194j87193L71260j07038k84834K85292
$$ 458279 191873 -32536 177507 702260 330066 142873 514133 407095 122261 407553
576D07553J05274k68467M33673p95917j27083K79038j39154j69309K17997l38910
$$ 407553 512827 244360 678033 -117884 -244967 34071 -105083 -274392 -56395 -395305
566c95305j85961K6275j71343M63884l9491J62529J97526j75803k13503K32849
$$ -395305 -581266 -554991 -726334 -262450 -301941 -139412 58114 -117689 -331192 -98343
556i8343J48217o12282p5579k56551J78635K06662J08778n2591M77762p8281m88425
$$ -98343 49874 -562408 -637987 -894538 -715903 -509241 -400463 -453054 24708 -53573 -541998
545e41998N23774K18916j64144L29224P89852m97224L064K14954j45369m9656
$$ -541998 -18224 200692 36548 365772 1155624 658400 661464 876418 731049 681393
535F81393k66698m60498o7991k32961O69O11933n96292M11668J62004n39798J78011
$$ 681393 414695 -45803 -113794 -346755 -346086 265847 -330445 81223 243227 -296571 -118560
524a18560k3678k68872L03454N00464j68829K74095q8507J97302j9118m50427
$$ -118560 -142238 -411110 -107656 392808 223979 498074 409567 606869 587751 137324
514A37324j82763L58758m25019J27599N43359L03328N5251k99773l38285k56518
$$ 137324 -45439 313319 -111700 15899 559258 862586 917837 618064 279779 23261
504B3261k75198j27672k0541J33512K30382J09848P3090J1543m05865m2608M01341
$$ 23261 -251937 -379609 -400150 -266638 -36256 73592 146682 158225 -247640 -290248 111093
493A11093j37957m04258M49370M5358p02259Q15898J95752k36089J42739J24835
$$ 111093 -26864 -431122 18248 63606 -638653 177245 372997 136908 279647 404482
483D04482K28522k36230J63453K51105K95006m48365n36032R2117O52711o03729
$$ 404482 633004 396774 560227 811332 1106338 657973 121941 214058 866769 263040
473B63040l60532J88550M6421M1343n30391K06904n0758L12050l35796o56792
$$ 263040 -97492 91058 137479 178822 -351569 -144665 -195423 116627 -219169 -875961
463h75961O78679O0827n17968O45773L22519l92000k6256L32809K6003m93888
$$ -875961 -197282 -136455 -654423 -8650 313869 -78131 -104387 228422 254425 -239463
453b39463M52343J62819k32466P38345k7539k77617K02560K11212k91245p80093
$$ -239463 212880 375699 143233 881578 854039 576422 778982 990194 698949 -81144
443h1144K54024K5427l17672K71117L53779o3679k38714K40499Q0959j43721K98393
$$ -81144 172880 198307 -119365 151752 505531 441852 203138 443637 524596 380875 679268
432F79268j6202p05396M29544k85563L40242j50877k35143P8171j48776k9353
$$ 679268 663066 -42330 387214 101651 441893 291016 55873 134044 -14732 -44085
422d4085p3776j73105k88554N05577M09783n14939n792L69862m84558l07707N59374
$$ -44085 -117861 -290966 -579520 -73943 335840 -179099 -184891 184971 -299587 -607294 -47920
411d7920K14330k8988l27621L46993l78785l05745N22304k29866L21525J22885
$$ -47920 166410 137422 -190199 156794 -221991 -527736 -5432 -235298 86227 209112
401B09112l432m9169K80876j5218o17332M61657K11986m06043J33477O12326r2449
$$ 209112 205680 156511 437387 422169 -195163 266494 478480 72437 205914 818240 725791
390G25791K98272j51315j06238P6482m53797N05194m26599q7632L72390l10888
$$ 725791 1024063 872748 766510 842992 389195 894389 467790 380158 752548 441660
380D41660k75777k65909J67662J79501l91315K5931N16001l80248J3647M76027
$$ 441660 165883 -100026 67636 247137 -144178 -118247 397754 17506 31153 507180
370E07180l53461l30801J83014M65097n87648P4845j06684l1752J71397j44360
$$ 507180 153719 -177082 5932 471029 -116619 -41774 -148458 -180210 -8813 -153173
360a53173K63815q5966n0228O83448k79149j60829P86957J2212k93790p2664n34533
$$ -153173 110642 24676 -25552 657896 378747 217918 1004875 1017087 723297 650633 116100
349A16100j72475M97698k02383l71217P1184P15271k56118l86436Q34743n64722
$$ 116100 -56375 441323 238940 -132277 -61093 654178 398060 11624 846367 281645
339B81645m28015L07112N4520l83029K92299j71455j71555l10868K63225M38074
$$ 281645 -146370 160742 215262 -167767 124532 -46923 -218478 -529346 -266121 171953
329A71953q9912K92632K07667J7339k08532N4084o304p6006L42206Q4882j53238
$$ 171953 82041 374673 582340 599679 391147 445231 438927 362921 705127 790009 636771
318F36771j12236m32253K89303l8497n41189L05290P0254L23172J95232Q1157
$$ 636771 524535 92282 381585 343088 -198101 107189 177443 500615 695847 777004
308G77004R5421j57364M35003q9987q18834L24313J22478m62619n8274j70266
$$ 777004 872425 715061 1150064 1060077 241243 565556 688034 225415 167141 -3125
298c125j49218j45541K0590k159M09412L18852r8522J43737L66890m87269j63026
$$ -3125 -152343 -297884 -277294 -279453 129959 448811 350289 494026 860916 373647 210621
287B10621L54883J15744l02075k85637O2367J33788l8530k15552l70604L80139
$$ 210621 565504 681248 379173 93536 155903 289691 251161 35609 -334995 45144
277D5144K24673l71040j17259J19654l67889m3888R52801k09351n28195P70861
$$ 45144 269817 -101223 -218482 -98828 -466717 -510605 442196 232845 -295350 475511
$$ [...]
##END NTUPLES=NMR SPECTRUM
##END=
