##TITLE=1H_CA-9453
 200.13Hz, DMSO-d6.
 8 sc
 
 23.4.2026
##JCAMPDX= 6.0         $$ Bruker NMR JCAMP-DX V2.0
##DATA TYPE= NMR SPECTRUM
##DATA CLASS= NTUPLES
##ORIGIN= UXNMR, Bruker Analytische Messtechnik GmbH
##OWNER= pz
$$ XWIN-NMR		Version 3.5
$$ Thu Apr 23 14:36:33 2026 Russian Standard Time (UT+4h)  she@DPX200
##.OBSERVE FREQUENCY= 200.131
##.OBSERVE NUCLEUS= ^1H
##.ACQUISITION MODE= SIMULTANEOUS
##.ACQUISITION SCHEME= undefined
##.AVERAGES= 8
##.DIGITISER RES= 18
##SPECTROMETER/DATA SYSTEM= spect
##.PULSE SEQUENCE= zg30
##.SOLVENT NAME= CDCl3
##.SHIFT REFERENCE= (INTERNAL, CDCl3, 0, 16.4179)
##AUDIT TRAIL= $$ (NUMBER, WHEN, WHO, WHERE, WHAT)
$$ ##TITLE= Audit trail, XWIN-NMR		Version 3.5
$$ ##JCAMPDX= 5.01
$$ ##ORIGIN= Bruker BioSpin GmbH
$$ ##OWNER= she
$$ F:/spectra/data/she/nmr/H-C/1/pdata/1/auditp.txt
$$ ##AUDIT TRAIL=  $$ (NUMBER, WHEN, WHO, WHERE, WHAT)
(   1,<2026-04-23 14:34:23.81 +0400>,<she>,<DPX200>,
      <created by zg, POWCHK disabled, PULCHK disabled
       configuration hash MD5:
       00 E9 B6 7A A2 85 ED C7 34 08 36 98 17 FE 4E 26
       data hash MD5: 16K
       70 55 1E AF 13 B8 6D 37 09 20 06 EB DE FC 75 CF>)
(   2,<2026-04-23 14:34:27.60 +0400>,<she>,<DPX200>,
      <Start of raw data processing
       efp BC_mod = 2 LB = 0.25 FT_mod = 6 PKNL = 1 PHC0 = -4220.519 PHC1 = 11.19229 SI = 16K 
       data hash MD5: 16K
       64 66 A6 B3 3C 0E A2 32 E1 34 4A 4E 9A B4 10 7B>)
(   3,<2026-04-23 14:34:44.65 +0400>,<she>,<DPX200>,
      <pk PHC0 = 159.639 PHC1 = -3.4 
       data hash MD5: 16K
       92 54 C9 B2 B0 B4 12 41 27 77 5D 23 30 0C D4 CD>)
(   4,<2026-04-23 14:34:48.75 +0400>,<she>,<DPX200>,
      <abs ABSG = 5 
       data hash MD5: 16K
       5A CB 2A 41 9C C4 8A F8 06 A7 BA 61 AC 27 42 0A>)
$$ ##END=
$$ 
$$ hash MD5
$$ 53 EF 23 2E 6F C3 B5 9D 91 8E 7B 8F B2 85 5E 67
##$RELAX= 
##$RELAX= 
##$RELAX= 
##$RELAX= 
##$RELAX= 
##$RELAX= 
$$ Bruker specific parameters
$$ --------------------------
##$DU= <F:/spectra>
##$EXPNO= 1
##$NAME= <H-C>
##$PROCNO= 1
##$TYPE= <nmr>
##$USER= <she>
##$AMP= (0..31)
100 100 100 100 100 100 100 100 100 100 100 100 100 100 100 100 100 100 
100 100 100 100 100 100 100 100 100 100 100 100 100 100 
##$AQSEQ= 0
##$AQ_mod= 1
##$AUNM= <au_zg>
##$AUTOPOS= <>
##$BF1= 200.13
##$BF2= 200.13
##$BF3= 200.13
##$BF4= 200.13
##$BF5= 200.13
##$BF6= 200.13
##$BF7= 200.13
##$BF8= 200.13
##$BYTORDA= 1
##$CFDGTYP= 0
##$CFRGTYP= 5
##$CHEMSTR= <none>
##$CNST= (0..31)
1 1 145 1 1 1 1 1 1 1 1 1 1 1 1 1 1 1 1 1 1 1 1 1 1 1 1 1 1 1 1 1 
##$CPDPRG= <>
##$CPDPRG1= <>
##$CPDPRG2= <>
##$CPDPRG3= <>
##$CPDPRG4= <mlev>
##$CPDPRG5= <mlev>
##$CPDPRG6= <mlev>
##$CPDPRG7= <mlev>
##$CPDPRG8= <mlev>
##$CPDPRGB= <>
##$CPDPRGT= <>
##$D= (0..31)
0 0.7 0 0 0 0 0 0 0 0 0 0.03 0 0 0 0 0 0 0 0 0 0 0 0 0 0 0 0 0 0 0 0 
##$DATE= 1776940463
##$DBL= (0..7)
120 120 120 120 120 120 120 120 
##$DBP= (0..7)
150 150 150 150 150 150 150 150 
##$DBP07= 0
##$DBPNAM0= <>
##$DBPNAM1= <>
##$DBPNAM2= <>
##$DBPNAM3= <>
##$DBPNAM4= <>
##$DBPNAM5= <>
$$ [...]
##$SUBNAM3= <"">
##$SUBNAM4= <"">
##$SUBNAM5= <"">
##$SUBNAM6= <"">
##$SUBNAM7= <"">
##$SUBNAM8= <"">
##$SUBNAM9= <"">
##$SW= 18.0517599122864
##$SWIBOX= (0..15)
0 0 2 0 0 0 0 0 0 0 0 0 0 0 0 0 
##$SW_h= 3612.71676300578
##$TD= 16384
##$TD0= 1
##$TE= 0
##$TE2= 300
##$TE3= 300
##$TEG= 300
##$TL= (0..7)
0 120 120 120 120 120 120 120 
##$TP= (0..7)
150 150 150 150 150 150 150 150 
##$TP07= 0
##$TPNAME0= <>
##$TPNAME1= <>
##$TPNAME2= <>
##$TPNAME3= <>
##$TPNAME4= <>
##$TPNAME5= <>
##$TPNAME6= <>
##$TPNAME7= <>
##$TPOAL= (0..7)
0.5 0.5 0.5 0.5 0.5 0.5 0.5 0.5 
##$TPOFFS= (0..7)
0 0 0 0 0 0 0 0 
##$TUNHIN= 0
##$TUNHOUT= 0
##$TUNXOUT= 0
##$USERA1= <user>
##$USERA2= <user>
##$USERA3= <user>
##$USERA4= <user>
##$USERA5= <user>
##$V9= 5
##$VALIST= <valist>
##$VCLIST= <CCCCCCCCCCCCCCC>
##$VD= 0
##$VDLIST= <DDDDDDDDDDDDDDD>
##$VPLIST= <PPPPPPPPPPPPPPP>
##$VTLIST= <TTTTTTTTTTTTTTT>
##$WBST= 1024
##$WBSW= 4
##$XGAIN= (0..3)
0 0 0 0 
##$XL= 0
##$YL= 0
##$YMAX_a= 340347
##$YMIN_a= -424343
##$ZGOPTNS= <>
##$ZL1= 120
##$ZL2= 120
##$ZL3= 120
##$ZL4= 120
##$ABSF1= 16.41792
##$ABSF2= -1.633974
##$ABSG= 5
##$ABSL= 3
##$ALPHA= 0
##$AQORDER= 0
##$ASSFAC= 0
##$ASSFACI= 0
##$ASSFACX= 0
##$ASSWID= 0
##$AUNMP= <proc_1d>
##$AZFE= 0.1
##$AZFW= 0.1
##$BCFW= 0
##$BC_mod= 2
##$BYTORDP= 0
##$COROFFS= 0
##$CY= -3
##$DATMOD= 1
##$DC= 0
##$DFILT= <>
##$DTYPP= 0
##$F1P= 0
##$F2P= 0
##$FCOR= 1
##$FTSIZE= 16384
##$FT_mod= 6
##$GAMMA= 0
##$GB= 0
##$INTBC= 1
##$INTSCL= 3.241238e-09
##$ISEN= 128
##$LB= 0.25
##$LEV0= 0
##$LPBIN= 0
##$MAXI= 10000
##$MC2= 0
##$MEAN= 0
##$ME_mod= 0
##$MI= 1.114404
##$NCOEF= 0
##$NC_proc= -5
##$NLEV= 6
##$NOISF1= 3.799351
##$NOISF2= 2.8
##$NSP= 0
##$NTH_PI= 0
##$NZP= 0
##$OFFSET= 16.41792
##$PC= 1
##$PHC0= -4060.88
##$PHC1= 7.79229
##$PH_mod= 1
##$PKNL= yes
##$PPARMOD= 0
##$PSCAL= 0
##$PSIGN= 0
##$REVERSE= no
##$SF= 200.129520647742
##$SI= 16384
##$SIGF1= 3
##$SIGF2= 2
##$SINO= 0.751879
##$SIOLD= 32768
##$SREGLST= <19F.Aceton>
##$SSB= 0
##$STSI= 16384
##$STSR= 0
##$SW_p= 3612.71676300579
##$SYMM= 0
##$S_DEV= 0
##$TDeff= 16384
##$TDoff= 0
##$TI= <>
##$TILT= no
##$TM1= 0
##$TM2= 0
##$TOPLEV= 0
##$USERP1= <user>
##$USERP2= <user>
##$USERP3= <user>
##$USERP4= <user>
##$USERP5= <user>
##$WDW= 1
##$XDIM= 16384
##$YMAX_p= 377016466
##$YMIN_p= -2499628
$$ End of Bruker specific parameters
$$ ---------------------------------
##NTUPLES= NMR SPECTRUM
##VAR_NAME=  FREQUENCY,     SPECTRUM/REAL,   SPECTRUM/IMAG
##SYMBOL=    X,             R,               I
##VAR_TYPE=  INDEPENDENT,   DEPENDENT,       DEPENDENT
##VAR_FORM=  AFFN,          ASDF,            ASDF
##VAR_DIM=   16384,         16384,           16384
##UNITS=     HZ,            ARBITRARY UNITS, ARBITRARY UNITS
##FACTOR=    0.220516191357248, 1,           1
##FIRST=     3285.71029131115, 0,            0
##LAST=      -327.00647169464, 0,            0
##MIN=       -327.00647169464, -2499628,     0
##MAX=       3285.71029131115, 377016466,    0
$$ Real data points
##PAGE= N=1
##DATA TABLE= (X++(R..R)), XYDATA
$$ [...]
5594d2540R5510j61951N2760m7919j1953J00807Q4599j5280M4192j07523r6369
$$ -42540 52970 -108981 -56221 -104140 -116093 -15286 69313 54033 98225 -9298 -105667
5583a05667K4271K29339j05166k00927m9220J42415l2531J4008J19392k0954j41254
$$ -105667 -81396 147943 42777 -158150 -207370 -64955 -97486 -83478 35914 14960 -126294
5572a26294M2733j49927J74594O6880j52649o9696R8098J8391j16031J01724J01901
$$ -126294 -83561 -233488 -58894 7986 -144663 -214359 -116261 -97870 -213901 -112177 -10276
5561a0276L3974l8820J01835q4766k5466P983R7454k4975k07412Q6535N7390L4973
$$ -10276 23698 -15122 86713 1947 -23519 -15536 81918 56943 -150469 -63934 -6544 28429
5549B8429O6876n050J7441j77814l7375N0328J73641o2754j30075j2031m3932
$$ 28429 95305 90255 107696 -70118 -107493 -57165 116476 53722 -76353 -88384 -132316
5538a32316O5819j007J00202j2341p7844m9606L1460J09522P3593j03827J4842
$$ -132316 -66497 -67504 32698 20357 -57487 -107093 -75633 33889 107482 3655 18497
5527A8497j42531N5211P5423K0834j8933l0147r1014J4545L2881R7347n1870j3780
$$ 18497 -124034 -68823 6600 27434 8501 -21646 -112660 -98115 -65234 32113 -19757 -33537
5515c3537l8341j580K1554p3763j08848M2965L9739M0026K9494r9485J14443J6325
$$ -33537 -71878 -73458 -51904 -125667 -234515 -191550 -151811 -111785 -82291 -181776 -67333 -51008
5503e1008M3543M029P2471j27528j22423Q5829L9137J3277M8421j8286K1872n9757
$$ -51008 -7465 -3436 69035 -58493 -180916 -95087 -55950 -42673 5748 -12538 9334 -50423
5491e0423k2285k4737J58334m2646o3627K3033k7685L8423J29737j10031o3086
$$ -50423 -72708 -97445 60889 18243 -45384 -22351 -50036 -11613 118124 8093 -54993
5480e4993m7232O6335o3022k3095L5841r9801N0972J51313J2975Q1619r1842j32101
$$ -54993 -102225 -35890 -98912 -122007 -86166 -185967 -134995 16318 29293 110912 19070 -113031
5468a13031O7306M3020J51585k14779q3102M7556m5952J2257J22074q8358p919
$$ -113031 -45725 -2705 148880 -65899 -149001 -101445 -147397 -135140 -13066 -101424 -109343
5457a09343M2667l093L0436l7720o1016k3721K2798P609P9625n9331l3816Q9593
$$ -109343 -66676 -69769 -39333 -77053 -138069 -161790 -138992 -131383 -51758 -111089 -144905 -55312
5445e5312J23769j0912j10731K7838J25742j73527M542J4576K7967K9289Q4069
$$ -55312 68457 57545 -53186 -25348 100394 -73133 -68591 -54015 -26048 3241 87310
5434H7310q5780m9779L7041O2219J33545l2657j45905n9379J46736L2545M6672
$$ 87310 1530 -48249 -11208 51011 184556 151899 5994 -53385 93351 125896 172568
5423A72568L5087j58067j35943Q2614K26811j23000j7912m6148k21329J72883
$$ 172568 207655 49588 -86355 -3741 223070 100070 82158 36010 -185319 -12436
5413a2436j7989Q1254l5584j4060q5858O8216L0j7552O5375Q322o0144m0281R9511
$$ -12436 -30425 50829 15245 1185 -84673 -16457 -16427 -33979 31396 39718 -20426 -60707 38804
5400C8804J15688j61008j9333O6903L8913K0755J2050K5090j38563q2139J9836
$$ 38804 154492 -6516 -25849 41054 79967 100722 112772 137862 -701 -82840 -63004
5389f3004L134J28929N8734k29140M5852J75278j6414p3604K410q3922l4898k0757
$$ -63004 -59870 69059 127793 -101347 -55495 119783 103369 29765 32175 -51747 -86645 -107402
5377a07402J12719P029j7120l2967K8100M605k5088J2019M2187K1241N6272j57247
$$ -107402 5317 12346 -4774 -37741 -9641 -5036 -30124 -18105 24082 45323 101595 -55652
5365e5652k5875N7115L4477k5485N5055l6618j19573J51293l4094p002L617j0015
$$ -55652 -81527 -24412 10065 -15420 39635 3017 -116556 34737 643 -6359 -2742 -12757
5353a2757q624l3785l612L7030r2407N6873J04143j55279j13674P7009J36752
$$ -12757 -21381 -55166 -58778 -21748 -114155 -57282 46861 -108418 -222092 -145083 -8331
5342h331J9242k4555L7570j87761N5377J07381j15683j4437q0117j02578O5484
$$ -8331 10911 -13644 23926 -163835 -108458 -1077 -116760 -131197 -211314 -313892 -248408
5331b48408J31267N2008q6729M0663M8044L9371J64723N2575j09861j00143J2138
$$ -248408 -117141 -65133 -151862 -111199 -63155 -23784 140939 193514 83653 -16490 -4352
5320d352o9670M8248J32078j63002J7397j37J2873J6445p7831M6856l6933m2407
$$ -4352 -74022 -25774 106304 -56698 -39301 -39438 -26565 -10120 -87951 -41095 -78028 -120435
5308a20435Q4434q1298Q367P3116l8642q4218J13225N0079j00421L0N3428N023
$$ -120435 -36001 -117299 -108932 -35816 -74458 -158676 -45451 4628 -95793 -95763 -42335 -37312
5296c7312N0227O1370L4494m4482j11833J26654J4926o4406K5309j4288j24535
$$ -37312 12915 74285 108779 64297 -47536 79118 94044 29638 54947 40659 -83876
5285h3876J73357M5691j25584J02576j04955r3768q9013O273J74635m6748j58754
$$ -83876 89481 135172 9588 112164 7209 -86559 -175572 -169299 5336 -41412 -200166
5274b00166m841p3935J32880O7304o3773O6061K051j30254O7557J00403J03673
$$ -200166 -205007 -278942 -146062 -78758 -142531 -76470 -74419 -204673 -137116 -36713 66960
5263F6960O2370j42651p5919J12765O6687l79K2869q1899p517j30188O7652J38821
$$ 66960 129330 -13321 -89240 23525 90212 89833 112702 30803 23286 -106902 -39250 99571
5251I9571l0553j15036K5950k5019J75100p350O093j66945m0620n5741K12822
$$ 99571 69018 -46018 -20068 -45087 130013 122663 128756 -38189 -78809 -134550 78272
5240G8272l0160q0501j409j02322K8259R1805k3229M3416r3341N8239j279o6973
$$ 78272 48112 -32389 -33798 -136120 -107861 -16056 -39285 4131 -89210 -30971 -32250 -99223
5228i9223R3850J3924j3260L908J06317r537J22404j9252j4649L5126L0551K431
$$ -99223 -5373 8551 -4709 -801 105516 95979 218383 199131 184482 219608 250159 252590
5216B52590o0039j5017N8198o8260K5114k4438P0610r7911Q7444k7783m3906j5695
$$ 252590 192551 177534 235732 167472 192586 168148 238758 140847 228291 200508 156602 140907
5204A40907l7962o2999O7488L5685L0751m6715R2398L5609k7034R1644L4443n7297
$$ 140907 102945 39946 107434 143119 173870 127155 219553 255162 228128 319772 354215 296918
5192B96918Q9027l2721K10247L1764j23246K0138J1499K50770P0597n0907l1769
$$ 296918 385945 353224 563471 595235 471989 492127 503626 754396 824993 774086 742317
5181G42317P9003J35293K14084J58683K22846L0537K14788M13224N80943P25336
$$ 742317 821320 956613 1170697 1329380 1552226 1582763 1797551 2210775 2791718 3517054
5171C517054J032725J765916K814762L982666L542090J220167j518389k755828
$$ 3517054 4549779 6315695 9130457 13113123 16655213 17875380 16356991 13601163
5163A3601163k717212k290201j756928j332153r52355p70650p01574m59042n02732
$$ 13601163 10883951 8593750 6836822 5504669 4552314 3781664 3080090 2621048 2118316
5154B118316l59803j96480k83406p530l3585j35235j60963l8457L3221J3104j12023
$$ 2118316 1758513 1562033 1278627 1271097 1237512 1102277 941314 902857 936078 949182 837159
5143H37159j52570j12284J4027L8922j6387p302j61736j41454J4406J27522M0884
$$ 837159 684589 572305 586332 625254 608867 601565 439829 298375 312781 440303 481187
5132D81187j15854j96698N5760J09878k1858R5049j59966o6753k9959J48234R309
$$ 481187 365333 168635 224395 334273 312415 407464 247498 180745 150786 299020 308329
5121C08329L4397n4046k43625P7629J52526M0487N3360k08423m3576l0129j5473
$$ 308329 342726 288680 45055 122684 275210 315697 369057 160634 117058 86929 71456
5110G1456K7691N8464k3205j87545j55705K00735L5328l6909J9315j36876N2810
$$ 71456 99147 157611 134406 -53139 -208844 -8109 27219 -9690 9625 -127251 -74441
5099g4441N3338J12791k8799q0515K9743K9221r561m4948m429N7790N0071J27467
$$ -74441 -21103 91688 62889 -17626 12117 41338 31777 -13171 -17600 40190 90261 217728
5087B17728n5446j52439q9999P9971N9541K10523j72705K2039p6055j75419P3970
$$ 217728 162282 9843 -80156 -185 59356 269879 97174 119213 43158 -132261 -58291
5076e8291K01972j07623j16278k0235P8847L0652J0035j04980J95588r4713j35116
$$ -58291 143681 36058 -80220 -100455 -21608 9044 19079 -85901 109687 14974 -120142
5065a20142J03210n1709R2454M375j38551n947J7974J12679L8351j04889P7669
$$ -120142 -16932 -68641 23813 28188 -110363 -116310 -98336 14343 52694 -52195 25474
5054B5474o027r8103L9651N5036J6519j3049r0618k96P1587J60017k1929l4920
$$ 25474 19447 -78656 -39005 16031 32550 19501 -71117 -71413 174 160191 138262 103342
5042A03342j41858n1845L4597N6019N6045O2912j52292o1050K532J30409J17765
$$ 103342 -38516 -90361 -55764 255 56300 119212 -33080 -94130 -91598 38811 156576
5031A56576r7485j07093l3921m6549J63577k2198j04192M9970R2129n2629N7644
$$ 156576 59091 -48002 -81923 -128472 35105 12907 -91285 -41315 50814 -1815 55829
5020E5829Q7859j34972m890J10195j01747J4400L7603k6182O9818L6845k7921
$$ 55829 143688 8716 3826 114021 12274 26674 64277 38095 107913 144758 116837
5009A16837j34264l44J69585k19728q1868k0654K2850l8722J16941N8339j04230
$$ 116837 -17427 -17771 151814 -67914 -149782 -170436 -147586 -186308 -69367 -11028 -115258
4998a15258K0498J72236o872k4270r6087J886J9909o3879N6090J17209q183n1832
$$ -115258 -94760 77476 70604 46334 -49753 -47867 -27958 -91837 -35747 81462 73279 21447
4986B1447j17333M0924J64333m47q6338p4819L9494q5822Q5327q219J73436j02384
$$ 21447 -95886 -54962 109371 108924 22586 -52233 -12739 -98561 -13234 -21453 151983 49599
4974D9599o0128P8743j7212Q7594j8465j79574J62392Q6402l214j05023n110j2804
$$ 49599 -10529 68214 51002 138596 120131 -59443 102949 189351 186137 81114 76004 63200
4962F3200K15543k5441j59987r4814k2282N5193k4957N6994O783j53249o1030
$$ 63200 278743 253302 93315 -1499 -23781 31412 6455 63449 70232 -83017 -144047
4951a44047J49892R8604l2081j42033l2382k4058K34422J07753j37589j64339
$$ -144047 5845 104449 72368 -69665 -102047 -126105 108317 216070 78481 -85858
4941h5858J32291J43449R5355j38498j53549k9863r763j3254P7287r785q1584
$$ -85858 46433 189882 285237 146739 -6810 -36673 -46436 -59690 17597 7812 -73772
4930g3772m3533n687P0950O6574N8268j97146R8236k6862m6604O2857J49235j14317
$$ -73772 -117305 -122992 -52042 14532 72800 -124346 -26110 -52972 -99576 -36719 112516 -1801
4918a801L3088J2901L3356P0450L8025j11902q1428J55248K971m6326J18245r6970
$$ -1801 31287 44188 77544 147994 186019 74117 -7311 147937 150908 104582 222827 125857
4906A25857M3058M431N2103r2537m1464n0463j40547J09914K5791Q5653j35056
$$ 125857 168915 173346 225449 132912 91448 40985 -99562 10352 36143 121796 -13260
4895a3260l8976J86854n7708L7831Q3991m4592l2736m227q9933P2386J10804j33965
$$ -13260 -52236 134618 76910 114741 198732 154140 121404 117177 27244 99630 210434 76469
4883G6469P5825k945l7452j18169J60576o5612j65870k383J10962q8629Q7073
$$ 76469 152294 149349 111897 -6272 154304 88692 -77178 -79561 31401 -57228 29845
4872B9845O4410m1021r1083k9244M5379N5197L0519J3635p8626q7293J17151J17316
$$ 29845 94255 53234 -37849 -67093 -21714 33483 64002 77637 -989 -88282 28869 146185
4860A46185l2701J0999o7796j3282R9731r5356K6537k9939k6085m7243J29333
$$ 146185 113484 124483 56687 43405 143136 47780 74317 44378 18293 -28950 100383
4849A00383O7901r0373k8379m1493J51822j3209p258j27264r5432J7359R6453
$$ 100383 168284 77911 49532 8039 159861 146652 139394 12130 -83302 -65943 30510
4838C0510Q4765o763j2035m4182O0601R8617Q0591k01100p4328J01260L504K2389
$$ 30510 115275 108512 96477 52295 112896 211513 292104 91004 16676 117936 121440 143829
4826A43829J5738O4137k10870M5671R9369r7733R6369R564j18465J2782J13851
$$ 143829 159567 223704 12834 58505 157874 60141 156510 166074 47609 60391 174242
4815A74242K9837q1663O4866j10715J33413M2368N88j93186n8772M5748J3874
$$ 174242 204079 122416 187282 76567 209980 252348 252936 59750 978 46726 60600
4804F0600J62180L8382m7247p3484J9933J65735R0978j01099L2459j56268k5429
$$ 60600 222780 261162 213915 140431 160364 326099 417077 315978 348437 192169 166740
4793A66740J66634j5137j4016n9487K7841J02613n7643R6887o383j11416n9736
$$ 166740 333374 318237 304221 244734 272575 375188 317545 414432 408049 296633 236897
4782B36897J38658j22767J03435l0811q6907J22216k6299N6494m677k4851Q5460
$$ 236897 375555 252788 356223 325412 238505 360721 334422 390916 386239 361388 446848
4771D46848j32009P2171O5450N8159j48021K26232o1264q5727J02984l8583L9929
$$ 446848 314839 387010 452460 510619 362598 588830 527566 441839 544823 506240 546169
4760E46169N1949j1720l0764Q3857q3529k6571j8013L5816M685r0483m2296O2102
$$ 546169 598118 586398 555634 639491 555962 529391 511378 547194 551879 461396 419100 481202
4748D81202P9731P1555k15n1363J0692O8714O0639O3094p0829M9814r8296N1554
$$ 481202 560933 632488 632273 580910 591602 660316 720955 784049 713220 763034 664738 716292
4736G16292J40789k6162l4055O626K9909L921K33816j23663J14142J03117m7201
$$ 716292 857081 830919 796864 803490 833399 837320 1071136 947473 1061615 1164732 1117531
4725A117531p6715P3210P5163l9617J5997N2568p191J01130J2356M7390P0800
$$ 1117531 1040816 1114026 1189189 1149572 1165569 1218137 1210946 1312076 1324432 1371822 1442622
4714A442622Q5328n5106l8522J27109j6216P2689N2415Q3296J23572l7511O5959
$$ 1442622 1527950 1472844 1434322 1561431 1545215 1617904 1670319 1753615 1877187 1839676 1905635
4703A905635J29057O2464K15783o2364M9444R3087P772J02926J09079l4234K01268
$$ 1905635 2034692 2097156 2312939 2250575 2300019 2393106 2400878 2503804 2612883 2578649 2779917
4692B779917J14613L2537J18949J50745k7835M8060l1213J21560N2932J6418K2481
$$ 2779917 2894530 2927067 3046016 3196761 3168926 3216986 3185773 3307333 3360265 3376683 3399164
4681C399164P3169O6119J25594p6847L3482J1132J04241k185o3822k9124J01035
$$ 3399164 3472333 3538452 3664046 3587199 3620681 3631813 3736054 3733869 3670047 3640923 3741958
4670C741958m4737m4776K8539L356j80307q5136p8543j29765K9185l1759j25608
$$ 3741958 3697221 3652445 3680984 3684340 3504033 3418897 3340354 3210589 3239774 3208015 3082407
4659C082407l7797n7300j24732K9049p8158j14554l3628q6339j21061n747m0320
$$ 3082407 3044610 2987310 2862578 2891627 2813469 2698915 2665287 2578948 2457887 2452140 2411820
4648B411820J5325j78343j40313j08091p946p2057r3567r183j2421p5220o9653
$$ 2411820 2427145 2248802 2108489 2000398 1992452 1920395 1826828 1817645 1805224 1730004 1660351
4637A660351j59563K1400L1489n8458j56294J31126j64879j36683J29137O4248
$$ 1660351 1500788 1522188 1553677 1495219 1338925 1470051 1305172 1168489 1297626 1361874
4627A361874q9107q3638l979n9172k6475M7797o6408l5452J2552k0095j79983
$$ 1361874 1272767 1189129 1185150 1125978 1099503 1147300 1080892 1045440 1057992 1037897 857914
4616H57914J16484K9913r4797j27789o1142K8774l1599K0760j72115j44054J84838
$$ 857914 974398 1004311 909514 781725 720583 749357 717758 738518 566403 422349 607187
4605F07187N5675j67807J16041l1516j0449J0575J4002j2824k9756J00209m6346
$$ 607187 662862 495055 611096 579580 569131 579706 593708 580884 551128 651337 604991
4594F04991j33325K7866j55459R5749l7391j4969Q1650r9653j4410J37909n7865
$$ 604991 471666 499532 344073 439822 402431 387462 469112 369459 355049 492958 435093
4583D35093r3862J27644j87604O779Q0750L4666n99L8554K3108r0716j37941M4900
$$ 435093 341231 468875 281271 288050 368800 403466 402867 441421 464529 373813 235872 280772
4571B80772Q1872j9389m4752j50849q6191J36413J65916N6061r4411p4236K2924
$$ 280772 362644 343255 298503 147654 61463 197876 363792 419853 325442 251206 274130
4560B74130Q7017N9068l2403r7214j20473l0399O7540K3404l4333p8950M4913
$$ 274130 361147 420215 387812 290598 170125 139726 207266 230670 196337 117387 162300
4549A62300K46880r3127k18971k8212M0123J68309K0996p7417O3126k24776L6975
$$ 162300 409180 316053 97082 68870 108993 277302 298298 220881 284007 59231 96206
4538I6206J42274J9778j52567q6727J1100L569J51522q5969L0695R4215o7367
$$ 96206 238480 258258 105691 18964 30064 33633 185155 99186 129881 224096 156729
4527A56729N9526J339n0144k8567K4384l1608O302m3333J9475j1497j7375J4815
$$ 156729 216255 217594 167450 138883 163267 131659 137961 94628 114103 102606 85231 100046
4515A00046O913N4310O9808j48044m8449J16611r0901K3829O5043o4307R3831
$$ 100046 106959 161269 231077 83033 34584 151195 60294 84123 149166 84859 178690
4504A78690q5784R6417k8831o6568m9260L6593j9862q8450J36287l9119J1749
$$ 178690 92906 189323 160492 93924 44664 81257 61395 -27055 109232 70113 81862
4493H1862m8761J28773r6228o477M147O0290r2532j06329O4406j18462J92587
$$ 81862 33101 161874 65646 59169 63316 123606 31074 -75255 -10849 -129311 63276
4482F3276M2244j93242L079m6580Q2114N7241K6693p7128j1530q195J41630K5543
$$ 63276 105520 -87722 -84643 -131223 -49109 8132 34825 -42303 -53833 -62028 79602 105145
4470A05145r563O7784j51579j4712n525n2416P106L1466N808o3838M3328L3432
$$ 105145 95582 163366 11787 -2925 -8450 -60866 -53760 -22294 -16486 -80324 -36996 -3564
4458c564O9952J5823p9584R1320k7623R9056q6807n4065o1134m4329Q8968O9623
$$ -3564 66388 82211 2627 93947 66324 165380 78573 24508 -36626 -80955 8013 77636
4446G7636r6897o6201j4098M3272J40196o3313j18193Q6166m2300Q7366O3556
$$ 77636 -19261 -85462 -99560 -56288 83908 20595 -97598 -11432 -53732 33634 97190
4435I7190r3369O9883q7756J18252j7493M2565k10701J44469J21387q6216j36732
$$ 97190 3821 73704 -14052 104200 86707 129272 -81429 63040 184427 98211 -38521
4424c8521J09655J07958l738m9759k5643M5824J58621J68186P8284k04117j40053
$$ -38521 71134 179092 175354 125595 99952 145776 304397 472583 550867 346750 206697
4413B06697j42N9353Q4467j32935j88343j11082J07023N3491J3610j3539j26687
$$ 206697 206555 265908 350375 217440 29097 -81985 25038 78529 92139 78600 -48087
4402d8087l2175J72348R1936p7628p0779j4424j16527J76310l3217m2079m9185
$$ -48087 -80262 92086 184022 106394 35615 21191 -95336 80974 47757 5678 -43507
4391d3507j08819J94476J5361r9860N0792p4285p584Q735P4631P2822N0114j92488
$$ -43507 -152326 42150 57511 -42349 8443 -65842 -73426 -64691 9940 82762 132876 -59612
4379e9612o0430N9672J52853J4188j41565n7460j8438n9247J38334O6488o8683
$$ -59612 -120042 -60370 92483 106671 -34894 -92354 -110792 -170039 -31705 34783 -33900
4368c3900r9473j506M3340J09411j32814K7684N1474k418r701J3114o7421r2748
$$ -33900 -133373 -134879 -91539 17872 -114942 -87258 -35784 -38202 -47903 -34789 -102210 -194958
4356a94958J36673M2843m7517L4765j73244N1912Q5818j3717J05260r6253l5259
$$ -194958 -58285 -15442 -62959 -28194 -201438 -149526 -63708 -77425 27835 -68418 -103677
4345a03677O9187m7422l9858J06416O6713j28341j07721j719J68223K4807k5951
$$ -103677 -34490 -81912 -121770 -15354 51359 -76982 -184703 -186422 -18199 6608 -19343
4334a9343p2578j43989P1627N6571R6186J6803o7277l0647j6912Q0926Q1110j4839
$$ -19343 -91921 -235910 -164283 -107712 -11526 5277 -62000 -92647 -109559 -28633 52477 37638
4322C7638j93337J11202M8127j62293J35013Q1505j03450q8076N6404o8030J98486
$$ 37638 -155699 -44497 3630 -158663 -23650 57855 -45595 -133671 -77267 -145297 53189
4311E3189q0758l7235p83P257O9624j4279o9029j2951L2251N5882o3571k7243
$$ 53189 -27569 -64804 -65587 -58330 11294 -2985 -72014 -84965 -52714 3168 -60403 -87646
4299h7646p7324J69316r6280q196p421Q7214M278j91358J87112N2704m3630P1332
$$ -87646 -164970 4346 -91934 -100130 -107551 -20337 -16059 -207417 -20305 32399 -11231 60101
4287F0101j8582O9583N1912N714k7356P7352j4848L2334N077J21638L6538l6306
$$ 60101 41519 111102 163014 168728 141372 218724 203876 236210 241287 362925 399463 363157
4275C63157n6752J46830j6889j01031j1832j8453J2458p1336K5353K9303j29035
$$ 363157 306405 453235 436346 335315 323483 305030 317488 246152 271505 300808 171773
4264A71773O9418N9119j9763R294n4549J39111j9975R5943M3096J05283Q7041
$$ 171773 241191 300310 280547 289841 235292 374403 354428 450371 493467 598750 685791
4253F85791L4932P1207J25936J75189J03642L0855L15295L32477L64869P43092
$$ 685791 720723 791930 917866 1093055 1196697 1227552 1542847 1875324 2240193 2983285
4243B983285J206519J724079K667227K601456J338330n49908j718424j984285
$$ 2983285 4189804 5913883 8581110 11182566 12520896 11970988 10252564 8268279
4235H268279j663915j535402j039764q28315n03415l58835o56791j75396j94366
$$ 8268279 6604364 5068962 4029198 3200883 2697468 2338633 1681842 1506446 1312080
4226A312080k11556q8947j51964q3955j29780p3231k1414P9968r3363n6589J9078
$$ 1312080 1100524 1011577 859613 775658 645878 572647 551233 631201 537838 481249 500327
4215E00327j63383J1407Q577K1018J7624k39866m739O5188l014J00199J0534j43200
$$ 500327 336944 348351 356928 377946 395570 155704 150965 216153 213139 313338 323872 180672
4203A80672j30996O4900M9629Lq1091n6610q3200j3829J93445J7674m2368m7164
$$ 180672 49676 114576 164205 164208 83117 26507 -56693 -70522 122923 140597 98229 51065
4191E1065j7158P5213n7397N4875q8685j54676J73341R7011m7571N0394q2816
$$ 51065 33907 109120 51723 106598 17913 -136763 36578 133589 86018 136412 53596
4180E3596M410P5965K7563o0358k1852K5049n2155M1599m0123L6277m2177N4840
$$ 53596 58006 133971 161534 101176 79324 104373 52218 93817 53694 89971 47794 102634
4168A02634l3174j6728J13705j33919N3004o678O4807M4915j7579J13473r1703
$$ 102634 69460 52732 166437 32518 85522 78844 143651 188566 170987 284460 192757
4157A92757k6327m5817j0249J20082R3687k80862j10086L8111J06604K74256o1812
$$ 192757 166430 120613 110364 230446 324133 43271 -66815 -28704 77900 352156 290344
4146B90344J5047j16053M8343J5341Q2564j10377j17913l6826p9296R9681m8078
$$ 290344 305391 189338 237681 253022 335586 225209 107296 70470 -8826 90855 42777
4135D2777q404N3514n7063M6296l3914l72L2222P6927l1267J32143L9481j75948
$$ 42777 34373 87887 30824 77120 43206 42834 75056 151983 120716 252859 292340 116392
4123A16392Q8491L0627K3427n613Q858k13842N0025o7967J21252J5623q1942j01227
$$ 116392 204883 235510 258937 253324 262182 48340 98365 30398 151650 167273 85331 -15896
4111a5896k1166J29211R0038l1814m7603k0545n9595J6486J41816q9527J809j30090
$$ -15896 -37062 92149 182187 150373 102770 82225 22630 39116 180932 91405 93214 -36876
4099c6876J6208J42826J8431K762q8991j49443m1449L0153Q541J57595j16557
$$ -36876 -20668 122158 140589 143351 54360 -95083 -136532 -106379 -97838 59757 -56800
4088e6800n6207Q1974R3479J25546n0788q7035J66472j21927q9698P2117N6183
$$ -56800 -113007 -31033 62446 187992 137204 50169 216641 94714 5016 77133 133316
4077A33316j06043L6324j00205R5440J1910k7860K8038L6716J08431L6510q9877
$$ 133316 27273 63597 -36608 58832 70742 42882 70920 107636 216067 252577 162700
4066A62700J09601q7811j38955J47371N7805K6195n6320j8261J55746J57249J00466
$$ 162700 272301 184490 45535 192906 250711 276906 220586 202325 358071 515320 615786
4055F15786Q2642J27847K97504M02341N83405P25121L29810n8049l39434l81369
$$ 615786 698428 826275 1123779 1526120 2109525 2834646 3164456 3106407 2766973 2385604
4045B385604k07442k54100k55810j75172j87574J06691k4509P4833n0809J82163
$$ 2385604 2178162 1924062 1668252 1493080 1305506 1412197 1387688 1462521 1411712 1593875
4035A593875J57566L37937L38361K69924l1037J5135K61998J80554L32456L95126
$$ 1593875 1751441 2089378 2427739 2697663 2666626 2681761 2943759 3124313 3456769 3851895
4025C851895M22234L64294K91969J78499J41354k8664l8445J82265M80346N33837
$$ 3851895 4274129 4638423 4930392 5108891 5250245 5221581 5183136 5365401 5845747 6379584
4015F379584L42659j89304j80421m07214k59189l37669K279o12R0021N2277l93222
$$ 6379584 6722243 6532939 6352518 5945304 5686115 5348446 5350725 5350113 5440134 5492411 5099189
4004E099189n40631n08773m33591n8509q4207j76598k75798k76834k93567j06501
$$ 5099189 4558558 4049785 3616194 3557685 3473478 3296880 3021082 2744248 2450681 2344180
3994B344180k38384k81692m04815k45136j02666n5037k9791k26983m9155j31405
$$ 2344180 2105796 1824104 1419289 1174153 1071487 1016450 986659 759676 710521 579116
3984E79116j5988M0300J6948Q4589j38198j59109n2447J63421J64942j24471o4384
$$ 579116 563128 603428 620376 704965 566767 407658 355211 518632 683574 559103 494719
3973D94719M0568q9656O2280J04978j30815k3403q6438p9091K14632L7219j67777
$$ 494719 535287 445631 507911 612889 482074 458671 372233 293142 507774 544993 377216
3962C77216J8310R1053j5679j8998n1077O8401j1186j8842J12614l3165n9668
$$ 377216 395526 486579 470900 451902 400825 469226 458040 439198 551812 518647 458979
3951D58979R4300J41298Q2055N4633j42186M8045Q3478L2141j10454l3640R5939
$$ 458979 553279 694577 776632 831265 689079 737124 820602 852743 742289 708649 804588
3940H04588k9959q7115J08185n1844j8193J65068Q065K9218M9027j15530J62506
$$ 804588 774629 687514 795699 743855 725662 890730 898795 928013 977040 861510 1024016
3929A024016J75417M6426J5358J25006L7555J64237J23507p3393o4309r6544j43765
$$ 1024016 1199433 1245859 1261217 1386223 1423778 1588015 1711522 1638129 1573820 1477276 1333511
3918A333511n0559j88593j11284q5876j27442O838j18851j8587j3840J24832j17246
$$ 1333511 1282952 1094359 983075 897199 769757 776595 657744 639157 625317 750149 632903
3907F32903k1145L3222P133R0108Q1585m9288o3777J0468N6056R8394k2143q5094
$$ 632903 611758 644980 652113 742221 823806 774518 710741 721209 777265 875659 853516 768422
3895G68422j49830r541N9095j7551m8838j44129j13319q2713j4961k7387N4461
$$ 768422 618592 609051 668146 650595 601757 457628 344309 261596 246635 219248 273709
3884B73709p1939p3650J16112r1742n0350L1565o3526K0849n4340m6213M8156
$$ 273709 201770 128120 244232 152490 102140 133705 70179 91028 36688 -9525 38631
3873C8631N6378j09565N8515J7770O7749j65787K6976P8698L44P0015q2066J07437
$$ 38631 95009 -14556 43959 61729 129478 -36309 -9333 69365 69709 139724 57658 165095
3861A65095j71305J34823J5116K8120M3619j14351k5747k7830M5822P1158k3682
$$ 165095 -6210 128613 143729 171849 215468 101117 75370 47540 93362 164520 140838
3850A40838q0538k4346M3042J7485l5640M441J7061R5303r591j33309k287R6744
$$ 140838 60300 35954 78996 96481 60841 65282 82343 177646 168055 34746 32459 129203
3838A29203J13627j25771q0306J23787m568L1417N3782P4191m1659k0086J231
$$ 129203 242830 117059 36753 160540 155972 187389 241171 315362 273703 253617 254848
3827B54848N5617L1280j20158J1070P5220J48473j80975J2449M981P209R4283
$$ 254848 310465 341745 221587 232657 307877 456350 275375 287824 292805 300014 394297
3816C94297N8744j06066q3827l023M3564L0727o8902p5653O5005j04423M6870
$$ 394297 453041 346975 263148 260125 303689 334416 265514 189861 254866 150443 197313
3805A97313n223J33208j6410L1993k617O4582n7292Q3347J42538j7631J2k3093
$$ 197313 192090 325298 308888 340881 338264 402846 345554 428901 571439 553808 553820 530727
3793E30727O9226M6297P2062o8011O2322Q9949L9101j14996L8247k7978J29816
$$ 530727 599953 646250 718312 650301 712623 802572 841673 726677 764924 736946 866762
3782H66762l0903K8730L43K5126n641J25342L5458N596q1203J01614J92999O2179
$$ 866762 835859 864589 864932 890058 884417 1009759 1045217 1050813 969610 1071224 1264223 1326402
3770A326402J8716K1284N4309J37048l3547P5837O7044o1790L2082K32459Q3911
$$ 1326402 1345118 1366402 1420711 1557759 1524212 1600049 1667093 1605303 1637385 1869844 1953755
3759A953755n2645P6503K19470L12543N3175l4022K3989J26875J45266J75049
$$ 1953755 1901110 1977613 2197083 2509626 2562801 2528779 2552768 2679643 2824909 2999958
3749B999958J23585R1187J3660J68503K12137M32674K30922N3165K48052J66434
$$ 2999958 3123543 3214730 3228390 3396893 3609030 4041704 4272626 4325791 4573843 4740277
3739D740277J93476K26773K18579J51287O1209J38581K79865K86325K47129K56870
$$ 4740277 4933753 5160526 5379105 5530392 5591601 5730182 6010047 6296372 6543501 6800371
3729F800371K82405L84211J49443K53310N13288J93860K23753L23162N50012M51644
$$ 6800371 7082776 7466987 7616430 7869740 8383028 8576888 8800641 9123803 9673815 10125459
3719A0125459L51151M98552M16365K71017K20141R3363J26069J21877K09479K67177
$$ 10125459 10476610 10975162 11391527 11662544 11882685 11976048 12102117 12223994 12433473 12700650
3709A2700650N21575O39398O90231Q90421J031461R30946O74093L67351K6934
$$ 12700650 13222225 13861623 14551854 15442275 16473736 17404682 18078775 18446126 18473060
3700A8473060k82867k33407l82858k89060J62J77921L38467R66706J017409J093872
$$ 18473060 18190193 17956786 17573928 17284868 17285030 17462951 17801418 18768124 19785533 20879405
3690B0879405J133065P10857M09084k25546o67235q95892j058021r06061q03381
$$ 20879405 22012470 22723327 23132411 22906865 22239630 21343738 20285717 19379656 18576275
3681A8576275m91078l28200p2541L69522N27917L83454K45773p9002m24928o96959
$$ 18576275 18085197 17756997 17684456 18053978 18581895 18965349 19211122 19132120 18707192 18010233
3671A8010233j082896j114453j281014j176300q74271n77386n81141l85479l31683
$$ 18010233 16927337 15812884 14531870 13355570 12481299 11903913 11322772 10937293 10605610
3662A0605610k23359j31063j43007m11887o44202n63774o09606o22367n43652
$$ 10605610 10382251 10251188 10108181 9696294 9052092 8488318 7878712 7256345 6712693
3653F712693o06808n60202l93687l83949k09249l40708l90478l0931k52807j75468
$$ 6712693 6105885 5545683 5151996 4768047 4558798 4218090 3827612 3796681 3543874 3368406
3643C368406l07727j65882j59849k12146j42120j20074j74296k81720j15435M3248
$$ 3368406 3060679 2894797 2734948 2522802 2380682 2260608 2086312 1804592 1689157 1732405
3633A732405p3100n5449l41246P8860K4803j9085j4625p3301j69896Q0410j15904
$$ 1732405 1659305 1603856 1262610 1341470 1366273 1347188 1332563 1259262 1089366 1169776 1053872
3622A053872N1857j1779k7819p7123j70930N5838O0477q8517k4927Q1375p5342
$$ 1053872 1105729 1093950 1066131 989008 818078 873916 934393 845876 820949 902324 826982
3611H26982r1513J27978R5075K0636j07016q5450L8505J33K91j92831P627l3594
$$ 826982 735469 863447 958522 979158 872142 786692 825197 825330 825621 632790 640417 606823
3599F06823J59076j0309k8635K0360J3358J02523l5841j24342j5766j03995N667
$$ 606823 765899 755590 726955 747315 760673 863196 827355 703013 687247 583252 588919
3588E88919O7993o5731o0120n7712J7142K15892o9267j71265m3831N0012q143
$$ 588919 656912 591181 531061 473349 490491 706383 637116 465851 422020 472032 463889
3577D63889O1241j06047n8232R419J26113J42446k5370p6478r8801o9077K50019
$$ 463889 525130 419083 360851 370270 496383 638829 613459 536981 438180 369103 619122
3566F19122L3829j36033l8534j7633P2958n1235j1282J79553r9997k51021N7331
$$ 619122 652951 516918 478384 460751 533709 482474 471192 650745 550748 299727 357058
3555C57058L9180N1715K1651j67392r951N423O9788l3634J1940N4594j51797P9469
$$ 357058 396238 447953 469604 302212 292261 297684 367472 333838 345778 400372 248575 328044
3543C28044L5474J00530L0058l7367M4310O6388J19041l3638j49365N0392K10683
$$ 328044 363518 464048 494106 456739 501049 567437 686478 652840 503475 553867 764550
3532G64550K0426j64700j13706J08287L7916J02231K48219o8811k03707O0943
$$ 764550 784976 620276 506570 614857 652773 755004 1003223 934412 730705 791648
3522G91648Q9941J79356J93345j28981k64261J39664m7082J96830j582L0104n2418
$$ 791648 881589 1060945 1254290 1125309 861048 1000712 953630 1150460 1148878 1178982 1126564
3511A126564j65618n6504J57261K2038o5858o8719o1869j7966P5394L8495l5167
$$ 1126564 960946 904442 1061703 1083741 1017883 949164 887295 869329 944723 983218 948051
3500I48051r700q767j27865k1976J43764q3153j15967k29J75274k6646p0144O4145
$$ 948051 938351 929584 801719 779743 923507 840354 724387 724158 899432 872786 802642 866787
3488H66787n6713J10434j7733n1523p4557j239k8000N6257R0609J53947r6761
$$ 866787 810074 920508 902775 851252 776695 775456 747456 803713 894322 1048269 951508
3477I51508m0148J48279K2333l4921J81760J546Q5877K51854J27577K94948K91277
$$ 951508 911360 1059639 1081972 1047051 1228811 1230357 1316234 1568088 1695665 1990613 2281890
3466B281890J58931r5906n5587k94120k04384j90794L0395r7734M5610k6161k7469
$$ 2281890 2440821 2344915 2289328 1995208 1790824 1600030 1630425 1532691 1578301 1552140 1524671
3455A524671n0496J34684M0465J99161r6088J21931k5302J87J06515J06371J65785
$$ 1524671 1474175 1608859 1649324 1848485 1752397 1874328 1849026 1849213 1955728 2062099 2227884
3444B227884M9925j22255N9547J12538J64911L5729K16140q3540Q487M9927N226
$$ 2227884 2277809 2155554 2215101 2327639 2492550 2528279 2744419 2660879 2669366 2719293 2724519
3433B724519K07419J54522P3523n6499j9443J91541R4419K42793K03879J33390
$$ 2724519 2931938 3086460 3159983 3103484 3084041 3275582 3370001 3612794 3816673 3950063
3423C950063N3550K22626J59184L68827M15558J98699J87549L89814M52672M56429
$$ 3950063 4003613 4226239 4385423 4754250 5169808 5368507 5556056 5945870 6398542 6854971
3413F854971N98366O60327O85232Q56537J027161J170525J426920J729087J968551
$$ 6854971 7453337 8113664 8798896 9655433 10682594 11853119 13280039 15009126 16977677
3404A6977677K199462K745087L218940L609352M118126M364429M209465M285920
$$ 16977677 19177139 21922226 25141166 28750518 32868644 37233073 41442538 45728458
3396D5728458L875245L351433K734197J692047Q38427K25745n22359o31065r81473
$$ 45728458 49603703 52955136 55689333 57381380 58219807 58445552 57923193 57292128 56310655
3387E6310655r61301o18668j90997J69161N29228L12784L67098p4252m77695j148315
$$ 56310655 55349354 54730686 54539689 54708850 55238078 55550862 55917960 55843708 55366013 54217698
3377E4217698j887386k452038l057995l558513l679847l714278l464904l379155
$$ 54217698 52330312 49878274 46820279 43261766 39581919 35867641 32402737 29023582
3369B9023582k815356k330497k071549k036028k091219j939834j454777j292074
$$ 29023582 26208226 23877729 21806180 19770152 17678933 15739099 14284322 12992248
3361A2992248j107644q20159p82514p05045n47288n04012l09100l00112j77395
$$ 12992248 11884604 11064445 10281931 9576886 9029598 8525586 8216486 7916374 7738979
3352G738979k11444k80977n0454q095l780j021q6940p7933R729J15293J20049
$$ 7738979 7527535 7246558 7196104 7188009 7184229 7183208 7096268 7018335 7028064 7143357 7263406
3341G263406K29390L3090J86483L59801N33716M32981q8588l15134l44576k95511
$$ 7263406 7492796 7525886 7712369 8072170 8605886 9038867 8950279 8635145 8290569 7995058
3331G995058j67166o8147J6870J8883J41997P1859K29737K68237K09968L09837
$$ 7995058 7827892 7759745 7776615 7795498 7937495 8009354 8239091 8507328 8717296 9027133
3321I027133M14441N36220L53911L76317M73783P34671P05269O40250N68852O29462
$$ 9027133 9441574 9977794 10331705 10708022 11181805 11916476 12621745 13261995 13830847 14460309
3311A4460309M90022L56627M25079J75983K6517P7858J0894R2317r5136l0422
$$ 14460309 14950331 15306958 15732037 15908020 15934537 16012395 16023289 16115606 16020470 15990048
3301A5990048J24236J81870Q7141O5068N6366K02516J72049q5209k08240J2262
$$ 15990048 16114284 16296154 16383295 16448363 16504729 16707245 16879294 16794085 16585845 16598107
3291A6598107k12256l16613l06752l85881m66853p34763n56143m84261n42690
$$ 16598107 16385851 16069238 15762486 15376605 14909752 14174989 13618846 13134585 12591895
3282A2591895n29018o09130k63468m18287m69048m33788j86340k49435k03816
$$ 12591895 12062877 11453747 11190279 10771992 10302944 9869156 9682816 9433381 9229565
3273I229565k58655j24904J6993j5657O1274k6206Q5947K24199J48692O9135J53597
$$ 9229565 8970910 8846006 8862999 8847342 8908616 8882410 8968357 9192556 9341248 9410383 9563980
3262I563980K41662J27695L11654N39363L52808L00206N98466P80567P32366R12113
$$ 9563980 9805642 9933337 10244991 10784354 11137162 11437368 12035834 12816401 13548767 14460880
3252A4460880Q85084J144200J479998J601563J790628K091074K532150L039872
$$ 14460880 15345964 16490164 17970162 19571725 21362353 23453427 25985577 29025449
3244B9025449L509984M098450M900417N650209O409039P461189Q279151R077686
$$ 29025449 32535433 36633883 41534300 47184509 53593548 61054737 69333888 78411574
3236G8411574J0259663J1135745J2047317J2231629J2017577J1091157R532041
$$ 78411574 88671237 99806982 111854299 124085928 136103505 147194662 156726703
3229A56726703P141158L829384P83172k308361n516096q073231j0010908j1703644
$$ 156726703 163867861 167697245 168480417 166172056 160655960 152582729 142571821 130868177
3221A30868177j2627026j2775451j2222793j1299858j0209484q935374p870435
$$ 130868177 118241151 105465700 93242907 81943049 71733565 62798191 54927756
3214E4927756o564506n385567m778448m041011l423951k685159k386228k251703
$$ 54927756 48363250 42977683 38199235 34158224 30734273 28049114 25662886 23411183
3206B3411183j718206j424665j520119j061104j028954r33697q27355p97700n83079
$$ 23411183 21692977 20268312 18748193 17687089 16658135 15724438 14897083 14099383 13516304
3197A3516304m89722m11749n15090l13212k83942l73090j53600k61532j70845
$$ 13516304 13026582 12614833 12099743 11786531 11502589 11129499 10975899 10714367 10543522
3188A0543522j37337k29414j95682j7503K269J95701Q5129o2392J58932K77781
$$ 10543522 10406185 10176771 9981089 9963586 9965855 10161556 10246685 10184293 10343225 10621006
3178A0621006K69981L61326L90286J33319o699J67991L50627p2331l07260l34666
$$ 10621006 10890987 11252313 11642599 11775918 11769219 11937210 12287837 12215506 11908246 11573580
3168A1573580n12064n48342n46935n21964n69804o05753l28466m90104l37632
$$ 11573580 11061516 10513174 9966239 9444275 8874471 8268718 7940252 7450148 7112516
3159G112516k27229j00608l53074k27348K8720m3757l0936J77244K9292J15968
$$ 7112516 6885287 6784679 6431605 6204257 6232977 6189220 6158284 6335528 6364820 6480788
3149F480788J63646K35344K55227J94675J68393J40644J97372K39234J21745J5097
$$ 6480788 6644434 6879778 7135005 7329680 7498073 7638717 7836089 8075323 8197068 8212165
3139H212165J97204J24271J94137J83415K74400J53644L29794M66492M16362N16261
$$ 8212165 8409369 8533640 8727777 8911192 9185592 9339236 9669030 10135522 10551884 11068145
3129A1068145O54576P12251Q48599R89019R56977P94373J119835J095669R91027
$$ 11068145 11722721 12434972 13283571 14272590 15229567 16023940 17143775 18239444 19230471
3120A9230471P02494N12400M36736J77323J51025R063k53815l80036m42459m37929
$$ 19230471 19932965 20445365 20882101 21059424 21210449 21219512 20965697 20585661 20143202 19705273
3110A9705273l08472l19652l73146k9284j22656j4275J24647M935P7913K15326
$$ 19705273 19396801 19077149 18704003 18674719 18552063 18537788 18662435 18667370 18745283 18960609
3100A8960609J8553o4673j89404j82342m22231m10341n16011n41639o85568p23180
$$ 18960609 18979162 18914489 18725085 18542743 18120512 17710171 17194160 16652521 15966953 15243773
3090A5243773p91999q29895o34421q02808o68630o84549o66651o69079m35682
$$ 15243773 14451774 13621879 12987458 12184650 11516020 10831471 10164820 9495741 9060059
3081I060059l33950m03199l73762l29409l03721k15969r2992k13321k62122j60855
$$ 9060059 8726109 8322910 7949148 7619739 7316018 7100049 7007057 6793736 6531614 6370759
3071F370759k07001Q0689j15493j29287j31016r6488J08541p3020q7459n8170
$$ 6370759 6163758 6244447 6128954 5999667 5868651 5772163 5880704 5807684 5720225 5662055
3061E662055k9392N7077J63179J42848m693K28914K27152L01426K08877K64372
$$ 5662055 5632663 5689740 5852919 5995767 5991074 6219988 6447140 6748566 6957443 7221815
3051G221815L30975K83474N53539M63930M65243N61702M56547O73209O81542P26230
$$ 7221815 7552790 7836264 8389803 8853733 9318976 9880678 10337225 11010434 11691976 12418206
3041A2418206Q37751O42442P61876O25343P68574Q83764O61848M85077M04474
$$ 12418206 13255957 13898399 14660275 15285618 16054192 16937956 17599804 18084881 18489355
3032A8489355L40926M02860L30994K36452K94297J09572J40368J48619r4689j98204
$$ 18489355 18830281 19233141 19564135 19800587 20094884 20204456 20344824 20493443 20398754 20200550
3022B0200550j88500l78787k44320q2236l84329m34845m12171l13433j89860m59986
$$ 20200550 20012050 19633263 19388943 19306707 18922378 18487533 18075362 17761929 17572069 17112083
3012A7112083l63452o01175n68514o83525o02215m91618m12335l99094m59931
$$ 17112083 16748631 16147456 15578942 14895417 14293202 13801584 13389249 12990155 12530224
3003A2530224r0700k4196J233K76745K00923L17240M03851N59557P42290R03945
$$ 12530224 12439524 12415328 12416561 12693306 12894229 13211469 13615320 14174877 14917167 15821112
2993A5821112J009777Q57523J121018J359207J548505J802273J934825K181093
$$ 15821112 16830889 17688412 18809430 20168637 21717142 23519415 25454240 27635333
2985B7635333K270495K576158K747900K611064K515390K361968K163747J965266
$$ 27635333 29905828 32481986 35229886 37840950 40356340 42718308 44882055 46847321
2977D6847321J875262J685908J584871J556456J279770J166183P55342M77992
$$ 46847321 48722583 50408491 51993362 53549818 54829588 55995771 56751113 57229105
2969E7229105O7779j47565m17968p24433q35651r88919j183837r83029j053604
$$ 57229105 57296884 57149319 56731351 56006918 55171267 54182348 52998511 52015482 50961878
2960E0961878j040793j007955j288646j553724j909414j851271k097510k025321
$$ 50961878 49921085 48913130 47624484 46070760 44161346 42310075 40212565 38187244
2952C8187244k126029j903937j729866j396977j149294j016759p34644m43300
$$ 38187244 36061215 34157278 32427412 31030435 29881141 28864382 28129738 27686438
2944B7686438k47246j29017J6784K44212L42323O76499Q68492J048529J351507
$$ 27686438 27439192 27310175 27326959 27571171 27913494 28589993 29458485 30507014 31858521
2935C1858521J509485J599702J812461K106530J940687K028264K055776J766646
$$ 31858521 33368006 34967708 36780169 38886699 40827386 42855650 44911426 46678072
2927D6678072J658088J437365J014691O63574P34214K27411l0531k12161l14645
$$ 46678072 48336160 49773525 50788216 51451790 52186004 52413415 52382884 52170723 51856078
2918E1856078k87769m13997k62852l79773n86773n45641p30038r84145j122077
$$ 51856078 51568309 51154312 50891460 50511687 49924914 49379273 48649235 47665090 46543013
2909D6543013j359660k005494k043628k296327k271652k513561k562634k251981
$$ 46543013 45183353 43177859 41134231 38837904 36566252 34052691 31490057 29238076
2901B9238076k363006k115632j772444j644662j320653j237462j177431q98107
$$ 29238076 26875070 24759438 22986994 21342332 20021679 18784217 17606786 16708679
2893A6708679o17352p08800m95311m79017l13695j80438j07400k8378r0345l401
$$ 16708679 16091327 15382527 14887216 14408199 14094504 13914066 13806666 13778288 13687943 13684542
2883A3684542M8732K94617K91889L24014L93815M18049M77878O72759Q56985P08501
$$ 13684542 13733274 14027891 14319780 14643794 15037609 15455658 15933536 16606295 17463280 18171781
2873A8171781P34523O43856O63347N77923M34500L19952L36956K48290J75759
$$ 18171781 18906304 19550160 20213507 20791430 21225930 21545882 21882838 22131128 22306887
2864B2306887R2903J1960K27150J53239K11706J63786J46809r9307j54326j33916
$$ 22306887 22399790 22411750 22638900 22792139 23003845 23167631 23314440 23215133 23060807 22926891
2854B2926891l29659n47729n01330o90930o05899p04876o56264j039772j031831
$$ 22926891 22597232 22049503 21548173 20857243 20251344 19546468 18890204 17850432 16818601
2845A6818601j158220q50210r61050p57964p42316m74883m59993n09273l13629
$$ 16818601 15660381 14810171 13849121 13091157 12348841 11873958 11413965 10904692 10591063
2836A0591063k40570k83627j66351j76289K9797n3660j61036J35836J90068P2789
$$ 10591063 10350493 10066866 9900515 9724226 9754023 9700363 9539327 9675163 9865231 9938020
2826I938020K26995J71377J95476L17552L44821K89914M28244N60457M24129N21883
$$ 9938020 10165015 10336392 10531868 10849420 11194241 11484155 11912399 12472856 12896985 13418868
2816A3418868O52273Q03271P44200R46341R13951J056347J248282J320098J645912
$$ 13418868 14071141 14874412 15618612 16564953 17478904 18535251 19783533 21103631 22749543
2807B2749543J886087K070326K463815K478397K725559K586166K040354J815944
$$ 22749543 24635630 26705956 29169771 31648168 34373727 36959893 39000247 40816191
2799D0816191J568759J092054J347480J512855J604636J633718J328678O39189
$$ 40816191 42384950 43477004 44824484 46337339 47941975 49575693 50904371 51543560
2791E1543560j32932p22775j007135j093753r57929p42133m65811k92654J5701
$$ 51543560 51410628 50687853 49680718 48586965 47629036 46886903 46421092 46128438 46144139
2782D6144139M162J72304N82332O24608N84047P00500M41899K3667m97559j136816
$$ 46144139 46148301 46320605 46902937 47527545 48111592 48812092 49253991 49277658 48780099 47643283
2772D7643283j541901j985645k350906k523005k710035k764213l036508k987965
$$ 47643283 46101382 44115737 41764831 39241826 36531791 33767578 30731070 27743105
2764B7743105k688245k547873k319572j908376j896981j623155j155451j118627
$$ 27743105 25054860 22506987 20187415 18279039 16382058 14758903 13603452 12484825
2756A2484825r30511o90839o01910n84520o22322m85913m17973m02237k55430
$$ 12484825 11554314 10863475 10261565 9677045 9054723 8568810 8150837 7748600 7493170
2747G493170k28161k98815j09856j96481j92296n6218K7698j45763k91610O2916
$$ 7493170 7265009 6966194 6856338 6659857 6467561 6411343 6439041 6293278 6001668 6064584
2737F064584p9694k00921J6300L4587j12456J267O3608J0444J1921Q3452J73294
$$ 6064584 5984890 5783969 5800269 5834856 5722400 5723667 5787275 5797719 5809640 5893092 6066386
2726F066386J91049L63452M21365K12797M23752N10881L24474K99666J95774o9424
$$ 6066386 6257435 6620887 7042252 7255049 7678801 8189682 8514156 8813822 9009596 8940172
2716H940172j94856q6348j91738l95445l55148m23573n56245m67589l16431m60010
$$ 8940172 8745316 8658968 8467230 8071785 7716637 7293064 6736819 6269230 5952799 5492789
2706E492789m90796m34642l82541j82217k82875l40378k75197k37027j9769M6023
$$ 5492789 5001993 4567351 4184810 4002593 3719718 3379340 3104143 2867116 2847347 2893370
2696B893370K4660j11574m7925k947L0064J25970J3427K9853q9015m4474P5371
$$ 2893370 2918030 2806456 2758531 2755584 2785648 2911618 2925045 2954898 2865883 2821409 2896780
2685B896780P9065Q3832j34479q7023J28032k7897m158O5566j5855p6564j7045
$$ 2896780 2975845 3059677 2925198 2838175 2966207 2938310 2934152 2999718 2983863 2907299 2890254
2674B890254P7759K8262j09607j58906l2120q0437M4335j64274k15969p8129P0983
$$ 2890254 2968013 2996275 2886668 2727762 2695642 2615205 2659540 2495266 2279297 2201168 2272151
2663B272151l5413N5982J00116j92706O1394M8934N9958k7386n2628J798k1626
$$ 2272151 2236738 2292720 2392836 2200130 2261524 2310458 2370416 2343030 2290402 2292200 2270574
2652B270574q2625J60457J00233l4157J06673R9272o1329J20548J31134L6452
$$ 2270574 2187949 2348406 2448639 2414482 2521155 2620427 2559098 2679646 2810780 2847232
2642B847232P4832L2164j7518J3938Q7871J08500m7623m0798P1260k28159L3727
$$ 2847232 2922064 2954228 2936710 2950648 3038519 3147019 3099396 3058598 3129858 2901699 2935426
2631B935426m7860q2652j51976m634j12284J38006J2139J58541N4163K7629K01548
$$ 2935426 2887566 2804914 2652938 2648304 2536020 2674026 2686165 2844706 2898869 2926498 3128046
2620C128046J68902K91162L10005J55635J04611J63855K50406K23107K67221Q0594
$$ 3128046 3296948 3588110 3898115 4053750 4158361 4322216 4572622 4795729 5062950 5143544
2610E143544q1844J19535J37775K97904J32288k9595P4235Q3101L2642L04480
$$ 5143544 5061700 5181235 5319010 5616914 5749202 5719607 5793842 5876943 5909585 6214065
2600F214065p9905p0121O3699J38129M1896M0251K93539K85411J32165M41601
$$ 6214065 6134160 6064039 6127738 6265867 6307763 6348014 6641553 6926964 7059129 7500730
2590G500730L10759K74068M67017M97026M61164N57561M28575O26784P82832R80059
$$ 7500730 7811489 8085557 8552574 9049600 9510764 10068325 10496900 11123684 11906516 12886575
2580A2886575J286677J184736J218106J341281J074101R16564N90864M01945L43726
$$ 12886575 14173252 15357988 16576094 17917375 18991476 19908040 20498904 20900849 21244575
2571B1244575N05995P35611Q99057R70178J468166J830360K090956K622666L060857
$$ 21244575 21750570 22486181 23385238 24355416 25823582 27653942 29744898 32367564 35428421
2562C5428421L819950M551738N544261O524196P327381P327006O443895M360833
$$ 35428421 39248371 43800109 49344370 55868566 63195947 70522953 76966848 81327681
2554H1327681J541341j478365l695292n058597n430419n376115m799058l917222
$$ 81327681 82869022 81390657 77695365 72636768 67206349 61830234 57031176 53113954
2546E3113954l300877k497284j540642j184189n18021K7225Q06788J256057K087206
$$ 53113954 49813077 47315793 45775151 44590962 44072941 44100166 44906954 46163011 48250217
2537D8250217K751894L429025M414827N230092O413683P736233R344491J1498584
$$ 48250217 51002111 54431136 58845963 64076055 70489738 78225971 87570462 99069046
2529I9069046J4688109J9512978K6391441L4981351M4334511N0221746M7366900
$$ 99069046 113757155 133270133 159661574 194642925 238977436 289199182 336566082
2522C36566082L2329105Q121279j6012793l2669726m0402252m0648000l6656479
$$ 336566082 368895187 377016466 361003673 328333947 287931695 247283695 210627216
2515B10627216l0990765k5739326k1299388j7797605j4799997j2652572j0616690
$$ 210627216 179636451 153897125 132597737 114800132 100000135 87347563 76730873
2508G6730873q731336p321336n990927n197886m395960l596603l112691k805424
$$ 76730873 67999537 60678201 54687274 49489388 45093428 41496825 38384134 35578710
2500C5578710k546365k476063k129595j704345j616262j340343j199725j153312
$$ 35578710 33032345 30556282 28426687 26722342 25106080 23765737 22566012 21412700
2492B1412700j153305r09184o95742q11929p87313o26842n66850m21665m43277
$$ 21412700 20259395 19350211 18654469 17842540 17055227 16428385 15861535 15439870 14996593
2483A4996593n18232l72615n08596k88526l30612l90660l74495m54984l25751
$$ 14996593 14478361 14105746 13597150 13308624 12978012 12587352 12212857 11757873 11432122
2474A1432122l76889l08199k87476l47713m00637l28106k70641l63708m67402
$$ 11432122 11055233 10747034 10459558 10111845 9711208 9383102 9112461 8748753 8281351
2465H281351m57268l20140l15424l42590j88061k48113j31338l07748q2549j56383
$$ 8281351 7824083 7503943 7188519 6845929 6657868 6409755 6278417 5970669 5888120 5731737
2455E731737k00397j99386l66881k39698l09630m6518L7134q8133k9855L7185
$$ 5731737 5531340 5331954 4965073 4725375 4415745 4369227 4406361 4318228 4288373 4325558
2445D325558J74338J82086J61431l0293q8740O5066M2856J04172j04076j24761
$$ 4325558 4499896 4681982 4843413 4813120 4724380 4789446 4832302 4936474 4832398 4707637
2435D707637k85795l1430K44637j04764k41451k28510j24243r2757p2269j72663
$$ 4707637 4421842 4390412 4635049 4530285 4288834 4060324 3936081 3843324 3771055 3598392
2425C598392k84068k85764k33180J9590j29837j54513q8770k11945j58782J66375
$$ 3598392 3314324 3028560 2795380 2814970 2685133 2530620 2441850 2229905 2071123 2237498
2415B237498k9634J2556m4879k3777j7062J48949O6713j32323j45853k6250n1153
$$ 2237498 2207864 2220420 2175541 2151764 2134702 2283651 2350364 2218041 2072188 2045938 1994785
2404A994785Q7867L5259j86948j40629r7818O7902J29523o0014k96398l0897j02873
$$ 1994785 2082652 2117911 1930963 1790334 1692516 1760418 1889941 1829927 1533529 1502632 1399759
2393A399759J66904l3685n7668m6498p3373j9556J31275P0895Q65j71698r0190
$$ 1399759 1566663 1532978 1475310 1428812 1355439 1335883 1467158 1538053 1538918 1367220 1277030
2382A277030J17195j18898p283J8904j23289n2681l6720k8391R6923J50552L8849
$$ 1277030 1394225 1275327 1268044 1286948 1163659 1110978 1074258 1045867 1142790 1293342 1332191
2371A332191n7219P3185J56450N7264j13258J81632j02087k02934N830P5192j12356
$$ 1332191 1274972 1348157 1504607 1561871 1448613 1630245 1528158 1325224 1331054 1406246 1293890
2360A293890j80278k71405j42957J35319P3513k97289l2092j29997p870J8214
$$ 1293890 1113612 842207 699250 834569 908082 610793 578701 448704 440834 459048
2350D59048j4171q7111j48721j69485l35Q6432L1446Q054j34544J12983J03514
$$ 459048 444877 357766 209045 39560 39225 125657 157103 165157 30613 143596 247110
2339B47110k4008K42428J02509K0994J23621q1277J70093J05851n1513j48544
$$ 247110 223102 465530 568039 589033 712654 631377 801470 907321 855808 707264
2329G07264J16534m463M6053M5941L653j07826k4925m4995O377K2230j33446p9682
$$ 707264 823798 819335 865388 911329 914982 807156 782231 737236 743613 765843 632397 552715
2317E52715m0886n1149J48637p8739o7050J9633J6556L1991O5726m3941j41870
$$ 552715 511829 460680 609317 530578 463528 483161 499717 531708 597434 553493 411623
2306D11623o140P7073m0133r6780K8036j44587K5235N4019K4965J28374o0521
$$ 411623 405483 482556 442423 345643 373679 229092 254327 308346 333311 461685 401164
2295D01164O8162Q6469o2102j6359K4894k2509n9835n7606p6051j52204k1871
$$ 401164 469326 555795 493693 477334 502228 479719 419884 362278 286227 134023 112152
2284A12152J40034J396r9929M8257n0185P8990N8754m4144N90P680j7281l0626
$$ 112152 252186 253582 153653 201910 151725 230715 289469 245325 245915 253595 236314 205688
2272B05688N3746J81857J44217j05121J6571J08876p0216K4889J53172j85248
$$ 205688 259434 441291 585508 480387 496958 605834 535618 560507 713679 528431
2262E28431L3945J84692k53723Q9776L0015j3411M382J26090K7056j63419P3890
$$ 528431 562376 747068 493345 583121 613136 599725 604107 730197 757253 593834 667724
2251F67724J50484n2917Q1040q4311k28011J91940K32703J01504O0614K1099J71426
$$ 667724 818208 765291 846331 762020 534009 725949 958652 1060156 1120770 1141869 1313295
2240A313295L28221K58349K61965j83496k39739j11564q8873j79186j04831k66156
$$ 1313295 1641516 1899865 2161830 1978334 1738595 1627031 1538158 1358972 1254141 987985
2230I87985j86489o6950M4466o6400j44585K2461Q828J7350J24813k0484j15595
$$ 987985 801496 734546 779012 712612 568027 590488 599316 616666 741479 720995 605400
2219F05400m0318K1031n0842L1745j7898p973j42359o7127P7437o5937q255K09353
$$ 605400 565082 586113 535271 567016 549118 541145 398786 331659 409096 343159 334904 544257
2207E44257k22681j41814K46252R3666j08890R01j43272j47067J86161J51655
$$ 544257 321576 179762 426014 519680 410790 411691 268419 121352 307513 459168
2197D59168k5202p6867r7619J55366J67237L3584L1605j95735L8827Q0383l9253
$$ 459168 433966 357099 259480 414846 582083 615667 647272 451537 490364 570747 531494
2186E31494o4474l9573j36599M6840K4826j9625j28451l9327J11028R4970j95607
$$ 531494 467020 427447 290848 337688 362514 342889 214438 175111 286139 381109 185502
2175A85502j1156K1185j99249J12316M6285l4086K2790k8632L3604L7454N9700
$$ 185502 174346 195531 -3718 108598 154883 120797 143587 114955 148559 186013 245713
2164B45713k8369j08833J42465N5668q2754q8817J04057m6488r426j3435M4043
$$ 245713 217344 108511 250976 306644 223890 135073 239130 192642 183216 169781 213824
2153B13824j10706N4540J1442J07637k2548J41590K9202j48423L8555K642K7466
$$ 213824 103118 157658 169100 276737 254189 395779 424981 276558 315113 317755 345221
2142C45221K2061o1678j87633j43387Q6821k7539K3879J33736k99578N1521J44572
$$ 345221 367282 305604 117971 -25416 61405 33866 57745 191481 -108097 -56576 87996
2131H7996Q1147k6883p3101j01746m1817k0555R2441m8311q531J10625o4756n7932
$$ 87996 169143 142260 69159 -32587 -74404 -94959 -2518 -50829 -59360 51265 -13491 -71423
2119g1423O2552O0440N2807M0883K2444q8458n6465J06435J16929j32351j3345
$$ -71423 -8871 51569 104376 145259 167703 79245 22780 129215 246144 113793 100448
2108A00448j2779l0435K8289l4795j67008O7890k84P0506M3530n1347m1809P5039
$$ 100448 87669 57234 85523 50728 -116280 -48390 -48674 21832 65362 14015 -27794 47245
2096D7245L3899J64757j42864j36840N5602R0732L1789K599j8209l3790j25245
$$ 47245 81144 245901 103037 -33803 21799 112531 144320 146919 128710 94920 -30325
2085c0325N7560Q8484Q639q1458p8700M7121N8743O6794j35227J10210J7354k7103
$$ -30325 27235 115719 124358 42900 -35800 11321 70064 136858 1631 111841 129195 102092
2073A02092M4639K3671O0350J3099j17372n9856M4137l013k3181j4881n7575l6624
$$ 102092 146731 170402 230752 243851 126479 66623 110760 107747 84566 69685 12110 -24514
2061b4514m6841M8779l0226n8175L6736j6089K0890J21248j09742p4668j8157
$$ -24514 -71355 -22576 -52802 -110977 -74241 -90330 -69440 51808 -57934 -132602 -150759
2050a50759J6268J45611l21k4168P1069o1392M2708M4661K9476J35631n3957j40027
$$ -150759 -134491 11120 10799 -13369 57700 -3692 39016 83677 113153 248784 194827 54800
2038E4800P7890N6216J29400q7161j21194q1013n7923P069P9166n646p6201j31332
$$ 54800 132690 188906 318306 231145 109951 28938 -28985 -21916 57250 51604 -24597 -155929
2026a55929m1451N7079P2917P9916j44240O5883J7930m1948K6652k2679L8690
$$ -155929 -197380 -140301 -67384 12532 -131708 -65825 -47895 -89843 -63191 -85870 -47180
2015d7180O2182j62174P0734l0298J4762K00745L5048l0367O9235j07523M4343
$$ -47180 15002 -147172 -76438 -106736 -91974 108771 143819 113452 182687 75164 119507
2004A19507K02903J7205J96976l2270j44997j38351k3826M4734J00234k89946
$$ 119507 322410 339615 536591 504321 359324 220973 197147 241881 342115 52169
1994E2169l3034n1422p1878M3126K17568j7023j44047j56310J06401l0695J48910
$$ 52169 19135 -32287 -104165 -61039 156529 139506 -4541 -160851 -54450 -85145 63765
1983F3765N7899l15522P1686J42935j09179M2723N8110J2179o2863P7843J27091
$$ 63765 121664 -193858 -122172 20763 -88416 -45693 12417 24596 -38267 39576 166667
1972A66667j10503p0822l0996O4204K3884J00891k04975K6024P4339P2942M7137
$$ 166667 56164 -14658 -45654 18550 42434 143325 -61650 -35626 38713 111655 158792
1961A58792r1499o5035q3471j2256J54006j10961k288j6789Q6420N894R9299r4397
$$ 158792 67293 2258 -81213 -93469 60537 -50424 -52712 -69501 16919 22813 122112 27715
1949B7715o3963J173R6792m6118m0293K9347r2702J28893n8652J59733q9794J6124
$$ 27715 -36248 -35075 61717 15599 -24694 4653 -88049 40844 -17808 141925 52131 68255
1937F8255P1577M7227j28605P9433M9524n2586j1995P8270J5667Q5381n2980j1068
$$ 68255 139832 187059 58454 137887 187411 134825 122830 201100 216767 302148 249168 238100
1925B38100l683j32110O7456J8273k3867l8309p5658j16767J42934m0726O4289
$$ 238100 234417 102307 169763 188036 164169 125860 50202 -66565 76369 35643 99932
1914I9932o9369k9967o3355K4720K4005J78667j79294m0813J32064l5016R9834
$$ 99932 30563 596 -62759 -38039 -14034 164633 -14661 -55474 76590 41574 141408
1903A41408j07135r853N266J17646L5516o2034O558O5095j27362P9675J14409
$$ 141408 34273 24420 29686 147332 182848 120814 127372 192467 65105 144780 259189
1892B59189p3923q0553J07313K6872r0310J602p4663L5321L6081j6307q8394P2030
$$ 259189 185266 104713 212026 238898 148588 150190 75527 110848 146929 130622 42228 114258
1880A14258K1444J7259n8118l4124l2929J9706m2223P4310k0651J17928J2255
$$ 114258 135702 152961 94843 60719 27790 47496 5273 79583 58932 176860 189115
1869A89115J9586l7443L5104q5036J26219j2616k2100j44924j26550K28851L986
$$ 189115 208701 171258 206362 121326 247545 234929 212829 67905 -58645 170206 174192
1858A74192n3410J25227r6304K3665N7804q6148R2737q5757Q7400l447j05035
$$ 174192 120782 246009 149705 173370 231174 145026 237763 152006 239406 235959 130924
1847A30924P2796j3162j86435r9031J58460J06889q9690L2836j04482K05867M8206
$$ 130924 203720 190558 4123 -94908 63552 170441 80751 113587 9105 214972 263178
1836B63178j0152n9806K8019J03931q0739L6366J00280J9713l7172K6971J58263
$$ 263178 253026 193220 221239 325170 244431 280797 381077 400790 363618 390589 548852
1825E48852l4261k9343N1162p556P4523r8084J5466L3894q4618r347j9131J37264
$$ 548852 514591 485248 536410 528854 603377 505293 520759 554653 470035 460688 441557 578821
1813E78821j24851j08551J1552P4383j17528j949j38666j2657K2182m7623J14931
$$ 578821 453970 345419 356971 431354 313826 311877 173211 160554 182736 135113 250044
1802B50044Q0791k9332K0078J6944J16884q6982j12343J12025R6598j06447J22285
$$ 250044 330835 301503 321581 338525 455409 368427 256084 368109 464707 358260 480545
1791D80545n7577J08486J72967M3436m936Q2782j0577r8880R3201R0140n1379
$$ 480545 422968 531454 704421 747857 742921 825703 815126 716246 809447 899587 848208
1780H48208K4986K84743m1271j4318K674P375L2599N3949J04956j23043O762J26040
$$ 848208 873194 1157937 1116666 1102348 1105022 1112397 1144996 1198945 1303901 1180858 1187620 1313660
1768A313660J0243J03654O1771Q7279K6774P8645J21396Q4535K8841K09897K55270
$$ 1313660 1323903 1427557 1489328 1576607 1603381 1682026 1803422 1887957 1916798 2126695 2381965
1757B381965J27712K67738K79565K96445M97973O48914Q42634P55853M98272K24030
$$ 2381965 2509677 2777415 3056980 3353425 3851398 4500312 5342946 6098799 6597071 6821101
1747F821101K88464M10688Q49433Q36266J228073J820589K279679L462425N863715
$$ 6821101 7109565 7520253 8369686 9205952 10434025 12254614 14534293 17996718 23860433
1738B3860433Q873313J3603433J7478310J4236328K997175q182524j1998559j1915221
$$ 23860433 32733746 46337179 63815489 78051817 81048992 72866468 60867909 48952688
1730D8952688j0267543p712901n673607m486269l457825l013582k375442j598465
$$ 48952688 38685145 30972244 25298637 20812368 17354543 14340961 11965519 10367054
1722A0367054j027244n18595n83329o04759o64768p64341m96377m90585o76897
$$ 10367054 9339810 8821215 8237886 7633127 6968359 6204018 5707641 5217056 4540159
1713D540159k78828k84932l04882k36578m29436k04107j40467r4435o6224r0995
$$ 4540159 4261331 3976399 3671517 3434939 3005503 2801396 2660929 2566494 2500270 2409275
1703B409275k31132j45529K6390p603J9767j66596l6888j18492j35732J2805J29569
$$ 2409275 2178143 2032614 2059004 2051401 2071168 1904572 1867684 1749192 1613460 1626265 1755834
1692A755834L5422j97446k68887J66939L021p210j5782k27476j93747o442M7601
$$ 1755834 1791256 1593810 1324923 1491862 1494883 1487673 1471891 1244415 1050668 1044226 1091827
1681A091827J13728o8649l39763k44656J48316L7204q0189l6585r2575J915J092
$$ 1091827 1205555 1136906 797143 552487 700803 738007 657818 621233 528658 530573 531665
1670E31665J7877K3055q084q9714p6115P2203j62712m834L1079M5849N9748o4595
$$ 531665 549542 572597 564513 474799 398684 470887 308175 303341 334420 380269 440017 375422
1658C75422k7574Q7853J50198P0675L0558n7165j08297P5089J00158j7364q3830
$$ 375422 347848 435701 585899 656574 687132 629967 521670 596759 696917 679553 595723
1647E95723n669j85821J02835N5832j43976M0584o271J9550n4195k4264j20049
$$ 595723 590054 404233 507068 562900 418924 459508 453237 472787 418592 394328 274279
1636B74279R8768j46588n9843r2099Q2874l5836p6717M9673o3908r4774J32832
$$ 274279 373047 226459 166616 74517 157391 121555 44838 94511 30603 -64171 68661
1625F8661N2552N8078r9133k4753J64222M5310m5162m7395q6924O5374Q7256q6898
$$ 68661 121213 179291 80158 55405 219627 264937 219775 172380 85456 150830 238086 151188
1613A51188p288m3773q2054L7173J18585r8843l349N0554o1226m7066N6360q3337
$$ 151188 143900 100127 18073 55246 173831 74988 71639 122193 60967 13901 70261 -13076
1601a3076o8971J36775m3084K0420O0971l0632j2797J13867k5280p7704J38985
$$ -13076 -82047 54728 11644 32064 93035 62403 49606 163473 138193 60489 199474
1590A99474K8967m2045J2269r5457j141N1415L2906M9826M1512m1974j52629J28573
$$ 199474 228441 186396 198665 103208 102067 153482 186388 236214 277726 235752 83123 211696
1578B11696k1368m4860N3617q4946m2885j04661J5831J42667j73492j30732J31952
$$ 211696 190328 145468 199085 114139 71254 -33407 -17576 125091 -48401 -179133 -47181
1567d7181n4095N6289j328l1203k7720J0024j06708R8030R3505Q6103k39772j3465
$$ -47181 -101276 -44987 -46315 -77518 -105238 -95214 -201922 -103892 -10387 75716 -164056 -177521
1555a77521K80231r0693j86708l0762M9192J81766M390p5951R5828k8982q5955
$$ -177521 102710 12017 -174691 -205453 -156261 25505 29895 -46056 49772 20790 -65165
1544f5165O5835J22229k9657j06069j63696K23860J30928L3335j88566J40972
$$ -65165 670 122899 93242 -12827 -176523 47337 178265 211600 23034 164006
1534A64006O4163k2214m2463j49788Q0147o0871q92j09042k4972Q9188l2731O1939
$$ 164006 228169 205955 163492 13704 93851 32980 32088 -76954 -101926 -12738 -45469 16470
1522A6470R4400k0231n3732j18490R1808J62871k08080p0931N5857r3998P1992
$$ 16470 110870 90639 36907 -81583 10225 173096 -34984 -105915 -50058 -144056 -72064
1511g2064R7770j1675Q3022j6628J9802N1523j13519N0911j51649o4885O4111
$$ -72064 25706 14031 97053 80425 100227 151750 38231 89142 -62507 -127392 -63281
1500f3281p4826N2252L1980p23l3137j3556P5069o867l4159o970M4944n2398R221
$$ -63281 -138107 -85855 -53875 -54598 -87735 -101291 -26222 -33089 -67248 -74218 -29274 -81672 -72451
1487g2451L4618p0390J02160P876p959N3584N9719j86291Q9522J9553J93618P6759
$$ -72451 -37833 -108223 -6063 1813 -6146 47438 107157 -79134 10388 29941 223559 300318
1475C00318j77716n0385K14963q9248p1487J26822L1812Q1032R1231r0323J5082
$$ 300318 122602 72217 287180 197932 126445 253267 285079 366111 457342 367019 382101
1464C82101N5719P646o6558J2586J8291l37854l3186J18969O2566q7617j90067
$$ 382101 437820 445466 378908 391494 409785 71931 38745 157714 220280 132663 -57404
1453e7404j04432J1929L7801J05202J47616j99605N7326J5942j27597J11925L7250
$$ -57404 -161836 -149907 -112106 -6904 140712 -58893 -1567 14375 -113222 -1297 35953
1442C5953p5833r0585O7950p0105J63212J13699l8580K9738q115J6169M3534q4246
$$ 35953 -39880 -130465 -62515 -132620 30592 144291 105711 135449 127334 143503 187037 102791
1430A02791k5830p5674k2922K2664J6398j3059j52454J31445R211P387J30600
$$ 102791 76961 1287 -21635 1029 17427 4368 -148086 -16641 -7430 -43 130557
1419A30557q2314o2669n5814J8520J05797j13651O7356j00582j1576n537Q3424
$$ 130557 48243 -14426 -70240 -51720 54077 -59574 7782 -92800 -104376 -109913 -26489
1408b6489J9154k970J0647L7849L1875j99455J56759j8938n47j2900m4393l6566
$$ -26489 -7335 -10305 342 38191 70066 -129389 27370 8432 7885 -5015 -49408 -85974
1396h5974J01729j38612P647J43068j01909r5538J17424J8309K676n4810Q802
$$ -85974 15755 -122857 -115210 27858 -74051 -169589 -52165 -33856 -31180 -85990 -77188
1385g7188R0591n0936j20181l2242m8909J18192Q4235Q39m8367o5386J0438J01298
$$ -77188 13403 -37533 -157714 -189956 -238865 -120673 -36438 -35599 -83966 -149352 -138914 -37616
1373c7616j3465J03229j03666o6319Q5869L5162Q5113k0440l6710j01495M1704
$$ -37616 -51081 52148 -51518 -117837 -31968 3194 88307 67867 31157 -70338 -28634
1362b8634k8128P9286P3016q5124L1103K3964j38124J43167J7644j53298j26052
$$ -28634 -56762 22524 95540 10416 41519 65483 -72641 70526 88170 -65128 -191180
1351a91180J40732M1615q0974M401o606k4416M1898Q1342o7249r5656o2988J07288
$$ -191180 -50448 -8833 -89807 -85406 -92012 -116428 -74530 6812 -60437 -156093 -219081 -111793
1339a11793j24040K4467J56605j8371j06205O2530Q0228J6798J1669l8240m4173
$$ -111793 -235833 -211366 -54761 -73132 -179337 -116807 -36579 -19781 -8112 -46352 -90525
1328i0525J59646j4744p3844K7709K9500q5975l0955J31314M870p5201o9051N1243
$$ -90525 69121 54377 -19467 8242 37742 -48233 -79188 52126 56996 -18205 -87256 -36013
1316c6013J2519j968J30261q6541q0474m4219J88008k4464j14447M3919q7894
$$ -36013 -23494 -25462 104799 18258 -62216 -106435 81573 57109 -57338 -13419 -101313
1305a01313j5682K1503J9135R7552j2438j05066q3807J11810J28924o8534k6182
$$ -101313 -116995 -95492 -76357 21195 8757 -96309 -180116 -68306 60618 -7916 -34098
1294c4098n0531j0368l428M5668J26665L9445j50726p6752j6205P2367P1253o908
$$ -34098 -84629 -94997 -98425 -52757 73908 113353 -37373 -114125 -130330 -57963 13290 6382
1282F382k18096l2573j6351J25339K1294L0607j15817p9126R7602j3935J9129
$$ 6382 -211714 -244287 -260638 -135299 -114005 -83398 -199215 -278341 -180739 -194674 -175545
1271a75545O4923k2731n0642O8496K1242o4920R6232P9361k6584o6089n8198O0936
$$ -175545 -110622 -133353 -183995 -115499 -94257 -159177 -62945 16416 -10168 -76257 -134455 -73519
1259g3519P4227Q492J38169p7893p2254n4386M0463K03367p7972j54260Q9037
$$ -73519 708 9200 147369 69476 -2778 -57164 -16701 186666 108694 -45566 43471
1248D3471r8841j2529P8608R7548j02044p1230j41O9565j09886N5909m3606q0816
$$ 43471 -55370 -67899 10709 108257 6213 -65017 -65158 4407 -105479 -49570 -93176 -173992
1236a73992j3729O5055q6267Q3863K2067j23837L9310k60j246K35397j02619j05852
$$ -173992 -187721 -122666 -208933 -125070 -103003 -226840 -187530 -187790 -189036 46361 -56258 -162110
1224a62110Q7274N0893J36168p089q1598j54698J32042k2236p9795O5468n8265
$$ -162110 -74836 -23943 112225 105136 23538 -131160 882 -21354 -101149 -35681 -93946
1213i3946j03181q940P3930M6624j19498O1461K5332P4003N5200q6681k30566
$$ -93946 -197127 -206067 -132137 -85513 -205011 -143550 -118218 -44215 10985 -75696 -306262
1202c06262J51258r365M1903j5199M6728r2264q9348J71645O6030l8560J6403
$$ -306262 -155004 -164369 -122466 -137665 -90937 -183201 -272549 -100904 -34874 -73434 -57031
1191e7031K2771q2621J96299L8081j40354O2635P870n316o3936J21190j06332
$$ -57031 -34260 -116881 79418 117499 -22855 39780 47650 42334 -21602 99588 -6744
1180f744J0380J6942K6269P4773j58506j85324P1833K17063n3363j20685P3767
$$ -6744 3636 20578 46847 121620 -36886 -222210 -150377 66686 13323 -107362 -33595
1169c3595l5024l55o3155J14598J14376p8202k29011N9993k2599J39890K883k2670
$$ -33595 -68619 -68974 -132129 -17531 96845 18643 -210368 -150375 -172974 -33084 -30201 -52871
1157e2871M8409m5902n5726J56242j9183j5675j8594l3801N1882P2259o8042j2980
$$ -52871 -4462 -50364 -106090 50152 30969 15294 -3300 -37101 14781 87040 18998 6018
1145F018J9993l594M4325p8136j12835j3610M4231L8481J50452j87685r5228j6874
$$ 6018 26011 22417 66742 -11394 -124229 -137839 -93608 -55127 95325 -92360 -187588 -204462
1133b04462J89216O2795l8536o3254j17562q6072J29367J23172m9384j01874Q3653
$$ -204462 -15246 47549 9013 -54241 -171803 -257875 -128508 -5336 -54720 -156594 -72941
1122g2941P1249k2045K3648O3974q0753o5674L1295m1294R731M8516j0630m6391
$$ -72941 -1692 -23737 -89 63885 -16868 -82542 -51247 -92541 -82810 -34294 -44924 -91315
1110i1315j2545P1591j64821L1681J39386l3395j56887n5554p544J52239O7915
$$ -91315 -103860 -32269 -197090 -165409 -26023 -59418 -216305 -271859 -279403 -127164 -59249
1099e9249p7759J11384o8041n1928Q4092N6524J03327k07576k871J44957j457
$$ -59249 -137008 -25624 -93665 -145593 -61501 -4977 98350 -109226 -112097 32860 31403
1088C1403j28532L0372J48947p1189p9978N8022O0948N971j60775P4302O7453
$$ 31403 -97129 -66757 82190 11001 -68977 -10955 49993 55964 -104811 -30509 36944
1077C6944P8591j19270m947l738O3205j23245j53751J35358J19508r7792q0801
$$ 36944 115535 -3735 -8682 -12420 50785 -72460 -226211 -90853 28655 -69137 -149938
1066a49938R5661P4004k1633Q1530k8864p5129r1354J7174L6653R5914n4062p5669
$$ -149938 -54277 19727 -1906 79624 50760 -24369 -115723 -98549 -61896 34018 -20044 -95713
1054i5713K9319O5071j1331j7202L6324J3435q6610R1744o0106l7422M4628Q1496
$$ -95713 -66394 -1323 -12654 -29856 6468 19903 -66707 25037 -35069 -72491 -27863 53633
1042E3633L4675q9516O3096j06179K824P1896K0525j17706o3566q6485J12749
$$ 53633 88308 -1208 61888 -44291 -41467 30429 50954 -66752 -130318 -216803 -104054
1031a04054J18555k4367Q541K7135q6809L4722l7422J78160O5518n6932k27282
$$ -104054 14501 -9866 -1325 25810 -60999 -26277 -63699 114461 179979 123047 -104235
1020a04235M6295O6463O6003K9462L2126j68905n9744L8149J52804P137o2900
$$ -104235 -57940 8523 74526 103988 136114 -32791 -92535 -54386 98418 105555 42655
1009D2655j66676Q4444P9359P9056o8831q7523N3372q1078P1043P7739J1677j05792
$$ 42655 -124021 -39577 39782 118838 50007 -37516 15856 -65222 5821 83560 95237 -10555
997a0555j9660J31203O809p516j19048k5937P8932N3412n1286p9473Q2490n9288
$$ -10555 -30215 100988 107797 100281 -18767 -44704 34228 87640 36354 -43119 39371 -19917
985a9917M0561K4707J4681K0975k00559N1627N2036r515q3018p7071J73816n3292
$$ -19917 20644 45351 60032 81007 -119552 -67925 -15889 -25404 -108422 -185493 -11677 -64969
973f4969J00838N1457q6052O5533L9809M3544p1491p041n7210q6287J8225P0558
$$ -64969 35869 87326 1274 66807 106616 150160 78669 71628 14418 -71869 -53644 16914
961A6914P341j13567m3261P6858K7699J02174j42530j51298K0910J93554o6483
$$ 16914 24255 -89312 -132573 -55715 -28016 74158 -68372 -219670 -198760 -5206 -71689
950g1689J7375J9105n7438K1378Q752J53877j06999k2405q7484R352J68046l9025
$$ -71689 -54314 -35209 -92647 -71269 -62517 91360 -15639 -38044 -125528 -116176 51870 12845
938A2845j17619J08038J213j09043p7442J23805J8521j4680j71995J22574o9322
$$ 12845 -104774 3264 4477 -104566 -182008 -58203 -39682 -54362 -226357 -103783 -173105
927a73105Q7695J4021K0450k2945K5213j42619P9487P5973l5764q9162J1792L1802
$$ -173105 -85410 -71389 -50939 -73884 -48671 -191290 -111803 -35830 -71594 -160756 -148964 -117162
915a17162j1814R8011M5011k4604J44815j09946n0214J10554q4447n9880M937
$$ -117162 -128976 -30965 14046 -10558 134257 24311 -25903 84651 204 -59676 -54739
904e4739Q0206K9942m8686j25630l8744J15680J07369M4907r6524q0956n6109
$$ -54739 25467 55409 6723 -118907 -157651 -41971 65398 110305 13781 -67175 -123284
893a23284k0601J63055P0795r0674j72263O77J31654R5635R4899m2517j27389
$$ -123284 -143885 19170 89965 -709 -172972 -172295 -40641 54994 149893 107376 -20013
882b0013l3738L5727J08649L5506O9238k10397n9075J15152N4933J7402j47169
$$ -20013 -53751 -18024 90625 126131 195369 -15028 -74103 41049 95982 113384 -33785
871c3785n4778L1784j9842M0905p208L5442n8616K8280q4780K27518J6732j15982
$$ -33785 -88563 -56779 -76621 -35716 -42924 -7482 -66098 -37818 -122598 104920 121652 5670
859E670p5275P3409j440p0821J27332Q0160k65341J10710K0029J7758L6918q8321
$$ 5670 -69605 3804 2364 -68457 58875 139035 -126306 -15596 4433 22191 59109 -29212
847b9212j07115J03796L0794k2150L5232R5339L890j04821J54041l7188j55558
$$ -29212 -136327 -32531 -1737 -23887 11345 106684 110574 5753 159794 122606 -32952
836c2952P7103p959O184q3027n9876k6357O4561J38962l7901l2115R572l8976
$$ -32952 44151 36192 42376 -40651 -100527 -126884 -62323 76639 38738 6623 16195 -22781
824b2781J2710Q3563M6182j29963L027P2687L6231j06648l4117J7316L1553M9609
$$ -22781 -10071 73492 119674 -10289 -7262 65425 101656 -4992 -39109 -21793 9760 59369
812E9369q2618j7928p1572Q1777N6859K6355O8592q6393j35877Q765Q8864J56416
$$ 59369 -23249 -41177 -112749 -30972 25887 52242 120834 34441 -101436 -92671 -3807 152609
800A52609j16871n0076j03289j59J00142J37226K2292j28143m1645o148r4262
$$ 152609 35738 -14338 -117627 -117786 -17644 119582 141874 13731 -27914 -34062 -128324
789a28324J81189k9056n8827k6791o072j19908K39664J2512K750m0076J272p6003
$$ -128324 52865 23809 -35018 -61809 -67881 -187789 51875 64387 67137 27061 28333 -47670
777d7670m3252J37312l3977k9011J49070j59135L2544j14274J97473N1377j01826
$$ -47670 -90922 46390 12413 -16598 132472 -26663 5881 -108393 89080 140457 38631
766C8631R7559k5533o9779n4105J47262K4004l7546k9905l15l9999K0863O5792
$$ 38631 136190 110657 40878 -13227 134035 158039 120493 90588 90273 50274 71137 136929
754A36929q1468k4712O0436j17208P6740M2788j11222j925J02196l1609K2397
$$ 136929 55461 30749 91185 -26023 50717 93505 -17717 -19642 82554 50945 73342
743G3342j54099j12447M1827J03076J01209p6134j6897J57332M3401p3761N1512
$$ 73342 -80757 -193204 -151377 -48301 52908 -23226 -40123 117209 160610 86849 138361
732A38361j7426j21976j6061Q3103j68710o5982Q156Q4157J69504p5031j00655
$$ 138361 120935 -1041 -17102 66001 -102709 -168691 -160535 -76378 93126 18095 -82560
721h2560o070J02569l9274J13802n5907l5045o3076j41540q967K83594J5809L0549
$$ -82560 -88630 13939 -25335 88467 32560 -2485 -65561 -207101 -216068 67526 83335 113884
709A13884k06441k3202N399R2842J03097m7696p7377o0083m4435J07049J24415
$$ 113884 -92557 -115759 -110360 -17518 85579 37883 -39494 -99577 -144012 -36963 87452
698H7452j08646j509P6646j35555J53143j4657j19028R4143O5397o1469n1312
$$ 87452 -21194 -22703 53943 -81612 71531 56874 -62154 31989 97386 35917 -15395
687a5395j42515n0039J93885R267j22110M4098L3015Q1608m4200l8104m3710R1387
$$ -15395 -157910 -207949 -14064 -4797 -126907 -82809 -49794 31814 -12386 -50490 -94200 -2813
675b813n8725P1657R083j11700n9904O8360J02103N216j0737j58642J33598R7752
$$ -2813 -61538 10119 19202 -92498 -152402 -84042 18061 23277 12540 -146102 -12504 85248
663H5248K1567j4277l0543k4644k52M2444Q7378p1889j12136p195J18612j52197
$$ 85248 106815 92538 61995 37351 37099 79543 166921 95032 -17104 -24299 94313 -57884
651e7884J6465L6864J58459n1683p5012N0029j4026O0547n6392j37572p8210Q6088
$$ -57884 -41419 -4555 153904 102221 27209 77238 63212 123759 67367 -70205 -148415 -62327
639f2327O9062P421Q1754r5172p261J75488M0782J1225j22787j87986K03098Q3903
$$ -62327 6735 14156 95910 738 -6523 168965 209747 220972 98185 -89801 113297 197200
627A97200j76391j4338L5850k9582L1575K2648L6356j50584M5968J03549j06327
$$ 197200 20809 6471 42321 12739 44314 66962 103318 -47266 -1298 102251 -4076
616d076o0548J10042m0788j6920k0499j7699n6699J58046J00915j66035M20m11
$$ -4076 -64624 45418 4630 -12290 -32789 -50488 -107187 50859 151774 -14261 -13841 -14252
604a4252l816J27395m791j52143p0291J45414L1065N3621l8041K1495j4719P9036
$$ -14252 -18068 109327 104536 -47607 -117898 27516 58581 112202 74161 95656 80937 159973
592A59973N8469p7379K7951j3117j03374p408Q7683o7710j14661J05477L0539
$$ 159973 218442 141063 169014 155897 52523 45115 132798 65088 -49573 55904 86443
581H6443K8043k61707M9626J46656n9418R4087p3541O123j3248J0739o5076Q5690
$$ 86443 114486 -147221 -97595 49061 -10357 83730 10189 16312 3064 13803 -51273 34417
569C4417j19226m6894J4028j2575O2970J3922J9132N3095m5658o4784J08537J72813
$$ 34417 -84809 -131703 -117675 -130250 -67280 -53358 -34226 18869 -26789 -91573 16964 189777
557A89777n8820k01339n9066P8333R666R4380R98j80746M1977M8084J12467O8605
$$ 189777 130957 -70382 -129448 -51115 -41449 52931 53929 -126817 -84840 -36756 75711 144316
545A44316j19520j28039K7304R8147j7579M411k80633J20815J34179J1692M2863
$$ 144316 24796 -103243 -75939 22208 4629 9040 -271593 -150778 -16599 -4907 37956
534C7956q3902m590P2630Q6166J7117j1111r8190j5488J04744M779k3895q4841
$$ 37956 -45946 -50536 22094 108260 125377 114266 16076 588 105332 110111 86216 1375
522A375n925P4211J1006r2329J09050J24237r1330o8505n5448N9005k5266o6345
$$ 1375 -4550 69661 80667 -11662 97388 221625 130295 61790 6342 65347 40081 -26264
510b6264J126q0806M4711J11757j98521P854P0522m4118J82006j4126l7052k8317
$$ -26264 -25138 -105944 -61233 50524 -147997 -140143 -69621 -113739 68267 54141 17089 -11228
498a1228j24851J8272K23420n509k10171j11572J14419L8559N4140J2669J6165
$$ -11228 -136079 -117807 105613 100104 -110067 -221639 -107220 -68661 -14521 -1852 14313
487A4313j77255J16580L8146j6312n0129j5670K5363o0087L2467p7031o8856K47281
$$ 14313 -162942 -46362 -8216 -24528 -74657 -90327 -64964 -125051 -92584 -169615 -238471 8810
475H810p271j09123K9431k02N8817J17378Q0753k21135k4571o8112K02888P3968
$$ 8810 1539 -107584 -78153 -78355 -19538 97840 178593 -42542 -67113 -135225 67663 141631
463A41631o3769q1428P534M3902Q5158k077l2886J5401p3280J0208r6185j636
$$ 141631 77862 -3566 3968 47870 133028 130951 98065 113466 40186 50394 -45791 -47427
451d7427J4551m820j9060J17957n8659j01592J15424j47257R9015R1574j41188
$$ -47427 -32876 -37696 -56756 61201 2542 -99050 16374 -130883 -31868 59706 -81482
440h1482m6189N5470O88o4334R3686J59233p0324j69903L7913P3011J34786l4722
$$ -81482 -127671 -72201 -71513 -135847 -42161 117072 46748 -123155 -85242 -12231 122555 87833
428H7833P779j00816n4211J53618J7808R7896k00561j42320M238o8954L17171
$$ 87833 95612 -5204 -59415 94203 112011 209907 9346 -132974 -128736 -197690 119481
417A19481n8742l07373O8525J18917M7496J39063Q4638l54012j08532J54117r84
$$ 119481 60739 -246634 -178109 -59192 -11696 127367 212005 -142007 -250539 -96422 -97406
406i7406Q3593Q872o2126p6867j6941J78557O1453L4895j17696j2639m3609J32872
$$ -97406 -13813 -4941 -67067 -143934 -160875 17682 79135 114030 -3666 -16305 -59914 72958
394G2958Q069j06321O3289l7489j37591P1640P1194M0024j46847P4531n5401j9738
$$ 72958 81027 -25294 37995 506 -137085 -65445 5749 45773 -101074 -26543 -81944 -101682
382a01682P0531l6297k07791P0468K0105J158L7706l260l9640p8778N9737J96680
$$ -101682 -31151 -67448 -275239 -204771 -184666 -183508 -145802 -149062 -188702 -267480 -207743 -11063
370a1063l9225j39922j180N8407J4930K35204O3461j69197k27345J269J17211
$$ -11063 -50288 -190210 -191390 -132983 -118053 117151 180612 11415 -215930 -214661 -97450
359i7450J50476O9617k21525j20556Q8148J43469O6009J34259j93704j85724p613
$$ -97450 53026 122643 -98882 -219438 -131290 12179 78188 212447 18743 -166981 -174594
348a74594P0198J6577N998p9204J15470j4047N535o02O3275M1643K6274q4518
$$ -174594 -104396 -87819 -81821 -161025 -45555 -59602 -54067 -54669 8606 50249 76523 -7995
336g995j7574k4598O944J264J11016o9574j07753O8890J4708J0576R1028n9451
$$ -7995 -25569 -50167 -43223 -41959 69057 -517 -108270 -39380 -24672 -14096 76932 17481
324A7481l9503L4027k7618Q200N5020j15869q729O5832J4539k15742L8361J63714
$$ 17481 -22022 12005 -15613 -7413 47607 -68262 -76991 -11159 3380 -212362 -174001 -10287
312a0287k0824j1606K1481j14100l0118O2925P0749j26220K7240j40239P1156
$$ -10287 -31111 -42717 -21236 -135336 -165454 -102529 -31780 -158000 -130760 -270999 -199843
301a99843J75924k8622p5705R26M2486j3497r7105P4834J31536J9216j34615L0896
$$ -199843 -23919 -52541 -128246 -127320 -84834 -98331 -195436 -120602 10934 30150 -104465 -73569
289g3569K0290O8405O3195o2117l2375q7882p1829P6965J74861p5011j23852m2156
$$ -73569 -53279 15126 78321 16204 -16171 -104053 -175882 -98917 75944 933 -122919 -165075
277a65075N6324L7640P1356q8888Q40q2624P9305L9003o6524o759k14L6673Q0143
$$ -165075 -108751 -71111 245 -88643 -87803 -170427 -91122 -52119 -118643 -125402 -125616 -88943 -8800
264h800k1688N1989k2947q1550L075O592K9998M1974j03011n1238L8566L1055
$$ -8800 -30488 21501 -1446 -82996 -79921 -73329 -43331 -1357 -104368 -155606 -117040 -85985
252h5985j9423J9704N8890J08858j30635l3054j9412L3212M664j11086j3986j9838
$$ -85985 -105408 -85704 -26814 82044 -48591 -81645 -101057 -67845 -63181 -174267 -188253 -208091
240b08091Q6584P6581Q6790k6208r6100p5283J05925R54J6194L8581j99689M199
$$ -208091 -121507 -44926 41864 15656 -80444 -155727 -49802 -48848 -32654 5927 -193762 -189563
228a89563Q8540P0191N7767j25915p5836M4146l210Q9182R6613o0709m3207m9911
$$ -189563 -101023 -30832 26935 -98980 -174816 -130670 -133880 -44698 51915 -8794 -52001 -101912
216a01912o117J19283p0285N9970j27579m1161L7220O4820l3145K8246N2072n6119
$$ -101912 -108029 11254 -59031 939 -126640 -167801 -130581 -65761 -98906 -70660 -18588 -74707
204g4707q5003P9246L7068o1391j0153l6076q1004n7659P9593O7413m6218K51951
$$ -74707 -159710 -80464 -43396 -104787 -114940 -151016 -232020 -289679 -210086 -142673 -188891 63060
192F3060j67895n8786R6234K6609R1537n4228r2833K7557p2689R4420J1426n170
$$ 63060 -104835 -163621 -67387 -40778 50759 -3469 -96302 -68745 -141434 -47014 -35588 -40758
180d0758K3040p6612q819J29950l4609o9011J04207r3318L1691o464O1730N2497
$$ -40758 -17718 -94330 -103149 26801 -7808 -76819 27388 -65930 -34239 -40703 21027 73524
168G3524j48814p1122K11359m6712n4725M9243J6160L6893p0091j5874Q9735j34390
$$ 73524 -75290 -146412 64947 18235 -36490 12753 28913 65806 -4285 -20159 69576 -64814
156f4814N4741l3381r1933m3066J05202n6569P3729O6054o5036j73651L8038P9863
$$ -64814 -10073 -43454 -135387 -178453 -73251 -129820 -56091 9963 -55073 -228724 -190686 -110823
144a10823R1107K1125r4955r4330l0743R8327J47813l6723k6075j20701M4703
$$ -110823 -19716 1409 -93546 -187876 -218619 -120292 27521 -9202 -35277 -155978 -111275
133a11275k1769R8350J06724j09821j43686m7362J4146Q0297P8148n0065r3154
$$ -111275 -133044 -34694 72030 -37791 -181477 -228839 -214693 -134396 -56248 -106313 -199467
122a99467M9253m6201J17360N4072N453l0448j19724Q0404N5503K0558q2543M5600
$$ -199467 -150214 -196415 -79055 -24983 -19530 -49978 -169702 -89298 -33795 -13237 -95780 -50180
110e0180n1792L2022O1467J7333m2121Q787j04942k3709R4882R1990q9205K9447
$$ -50180 -101972 -69950 -8483 8850 -33271 -24484 -129426 -153135 -58253 33737 -55468 -26021
98b6021j5164j65194N8341R2715P7773j70251j05038k5013O7162J66835R614r3204
$$ -26021 -41185 -206379 -148038 -55323 22450 -147801 -252839 -277852 -210690 -43855 -34241 -127445
86a27445j07976j02876J14843J67367M9025r1757o2406K2159M6235k8131J41866
$$ -127445 -235421 -338297 -223454 -56087 -7062 -98819 -161225 -139066 -92831 -120962 20904
75B0904k3432j79153R4357n5902O8775N9311l0660m3518L6454l1713J606N382
$$ 20904 -2528 -181681 -87324 -143226 -74451 -15140 -45800 -89318 -52864 -84577 -82971 -77589
63g7589O0588m1931L4830l961K5922j250K6769o740j8399j50788M7836J1081k1581
$$ -77589 -17001 -58932 -24102 -28063 -2141 -3391 23378 16638 -1761 -152549 -104713 -93632 -115213
50a15213O6601K071j7144n0396j1923L5658L6012O0628L3133j47254L3622p4810
$$ -115213 -48612 -46541 -63685 -114081 -126004 -90346 -54334 6294 39427 -107827 -74205 -149015
38a49015l9474J22534j18o2613K1115k3013O2111Q645Q8270k1319j28062J5275
$$ -149015 -188489 -65955 -66073 -128686 -107571 -130584 -68473 -59828 28442 7123 -120939 -105664
26a05664L1857J115m7787R7452r7971n018n5326O6736l517L1023j28294R588J22318
$$ -105664 -73807 -72692 -120479 -23027 -120998 -126016 -181342 -114606 -118123 -87100 -215394 -205806 -83488
13h3488k4103l736r565L2213k4971N9384p304m284N00r922j129K7818K5926
$$ -83488 -107591 -111327 -120892 -88679 -113650 -54266 -61570 -65854 -65354 -75276 -76405 -48587 -22661
0b2661
$$ -22661
$$ Imaginary data points
##PAGE= N=2
##DATA TABLE= (X++(I..I)), XYDATA
16383a293001J11708m3323M0452J3403p9566L4524O6941j4801r391R1412o686
$$ -1293001 -1181293 -1224616 -1184164 -1170761 -1250327 -1215803 -1148862 -1163663 -1173054 -1081642 -1088328
16372a088328l9930m6098Q1417j2787M4400l843j6154O7100o420J7094O4779N2938
$$ -1088328 -1128258 -1174356 -1092939 -1105726 -1061326 -1065169 -1081323 -1014223 -1020643 -1003549 -938770 -885832
16360h85832q4916J8907J3850P8916J8469q8135M6560n3257J09320K2821R11K8695
$$ -885832 -970748 -951841 -937991 -859075 -840606 -928741 -882181 -935438 -826118 -803297 -802386 -773691
16348g73691M3544J5594N973j3178j3973M5819k4275o206M3224m4691J3322p8130
$$ -773691 -730147 -714553 -708580 -721758 -735731 -689912 -714187 -720393 -677169 -721860 -708538 -786668
16336g86668J37721J07006p4527r0976j3952L3797J08963N1986o3754j7123M0340
$$ -786668 -648947 -541941 -616468 -707444 -721396 -687599 -578636 -526650 -590404 -607527 -567187
16325e67187J2125N0627J37543K8346q5493j9876j8806j5430L0563N366O2028
$$ -567187 -555062 -504435 -366892 -338546 -424039 -443915 -462721 -478151 -447588 -442222 -380194
16314c80194o5568O662K5728L5150N3584Q0065j55283M5491N7823p8730L841R598
$$ -380194 -445762 -439100 -413372 -378222 -324638 -244573 -399856 -354365 -296542 -375272 -371431 -361833
16302c61833k9085K3259K7898M0299J18274J2689r659M263j1512J3509j03910
$$ -361833 -390918 -367659 -339761 -299462 -181188 -168499 -178158 -173895 -185407 -171898 -275808
16291b75808J20012J2752l1148K9237J84987j14069o6891K0948j4610J00540k6498
$$ -275808 -155796 -143044 -174192 -144955 40032 -74037 -140928 -119980 -134590 -34050 -60548
16280f0548n8656l2785J58499J6984j18810M2970J51190p3421J1362k527K4814
$$ -60548 -119204 -151989 6510 23494 -95316 -52346 98844 25423 36785 34258 59072
16269E9072o1464L7375o5325J35674M8917r37j58399N4173O4941Q0644J4081q2531
$$ 59072 -2392 34983 -30342 105332 154249 153312 -5087 49086 114027 194671 208752 126221
16257A26221j5276J804J42170j8628k4607M2693P6950j07008L2718J63237j30374
$$ 126221 110945 112749 254919 236291 211684 254377 331327 224319 257037 420274 289900
16246B89900j01922Q4779J15041L0014j01823j7197R5996J5309o4776N1381J15575
$$ 289900 187978 272757 387798 417812 315989 298792 394788 410097 345321 396702 512277
16235E12277r7066l7079N154J1620M8791m7831r3003m0894R980R3965J59141j1204
$$ 512277 415211 378132 383286 394906 443697 395866 302863 261969 271949 365914 525055 513851
16223E13851q922J0472r2179O4492R3809k7326l0315o6373Q0619k5519p5482N974
$$ 513851 504929 515401 423222 487714 581523 554197 523882 457509 538128 512609 437127 443101
16211D43101p380k3475O8001n6924J36421p822j07538n9354J35059O2481j7895
$$ 443101 435721 412246 480247 423323 559744 551922 444384 385030 520089 582570 564675
16200E64675p5311j0511j65774J57330J74982j08016P6145p8994p3906r1002J42671
$$ 564675 489364 478853 313079 470409 645391 537375 613520 534526 460620 369618 512289
16189E12289J40852q3563o0020J21935j84033N9924K39155k4355M2499n7867p3473
$$ 512289 653141 569578 509558 631493 447460 507384 746539 722184 764683 706816 633343
16178F33343L1103N1656M4959l7057O0888p4858j46945Q8526o0180J72904l9671
$$ 633343 664446 716102 761061 724004 784892 710034 563089 651615 591435 764339 724668
16167G24668Q769n1825n7650K7612O343o8803P1955J06788k17188N504P4653K2589
$$ 724668 733437 681612 623962 651574 657917 589114 661069 767857 550669 556173 630826 653415
16155F53415P2940N7010k6800l9205j50141L35143P3668j00811M2808k14331m2845
$$ 653415 726355 783365 756565 717360 567219 902362 976030 875219 918027 703696 660851
16144F60851J78133r4950M1813K857j21342R2652J25925n8921m971j49670n8391
$$ 660851 838984 744034 785847 788704 667362 760014 885939 827018 822047 672377 613986
16133F13986J02919m6366L0404j31127o3274J42873M8200L7616n1413L3661j03065
$$ 613986 716905 670539 700943 569816 506542 649415 697615 735231 683818 717479 614414
16122F14414P8448R6532K0386K5705j23461K0876r2434N7838J08495j9692r450
$$ 614414 692862 789394 809780 835485 712024 732900 640466 698304 806799 787107 777657
16111G77657M9843o8074k6539J31992m6932l9081l7770o9846K8678K9795N122
$$ 777657 827500 759426 732887 864879 817947 778866 741096 671250 699928 729723 734845
16100G34845k9692P5345n6903L0846l8978P1587P3645j95969J40088l484j29336
$$ 734845 705153 780498 723595 754441 715463 787050 860695 664726 804814 801330 671994
16089F71994P0190p2620o4974J50393o2902j194m463J33456m903o9724Q3985j3079
$$ 671994 742184 669564 604590 754983 692081 690887 686424 819880 814977 745253 829238 816159
16077H16159p6027J24427o7404j6059J09183j14053l1169K01980j37371l445Q499
$$ 816159 740132 864559 797155 781096 890279 776226 745057 947037 809666 806221 814720
16066H14720j04129P5492p7058J71165o8292m1856O558L9286q2522n7319M6034
$$ 814720 710591 786083 709025 880190 811898 770042 776600 815886 733364 676045 722079
16055G22079K7602J21073l9210j59018K5802J17941J22781k1378O780n2620q7620
$$ 722079 749681 870754 831544 672526 698328 816269 939050 917672 924452 871832 784212
16044G84212r54J37195k8495m0428j65099l0263R2093J18794l281M3427j45868
$$ 784212 783258 920453 891958 851530 686431 656168 748261 867055 863774 907201 761333
16033G61333k371K8493M5327l3350J65231j34240q5180M342l5448L5903R3103
$$ 761333 758962 787455 832782 799432 964663 830423 745243 749585 714137 750040 843143
16022H43143R2154r5168p2060j11017J07009K19786M8100j14330j69733q1990
$$ 843143 935297 840129 768069 657052 764061 983847 1031947 917617 747884 665894
16012F65894K38993L5314n4139n04j07214J751R9688k252M623m5147K9452p8069
$$ 665894 904887 940201 886062 885558 778344 780095 879783 877531 882154 837007 866459 788390
16000G88390J38206r4533j57054J89519K4808l98J8838o6226N1163O1723k0528
$$ 788390 926596 832063 675009 864528 889336 888938 907776 841550 892713 954436 933908
15989I33908o7321o124r855r9773j8987J87110m0481j24478r517M4246j9575J27338
$$ 933908 866587 860463 850608 750835 731848 918958 878477 753999 744482 788728 769153 896491
15977H96491O8608n9584M0687l4002l1502M9732N9263k9556j80794k0779J30686
$$ 896491 965099 905515 946202 912200 880698 930430 989693 960137 779343 758564 889250
15966H89250P4037o8183L8194n2954j37988J14273J79176j04863j65119n3140
$$ 889250 963287 895104 933298 880344 742356 856629 1035805 930942 765823 712683
15956G12683J50934L2820N1018o3152j72603n3285K09667O3941k5303j9250p0190
$$ 712683 863617 896437 947455 884303 711700 658415 868082 932023 906720 887470 817280
15945H17280j70193K97122J6441p3840r7895q898M1656N8490L8923p5434j26071
$$ 817280 647087 944209 960650 886810 788915 780017 821673 880163 919086 843652 717581
15934G17581M7710J08226m4694R789J22647j62550L8485O5699j2994J8951l0809
$$ 717581 765291 873517 828823 838612 961259 798709 837194 902893 889899 908850 878041
15923H78041M0991j07406O5335k089m102J8045J1844K9340j10131l3756J63381
$$ 878041 919032 811626 876961 874872 870770 888815 900659 929999 819868 786112 949493
15912I49493j19298r40P2726j08303P421P7246l7534M9793m7807J21587l2665
$$ 949493 830195 829255 901981 793678 801099 878345 840811 890604 842797 964384 931719
15901I31719R2466j11871K8872j55748J32782j06651O3530n987o2854m2387J52293
$$ 931719 1024185 912314 941186 785438 918220 811569 875099 869112 806258 763871 916164
15890I16164K4403m4455j5564j1465m3092k0215k2224m0252o8270Q1405k0883
$$ 916164 940567 896112 880548 869083 825991 805776 783552 743300 675030 756435 735552
15879G35552K1492M0766L9193n511l9617N2289o6648Q9974R275N6811r7306J70323
$$ 735552 757044 797810 837003 831492 791875 844164 777516 867490 876765 933576 836270 1006593
15867A006593r9954K019P2784j30228L9668j36711j3475J37433j33062L8679M2295
$$ 1006593 906639 908658 981442 851214 890882 754171 740696 878129 745067 783746 826041
15856H26041k9947O842R18n9587N0832j9775R676P0071j24809o1537Q0453J91
$$ 826041 796094 802936 803854 744267 795099 775324 785000 855071 730262 668725 749178 749369
15844G49369l3378O5378P2131l64P585r611q8756K9564Q1627n564J2283j7183
$$ 749369 715991 781369 853500 853136 860721 851110 762354 791918 873545 867981 880264 863081
15832H63081n7058k2610R4619N1988l9981j22793p9180n9387J78736J5480j9830
$$ 863081 806023 783413 878032 930020 890039 767246 688066 628679 807415 822895 803065
15821H03065o7698q4688O2355J03298q4592n0719J89485r7863l963J00544R2577
$$ 803065 735367 650679 713034 816332 731740 681021 870506 772643 768680 869224 961801
15810I61801p7740p4604M2103l8240K091J01192j02490O3378N1381o6446m2188
$$ 961801 884061 809457 851560 813320 815411 916603 814113 877491 928872 862426 820238
15799H20238J24104M7581j24160J7787N8011j3669r4030N9257k15525m2179K92945
$$ 820238 944342 991923 867763 885550 943561 929892 835862 895119 679594 637415 930360
15788I30360q1071n1302J84935r4475K417j8213J73833o3386j40353p5050J61109
$$ 930360 849289 797987 982922 888447 890864 872651 1046484 983098 842745 767695 928804
15777I28804P8211j06897K6518k8770o4604P917N048R4189q4273j2681O474R0918
$$ 928804 1007015 900118 926636 897866 833262 841179 846227 940416 856143 843462 849936 940854
15765I40854l2190n4658o9443J14316Q8636o7450j21903l1221J6377J60363j5950
$$ 940854 908664 854006 784563 898879 987515 920065 798162 766941 783318 943681 927731
15754I27731j39805P0700j00565L8389O2903J14959m1383j14299j45688K22217
$$ 927731 787926 858626 758061 796450 859353 974312 932929 818630 672942 895159
15744H95159L5391n8504Q9925j20277o9247j8542O4535o535M5095j8832j09258
$$ 895159 930550 872046 961971 841694 772447 753905 818440 811905 857000 838168 728910
15733G28910J37363j4672J00821N7822p5462n5663N5893N6157M6344M223p0406
$$ 728910 866273 851601 952422 1010244 934782 879119 935012 991169 1037513 1041736 971330
15722I71330o8269O0799J9622L3575j61070q1495K4981J94622L5357r1089o9509
$$ 971330 903061 963860 983482 1017057 855987 774492 799473 994095 1029452 938363 868854
15711H68854q916R3474J35324j80273l1905O4248M457o7586M2789j4080r9167
$$ 868854 859938 953412 1088736 908463 876558 940806 945263 877677 920466 906386 807219
15700H07219J1046L5520J75988o6506j66389J31236J07561j69365k2381N9578
$$ 807219 818265 853785 1029773 963267 796878 928114 1035675 866310 843929 903507
15690I03507n4322J6709M7597j012P1725j32476n0065Q0088M0045n0453K7760
$$ 903507 849185 865894 913491 912479 984204 851728 801663 881751 921796 871343 899103
15679H99103K0033r3502q2437J29369J13703k4052p9820n6763M6404Q2949K8749
$$ 899103 919136 825634 743197 872566 986269 962217 882397 825634 872038 954987 983736
15668I83736r1022m1450J386j10683P6523J86414k736r1170P1986j3636r7344
$$ 983736 892714 851264 852650 741967 818490 1004904 1002168 910998 982984 969348 872004
15657H72004P3920N7492j10013l5508O7434L8283m9073J02647r2158k7381O2829
$$ 872004 945924 1003416 893403 857895 925329 963612 914539 1017186 925028 897647 960476
15646I60476j53138P788J38936r5960n7590J07461K6158M231N264o0881r1659
$$ 960476 807338 815126 954062 858102 800512 907973 934131 938362 943626 882745 791086
$$ [...]
##END NTUPLES=NMR SPECTRUM
##END=
