##TITLE=1H_CA-9450-3
 200.13Hz,CDcl3.
 8 sc
 
 5.5.2026
##JCAMPDX= 6.0         $$ Bruker NMR JCAMP-DX V2.0
##DATA TYPE= NMR SPECTRUM
##DATA CLASS= NTUPLES
##ORIGIN= UXNMR, Bruker Analytische Messtechnik GmbH
##OWNER= pz
$$ XWIN-NMR		Version 3.5
$$ Tue May  5 14:02:09 2026 Russian Standard Time (UT+4h)  she@DPX200
##.OBSERVE FREQUENCY= 200.131
##.OBSERVE NUCLEUS= ^1H
##.ACQUISITION MODE= SIMULTANEOUS
##.ACQUISITION SCHEME= undefined
##.AVERAGES= 8
##.DIGITISER RES= 18
##SPECTROMETER/DATA SYSTEM= spect
##.PULSE SEQUENCE= zg30
##.SOLVENT NAME= CDCl3
##.SHIFT REFERENCE= (INTERNAL, CDCl3, 0, 16.5656)
##AUDIT TRAIL= $$ (NUMBER, WHEN, WHO, WHERE, WHAT)
$$ ##TITLE= Audit trail, XWIN-NMR		Version 3.5
$$ ##JCAMPDX= 5.01
$$ ##ORIGIN= Bruker BioSpin GmbH
$$ ##OWNER= she
$$ F:/spectra/data/she/nmr/H-C/1/pdata/1/auditp.txt
$$ ##AUDIT TRAIL=  $$ (NUMBER, WHEN, WHO, WHERE, WHAT)
(   1,<2026-05-05 14:00:21.60 +0400>,<she>,<DPX200>,
      <created by zg, POWCHK disabled, PULCHK disabled
       configuration hash MD5:
       00 E9 B6 7A A2 85 ED C7 34 08 36 98 17 FE 4E 26
       data hash MD5: 16K
       D9 79 A3 80 11 92 27 A4 6F F2 14 69 C7 21 E3 76>)
(   2,<2026-05-05 14:00:45.09 +0400>,<she>,<DPX200>,
      <Start of raw data processing
       efp BC_mod = 2 LB = 0.25 FT_mod = 6 PKNL = 1 PHC0 = -4067.111 PHC1 = 12.99229 SI = 16K 
       data hash MD5: 16K
       5F BD A7 BB A8 81 9B 07 B6 4D 7D 2C A1 B5 28 63>)
(   3,<2026-05-05 14:01:09.25 +0400>,<she>,<DPX200>,
      <pk PHC0 = 0.7472756 PHC1 = 0 
       data hash MD5: 16K
       4E C7 56 C3 DA 77 D3 3F 9F B1 F6 7A 1A 87 D0 86>)
(   4,<2026-05-05 14:01:13.20 +0400>,<she>,<DPX200>,
      <abs ABSG = 5 
       data hash MD5: 16K
       F3 23 57 16 82 FE ED 66 EB 00 91 9B 4D 44 A4 F0>)
$$ ##END=
$$ 
$$ hash MD5
$$ FC 84 79 B1 04 B0 A3 F7 41 AD 25 BD A5 64 02 3C
##$RELAX= 
##$RELAX= 
##$RELAX= 
##$RELAX= 
##$RELAX= 
##$RELAX= 
$$ Bruker specific parameters
$$ --------------------------
##$DU= <F:/spectra>
##$EXPNO= 1
##$NAME= <H-C>
##$PROCNO= 1
##$TYPE= <nmr>
##$USER= <she>
##$AMP= (0..31)
100 100 100 100 100 100 100 100 100 100 100 100 100 100 100 100 100 100 
100 100 100 100 100 100 100 100 100 100 100 100 100 100 
##$AQSEQ= 0
##$AQ_mod= 1
##$AUNM= <au_zg>
##$AUTOPOS= <>
##$BF1= 200.13
##$BF2= 200.13
##$BF3= 200.13
##$BF4= 200.13
##$BF5= 200.13
##$BF6= 200.13
##$BF7= 200.13
##$BF8= 200.13
##$BYTORDA= 1
##$CFDGTYP= 0
##$CFRGTYP= 5
##$CHEMSTR= <none>
##$CNST= (0..31)
1 1 145 1 1 1 1 1 1 1 1 1 1 1 1 1 1 1 1 1 1 1 1 1 1 1 1 1 1 1 1 1 
##$CPDPRG= <>
##$CPDPRG1= <>
##$CPDPRG2= <>
##$CPDPRG3= <>
##$CPDPRG4= <mlev>
##$CPDPRG5= <mlev>
##$CPDPRG6= <mlev>
##$CPDPRG7= <mlev>
##$CPDPRG8= <mlev>
##$CPDPRGB= <>
##$CPDPRGT= <>
##$D= (0..31)
0 0.7 0 0 0 0 0 0 0 0 0 0.03 0 0 0 0 0 0 0 0 0 0 0 0 0 0 0 0 0 0 0 0 
##$DATE= 1777975220
##$DBL= (0..7)
120 120 120 120 120 120 120 120 
##$DBP= (0..7)
150 150 150 150 150 150 150 150 
##$DBP07= 0
##$DBPNAM0= <>
##$DBPNAM1= <>
##$DBPNAM2= <>
##$DBPNAM3= <>
##$DBPNAM4= <>
##$DBPNAM5= <>
$$ [...]
##$SUBNAM3= <"">
##$SUBNAM4= <"">
##$SUBNAM5= <"">
##$SUBNAM6= <"">
##$SUBNAM7= <"">
##$SUBNAM8= <"">
##$SUBNAM9= <"">
##$SW= 18.0517599122864
##$SWIBOX= (0..15)
0 0 2 0 0 0 0 0 0 0 0 0 0 0 0 0 
##$SW_h= 3612.71676300578
##$TD= 16384
##$TD0= 1
##$TE= 0
##$TE2= 300
##$TE3= 300
##$TEG= 300
##$TL= (0..7)
0 120 120 120 120 120 120 120 
##$TP= (0..7)
150 150 150 150 150 150 150 150 
##$TP07= 0
##$TPNAME0= <>
##$TPNAME1= <>
##$TPNAME2= <>
##$TPNAME3= <>
##$TPNAME4= <>
##$TPNAME5= <>
##$TPNAME6= <>
##$TPNAME7= <>
##$TPOAL= (0..7)
0.5 0.5 0.5 0.5 0.5 0.5 0.5 0.5 
##$TPOFFS= (0..7)
0 0 0 0 0 0 0 0 
##$TUNHIN= 0
##$TUNHOUT= 0
##$TUNXOUT= 0
##$USERA1= <user>
##$USERA2= <user>
##$USERA3= <user>
##$USERA4= <user>
##$USERA5= <user>
##$V9= 5
##$VALIST= <valist>
##$VCLIST= <CCCCCCCCCCCCCCC>
##$VD= 0
##$VDLIST= <DDDDDDDDDDDDDDD>
##$VPLIST= <PPPPPPPPPPPPPPP>
##$VTLIST= <TTTTTTTTTTTTTTT>
##$WBST= 1024
##$WBSW= 4
##$XGAIN= (0..3)
0 0 0 0 
##$XL= 0
##$YL= 0
##$YMAX_a= 299662
##$YMIN_a= -746416
##$ZGOPTNS= <>
##$ZL1= 120
##$ZL2= 120
##$ZL3= 120
##$ZL4= 120
##$ABSF1= 14.11293
##$ABSF2= -3.938921
##$ABSG= 5
##$ABSL= 3
##$ALPHA= 0
##$AQORDER= 0
##$ASSFAC= 0
##$ASSFACI= 0
##$ASSFACX= 0
##$ASSWID= 0
##$AUNMP= <proc_1d>
##$AZFE= 0.1
##$AZFW= 0.1
##$BCFW= 0
##$BC_mod= 2
##$BYTORDP= 0
##$COROFFS= 0
##$CY= -3
##$DATMOD= 1
##$DC= 0
##$DFILT= <>
##$DTYPP= 0
##$F1P= 0
##$F2P= 0
##$FCOR= 1
##$FTSIZE= 16384
##$FT_mod= 6
##$GAMMA= 0
##$GB= 0
##$INTBC= 1
##$INTSCL= 3.241238e-09
##$ISEN= 128
##$LB= 0.25
##$LEV0= 0
##$LPBIN= 0
##$MAXI= 10000
##$MC2= 0
##$MEAN= 0
##$ME_mod= 0
##$MI= 1.114404
##$NCOEF= 0
##$NC_proc= -6
##$NLEV= 6
##$NOISF1= 3.799351
##$NOISF2= 2.8
##$NSP= 0
##$NTH_PI= 0
##$NZP= 0
##$OFFSET= 16.56557
##$PC= 1
##$PHC0= -4066.364
##$PHC1= 12.99229
##$PH_mod= 1
##$PKNL= yes
##$PPARMOD= 0
##$PSCAL= 0
##$PSIGN= 0
##$REVERSE= no
##$SF= 200.129491100841
##$SI= 16384
##$SIGF1= 3
##$SIGF2= 2
##$SINO= 0.751879
##$SIOLD= 32768
##$SREGLST= <19F.Aceton>
##$SSB= 0
##$STSI= 16384
##$STSR= 0
##$SW_p= 3612.71676300579
##$SYMM= 0
##$S_DEV= 0
##$TDeff= 16384
##$TDoff= 0
##$TI= <>
##$TILT= no
##$TM1= 0
##$TM2= 0
##$TOPLEV= 0
##$USERP1= <user>
##$USERP2= <user>
##$USERP3= <user>
##$USERP4= <user>
##$USERP5= <user>
##$WDW= 1
##$XDIM= 16384
##$YMAX_p= 282938256
##$YMIN_p= -1459242
$$ End of Bruker specific parameters
$$ ---------------------------------
##NTUPLES= NMR SPECTRUM
##VAR_NAME=  FREQUENCY,     SPECTRUM/REAL,   SPECTRUM/IMAG
##SYMBOL=    X,             R,               I
##VAR_TYPE=  INDEPENDENT,   DEPENDENT,       DEPENDENT
##VAR_FORM=  AFFN,          ASDF,            ASDF
##VAR_DIM=   16384,         16384,           16384
##UNITS=     HZ,            ARBITRARY UNITS, ARBITRARY UNITS
##FACTOR=    0.220516191357248, 1,           1
##FIRST=     3315.25926026277, 0,            0
##LAST=      -297.45750274302, 0,            0
##MIN=       -297.45750274302, -1459242,     0
##MAX=       3315.25926026277, 282938256,    0
$$ Real data points
##PAGE= N=1
##DATA TABLE= (X++(R..R)), XYDATA
$$ [...]
8055 14203590 14568069 15091035 15485084 15977497 16518405 17112680 17736817 18432531 19220855
8046 19220855 19948704 20828031 21719900 22633588 23600354 24786772 26067899 27486614 29083752
8037 29083752 30944966 32945669 35231936 37943312 41230483 44734555 48818101 53503423
8029 53503423 58622292 64361751 70360822 76564483 82830267 88983566 94570528 99620712
8021 99620712 103873930 107110490 109593023 111303294 112168387 112333055 111781163 110790357 109142553
8012 109142553 106730728 103804116 100284245 95825027 90893992 85450750 79611907 73436763
8004 73436763 67194160 61204023 55458791 50191215 45427671 41348736 37892944 34924709
7996 34924709 32369302 30107215 28348989 26960739 25750121 24694875 23841966 22994640
7988 22994640 22315985 21675392 21144559 20573040 20138523 19873745 19407501 19118228 18778936
7979 18778936 18608837 18419320 18214664 18163216 18094492 17961632 17885874 17989049 18106530 18294007
7969 18294007 18514151 18762933 18904692 18932568 18848236 18705194 18542506 18254658 17972821 17637296
7959 17637296 17201789 16881229 16608615 16329951 16110687 15910903 15700956 15574474 15468331
7950 15468331 15360858 15244056 15163335 15140286 15203042 15157191 15151651 15085674 15063470 15247220 15343462
7939 15343462 15368723 15475281 15547990 15633973 15863174 16001258 16158008 16333401 16419148 16621603
7929 16621603 16906970 17256279 17591638 17810379 18162221 18493482 18883823 19289592 19711045
7920 19711045 20112466 20500174 20805853 21326336 21946737 22730371 23681456 24829694 26326275
7911 26326275 28135121 30503159 33684278 37587360 40948114 43043788 43736926 43772549 42967961
7902 42967961 41442893 40019985 38836744 37860905 37212986 37295761 37941599 39141787 40566076
7893 40566076 42309480 44264963 46307446 48072518 49793556 51212685 52355333 52966066
7885 52966066 53048479 52917727 52228865 51391134 50550083 49754234 48985475 48383348 47973454 47940203
7875 47940203 48332568 49015310 49978666 51032515 52281018 53486482 54226514 54748912 55055169
7866 55055169 55285617 55587854 55996120 56703326 57866183 59499255 61704073 64676249 68030952
7857 68030952 72271407 77477521 83257349 89856175 97094196 104649939 112033308 118857874
7849 118857874 124890551 129502225 132707009 134470601 134773884 133700240 131459029 128468201
7841 128468201 124637961 120245416 115580301 110758358 105968814 101528908 97587932 93983371
7833 93983371 91120448 88823175 86577714 84443670 82137557 79546416 76684976 73747227
7825 73747227 70863107 68139005 65670534 63450992 61629051 60317056 59489882 58983473
7817 58983473 58905070 59201073 59993757 61179126 62650529 64183990 65623258 66663752 67094583
7808 67094583 67049203 66501566 65631924 64710905 63842302 63443276 63567824 63588267 64110241 65164340
7798 65164340 66562859 68319073 70332483 72268566 73776371 75012471 75849758 76335584
7790 76335584 76790115 76990187 77290698 77966998 78973622 80315045 81885878 83287897 84243226
7781 84243226 84705651 84608902 84091558 83099536 81731939 80440072 79215503 78270980 77527159
7772 77527159 77279507 77494616 78253655 79512031 81056323 82974450 85048049 87295126 89727064
7763 89727064 92253135 94890552 97691847 100496499 103325576 106264605 109069472 111960381
7755 111960381 114958792 117893381 120806891 123436076 125792454 127644842 128780918 129376945
7747 129376945 129315942 129045515 128553062 127902737 127261441 126792900 126398572 125712475 124655583
7738 124655583 122830249 120285768 117259419 113772113 110179327 106763530 103726514 101348797
7730 101348797 99528097 98208941 97384619 96929303 96524206 96309607 96106199 95811593 95406886
7721 95406886 94840999 94349464 93846341 93163771 92392746 91570902 90921041 90151342 89438647
7712 89438647 88608048 87749822 86954067 86235472 85496078 84575679 83566132 82309722 80810711
7703 80810711 79175077 77525721 75699031 74056900 72506436 70992536 69544275 68180291
7695 68180291 66873866 65476073 64115455 62908103 61714807 60635571 59731643 58926074
7687 58926074 58106255 57216748 56259325 55113501 53819847 52185282 50582493 48835808 47120531
7678 47120531 45297658 43708088 42251203 40881878 39740052 38579985 37627946 36743468
7670 36743468 35955128 35300503 34639154 34030551 33475272 33005031 32585950 32104083 31637801
7661 31637801 31185404 30824837 30590361 30168943 29740020 29478343 29283552 29003797 28759593
7652 28759593 28658192 28567376 28600144 28617682 28640143 28718681 28744008 28721822 28682822 28632221 28490567
7641 28490567 28412319 28283616 28220641 28261072 28122025 28055627 27976750 27891521 27649099 27424098
7631 27424098 27343884 27168963 26973737 26823122 26574341 26318845 26122184 25914674 25827661 25741152
7621 25741152 25685719 25764283 25806752 26036664 26075817 26213736 26623332 26943321 27469916 28138620
7611 28138620 28947860 29963666 31110983 32160214 32955161 33547549 33763640 33788513 33573559
7602 33573559 33346624 33137667 33074615 33161293 33438359 33848184 34283256 34481287 34390810 34007388
7592 34007388 33397756 32791083 32041269 31358074 30679254 30083761 29639671 29206643 28968944
7583 28968944 28815063 28663522 28465514 28340099 28313775 28428256 28720434 28929123 29224772 29749852
7573 29749852 30390589 31209219 32383318 33802530 35389051 37111829 38994821 40575442
7565 40575442 41981757 42941589 43486761 43768221 43760803 43875875 43941137 44252034 44846237 45631821
7555 45631821 46395443 47138324 47667516 47770092 47437382 46912589 46105154 45051737 44010218
7546 44010218 42935521 41874800 40913997 40235403 39618616 39140428 38674400 38395286 38122728
7537 38122728 37827232 37496594 37231447 36938663 36788058 36787884 36816532 36951723 37380264 38045787
7527 38045787 38860343 39748124 40662929 41413179 42016635 42523850 42901922 43332328 43543440
7518 43543440 43858087 44300235 44941231 45778500 46705631 47537684 48257236 48761737 49104098
7509 49104098 49214994 49030479 48608025 47960968 47187948 46338810 45464413 44585543 43713451
7500 43713451 42922652 42218103 41568521 40853313 40140760 39267988 38378744 37551074 36542322
7491 36542322 35471323 34574935 33772387 33198155 32510657 31914909 31572529 31282920 31066241
7482 31066241 30919873 30911190 30847262 30718205 30620095 30496274 30385960 30286972 30207539 30089325
7472 30089325 29974476 30130287 30289006 30443869 30433118 30297648 30124692 29935655 29554774 29024397
7462 29024397 28552661 28122637 27494653 26974659 26389811 25827136 25258826 24684040 24085180
7453 24085180 23448691 22770762 22071920 21441239 20818947 20314320 19806698 19385207 18954064
7444 18954064 18629383 18325142 18024735 17756063 17398074 17073317 16925170 16647287 16183950
7435 16183950 15842724 15565413 15240824 15027544 14726629 14627734 14438187 14192281 14170787 14048910
7425 14048910 13975475 13781271 13586016 13422747 13188266 12914521 12764270 12539792 12376880 12083700
7415 12083700 11922474 11716926 11418450 11280411 11194330 11020931 10718801 10617979 10511942 10233214
7405 10233214 10147636 10012474 9908743 9846271 9747716 9621632 9600124 9600991 9373229 9180843 8969168
7394 8969168 8875830 8834583 8723975 8565953 8420386 8324808 8265410 8201962 8203650 8085558 7943048
7383 7943048 7807265 7770686 7712554 7600115 7467678 7431694 7458634 7491614 7428362 7414794 7280236
7372 7280236 7095479 7078381 7043235 6920800 6859808 6893589 6736955 6697981 6668956 6604246 6474830
7361 6474830 6379712 6344962 6338043 6350988 6253138 6140811 6124342 6122160 6010409 5946742 5916304
7350 5916304 5810758 5736706 5712812 5573151 5539816 5520227 5461745 5473826 5434465 5419933 5431097
7339 5431097 5347932 5311667 5347919 5351704 5233182 5252659 5318432 5399306 5487360 5382735 5269084
7328 5269084 5256186 5294000 5275763 5144474 5060081 5101662 5155390 5075513 5069417 5060527 4993639 5087020
7316 5087020 5092720 4985437 4958329 4931995 4893213 4831354 4697240 4536256 4342004 4244646 4212381
7305 4212381 4183861 4174124 4057520 4051298 3910775 3943368 3960555 3950395 3913697 3820440 3738200
7294 3738200 3706742 3808728 3800722 3755676 3710787 3695722 3715290 3702922 3628447 3583144 3710582
7283 3710582 3730261 3660234 3642598 3715649 3755714 3720521 3680011 3601388 3575252 3432171 3503150
7272 3503150 3549228 3355939 3307887 3288647 3269561 3333852 3421218 3372673 3177276 3224620 3180950
7261 3180950 3130228 3139438 3179509 3195175 3298421 3236067 3156985 3156132 3173781 3010666 2970844 2967799
7249 2967799 2988759 2968929 2890279 2914030 2908957 3007444 2943910 2899892 2930905 2805861 2790474
7238 2790474 2945801 2837788 2781695 2837885 2913861 3047801 2922492 2879417 2881357 2856482 2930020
7227 2930020 2863765 2858956 2879309 2962760 2910448 2800891 2861765 2859173 2752063 2755201 2829957 2898129
7215 2898129 2918759 2833395 2836669 2837637 2889645 2867473 2922554 2671048 2561646 2618076 2676104 2688371
7203 2688371 2716968 2729094 2704800 2710734 2732687 2740916 2659354 2581381 2621780 2608249 2707141 2721941
7191 2721941 2651688 2632437 2541742 2494565 2509871 2550075 2518931 2564625 2470500 2505043 2487140
7180 2487140 2521663 2549878 2551404 2491030 2491385 2524715 2536010 2416894 2425945 2434713 2573148 2528840
7168 2528840 2440233 2537707 2495573 2525005 2471944 2461700 2482234 2598846 2576751 2437938 2341950
7157 2341950 2299051 2449844 2467972 2478366 2397341 2419679 2476793 2498645 2477436 2440403 2407701
7146 2407701 2385848 2371514 2439048 2513854 2474203 2470251 2540088 2457828 2401475 2315905 2292666 2325795
7134 2325795 2405753 2417088 2404430 2388859 2399651 2376618 2339389 2330876 2392042 2442905 2448018 2496242
7122 2496242 2338316 2342892 2395576 2405080 2315525 2175667 2184867 2251342 2220253 2209418 2186457 2210693
7110 2210693 2284470 2267213 2178789 2214948 2276179 2269335 2291381 2334799 2252707 2158411 2218715 2283718
7098 2283718 2189075 2244712 2272670 2300909 2302146 2249148 2226863 2255587 2349513 2353981 2347149 2242290
7086 2242290 2173616 2190677 2122971 2172936 2199635 2214350 2285714 2228067 2101707 2117062 2133016
7075 2133016 2188680 2159901 2111736 2145559 2225169 2256519 2199046 2189107 2203190 2211196 2274266 2264985
7063 2264985 2257276 2363055 2272731 2385165 2507895 2379590 2274354 2272141 2271458 2332034 2340451
7052 2340451 2290809 2240845 2397791 2424941 2384030 2434338 2546513 2602897 2551958 2559039 2511473
7041 2511473 2567491 2605935 2520652 2572180 2562164 2459790 2364838 2300533 2353698 2299456 2255984
7030 2255984 2255355 2277269 2274296 2179454 2238836 2289157 2347660 2346760 2252933 2370997 2361462 2319712
7018 2319712 2284434 2336952 2308591 2248032 2294288 2337406 2323290 2430191 2456653 2494844 2502007
7007 2502007 2469563 2556955 2656494 2665280 2520008 2566564 2658621 2541062 2569869 2610167 2562490
6996 2562490 2429872 2524928 2520921 2534398 2674778 2568856 2537407 2661544 2716029 2656817 2699797
6985 2699797 2792436 2774756 2784854 2858586 2873661 2871340 2847279 2709050 2640626 2565410 2487455
6974 2487455 2474352 2448858 2517972 2469140 2464052 2491586 2472354 2556122 2575222 2640734 2611539 2583005
6962 2583005 2570929 2436339 2512897 2581713 2616313 2635080 2642127 2690110 2708472 2685233 2754114
6951 2754114 2828912 2771564 2842271 2923942 2769524 2895170 2915885 2900704 2936568 2865000 2888272
6940 2888272 2977921 2969148 2893824 2979251 3058118 2935685 2851000 2697759 2681318 2748797 2816824
6929 2816824 2873357 2868140 2898989 2811624 2772324 2856896 2783958 2766526 2792968 2924971 3013722
6918 3013722 2988697 2926615 2862238 2927667 2938667 3043721 3114105 3155000 3151668 3136662 3190178
6907 3190178 3168556 3213873 3171498 3116570 3190566 3317842 3277218 3371103 3420921 3447003 3457582
6896 3457582 3440297 3441904 3536476 3591234 3692169 3868056 3933088 4047917 4185648 4272392 4417157
6885 4417157 4623521 4924541 5280787 5396616 5740719 5826294 5739017 5555781 5512804 5507646
6875 5507646 5354868 5147994 4880454 4729060 4682330 4540687 4296016 4265703 4287768 4273247
6865 4273247 4248737 4307611 4243910 4155328 4213825 4261277 4285962 4314029 4309928 4263806 4315595 4370456
6853 4370456 4431295 4488740 4616657 4746048 4797085 4747968 4933110 5085843 5216736 5412166
6843 5412166 5653329 5890892 6033105 6163063 6083920 6106797 6064277 5972928 5869921 5725068
6833 5725068 5550257 5375284 5164749 4986604 4976090 4966322 4961197 4887456 4819627 4771136 4751895
6822 4751895 4792337 4811325 4822030 4874607 4745461 4749012 4838629 4838567 4942384 4912826 4847028 4909418
6810 4909418 4886570 4906998 4950388 4981057 5017192 5050659 5054170 5132738 5199831 5147349 5185694 5272186
6798 5272186 5210884 5218515 5160890 5125409 5280982 5322839 5218127 5238418 5341560 5457279 5419551
6787 5419551 5367429 5375910 5417867 5526599 5612398 5733616 5768824 5663318 5649821 5797195 5779713
6776 5779713 5846082 5887571 5858369 5941860 5989492 6060898 6158421 6158825 6137986 6199024 6171369 6237896
6764 6237896 6334752 6334208 6347373 6400370 6473234 6528099 6710166 6761744 6818642 6872007 6904540 6942794
6752 6942794 6928201 6978528 7079922 7028426 7048789 7098873 7094909 7176355 7261821 7418906 7578854
6741 7578854 7671822 7607922 7637444 7751749 7869264 7898635 8004405 8033720 8040134 8011655 8024791
6730 8024791 8097212 8106726 8164278 8262541 8291356 8372426 8357714 8357693 8436043 8473648 8530647 8511148
6718 8511148 8625528 8595750 8714911 8676678 8720411 8794792 8810691 8780278 8926405 9048057 9148061
6707 9148061 9152409 9100306 9160992 9267175 9348207 9360847 9481662 9639260 9688559 9630335 9673356
6696 9673356 9834832 9910230 9988107 9977140 10041065 10084450 10152831 10263400 10279992 10425008 10471576
6685 10471576 10547942 10662659 10795868 10874372 10865593 10919664 10944061 10960115 11036434 11183510 11238640
6674 11238640 11310798 11461191 11548674 11560665 11782129 11865690 11830608 11922644 12015731 12087505 12149682
6663 12149682 12299792 12495425 12413054 12445078 12581107 12689119 12850308 12954880 13020594 13063427
6653 13063427 13113717 13297999 13338329 13365818 13483848 13564808 13837691 14023917 14044714 14005201
6643 14005201 14046414 14163641 14384502 14521753 14627105 14681440 14794746 14874516 15003116 15094740
6633 15094740 15189082 15199567 15295569 15462609 15638152 15642604 15718555 15854351 15967714 16015839 16208542
6622 16208542 16269218 16315580 16384486 16523424 16535719 16700640 16909187 16979612 17053537 17104145 17138292
6611 17138292 17266509 17302165 17406677 17472086 17617091 17711976 17709772 17902817 18009849 17945340
6601 17945340 18019621 18157800 18175963 18264588 18344661 18476720 18596612 18586041 18659685 18744391 18775513
6590 18775513 18946535 18997771 19116926 19221584 19318205 19408803 19418716 19492635 19419183 19571509 19686139
6579 19686139 19762439 19903442 20002652 20023376 20075349 20206160 20152634 20182785 20156647 20232699 20228011
6568 20228011 20287488 20326859 20423757 20565415 20601026 20568097 20533899 20495280 20531560 20595812 20739771
6557 20739771 20692953 20739824 20806041 20862072 20875766 21037547 20944592 20856585 20855216 20929769 20946708
6546 20946708 20952200 20930395 20820161 20831731 20825917 20902069 20968487 20931252 20936660 20951190 21024979 21062432
6534 21062432 20954663 20916423 20840650 20785152 20776912 20757802 20771982 20848292 20811995 20754684 20647800
6523 20647800 20576067 20486546 20548618 20561175 20529712 20393048 20346483 20283013 20222983 20266673 20248977
6512 20248977 20186302 20164633 20112340 20091356 19989002 19927230 19953591 19970196 19982263 19720358 19669763
6501 19669763 19694920 19595730 19444775 19435204 19433321 19339688 19231074 19169779 19011371 19011031 18908943
6490 18908943 18866287 18846859 18810115 18798052 18805688 18732519 18570041 18542072 18359976 18238651 18259200
6479 18259200 18168465 17958099 17980427 18008240 17963575 17891243 17786889 17843811 17706648 17662628 17503981
6468 17503981 17411173 17380895 17292950 17248965 17096677 17000971 16945287 16887285 16855420 16735700 16607595
6457 16607595 16659967 16614660 16552545 16357803 16251641 16225802 16161219 16080177 16084159 16037151 16007654
6446 16007654 15899402 15746579 15787678 15727570 15615796 15559593 15376517 15340165 15329304 15165387
6436 15165387 15147577 15134950 14952429 14834991 14807228 14786652 14697711 14529500 14475305 14461775 14419492
6425 14419492 14435203 14250974 14191276 14119100 14136646 14106197 14139699 14062187 13955884 13945290 13879017
6414 13879017 13823406 13838477 13667427 13585414 13384809 13324340 13361816 13418006 13351927 13207894 13134040
6403 13134040 13006656 13049176 12940753 12807825 12713852 12608609 12572240 12511517 12459313 12455249 12415653
6392 12415653 12480422 12373428 12297279 12222508 12150013 12202364 12236884 12082315 11950043 11890188 11861432
6381 11861432 11902216 11919630 11837028 11668875 11659522 11572417 11474110 11395267 11410551 11399522 11338696
6370 11338696 11254440 11182026 11235142 11175521 11112445 11061667 10890062 10777990 10736629 10693098 10701807
6359 10701807 10717120 10776637 10729375 10586937 10440200 10483546 10390869 10451783 10439433 10398116 10270843
6348 10270843 10125313 10077476 10171135 10095363 10117587 10034113 9959168 9981096 9840169 9711451 9756068
6337 9756068 9694837 9680661 9699354 9535995 9374634 9373121 9409274 9309300 9331132 9295630 9289589
6326 9289589 9304306 9224731 9237981 9165308 9162590 9114510 9162192 9127030 8973546 8832054 8770590
6315 8770590 8844472 8772352 8770529 8665040 8742511 8681039 8659062 8583346 8502706 8422758 8370524
6304 8370524 8412419 8371322 8342158 8357818 8388124 8394517 8298974 8162692 8116647 8159640 8128062
6293 8128062 8012177 7884426 7915916 7886019 7909175 7880051 7832407 7818930 7786985 7842573 7791766
6282 7791766 7707076 7672433 7677147 7640937 7643631 7588473 7458550 7446227 7518635 7481281 7466768 7426302
6270 7426302 7468228 7523851 7439823 7287741 7327236 7320285 7303566 7258075 7220283 7224076 7164909 7215588
6258 7215588 7226036 7151358 7103029 7064074 7144654 7119562 7123880 7063958 7000069 6890164 6747026
6247 6747026 6816469 6761742 6754916 6728603 6760124 6803297 6694914 6652397 6693358 6728193 6684027
6236 6684027 6611045 6693097 6601740 6526976 6557651 6592521 6510101 6461541 6347771 6353790 6482612
6225 6482612 6395518 6216780 6244294 6311242 6325201 6319570 6247143 6127622 6132719 6141295 6153628 6167672
6213 6167672 6153721 6146368 6040133 5937748 5846731 5906711 6014416 5973809 5894276 5956780 5992547
6202 5992547 5885359 5846986 5871863 5976673 5873452 5742411 5776942 5808252 5750111 5625308
6192 5625308 5619871 5803572 5807212 5795939 5791395 5672726 5648934 5661169 5754762 5745297 5610898 5600788
6180 5600788 5561949 5600627 5604289 5522853 5503807 5441754 5419186 5448866 5402625 5408911 5380533 5355678
6168 5355678 5410483 5400050 5428866 5273910 5309831 5223164 5151195 5150176 5173462 5274686 5324008
6157 5324008 5281256 5288160 5325171 5323908 5283066 5198193 5210443 5168401 5133385 5207678 5252812 5244886
6145 5244886 5187097 5104215 5053217 5103283 5113259 5107062 5041613 4967169 4986394 4974382 5065964 4993488
6133 4993488 4815357 4762401 4816128 4815835 4747552 4791599 4925222 4904469 4829684 4749597 4692978
6122 4692978 4749225 4761412 4720690 4640947 4658712 4604067 4622840 4603794 4616479 4638531 4601093
6111 4601093 4612718 4653385 4500515 4525818 4457583 4494800 4549416 4514896 4523480 4452013 4455323 4451410
6099 4451410 4392530 4446010 4482001 4402818 4319276 4321182 4363956 4367983 4270391 4379630 4471312 4444086
6087 4444086 4422400 4340731 4337020 4378468 4333466 4214512 4246177 4235642 4313108 4313162 4239770 4209345
6075 4209345 4264460 4237981 4333522 4330722 4336875 4253764 4298446 4286432 4205169 4271595 4153981 4181663
6063 4181663 4196799 4119101 4124216 4147569 4165291 4105045 4085574 4105707 4170514 4096932 4131219 4060022
6051 4060022 4056431 4043821 4026249 4042915 4032205 4085712 4011571 3955464 3991803 3903094 3878604 3836316
6039 3836316 3976674 4041418 3961368 4029096 3961432 3928969 3913049 3922689 3999837 3971262 3968037 3963879
6027 3963879 3912220 3895998 4004842 4110968 4057442 3988623 3994329 4052527 4035358 4073498 4083231
6016 4083231 3983454 4021953 4003048 4029716 4115807 4110872 4038605 3972070 3996828 3989890 4051669 4061898
6004 4061898 4043391 4037764 4137246 4083785 4205190 4287715 4222293 4226612 4277924 4333602 4349775 4279625
5992 4279625 4231287 4290036 4359454 4425820 4533045 4578500 4610265 4530632 4471730 4505841 4614834
5981 4614834 4600257 4665863 4758518 4770761 4718240 4688348 4783456 4678015 4638466 4722661 4720440
5970 4720440 4574972 4610728 4658740 4513792 4447930 4363634 4446831 4486286 4434925 4448225 4394506
5959 4394506 4287490 4264594 4404325 4295662 4276624 4269455 4138294 4116045 4122445 4141774 4059559
5948 4059559 4146023 4220901 4230539 4152369 4145566 4105038 4102971 4071003 4043260 3961974 3921938 3986543
5936 3986543 3956280 3966189 3868491 3890006 3934873 3788868 3671021 3720593 3765346 3754316 3744795
5925 3744795 3783953 3702076 3693088 3672553 3723058 3719283 3599345 3659054 3761510 3701213 3629474
5914 3629474 3552852 3651451 3694565 3648849 3550010 3567961 3674899 3606069 3524193 3554981 3538454
5903 3538454 3559894 3609031 3623683 3677044 3676693 3622222 3596557 3607921 3704740 3723878 3810437 3874957
5891 3874957 3812655 3832627 3902948 3860256 3808772 3881321 3995735 4019334 4029768 4059151 4009586
5880 4009586 4055650 4091124 4030188 3972186 4039955 4082394 4085487 4071098 4156324 4089974 4083416 4243246
5868 4243246 4338912 4235121 4232839 4236175 4195118 4325092 4399533 4388183 4400997 4440089 4475291
5857 4475291 4441848 4417191 4421245 4472767 4616569 4698726 4585907 4595546 4660867 4663106 4772803
5846 4772803 4760814 4840185 4763378 4753116 4805332 4919583 4997570 4915075 4901694 5002572 5008507
5835 5008507 4968438 5052640 5064403 5108534 5116370 5104860 5114958 4993465 5187220 5348010 5344567
5824 5344567 5270781 5198277 5308355 5245412 5281448 5373109 5391350 5288747 5356378 5373459 5383558
5813 5383558 5402177 5441586 5443013 5331161 5327097 5542445 5500071 5527441 5563464 5506599 5396234
5802 5396234 5437991 5525557 5482875 5698579 5647582 5521240 5497675 5506190 5607837 5572936 5560573
5791 5560573 5379478 5341932 5284864 5196313 5224114 5099619 5064664 5157856 5194918 5120049 4995567
5780 4995567 4831053 4729812 4685258 4809942 4767537 4664600 4633699 4649516 4656232 4726348 4639864
5769 4639864 4646278 4583122 4522905 4513699 4475409 4439861 4375431 4299855 4278910 4330511 4243952 4166564
5757 4166564 4146658 4159934 4099473 4024442 3956652 3913331 3895371 3855495 3875884 3888301 3825816
5746 3825816 3678236 3709811 3717682 3693202 3568183 3570933 3560981 3482226 3552812 3583364 3491945 3442984
5734 3442984 3442893 3324747 3337749 3329743 3308954 3364629 3337386 3344251 3342240 3330822 3359458 3368362 3396585
5721 3396585 3343250 3337733 3390154 3390230 3381396 3372646 3369246 3374023 3409346 3391417 3309686 3382075 3413662
5708 3413662 3498876 3524115 3513474 3590478 3637385 3631002 3582171 3574276 3575987 3493101 3500979 3590707
5696 3590707 3642519 3671092 3634343 3707087 3585658 3580242 3649197 3554938 3530484 3607521 3638367
5685 3638367 3532145 3474844 3363189 3333119 3324936 3398541 3406030 3365280 3372448 3419550 3540074
5674 3540074 3499229 3465600 3489782 3400084 3309448 3278082 3229212 3261377 3238002 3150868 3171012
5663 3171012 3235451 3221520 3130573 3050658 2979334 3066815 2990248 3048459 2882304 2845308 2944808
5652 2944808 2941094 2854715 2846722 2857072 2827815 2897967 2752693 2771690 2734422 2700815 2611849 2680021
5640 2680021 2567735 2463549 2575155 2538525 2664548 2719874 2543769 2563148 2570757 2511401 2619315
5629 2619315 2655088 2599206 2579840 2512402 2424368 2535373 2472486 2398577 2393212 2445174 2409715
5618 2409715 2367709 2321249 2330295 2386767 2302857 2294329 2289652 2316374 2243881 2304857 2376311 2396222
5606 2396222 2333077 2276475 2311471 2268140 2207402 2235146 2288817 2269924 2287324 2334886 2356563
5595 2356563 2311934 2112868 2118817 2128653 2109581 2081729 2173015 2125147 2057714 1951222 2049761
5584 2049761 2007647 2007619 2128423 2094215 2084855 2056699 2174412 2137063 2090490 1983470 1975080 1998658
5572 1998658 2026587 2070236 2035144 1942041 1985457 2018761 2172582 2116959 2080234 2049688 2056033
5561 2056033 2040907 2082097 2135779 2069738 2089922 2149838 2135595 2211944 2140828 2048148 2196372
5550 2196372 2249031 2270496 2202482 2157051 2177782 2176076 2247004 2219831 2262500 2278926 2155308
5539 2155308 2173622 2234819 2297611 2253715 2259617 2197922 2253056 2205945 2164091 2201891 2212895 2240364
5527 2240364 2212695 2245393 2178250 2080394 2249723 2390455 2496118 2474425 2386559 2358636 2388509
5516 2388509 2453651 2474562 2435555 2468210 2564036 2500828 2481826 2525210 2540726 2532221 2438670 2460348
5504 2460348 2416191 2480483 2475365 2472063 2544601 2519162 2455234 2448433 2421405 2403086 2485973 2524041
5492 2524041 2460246 2393642 2411164 2445722 2449948 2402840 2524689 2500655 2352993 2328836 2424475
5481 2424475 2581599 2554970 2572285 2603371 2497549 2542806 2543030 2568320 2566386 2472213 2404411 2448510
5469 2448510 2548064 2554207 2462277 2506367 2536966 2662834 2695080 2617748 2569177 2606333 2573571
5458 2573571 2475623 2492992 2531026 2544974 2602019 2596940 2639302 2689537 2635148 2686230 2735086 2718819
5446 2718819 2820149 2798619 2722854 2761165 2833059 2761562 2744030 2843423 2867082 2791372 2841703
5435 2841703 2791795 2723823 2799052 2958201 2963493 2816987 2822344 2790816 2811093 2886470 2869578
5424 2869578 2949567 3043097 3008254 3024079 3065536 3133145 3107446 3084533 3152019 3143366 3244239
5413 3244239 3342309 3387627 3393682 3332872 3427853 3397808 3421211 3442109 3311875 3273947 3308352
5402 3308352 3239145 3215342 3210549 3354253 3335156 3370679 3320151 3290035 3299065 3357500 3412045 3371628
5390 3371628 3308949 3440340 3499498 3462324 3542934 3535468 3613012 3584930 3604467 3665407 3719551
5379 3719551 3797479 3810997 3827449 3844477 3904739 3865276 3865714 3936316 3912251 3938635 3877666 3793403
5367 3793403 3745564 3750348 3825523 3802077 3769304 3737716 3855826 3810253 3863597 3943270 3965488
5356 3965488 3972207 3942777 3987875 3959160 4007579 4139308 4074225 4040167 4206888 4273370 4294002
5345 4294002 4312088 4328757 4291511 4347158 4293172 4336818 4375485 4509844 4464854 4542715 4631250
5334 4631250 4481983 4437228 4557290 4614476 4621133 4674824 4742453 4770762 4752763 4786151 4794376
5323 4794376 4938630 4925338 5012222 5073172 5118488 5199586 5268309 5424818 5444665 5538656 5497189
5312 5497189 5627182 5631365 5575499 5692786 5795720 5826569 5912462 6133037 6189994 6195697 6293123
5301 6293123 6387388 6337175 6420491 6576683 6701069 6886592 7004919 7169999 7263231 7313837
5291 7313837 7454682 7751894 8020038 8159421 8433661 8826954 9111484 9460377 9977506 10708505
5281 10708505 11454395 12150592 13186063 14263030 15317984 16241298 16823145 17074847 17158648
5272 17158648 16906098 16373816 16013919 15801847 15621680 15689531 15901500 16286653 16930285 17738682
5262 17738682 18374918 18731475 18773082 18566007 18039537 17186566 16420763 15653644 14934796 14126136
5252 14126136 13585127 13250231 12755954 12499376 12377369 12327532 12297750 12131080 12062673 11993057
5242 11993057 12049958 12094890 12172056 12230171 12216885 12369744 12470332 12621025 12726813 12792158
5232 12792158 12886146 13026759 13212151 13371600 13447697 13635361 13827588 13949070 14180603 14469495
5222 14469495 14654560 14968631 15274010 15537659 15719027 16070421 16388710 16828264 17456375
5213 17456375 18158639 18892372 19849745 21057107 22486673 24181936 26054648 28036965 29760094
5204 29760094 31080641 31890015 32010198 31673982 31115226 30259866 29573941 28916471 28572903
5195 28572903 28695713 29279161 30241072 31263056 32199372 32819620 32859381 32262140 31181338
5186 31181338 29824302 28268196 26551620 24973895 23487956 22090674 21081859 20208273
5178 20208273 19556448 19066695 18636265 18236326 17828325 17441562 17277018 17137294 16830729
5169 16830729 16623107 16508972 16285643 16115517 15930095 15828557 15732823 15594192 15487219 15421239
5159 15421239 15339801 15261969 15167086 15160120 15131147 15018066 15000374 14903174 14781965 14651963 14568056
5148 14568056 14459020 14381968 14266922 14147129 14034748 14100101 14019238 14003490 13965781 14024838
5138 14024838 14064507 13997308 14026661 14067775 14162100 14215143 14315169 14392976 14483669 14601623 14805616
5127 14805616 14831941 14999942 15232136 15421237 15663371 15898124 16181399 16718057 17444120 18269884
5117 18269884 19308542 20753968 22672727 25145535 28168865 31078590 33273777 34549756
5109 34549756 34558773 33608312 32093101 30143801 28062190 26034215 24208513 22812406 21774271
5100 21774271 21019343 20553547 20374647 20334437 20189967 20460725 20776418 21145484 21670888 22317672
5090 22317672 23158698 24246807 25537866 27274705 29607305 32698559 36628676 41859109
5082 41859109 48765051 57454862 66963126 74985972 79948808 81246551 79423607 75169069
5074 75169069 69153007 62460422 55760742 49346474 43832457 39482609 36377861 34394863
5066 34394863 32977708 31890507 31084945 30563436 30407663 30428344 30597264 31002149 31715291
5057 31715291 32714658 33999854 35644793 37843164 40785472 44579506 49446634 55822663
5049 55822663 64043941 73811267 83317331 90109472 93065671 92868021 89954824 84940537
5041 84940537 79042916 73213701 67858447 63324027 60102721 58001752 56785368 55766254
5033 55766254 54564245 53214209 51633760 50070509 48373788 46830002 45746088 44994302
5025 44994302 44565838 44637190 45139243 46005740 47267529 49028407 51510950 54744024 58864665
5016 58864665 63829243 69273575 74154856 77579878 79225071 79174635 77953709 75657344
5008 75657344 72823513 69730115 66578462 63712197 61296751 59433520 57909474 56751255
5000 56751255 55701118 54769769 53995183 53275739 52639508 52142289 51623329 51185534 50730448
4991 50730448 50274229 49881594 49516297 49203920 48848084 48693043 48665598 48643080 48549849 48594900
4981 48594900 48774720 48982901 49173627 49472949 49903777 50304864 50683997 51034796 51455718
4972 51455718 51764006 52109097 52551351 52908414 53309653 53717502 54140206 54492088 54794871
4963 54794871 54834222 54350964 53523915 52544870 51399892 50098751 49072358 48088116 47336076
4954 47336076 46777519 46472991 46200905 46222249 46490246 46908171 47374621 48097094 48955431 49920881
4944 49920881 51343148 52632961 53937803 54856329 55458258 55867082 55772993 55497465 55104220
4935 55104220 54563224 54100770 53569880 52955432 52364010 51862242 51372974 50729475 49988530
4926 49988530 49168891 48406128 47601985 46546691 45587514 44758428 43979398 43055924 42157659
4917 42157659 41614660 41033692 40465863 39953779 39519051 39134834 38853075 38674367 38413298
4908 38413298 38245365 38141260 38047113 37769863 37618554 37320875 37013738 36618019 36215731 35760323
4898 35760323 35262589 34756331 34221667 33672836 33085551 32463507 31890027 31341366 30750786
4889 30750786 30117274 29346582 28677915 28051946 27422815 26779333 26256755 25673834 25088467
4880 25088467 24543955 24132399 23719293 23205376 22807728 22514996 22336470 22045360 21721652
4871 21721652 21410750 21061777 20769622 20506937 20304988 20085537 19857361 19711834 19455349
4862 19455349 19152134 18906829 18754862 18600795 18308934 18156474 17915489 17702251 17460432
4853 17460432 17324273 17155803 16869254 16730099 16552947 16280537 15922497 15851282 15783999 15616130
4843 15616130 15395490 15181562 15058033 14907751 14747208 14714963 14647892 14520721 14401840 14295963
4833 14295963 14283685 14176319 14215530 14186024 14196446 14240971 14228916 14201631 14155570 14141967 14110202
4822 14110202 14059144 13980141 13912247 13793144 13560950 13498374 13303634 13064689 12872027 12772133
4812 12772133 12561067 12266297 12164168 12001141 11802802 11705173 11621605 11393022 11303423 11247198
4802 11247198 11156954 11033404 10996014 10929002 10869698 10735963 10634495 10482446 10426393 10408454
4792 10408454 10272738 10259848 10267588 10215853 10196789 10258716 10205555 10204831 10165943 10095063 10114111 9997675
4780 9997675 9983674 9879148 9762110 9689236 9531397 9452680 9377819 9274497 9177337 9093676 8910557
4769 8910557 8877655 8776416 8630880 8450950 8430187 8291746 8198489 7988815 7975624 7969812 7935736
4758 7935736 7700558 7604511 7725768 7607673 7716037 7619295 7579192 7450512 7288842 7181320
4748 7181320 7111354 7051573 7054413 6983697 7051615 7094935 7000238 7011702 6988067 6919453 6932491 6917597
4736 6917597 6743926 6659581 6688100 6642040 6630762 6538772 6394791 6280450 6328226 6402583 6419241
4725 6419241 6379430 6383096 6497187 6396996 6435917 6470456 6431848 6474314 6451589 6463843 6543650
4714 6543650 6631069 6644792 6643963 6636709 6727905 6878773 6871944 6900451 6959965 6930423 7017949 6960125
4702 6960125 7004552 7011108 6924326 6970690 7043463 6957397 6971408 7007489 6993973 7036841 6918427
4691 6918427 6838132 6786762 6755545 6758172 6757007 6697968 6638628 6547410 6490294 6391581 6241940 6220455
4679 6220455 6200605 6180588 6064919 5902489 5837841 5823337 5740460 5648014 5521506 5536699 5414155
4668 5414155 5341819 5357268 5312996 5302252 5208894 5029092 5067288 5122304 5267795 5309863 5241434
4657 5241434 5223165 5213502 5154876 5141599 5203615 5176026 5185248 5116921 5070421 4958397 4923626 4915148
4645 4915148 4953395 4986115 5133939 5095279 5105906 5079938 5118371 5150277 5315073 5371155 5413217
4634 5413217 5396370 5521605 5601986 5659963 5738715 5756174 5751383 5801571 5915086 5915243 5836999 5836119
4622 5836119 5874005 5901826 5943645 5933098 5898684 5849698 5808309 5773984 5728136 5725758 5748372 5664614
4610 5664614 5701040 5646376 5606893 5559429 5490765 5541579 5597977 5528785 5586638 5590998 5554727 5514147
4598 5514147 5528644 5577866 5624368 5739931 5770216 5788040 5820847 5703627 5650660 5762104 5841305
4587 5841305 5757154 5678152 5760896 5708343 5656135 5643182 5676890 5774311 5736366 5704543 5705127 5684240
4575 5684240 5796019 5907100 5924571 6046505 6012397 6123769 6140337 6238155 6289901 6424683
4565 6424683 6472787 6455740 6609825 6661605 6639338 6687579 6732454 6750247 6774675 6809656 6704288
4554 6704288 6581133 6575258 6519736 6418559 6438544 6370521 6367529 6432851 6375145 6290636 6291561 6347448
4542 6347448 6306835 6311630 6342779 6208875 6087811 6088676 6099757 6146317 6121261 6136874 6081823 6032449
4530 6032449 5868845 5856583 5820956 5886470 5851273 5736255 5586683 5632436 5730839 5806217 5601280
4519 5601280 5548341 5525152 5476049 5502542 5479639 5508463 5569737 5564533 5603227 5675290 5719226 5751019
4507 5751019 5778770 5856246 5874826 5966150 6038464 6149481 6133848 6112324 6214294 6330969 6340770
4496 6340770 6318176 6330017 6371254 6244920 6115985 6023278 5998773 6006422 5999063 5883190 5765885
4485 5765885 5635260 5422187 5409163 5277940 5157255 5020807 4871927 4778380 4670994 4584029
4475 4584029 4520902 4444851 4188168 4182098 4141915 4154219 4135642 4046275 3895885 3946804 3878278
4464 3878278 3872896 3959348 3944469 3895338 3888496 3855564 3817209 3922378 3971562 3974613 4008143 3923607
4452 3923607 3885561 3888069 3871340 3905053 4012334 4156299 4158184 4150458 4217201 4196728 4188209 4249006
4440 4249006 4298647 4320540 4195971 4170798 4123602 4116902 3992257 3910691 3906934 3808847 3834277
4429 3834277 3887459 3790434 3773435 3737479 3712770 3621776 3588120 3612501 3637864 3546619 3595517
4418 3595517 3669965 3676091 3778131 3727388 3795019 3828314 3861999 3747246 3738823 3721010 3848208
4407 3848208 3919200 3785226 3693041 3650031 3669730 3574781 3563500 3446535 3330900 3195221 3173204
4396 3173204 3118556 3169983 3142548 3076719 3038427 2989627 2996151 3056509 2929677 2971168 3093144
4385 3093144 3024812 3073263 3105479 3111501 3082822 3132099 3062192 3082239 3158069 3141781 3144296 3201845
4373 3201845 3163316 3060524 2992177 2965877 2929310 2966072 3042666 3016618 3062717 3012825 2979703
4362 2979703 3025679 2992932 3116116 3165914 3182437 3170401 3136189 3121294 3202596 3352734 3330777
4351 3330777 3404685 3381775 3368994 3445223 3408406 3448360 3464964 3368401 3278224 3269234 3318969 3387951
4339 3387951 3372394 3304907 3370266 3355843 3326020 3308851 3332819 3314318 3270512 3310335 3383245
4328 3383245 3374076 3312618 3375584 3400999 3297869 3334252 3320036 3301791 3393044 3382541 3279371
4317 3279371 3283410 3220248 3113493 3124093 3169423 3257265 3220832 3231288 3235735 3157992 3130575 3160484
4305 3160484 3150737 3135913 3218132 3225629 3197319 3183236 3159572 3171960 3187034 3140143 3133874 3168083
4293 3168083 3217110 3167469 3128344 3161485 3080211 3120752 3089820 3109781 3102031 3132762 3173246 3207145
4281 3207145 3252614 3196971 3240584 3279908 3276309 3354983 3441656 3495603 3417820 3372782 3344521 3371261
4269 3371261 3420433 3450737 3622058 3516402 3387325 3472198 3485008 3630840 3660704 3686280 3721562
4258 3721562 3811962 4004104 4055039 4090456 4181492 4274410 4405013 4544981 4729018 4987578
4248 4987578 5297164 5684056 6083848 6665564 7104133 7429406 7821856 7961189 8100750 8187801
4238 8187801 8357060 8533685 8813351 9311302 9998260 10800891 11646354 12397163 13078356 13788129
4228 13788129 14223657 14633355 14917384 15194555 15518955 15699061 15828495 16101852 16483430
4219 16483430 16789407 17089004 17426527 17824916 18205404 18691311 19121828 19532979 19899212
4210 19899212 20081007 20143384 20014681 19754378 19450117 19291660 19074032 18745120 18336122 18003473
4200 18003473 17735260 17449788 17155179 16837663 16546587 16327341 16183294 16076059 15923938
4191 15923938 15718563 15473135 14988202 14357664 13674164 12904407 12175124 11489832 10916072
4182 10916072 10328988 10045435 9897119 9786146 9837257 9691296 9412751 9101018 8776971 8297120
4172 8297120 7877691 7470023 7091079 6796790 6467738 6181834 5967558 5810261 5696476 5584732
4162 5584732 5390613 5350318 5306941 5253933 5177733 5142098 5037530 5090083 5130235 5124572 5119821
4151 5119821 4991357 4982430 4964255 4872127 4951144 4863858 4857403 4957895 4909955 4897662 4955286
4140 4955286 4883278 4886173 4821784 4821388 4892745 4873856 4873570 4803533 4739109 4726059 4713685 4763670
4128 4763670 4845543 4968041 4976244 4926436 5144168 5303895 5282289 5238494 5308421 5405568 5495903
4117 5495903 5683197 5864897 5878355 6049188 6196692 6313749 6374105 6342345 6264207 6302580
4107 6302580 6332918 6240574 6194100 6141466 6138312 6093825 6156984 6267837 6283796 6196223 6213435
4096 6213435 6328042 6442787 6617479 6718582 6881734 6997683 7109349 7238985 7347035 7283316
4086 7283316 7323991 7495856 7613750 7618976 7714681 7851888 7948343 8033429 8188986 8309081 8509783
4075 8509783 8615348 8856867 9091826 9165373 9408450 9691109 9896566 10198604 10543704 10865647
4065 10865647 11196811 11560484 11977931 12353633 12762018 13111460 13288890 13562777 13855256
4056 13855256 14068982 14234063 14367956 14506404 14582736 14613983 14501454 14294343 14118795 13905114
4046 13905114 13642475 13489610 13166527 12785500 12641807 12421717 12057852 11734344 11626210
4037 11626210 11366889 11220880 11093781 11056509 11024588 10888458 10805469 10793107 10898395 10981337
4027 10981337 11062079 11109761 11271296 11367295 11431240 11418434 11513684 11612172 11809125 12038973 12285807
4016 12285807 12540360 12775482 12944936 13324161 13696536 14081276 14537266 15104563 15589858
4007 15589858 16009017 16563312 17114579 17659253 18137669 18676263 18966614 19244203 19659132
3998 19659132 19939033 20141144 20367629 20538233 20682950 20846107 20830458 20838275 20788886 20612094
3988 20612094 20533035 20407809 20157063 19803958 19548936 19141039 18704317 18246530 17779571 17308973
3978 17308973 16818359 16566417 16165988 15767918 15508484 15383927 14971609 14710862 14450336
3969 14450336 14230941 14092920 13972636 13951081 13775240 13603934 13490942 13464396 13295523 13177085
3959 13177085 13233841 13235175 13205301 13186285 13111034 13013520 13006525 13034781 13083164 13044134 13036202 13157023
3947 13157023 13322047 13270281 13276381 13393593 13518064 13802667 13781282 13909695 14077757 14242799
3937 14242799 14481487 14708295 15068596 15377958 15741401 16107630 16550221 17060856 17681643
3928 17681643 18491206 19455779 20601511 21789633 22797548 23435216 23673800 23490508 22860332
3919 22860332 22186255 21386776 20465194 19608705 18755218 17937503 17392408 16972328 16653026
3910 16653026 16498497 16386478 16227866 16133192 15915702 15689193 15676622 15483777 15376827 15248685
3900 15248685 15168802 14996598 14873438 14852456 14790319 14610624 14588732 14602618 14502360 14494978 14635067
3889 14635067 14637782 14660880 14567550 14575044 14688369 14770436 14781897 14810497 14875342 14908979 15158871
3878 15158871 15229232 15324222 15551977 15695015 15805917 16029975 16206752 16472101 16763663 17042818
3868 17042818 17261733 17518104 17867958 18355155 18731762 19205354 19788135 20273235 20863391
3859 20863391 21514779 22288110 23129686 24042584 24987994 26014052 27165561 28545714 30057974
3850 30057974 31599462 33184930 34726287 36039750 37155522 38119544 39160277 40104048
3842 40104048 41010194 41491926 41362023 40734813 39728863 38505946 37213554 35948366 34878471
3833 34878471 34024032 33413855 33208707 33335063 34008288 35176507 36737388 38911556 41471209
3824 41471209 44334945 47030495 49495367 51649549 53102961 53604234 53289649 52272667
3816 52272667 50712179 48967781 46989867 45241622 43798915 42707443 42140506 42021987
3808 42021987 42387546 43240667 44480965 46190801 48411838 50930979 53237163 55080710
3800 55080710 56380482 57100068 57194723 56967901 56717744 56102802 55517673 54988771 54451790
3791 54451790 54038103 53766048 53651456 53506264 53473390 53440806 53646556 54000583 54475132 55086630
3781 55086630 56172759 57336551 58700553 60342388 62207471 64198701 66335469 68515232
3773 68515232 70682457 72689701 74713519 76440858 77818265 78913164 79648577 80118800
3765 80118800 80416165 80498063 80403260 80322333 80252529 80077316 79865927 80035153 80323546 80811674
3755 80811674 81304312 82038026 82794539 83695666 84661907 85542098 86460492 87429702 88334319
3746 88334319 89197483 90059965 90728000 91609883 92448085 93349532 94176154 95219964 96481793
3737 96481793 97755097 99014047 100434832 101757758 102905462 104188282 105444477 106540712
3729 106540712 107367525 108071703 108500190 108633011 108417715 108054999 107503650 106844667 106197307
3720 106197307 105494751 104909936 104394335 104035400 103906129 103827140 103936389 104171265 104571664
3711 104571664 105046805 105658107 106233386 106871382 107710814 108501729 109122594 109633061 110106651
3702 110106651 110468532 110549746 110389600 110020592 109424022 108746337 108042699 107133372 106176235
3693 106176235 105405454 104578080 103834728 103089813 102527766 102057846 101540971 101129552 100813604
3684 100813604 100629544 100479355 100271341 100022523 99765104 99498451 99370591 99243849 98980820
3675 98980820 98581114 98213294 97758430 97197559 96735517 96254900 95733084 95042992 94446436
3666 94446436 93876640 93319771 92835704 92351819 92047160 91625953 91174295 90823777 90445299
3657 90445299 90056490 89828584 89479889 89138831 88805514 88447568 87988160 87674250 87174080
3648 87174080 86655602 85972025 85118300 84242886 83289435 82259914 81174384 79967914 78774584
3639 78774584 77676345 76407410 75158634 73913343 72714048 71567738 70569792 69492185
3631 69492185 68342346 67363619 66383233 65444155 64605792 63626686 62579253 61611310 60716295
3622 60716295 59856086 58757959 57758571 56878594 55847505 54739079 53734218 52741562 51700982
3613 51700982 50688805 49699787 48730170 47710449 46784288 45880775 45001333 44094354 43210884
3604 43210884 42342131 41545236 40736768 40031103 39341101 38647887 37988069 37301235 36836443
3595 36836443 36313578 35619168 35098184 34586359 34214234 33681922 33182968 32758478 32403129
3586 32403129 31906712 31467736 31033862 30629217 30269489 29788194 29311447 28799545 28507498
3577 28507498 28151853 27753896 27321554 26885422 26529333 26043941 25676694 25380031 24978989
3568 24978989 24498841 24246693 24049147 23879149 23825927 23650469 23554475 23477711 23444912 23592811
3558 23592811 23631199 23721562 23828754 24051551 24527722 25077893 25999320 27147992 28491349
3549 28491349 30128824 31723996 32962549 33508146 33668237 33382409 32686561 31905988 31239010
3540 31239010 30851760 30801830 31327189 32227039 33092825 33789675 34101405 33890519 33324691 32699972
3530 32699972 32084258 31594421 31467793 31574900 31741568 31655940 31264394 30612226 29723090 28700757
3520 28700757 27576885 26637422 26134934 25849671 26115011 26645445 27031271 27214250 26873476
3511 26873476 25983281 24705474 23244443 21764602 20194366 18722351 17459539 16478907
3503 16478907 15581646 14771945 14155233 13703902 13334027 12976458 12679009 12292191 12077046
3494 12077046 11875051 11698977 11472791 11245532 11134842 10927676 10746745 10625745 10709637 10526974
3484 10526974 10430114 10287797 10249286 10191871 10195513 10192595 10224929 10265240 10434067 10531825 10493610
3473 10493610 10466733 10314605 10290104 10016861 9854841 9553248 9392744 9207047 9000173 8916519
3463 8916519 8716336 8741314 8683985 8651754 8480607 8371399 8356468 8242169 8262515 8226562 8185391
3452 8185391 8118874 8012240 8004698 7967864 7933407 7918123 7724709 7851155 7745771 7692793 7879430
3441 7879430 7806397 7736692 7662456 7566494 7576833 7595339 7498156 7573233 7610630 7406968 7402168
3430 7402168 7316295 7317676 7229789 7242265 7302844 7359031 7295709 7134221 7219210 7164689 7020902
3419 7020902 7108999 7153888 7062591 7045699 6886350 6946959 6916807 6759760 6759158 6746685 6711792
3408 6711792 6772237 6726684 6679903 6701649 6783378 6798399 6640365 6559418 6576068 6527736 6579302
3397 6579302 6559110 6596798 6749833 6644389 6628563 6622418 6634609 6624792 6650323 6746039 6884539
3386 6884539 6910229 7117281 7483779 7729911 7791171 7881831 7840230 7694876 7525610 7326650
3376 7326650 7136985 6958501 6870030 6690135 6717488 6658586 6581940 6647626 6571134 6340736 6273912
3365 6273912 6279575 6315735 6218590 6208330 6285639 6243772 6224625 6360471 6458497 6526634 6427988
3354 6427988 6389387 6514080 6578627 6580161 6571590 6499164 6448482 6519282 6441256 6337051 6386353
3343 6386353 6473096 6405024 6400071 6563919 6622571 6636096 6693672 6656194 6642923 6709259 6600764
3332 6600764 6576869 6657966 6741693 6720032 6704027 6869117 6882074 6765586 6876721 6923822 6746742
3321 6746742 6733400 6791487 6975056 7058326 7023373 6991640 6953774 6902724 6860576 6931564 7035022
3310 7035022 7038597 6964032 6968473 7023834 7032486 7095116 7156640 7217421 7256235 7359455 7569480 7569489
3298 7569489 7686367 7885246 8012464 8219473 8301597 8289008 8332246 8368317 8398466 8356436 8382984
3287 8382984 8334845 8327457 8420702 8513416 8623056 8648255 8757696 8890965 9017382 9077842 9205747
3276 9205747 9313424 9348228 9453246 9561669 9662521 9797314 9900298 9866565 9752061 9793444
3266 9793444 9882549 10102306 10217253 10324190 10449713 10610349 10750484 10842799 10993730 11094514
3256 11094514 11115759 11218193 11335102 11354412 11312761 11322444 11342130 11465554 11510173 11525740 11616418
3245 11616418 11724679 11705782 11833839 11957605 12020168 12075130 12141163 12213905 12275276 12322922 12389904
3234 12389904 12467199 12586496 12749142 12787530 12888431 13020275 13119049 13173242 13363077 13547186
3224 13547186 13711098 14009159 14223675 14429691 14636673 14922862 15247917 15395904 15541660
3215 15541660 15865200 16118816 16436817 16801844 17094667 17573896 18131183 18685924 19337090
3206 19337090 20039400 20906202 21864548 22907861 24107842 25351419 26775449 28252197 30060028
3197 30060028 31826228 33668158 35897791 38609065 41962240 46472532 52165379 59975434
3189 59975434 70779620 85737008 105973903 133414658 170656651 214789860 253773681
3182 253773681 277029225 282938256 275650332 256974927 229396091 198580795 167930811
3175 167930811 138875470 113120718 92956686 78532273 68326936 61085349 55342067
3168 55342067 50569345 46646996 43387854 40621725 38125353 35945503 34263984 32925001
3160 32925001 31667941 30457140 29208985 28154424 27247822 26457856 25727926 25178422 24596700
3151 24596700 24061030 23541376 23093144 22506547 22056175 21755484 21423586 21210542 20974683
3142 20974683 20790921 20838473 20860257 20896569 20939291 21041765 21223915 21451122 21664080 21884437
3132 21884437 22041286 22142241 22166419 22397038 22543930 22538389 22610429 22609543 22674049 22708556 22898692
3121 22898692 23169605 23204842 23476796 23905881 24309594 24719610 25167744 25478323 25731974 26099085
3111 26099085 26394899 26659141 26877150 27144853 27346836 27613094 27967865 28370082 28783102
3102 28783102 29100894 29461055 29863983 30304357 30694561 31277114 31865898 32445076 33143469
3093 33143469 33843625 34690785 35640731 36693421 37566970 38287898 38980511 39462719 39917029
3084 39917029 40371391 40763330 41133287 41587716 42041897 42406890 42864019 43366775 43740894
3075 43740894 44197887 44660719 45071028 45373151 45645236 45964342 46489244 46929707 47477541
3066 47477541 48311623 49213362 50315945 51675528 52996145 54367034 55804587 57131640
3058 57131640 58515227 59715687 60852662 61972310 63163311 64285605 65308442 66383700
3050 66383700 67149911 67956067 68633152 69281185 69896205 70473783 71134778 71776153 72587920
3041 72587920 73373046 74457422 75666252 76964198 78372981 79679989 80915701 82083821
3033 82083821 83204531 84171557 85055142 85888621 86627477 87347109 87963135 88746667 89494795
3024 89494795 90440942 91486418 92519945 93567722 94491709 95647355 96734586 97698328 98752761
3015 98752761 99856029 100953844 101955770 102851510 103660903 104659516 105461488 106059373 106544752
3006 106544752 106836277 107033536 107232796 107351345 107430082 107680387 108013954 108516621 108993644
2997 108993644 109572661 110296607 111070597 111766382 112254343 112798074 113420933 114127544 114711507
2988 114711507 115148176 115678233 116218868 116952973 117676448 118465266 119403048 120115887 120749338
2979 120749338 121252556 121580096 121599266 121516278 121434668 121287578 121058960 120952294 120774700 120593488
2969 120593488 120350563 120022019 119769319 119521124 119257556 118871410 118478854 117960418 117341669
2960 117341669 116787907 116345334 115928520 115396940 114830811 114236631 113580303 112905636 112327299
2951 112327299 111526009 110646538 109705163 108701407 107782340 106935106 106002991 104950692 104069212
2942 104069212 103253268 102482465 101511605 100522583 99737502 98681383 97477032 96437348 95331061
2933 95331061 94101718 92822958 91458595 89990977 88541969 87196779 85825795 84541974
2925 84541974 83287133 82147082 80834346 79610862 78463208 77270761 76204956 75156202
2917 75156202 74115171 73050002 72050559 70925228 69973876 69018902 68116115 67172480 66131331
2908 66131331 65157541 64250091 63408007 62522823 61621873 60777345 59788254 58942082 58044295
2899 58044295 57127464 56204226 55235908 54327294 53399081 52637127 51753922 50913774 50117873
2890 50117873 49485095 48932955 48265205 47656513 46920907 46079041 45233430 44505576 43720638
2881 43720638 43051360 42473188 41808084 41197619 40740579 40279169 39776823 39090638 38414121
2872 38414121 37859667 37432519 36997314 36573224 36143192 35783667 35475602 35142197 34861325
2863 34861325 34387931 33921536 33514833 32958615 32410434 31759996 31104804 30481541 29943205
2854 29943205 29409114 28978503 28405266 27817164 27317181 26858865 26366506 25610370 24928147
2845 24928147 24336474 23782576 23255984 22610777 22145917 21679300 21120890 20795046 20340028
2836 20340028 19960908 19592402 19282008 19019143 18673359 18304166 17996622 17662713 17419311
2827 17419311 17108638 16851838 16613445 16303631 16073954 15814684 15621866 15523131 15337198 15089974
2817 15089974 14843894 14637588 14446581 14186509 13949837 13696136 13621296 13544978 13249523 12979225
2807 12979225 12828835 12702142 12556506 12387042 12216099 12110067 12065048 11818052 11734685 11638395
2797 11638395 11588492 11495310 11394869 11275439 11209303 11198170 11010605 10889058 10807255 10632083
2787 10632083 10424110 10365839 10256097 10122575 10101558 9963019 9867840 9819354 9710438 9664987
2777 9664987 9494953 9395309 9288672 9351406 9252538 9253432 9128047 9060267 8989382 8993256 9053784
2766 9053784 8976718 8918828 8962403 8972485 9024065 9124193 9078517 9035382 9040865 8902442 8740633
2755 8740633 8586573 8428686 8382552 8283521 8130354 8007731 7968503 7995743 7927407 8036466
2745 8036466 7927928 7821038 7688975 7650826 7701660 7628981 7582324 7600295 7542984 7421085 7452430
2734 7452430 7486001 7512815 7495880 7454401 7468958 7557912 7531248 7501074 7448097 7423683 7311319
2723 7311319 7226384 7187434 7087761 6922958 7040772 7003030 6778840 6759664 6681211 6661833 6711292
2712 6711292 6784058 6778866 6701619 6684613 6624533 6644963 6539648 6493177 6479662 6465276 6422991
2701 6422991 6374661 6374548 6402597 6427766 6473282 6386901 6363711 6363192 6361331 6316928 6242936 6234902 6271695
2688 6271695 6199143 6108256 6088950 6060704 6124382 6049055 6111130 6072310 6019439 5978553 5976963 5863121
2676 5863121 5942894 6028653 5943665 5927225 5837061 5820758 5845208 6002465 6006372 5987616 5986973 5985531
2664 5985531 5931397 5920600 5851982 5808970 5881464 5809890 5698634 5816747 5816199 5817763 5771922 5755849
2652 5755849 5713337 5724337 5769198 5838352 5789366 5664768 5596688 5677210 5650172 5523707 5570718
2641 5570718 5571158 5554287 5530580 5620023 5640020 5630249 5604262 5584525 5587977 5712731 5750942 5658336
2629 5658336 5737095 5804596 5784860 5698169 5644285 5680170 5705839 5720043 5699331 5744033 5853768
2618 5853768 5762539 5791133 5773625 5762031 5831253 5888598 5897385 5776265 5766507 5764452 5761978 5814938
2606 5814938 5894964 5898774 5956781 5967241 5969316 6081115 6136916 6143956 6197493 6299235 6256131 6360583
2594 6360583 6382618 6465603 6480044 6593964 6634078 6678495 6798202 6763218 6852369 6897431 6998053
2583 6998053 6969804 7056469 7174795 7271948 7255965 7385095 7536163 7700300 7735355 7900488
2573 7900488 8026477 8145722 8248686 8394008 8583278 8717976 8943096 9090567 9165262 9223142
2563 9223142 9199670 9282146 9303304 9343795 9555844 9581432 9643374 9788847 9945681 10250391 10427962
2552 10427962 10647868 10842762 10832750 11070337 11342783 11668776 11953282 12293331 12586916 12912910
2542 12912910 13301376 13464507 13726511 13978596 14323035 14661812 14980004 15327387 15707667
2533 15707667 15977744 16326043 16684003 17098062 17541261 17953139 18398811 18965893 19475778
2524 19475778 20051996 20744316 21572879 22397907 23355292 24508480 25912264 27565924 29470844
2515 29470844 31547440 34205270 37600088 41916911 47486125 54628921 64223771 76339613
2507 76339613 87652253 95328990 98671700 98888035 96537770 91912463 86719073 81723939
2499 81723939 77396586 73767011 71876403 71397532 71702447 72482267 73323601 73696312 73605377
2490 73605377 73040390 72040585 70516809 68792463 67426213 66290194 65731708 65807778 66846503
2481 66846503 69161620 73298299 79644564 89047562 102370355 121373985 141714105 156203229
2473 156203229 161934098 159926821 152726148 139613825 123825444 107555211 92010844
2466 92010844 77423099 65105080 55884476 49241862 44535088 40835683 37758241 35087877
2458 35087877 32927628 31276502 29951057 28947698 28281748 28058767 28036864 28330091 28938269
2449 28938269 30084178 32055197 35053486 39414019 45412670 53692057 63768893 72534392
2441 72534392 77397294 78025144 75770909 70763516 63666564 55899585 48219435 40964195
2433 40964195 34463655 29324057 25637055 22980803 21019626 19389447 18003136 16795324
2425 16795324 15636111 14752033 13984195 13292661 12654381 12228136 11769191 11446812 11048438
2416 11048438 10755152 10525657 10234859 9989559 9793490 9558059 9317128 9021292 8752751
2407 8752751 8626886 8499744 8320351 8165297 8077799 8044594 7795406 7686419 7495567 7318922
2397 7318922 7122772 7028232 6882327 6860888 6826046 6790228 6600133 6487809 6508741 6498473 6424658
2386 6424658 6417106 6420029 6352819 6135551 6050371 5857563 5684533 5661771 5455297 5475010 5472165
2375 5472165 5371211 5363834 5363205 5316780 5213926 5173983 5137509 5005815 5014799 4935794 4897744 4748249
2363 4748249 4660228 4633869 4628113 4496537 4407814 4388320 4465395 4567425 4506774 4523211 4379649
2352 4379649 4348597 4298805 4213174 4126669 4124309 4042196 4063660 4055609 4001901 3938676 4001174 4008067
2340 4008067 4056722 4110880 4077952 4006844 4075216 4141807 3941481 3848238 3870018 3932184 3901803
2329 3901803 3815354 3697737 3711537 3625076 3616719 3632696 3615035 3694463 3763080 3689898 3655059
2318 3655059 3629506 3567022 3528820 3540486 3658864 3620284 3540400 3553902 3583386 3650292 3656805
2307 3656805 3733778 3694006 3789783 3770906 3679587 3745098 3713145 3678354 3624573 3649425 3649402 3639337
2295 3639337 3610204 3672159 3705837 3656727 3690623 3664200 3685759 3828165 3915630 3972468 3958298
2284 3958298 4007685 4084052 4134082 4254476 4336247 4561784 4893044 5091194 5345643 5495455
2274 5495455 5700488 6152223 6528796 6801530 7121008 7425896 7598418 7641109 7555791 7469778
2264 7469778 7428438 7399431 7259994 7227348 7147258 7029505 7090182 7197166 7102427 7120697 7207830
2253 7207830 7350710 7358164 7374964 7441809 7443939 7338422 7366818 7387837 7431338 7581860 7763027
2242 7763027 8042114 8529617 8900240 9448801 10179738 10865335 11652360 12484176 13258378 13987966
2232 13987966 14455170 14675246 14601624 14256902 13866027 13397846 12827396 12325430 11896892 11686290
2222 11686290 11675367 11659917 11788022 11859365 12119451 12131221 11958059 11851250 11607306 11293137
2212 11293137 10813403 10240597 9763585 9341757 9115542 8961516 8936925 9069523 9239143 9545528
2202 9545528 9884463 10275478 10867714 11358430 11853364 12180254 12368442 12436187 12358798 12261345
2192 12261345 12209015 12162613 12079686 12164736 12353326 12545641 12877947 13422716 13936748 14454753
2182 14454753 14888158 15425176 16030074 16499693 16827266 17181919 17532508 17645398 17644341 17599767
2172 17599767 17410690 17278140 17170446 16999606 16831697 16694672 16619285 16425989 16446787 16548444
2162 16548444 16605395 16690385 16873845 17078793 17346937 17620875 18147014 18666223 19411662 20345270
2152 20345270 21673281 23221655 25014731 27325985 29730620 31623164 32600289 32658437 31963019
2143 31963019 30694062 28873181 26890065 24791799 22807442 21068123 19612764 18573863
2135 18573863 17757107 17100810 16545523 15965721 15580777 15377186 15129106 14970435 15020817 15065327
2125 15065327 15118842 15399046 15603582 15926237 16215245 16633391 17152565 17695457 18029124 18131224
2115 18131224 17995545 17674101 17108694 16197219 15395394 14441755 13504586 12760352 12021622
2106 12021622 11278887 10628510 10032397 9577196 9147972 8812377 8467850 8012629 7701707
2097 7701707 7334454 6947779 6772959 6588692 6281934 5964950 5706953 5486023 5301744 5053526
2087 5053526 4784977 4606499 4405510 4223943 4169281 4001481 3912403 3838370 3844453 3774857 3608651
2076 3608651 3400022 3349588 3279325 3267990 3149559 2996072 2984701 2920623 2804422 2749169 2665228
2065 2665228 2586992 2508574 2597085 2558423 2531157 2477334 2388565 2302028 2282395 2219488 2175797
2054 2175797 2138604 2049455 1996335 1947810 2015751 2008265 1890377 1858658 1825113 1785437 1874237
2043 1874237 1885548 1854181 1823266 1846033 1763590 1693055 1641358 1662382 1582480 1551348 1524866
2032 1524866 1421875 1386639 1324283 1315072 1338906 1417486 1397058 1339797 1392233 1415539 1328964
2021 1328964 1300819 1304578 1281974 1288152 1237124 1344099 1320885 1339369 1317523 1218240 1164671 1248878
2009 1248878 1248204 1158120 1166962 1136462 1059428 1003829 922005 925878 1026770 981184 921632 981372
1997 981372 947219 887932 906839 948690 986395 969746 930553 986981 908796 887168 893645 962028
1985 962028 895532 933994 961084 840406 902132 841095 760496 751806 836815 934870 871610 832117
1973 832117 964567 903499 808963 751808 895193 861148 831279 864623 794305 746173 778576
1962 778576 778660 882111 1003879 856686 813114 762837 785882 809733 849750 866895 805729 886084
1950 886084 916233 964989 1005493 972377 890331 838439 935359 986137 931908 959584 932800 980665
1938 980665 997735 1040103 1110917 1196338 1161913 1069402 1176569 1108774 1071226 1133087 1247890
1927 1247890 1313051 1318726 1267740 1203482 1295427 1312621 1344115 1428254 1452180 1429969 1360869 1357916
1915 1357916 1575391 1740129 1735083 1703935 1704944 1877564 1977670 2092180 2217610 2262544 2277103
1904 2277103 2398721 2418685 2478372 2498009 2514015 2604677 2618245 2705391 2741329 2872661 3082716
1893 3082716 3207258 3312811 3320844 3541361 3604421 3533844 3533823 3549846 3496168 3376752 3433918
1882 3433918 3246202 3176058 3281474 3247523 3293012 3412443 3448169 3559052 3857972 4021210
1872 4021210 4206090 4288718 4323349 4530363 4630092 4677622 4748743 4849846 4950783 4925451 4972673
1861 4972673 5079540 5202500 5420431 5736479 5852712 6001238 6007500 5914920 5910930 5792012
1851 5792012 5728647 5355703 5203596 4961196 4567751 4380972 4178518 3986407 3804461 3706219
1841 3706219 3584969 3619706 3757432 3818732 3944754 4150609 4378035 4480317 4612713 4676817
1831 4676817 4689108 4612028 4614914 4446808 4461493 4501317 4426349 4475036 4548307 4608473 4780677
1820 4780677 4930699 4931504 4850023 4574785 4399383 4305400 4128142 3889105 3635536 3397381
1810 3397381 3066613 2842685 2651669 2565769 2498511 2305687 2121689 2090223 2033696 2029950 2084722
1799 2084722 2118198 2261997 2195338 2199550 2170867 2195917 2215903 2109226 1958809 1885312 1809232
1788 1809232 1786386 1819379 1897148 1824479 1709187 1722798 1737319 1652596 1655864 1623341 1490115
1777 1490115 1399824 1316598 1212929 1075829 1014599 937719 863835 860922 838443 731372 658662
1766 658662 588935 511393 585879 579910 523632 625686 668077 595277 517783 514183 541789 618122
1754 618122 579552 500911 466538 433768 470810 549674 535398 349141 229768 242734 286384
1743 286384 259468 198470 239978 260599 288507 255431 233312 155889 158565 260383 243543 260407
1731 260407 187863 218737 241267 222289 249240 211753 162148 140410 101180 186304 121218 29935
1719 29935 -38935 32971 217065 283810 256485 289199 257457 189111 212446 176059 107181 97539
1707 97539 -38327 -60898 44976 7391 34645 -9240 74252 86616 110453 101431 139877 101133
1695 101133 18003 77567 76072 69467 59071 26824 79411 98382 99229 81252 52621 96604
1683 96604 75624 24013 75004 160068 49715 -101414 -39647 84268 74233 18024 -41915
1672 -41915 1683 114434 88751 120793 147275 131100 146636 65601 121 -44502 70597
1661 70597 79909 8263 7538 135149 77304 128739 130976 75329 142164 135287 10024 392 40230
1648 40230 143855 254874 234045 173828 97701 134403 38691 142422 25036 -3426 -23937
1637 -23937 -69445 -67292 32977 31038 -25779 -11050 69895 38729 26917 -10184 -11767 88435
1625 88435 69609 10571 17878 48087 125237 192886 169117 133483 209845 278113 214745 153897
1613 153897 111392 79737 100599 226689 94008 38035 65992 63254 37374 -25892 68758
1602 68758 104211 78212 66334 104088 55367 -59461 -30790 92619 210899 129742 23260
1591 23260 63964 102589 67738 26566 -52377 -49236 -79773 6788 -4473 -8111 33087 46786
1579 46786 7290 11140 31528 18214 18653 33366 133005 84382 35784 63947 30738 -25192
1567 -25192 25117 23957 -22179 13690 79185 125744 41373 -1162 -5442 12083 2953 -45525
1555 -45525 7438 138313 20985 -63506 -16815 16999 1592 -9451 -53917 -56502 -10063 -16882
1543 -16882 -22203 -1668 36198 144517 121450 162750 185791 121584 86747 -76754 -95033 -105002
1531 -105002 16473 18435 23463 -51840 5784 63456 -35526 -2890 40506 23097 15837 22180
1519 22180 -25616 72840 50045 -21753 -38953 -26095 -59321 -131603 -80592 -28306 -40017 11965
1507 11965 95004 -18974 25350 86519 -5149 -91448 -35630 -12147 95702 53568 -65072
1496 -65072 40209 -17183 -102561 -159650 -119701 -137328 -150736 -92243 -13028 -18190 -111542 -84325
1484 -84325 -38040 -20309 6380 -81811 58928 106303 19438 48794 2587 12952 1989 34674
1472 34674 26568 69882 21413 54149 65879 -656 36463 -11150 -25608 29445 55843 31470
1460 31470 119918 125505 154208 66405 14808 99362 72829 -17742 1132 19718 59877 221816
1448 221816 174956 57318 48646 117020 155587 237776 259507 204413 219557 217860 218388 279046
1436 279046 198617 302684 253285 217830 211681 178692 166883 111314 152426 187835 174358 226329
1424 226329 219642 176590 213639 187798 227135 246130 288859 304686 251397 207043 149308 176601
1412 176601 219286 264073 223604 282862 283094 324273 339213 381593 338094 300228 286989 181741
1400 181741 319094 484243 542739 493734 363002 369067 398516 473377 571898 462739 542634
1389 542634 616540 622411 594773 657054 813706 816564 730371 746115 745175 762876 785156 824138
1377 824138 877271 941105 906462 1129875 1308117 1445854 1617839 1805637 2056794 2313350
1367 2313350 2591964 2970557 3269352 3552005 3785443 4096133 4440559 4985947 5629141 6441457
1357 6441457 7672179 9523959 11931317 15310728 19940400 26584027 33166474 37376483
1349 37376483 38552784 37824599 35852391 31918585 27457095 22999770 18778754 14670792
1341 14670792 11515144 9351046 7845243 6907602 6145594 5653071 5175647 4733112 4330452
1332 4330452 3891227 3588757 3221890 2926404 2588632 2334944 2110351 2022022 1892363 1813072
1322 1813072 1764602 1675975 1598439 1489959 1412460 1377488 1214886 1178617 1150330 1131407 1214530
1311 1214530 1086861 974790 885902 898255 894004 847414 787952 789383 804429 685956 612591
1300 612591 678284 708845 705671 611763 558648 581860 471483 506896 501411 511773 447061 473277
1288 473277 502517 377929 394077 452136 372206 380095 408441 413511 441901 447935 297708 289442
1276 289442 251996 207362 224938 273284 248728 227422 326905 383176 409610 329631 242612 183326
1264 183326 129812 228571 292070 288394 171950 202301 261800 245755 220581 232339 225847 182546
1252 182546 179278 182207 96907 141440 43700 46232 173352 132100 89501 106029 66463 41218
1240 41218 137964 101138 141462 98695 189081 115353 110537 66634 -57211 -12928 95760 66274
1228 66274 76473 8485 -34779 54178 189763 212837 38269 -47259 71934 14970 9497
1217 9497 65642 115435 64753 81824 46743 -12435 14283 -16027 23073 -32920 87318 27591
1205 27591 -29207 78027 9300 -50305 -40962 -14858 -21484 115393 90452 102102 107529 100000
1193 100000 74014 69850 -92098 -184071 -228926 -168352 -114595 -133490 -76242 -13153 -4770 125636
1181 125636 85478 -47306 -45250 -57858 -76262 -94098 -42207 27069 28978 -119169 -125519 -73613
1169 -73613 -43333 -72769 45623 23194 22073 6975 65288 16773 45904 21853 43072 136964
1157 136964 31034 -34553 -15635 -5961 82452 80800 22093 50817 133498 139214 40068 -4265
1145 -4265 -61036 -38441 -47002 18004 30044 -67675 -26024 -68127 -5630 77215 46177 21408
1133 21408 -8430 23927 6042 22981 -121126 -101565 -12907 6464 -65540 -83572 -77745 -163301
1121 -163301 -171796 -89216 -28189 -53789 79966 114300 -28242 -75151 -37848 -41964 9504 -21110
1109 -21110 -63505 -38778 -88087 -142540 -81002 -131063 -131640 -103169 -337 36618 -78435 -35170
1097 -35170 44291 42482 27115 -153531 -156508 -1479 -7198 -88463 -47932 93730 87655 9538
1085 9538 60892 12924 94365 206077 159287 143739 156084 166202 200866 186568 140172 150993
1073 150993 167681 131718 53480 -18791 -95951 -27457 43836 17748 13188 -1322 -95056 -76161
1061 -76161 -48060 -6922 -75426 26315 29532 -57786 -82838 -7098 -107410 -98402 11331 -61336
1049 -61336 -59086 -176219 -136479 -53273 -58573 -50234 -93665 -128437 16773 -36416 -23206 -24345
1037 -24345 -58152 -127393 -194184 -205592 -121070 43024 42280 41993 23611 -47231 -99383 -65040
1025 -65040 -21373 -49562 -154573 -121654 -144079 -113828 -181523 -142423 -118372 -156463 -107592 -108542
1013 -108542 -88374 -111775 52353 20633 -38488 -9200 -12266 15743 -60505 -86856 -12186 45788
1001 45788 55120 -1987 -53467 -47587 -3757 -52565 -76713 -26212 -48986 -98882 -122285 -145925
989 -145925 -71809 -91424 -138067 -65690 -61399 -68156 57262 7958 47299 99377 28080 27370
977 27370 -9619 -34618 -56918 -6837 -28743 -100487 28601 -2765 -32881 36627 -10106 -1500
965 -1500 -24303 58508 58407 60260 50830 53860 -75812 -142661 -32118 95359 83666 871 -69551
952 -69551 15209 16754 -15768 -117898 -73648 58547 36013 5524 -34641 5822 21436 -27298
940 -27298 -56220 -30217 -31747 -109884 -936 -46595 -15493 65841 39380 23483 34919 -52103
928 -52103 -88508 -49917 64488 39918 -105815 -211729 -250268 -179880 -266509 -204114 -103864
917 -103864 -113763 -76433 22216 -78625 -14402 -14434 -97837 -121074 -117548 -50721 -91663 -139682 -60329
904 -60329 10427 36988 -33050 69217 46543 695 -66306 -25189 105133 133165 108727 1876
892 1876 -12817 101850 66028 11810 -93794 -62089 -21557 -44163 -35004 -86752 -88386 -35730
880 -35730 -6907 -11406 44860 -102279 -79799 -45283 -21505 -87800 -44321 46864 -33100 -47596
868 -47596 -55390 37368 -63975 -74158 -136235 -114073 -115402 -128208 -10101 1462 35914 24557
856 24557 14764 14424 20936 11072 9206 14250 -6769 64599 96811 64471 109426 122951 75244
843 75244 38969 -31894 -15760 -34910 35237 134245 28058 59132 20445 -31177 -40978 -68397
831 -68397 -15245 -56040 -51578 58751 5558 -24726 -59599 -67577 -51842 -54622 -89621 -52953
819 -52953 27888 59321 5256 -116773 -132203 -166110 -15838 -22783 -131796 -71223 58338
808 58338 96021 59921 -43147 -64276 -68962 -76530 -95005 -86194 -25460 29296 -42451 4805
796 4805 11760 -103883 -55761 14686 -1743 -104760 -10858 -19489 -17951 25662 -9248 -105209
784 -105209 -5962 31726 13724 -102051 -103411 -80487 -18084 -46923 -57221 -95065 57957 110586
772 110586 78186 100877 193264 106631 -18964 34087 70903 36269 -7696 34394 -54992 -22255
760 -22255 -18092 -39439 -74537 -74471 3919 -34557 -170458 -216766 -146860 -104547 -71283 -36663 -94288
747 -94288 -71265 -62370 -66993 -23746 110029 -36382 -13785 4943 56696 34328 -5124 106702
735 106702 21108 -88209 -31535 5088 -80515 41430 35237 -40279 -86491 -128584 3919
724 3919 -6578 -77046 -19750 -23964 -37308 -28434 -14253 92951 66567 -349 46705 20787
712 20787 3084 70212 49146 108506 14017 -2382 -15860 -44911 43672 19248 27633 30992
700 30992 70134 19453 -53977 -60669 -59237 -49340 16482 19452 4445 -42561 15044 36070 53672
687 53672 -31019 -67666 -57983 -39672 78669 41680 -47121 -1504 68181 77206 68518 -28886
675 -28886 19158 -69339 -112440 -27536 59705 63857 -19260 -16246 -14697 -57202 -132034 -111797 21462
662 21462 -11522 -65446 -87281 -29303 34038 -44496 -50312 -26815 -59344 -57782 14197 20809 89512
649 89512 131430 115358 29261 9508 -131101 -75079 15795 34957 33442 -8992 64024 -31468
637 -31468 -60022 7909 -11331 -56722 -15296 -34441 -36050 -19109 -42718 -25868 79935 112044
625 112044 63058 90954 33429 7629 20035 101434 123085 -33598 -20224 42242 58985 126843
613 126843 61696 77888 168734 75669 -590 18428 15092 33554 64665 -37887 -70999 -95508
601 -95508 -114631 -130919 -137456 -63425 2666 -19085 -7437 41863 48197 10373 -23320 86400
589 86400 46737 -20190 -7799 -22553 98243 110791 71769 9242 14549 -8498 -9133 33604
577 33604 47918 -108724 -172068 -16450 -6816 3428 83293 -300 -14264 -41526 -92722 31524
565 31524 -32148 37419 68734 31882 39872 -36279 -18029 -26935 -124968 -170684 -134123 -79305
553 -79305 -109281 -10059 -47801 -91709 25361 42289 -60599 -14752 -24813 -31412 49226 -12875
541 -12875 -34561 -40885 -15156 -10733 70902 12629 -7928 46604 -52161 -108302 -37499 16814
529 16814 31839 -67102 4586 49128 14154 -4594 -83299 14047 -60968 -98610 16731 11643
517 11643 48059 51803 63528 13689 14764 152853 101121 42091 -31428 -40508 136717 -50491
505 -50491 -28591 52196 -2917 -45148 -200623 -86947 -99779 -171060 -112442 -46001 23874 17713
493 17713 -6624 21997 -14948 3815 143672 100617 -26509 60696 24900 -22975 -68675 -10785
481 -10785 5749 -18893 37928 60926 63097 57792 82656 10076 -7230 99603 56996 40095
469 40095 -32137 -42380 10935 56092 126446 100889 23231 36949 -77217 -116524 -26014 111577
457 111577 166028 140567 75918 55879 73588 60845 60568 25617 111600 85589 80776 34731
445 34731 -42702 7547 -1631 -53939 -94646 -65499 38091 135282 54387 42328 71717 105093
433 105093 131582 3188 -54194 -12728 24156 74100 52944 84579 47129 -34759 -44979 50439
421 50439 49050 -38662 -40924 -82786 -50494 -41266 14327 -39868 4588 25380 56017 81404 36036
408 36036 40432 129234 171173 55815 42220 63064 38446 7710 11306 -18987 -19323 31368 1057
395 1057 -13768 132411 177690 68017 106713 -28649 28005 -850 15617 -33435 60755 42169
383 42169 92155 168798 53550 143443 146529 197122 176633 79531 49123 33602 109367 25472
371 25472 -23854 36227 30743 -71519 33329 174457 136566 11587 13100 -4741 24086 57152
359 57152 78003 82548 25813 113313 38483 7611 13668 56375 54037 36742 42733 45887 96789
346 96789 68030 -6028 -77184 20831 42223 -33005 83555 123202 37838 -104960 -129171 -129943
334 -129943 -44660 51230 73508 80877 134606 146739 84488 -34443 12298 -4794 -5271 51493
322 51493 1741 -109604 -49411 26849 65005 57363 57937 36521 29394 25495 15609 34469 -53170
309 -53170 -104809 7052 16318 -32225 -55406 138394 132080 120334 122403 80898 47596 52932
297 52932 -35108 -97433 -63965 -84695 23083 77250 86995 143673 51112 -45689 12786 -12396
285 -12396 -28343 -41244 13704 -28461 -1872 24037 26306 30093 12955 -53513 -81008 20953
273 20953 40994 -28724 -66418 -47842 57451 43591 61220 76900 -15826 44339 94591 111387
261 111387 -668 -57930 -64362 17416 73403 72248 -28196 -81293 79823 118962 182524 149800
249 149800 69906 -19985 -36295 -19188 23986 49291 48497 67693 83079 66835 36214 -36569
237 -36569 16830 93970 126378 81771 -15187 79627 35466 98672 146743 116315 68977 60135
225 60135 -7261 -17133 -67818 -28304 -8667 -26154 -20829 19803 120137 62777 68716 14210
213 14210 80989 76840 -12834 -5568 8991 -24444 53968 28223 72719 173536 149720 25469
201 25469 59857 94842 134426 213855 98382 24000 18155 43389 92713 14637 70148 45439
189 45439 59579 20457 -3202 -38447 -76997 -4250 49773 46770 46105 39659 5888 -16893 7145
176 7145 35479 -24668 18914 13644 1614 40878 -39329 -13881 -31744 -156879 -152554 -73961
164 -73961 -54050 -16153 9636 38452 -4559 -114890 -185129 -90915 -69340 -79642 -105773 -34448
152 -34448 -32444 -129935 -23642 -42842 -33605 -62734 -85458 -119352 -93043 -153827 -129110 -108571
140 -108571 -62687 -17716 -119190 -102899 -92863 -137060 -25651 13588 -68697 -110264 -132822
129 -132822 -106002 -125392 -129319 -90892 -113335 -89437 -61989 -15212 21259 -72478 -90262 -150734
117 -150734 -139851 -170572 -169456 -102730 -191579 -193630 -225903 -203916 -130442 -114040 -132160 -104938
105 -104938 -173303 -176671 -219264 -170004 -201645 -202885 -172481 -194592 -145576 -198333 -255488 -203345
93 -203345 -162720 -177652 -199594 -288081 -327976 -255222 -239802 -241947 -274098 -248806 -188050 -204499
81 -204499 -301597 -329606 -292638 -269458 -298619 -319867 -293199 -291787 -306131 -295672 -264779 -327466
69 -327466 -323270 -292949 -258685 -260167 -239083 -197756 -329887 -340187 -238433 -273487 -301106 -313755
57 -313755 -316463 -372876 -365637 -263345 -318238 -357002 -392425 -435387 -479046 -453474 -410947 -433400
45 -433400 -353200 -364794 -441860 -373900 -332718 -338348 -433056 -509563 -464797 -426405 -390842 -428865
33 -428865 -457585 -471585 -481548 -480759 -410209 -449835 -544162 -519369 -472603 -423827 -482020 -501934 -477039
20 -477039 -494068 -460850 -471751 -526988 -485563 -465520 -466038 -446781 -494458 -588724 -621478 -541993
8 -541993 -539579 -537169 -594229 -597266 -580645 -581427 -557211 -560131
0 -560131
$$ Imaginary data points
##PAGE= N=2
##DATA TABLE= (X++(I..I)), XYDATA
16383 -2913070 -2895291 -2864239 -2817808 -2761254 -2764125 -2742981 -2716524 -2682451 -2669875 -2577348 -2451000
16372 -2451000 -2405273 -2375194 -2323512 -2260490 -2253901 -2227670 -2170298 -2173474 -2188618 -2027414 -1990271
16361 -1990271 -1967564 -1895690 -1878444 -1884561 -1790503 -1691434 -1655359 -1651560 -1617991 -1650173 -1524871
16350 -1524871 -1416057 -1380496 -1407889 -1384110 -1320293 -1247674 -1235259 -1212306 -1140813 -1142706 -1137939
16339 -1137939 -1138162 -1048541 -1048320 -959536 -919534 -858400 -794001 -788731 -702733 -659481 -625573 -603957
16327 -603957 -543416 -502826 -518143 -448332 -460103 -438607 -400022 -346075 -287495 -294336 -224191 -186882
16315 -186882 -123289 -113226 -8424 140220 203313 218209 202411 210632 239320 228294 317274
16304 317274 336545 339697 360770 441808 502917 568804 610345 597818 631512 682511 700544 730379
16292 730379 793628 741173 780564 827842 888861 894940 937516 950280 1067256 1147053 1090395
16281 1090395 1061459 1068814 1104914 1124783 1168672 1190465 1324846 1370216 1353564 1406657 1400317
16270 1400317 1426924 1550007 1552853 1477972 1476624 1485589 1583604 1674036 1744001 1789414 1729790 1728016
16258 1728016 1772964 1832805 1815661 1847498 1853999 1883273 1974483 1994582 1973012 2030236 2105814
16247 2105814 2159152 2146068 2185369 2172834 2122322 2112636 2263409 2321563 2302746 2302764 2306865 2274611
16235 2274611 2408223 2466019 2439655 2425521 2398434 2430697 2404710 2502688 2570282 2508815 2473361
16224 2473361 2488614 2487301 2500462 2512529 2610149 2656783 2683272 2721721 2735548 2760310 2738599
16213 2738599 2823835 2855722 2801351 2807467 2786508 2867796 2924921 2964955 2903813 2945786 2881821
16202 2881821 2963620 3075782 3105526 3121089 3170254 3155881 3167941 3216717 3236442 3212918 3174995
16191 3174995 3143712 3260593 3225092 3187242 3259323 3326273 3199143 3176161 3154381 3221941 3226212
16180 3226212 3212276 3261799 3220866 3373397 3418840 3458731 3404582 3414441 3476016 3486170 3404068
16169 3404068 3336377 3390269 3468754 3444138 3437197 3478585 3507979 3474655 3435706 3510350 3561474
16158 3561474 3525628 3418620 3499538 3556067 3489965 3475141 3504770 3672444 3685188 3642984 3676661
16147 3676661 3643841 3521383 3603859 3606168 3623692 3586191 3500736 3618143 3680308 3710115 3719637
16136 3719637 3615412 3629395 3634736 3723823 3745441 3779262 3851458 3773934 3850780 3836138 3813715
16125 3813715 3797468 3770561 3781555 3760064 3811058 3830741 3775052 3745737 3711418 3755929 3831358
16114 3831358 3829190 3857612 3828067 3802896 3761462 3802354 3859106 3897242 3929361 3875717 3870214 3931385
16102 3931385 3954254 4012324 3968588 3866962 3901691 3915754 3921433 3956621 3904922 3899444 3928709
16091 3928709 3891136 3836175 3895967 3830465 3859975 3964531 3955470 3959578 3948199 3913846 3964277
16080 3964277 3932968 3867914 3944436 3890153 3943487 3934633 3928626 3975183 3970465 3924182 3915671 3991383
16068 3991383 3945415 3950075 4071713 4076185 4033048 4043518 3961715 3962703 3998565 4053640 4078335 4022307
16056 4022307 3981942 3953006 3957053 3942504 3907895 3899357 3918825 3943640 4040785 4027645 4031582 4009108
16044 4009108 4048372 4135307 4039589 4042368 4061310 3940566 3933637 3917549 3935189 3896097 3939613
16033 3939613 3925790 3934922 3965691 3900177 3910951 3922400 3943232 3978082 4038567 4064912 4094392
16022 4094392 4101621 4046976 4065029 4071954 4067395 4059963 4117625 4051941 4066215 4073662 4005776 4013702
16010 4013702 3960228 4064239 4001659 4042931 4044973 4007481 3995289 4044768 4008533 4048806 4046348
15999 4046348 4048591 4100800 4057008 4039596 4164976 4130845 4060321 4046928 4126601 4175898 4154550
15988 4154550 4151387 4022629 4002047 4010696 4087274 4118859 4121260 4062267 4014597 4054881 4087075 4015190
15976 4015190 4027004 4051904 3979528 4063323 4041794 3974228 3979024 4072112 4156206 4183217 4123460
15965 4123460 3985622 4023747 4124669 4070601 4058609 4071789 4045066 4086197 4053885 3997103 3911237
15954 3911237 4007378 4026049 4108867 4097641 4151423 4116096 4056855 4042051 4003458 4109211 4132448
15943 4132448 4037116 4050423 4073029 4057586 4076642 4071235 4060275 4146562 4043216 3963991 4012993
15932 4012993 4068050 4154630 4186105 4161084 4106719 4070742 4126355 4157699 4102110 4161976 4112805
15921 4112805 4026540 4042373 3997441 4027216 3980545 4035597 4081224 4127750 4111813 4019473 3940470
15910 3940470 3945155 3985002 3891923 3989713 3918492 3938835 3963207 4022196 4033927 4044013 4023532
15899 4023532 4031369 4003648 4025488 4058958 4005812 4121643 4006661 4148453 4177557 4004375 3998704
15888 3998704 4033472 4030301 4015758 4076620 4117152 4120349 4104161 4125642 4098706 4106903 4145286 4123496
15876 4123496 4188290 4229986 4177606 4154574 4096414 4008111 4034792 4103597 4042041 4137115 4214418
15865 4214418 4105037 4046330 3988553 3979766 4124395 4068382 4153851 4134155 4130679 4082727 4102284
15854 4102284 4066723 3976112 4081311 4100777 4166394 4197572 4151560 4142954 4003294 4023019 4082611
15843 4082611 4060796 4046133 4039636 4108475 4154000 4103176 4077324 4106920 4053884 4024639 4034779
15832 4034779 4100226 4146465 4111833 4213199 4223650 4128501 4055677 4037273 3985762 4065980 4101385
15821 4101385 4109276 4243622 4272106 4254568 4167215 4092321 4017545 4060468 4170043 4232348 4115878
15810 4115878 4171820 4223142 4185246 4182808 4163828 4104422 4099032 4125352 4228449 4241123 4151641
15799 4151641 4134832 4283157 4247749 4139831 4159091 4075954 4098801 4145711 4107788 4081157 4161581
15788 4161581 4091385 4051623 4118313 4155203 4144060 4161342 4218635 4179712 4154357 4024231 4023039
15777 4023039 4169768 4098654 4111124 4130865 4135306 4140804 4110378 4149276 4170415 4143688 4086290
15766 4086290 4310348 4303856 4181879 4108673 4068216 4132146 4161728 4169436 4111796 4051062 4121869
15755 4121869 4205061 4136540 4127761 4203678 4324733 4210235 4142223 4208206 4145816 4052766 4066002
15744 4066002 4156699 4187925 4290723 4213792 4199816 4114139 4090473 4140517 4112233 4147616 4235010
15733 4235010 4280474 4161613 4154876 4158021 4106154 4084395 4115086 4155673 4191940 4208214 4123786
15722 4123786 4176178 4155390 4154000 4078851 4109573 4154533 4188857 4128369 4173557 4205327 4274069
15711 4274069 4233679 4150014 4122732 4098317 4180247 4121757 3998025 4101626 4218690 4161233 4203577
15700 4203577 4201097 4200950 4276658 4216230 4099029 4141348 4107731 4181079 4193941 4149138 4133218 4047014
15688 4047014 4080830 4182127 4202440 4319493 4292694 4229863 4236138 4180407 4222868 4294045 4172871
15677 4172871 4148279 4152140 4111286 4079202 4092826 4005602 4040320 4047103 4111697 4109506 4117835 4122380
15665 4122380 4143851 4143336 4108816 4111681 4118806 4208816 4174118 4114521 4077965 4022340 4126490 4249562
15653 4249562 4243429 4198755 4189125 4129676 4210340 4218700 4210260 4220676 4174337 4164733 4226363 4168924
15641 4168924 4109516 4142382 4156599 4123133 4108852 4191654 4196971 4124566 4097175 4149929 4153256 4107252
15629 4107252 4173812 4130231 4089215 4115677 4121991 4125194 4180739 4180830 4200519 4224153 4202406 4230106
15617 4230106 4243042 4160854 4073542 4064604 4198270 4145565 4157057 4276006 4215353 4157661 4212890
15606 4212890 4214725 4189889 4196194 4154898 4068101 4049396 4235904 4318510 4214185 4226983 4269376
15595 4269376 4269813 4322279 4227582 4234725 4179201 4261153 4272255 4286620 4218328 4221653 4209663 4262559
15583 4262559 4306919 4319377 4173157 4177503 4157216 4240014 4323609 4271082 4214816 4196687 4255079
15572 4255079 4244252 4234459 4302903 4207976 4166337 4150516 4202844 4149508 4127766 4210861 4178051
15561 4178051 4263529 4313954 4279089 4278527 4253677 4260630 4212204 4131404 4205035 4227205 4190374 4192348
15549 4192348 4211486 4253413 4247974 4268468 4349295 4324932 4360172 4357049 4279355 4284449 4199641 4218724
15537 4218724 4236830 4274692 4336729 4317621 4309268 4275553 4227999 4234310 4192379 4239782 4328195 4275177
15525 4275177 4283878 4214256 4158113 4273614 4243381 4220300 4348200 4262751 4255773 4226831 4261711
15514 4261711 4233401 4246692 4272287 4265650 4324419 4257075 4273387 4328658 4261451 4266039 4262820 4260215
15502 4260215 4173124 4176818 4310226 4477085 4516459 4438152 4242171 4276111 4277467 4273688 4239545
15491 4239545 4280245 4164443 4121503 4183233 4136226 4210773 4255238 4285338 4302945 4284686 4293194
15480 4293194 4256518 4306190 4361427 4295900 4291681 4256381 4246276 4367178 4317355 4282989 4271171
15469 4271171 4276513 4312987 4193043 4177572 4212301 4418082 4393132 4288799 4226525 4182691 4373317
15458 4373317 4350614 4413827 4412520 4350452 4330719 4301094 4328698 4313167 4346880 4345388 4263723 4116945
15446 4116945 4290253 4346549 4289768 4222131 4306475 4336129 4265841 4325319 4428286 4398874 4342675
15435 4342675 4326543 4323676 4333999 4277603 4279013 4246480 4215690 4208097 4234030 4392260 4373808 4258465
15423 4258465 4242113 4240060 4236858 4232041 4233049 4245375 4215147 4233357 4328608 4334077 4278673 4251600
15411 4251600 4201388 4162377 4176416 4132488 4258677 4377695 4423002 4402926 4365238 4337834 4391733
15400 4391733 4307564 4191612 4222500 4317690 4330007 4383915 4294228 4293210 4336942 4317726 4282269
15389 4282269 4237375 4197008 4236408 4315302 4346000 4314431 4284746 4263390 4271934 4195672 4124665
15378 4124665 4181916 4209298 4276347 4271192 4293302 4337078 4375564 4318722 4453030 4494601 4458471
15367 4458471 4404218 4359492 4382489 4437723 4328712 4277942 4315378 4383186 4376443 4470276 4385257
15356 4385257 4332888 4305803 4278035 4258392 4310632 4360368 4417791 4438267 4418908 4392135 4427384
15345 4427384 4452589 4394951 4334274 4324873 4408001 4419268 4389624 4418586 4393893 4408576 4368613
15334 4368613 4380708 4378520 4445732 4563967 4470183 4311129 4332111 4399593 4346061 4313595 4303270
15323 4303270 4301625 4360338 4314702 4330758 4285013 4290032 4289073 4348391 4381775 4387716 4382461 4312576
15311 4312576 4285996 4233627 4376911 4337687 4386237 4449499 4461273 4358566 4302476 4311982 4447103
15300 4447103 4361472 4377111 4351044 4349013 4425135 4438128 4396601 4372530 4281535 4240055 4371788
15289 4371788 4373657 4404742 4425659 4344511 4411989 4355290 4339166 4329332 4488848 4556841 4417561
15278 4417561 4392714 4326775 4343153 4406201 4333071 4326630 4392280 4381767 4286102 4433181 4445523
15267 4445523 4444271 4393172 4351020 4444009 4505184 4410459 4358128 4363334 4333627 4378610 4455727 4399101
15255 4399101 4299881 4374209 4312108 4221859 4320057 4372878 4414297 4450629 4386251 4422396 4426539
15244 4426539 4362873 4352890 4379535 4383801 4332723 4328399 4389000 4396281 4374003 4407504 4326885 4359217
15232 4359217 4505748 4469318 4444802 4488739 4373565 4339580 4396631 4329861 4358138 4336402 4373663
15221 4373663 4302802 4405196 4437902 4487156 4517407 4431243 4327862 4388794 4455657 4483770 4527705
15210 4527705 4389954 4462433 4485632 4429202 4544546 4516138 4444663 4380599 4411461 4364735 4385983
15199 4385983 4361192 4364521 4453895 4468952 4481366 4480993 4363144 4318622 4417078 4501951 4584581 4543340
15187 4543340 4427105 4453874 4323601 4334742 4430823 4511091 4492301 4407208 4430388 4496317 4386089
15176 4386089 4427867 4488760 4467267 4404138 4426938 4465154 4348226 4318456 4383243 4425736 4375073
15165 4375073 4383174 4404998 4460594 4447179 4480994 4426013 4367156 4357317 4461919 4547255 4520687
15154 4520687 4475301 4572154 4477969 4420856 4458192 4506849 4440075 4474267 4410054 4259809 4235617
15143 4235617 4364784 4381999 4407333 4497060 4494534 4480216 4436408 4511911 4533083 4513477 4425919
15132 4425919 4370460 4311209 4360542 4423250 4452724 4458878 4477185 4408091 4382632 4296037 4385171
15121 4385171 4461798 4498698 4404330 4380550 4440350 4435716 4510856 4522483 4430289 4456591 4512357
15110 4512357 4436533 4487883 4549341 4552758 4482735 4464641 4537820 4416652 4306166 4433492 4448895
15099 4448895 4431404 4369104 4472160 4519598 4547136 4589670 4582894 4487591 4423443 4357882 4408703
15088 4408703 4496984 4453743 4402307 4473916 4447544 4417286 4518889 4476660 4488940 4449563 4452395
15077 4452395 4512103 4513335 4512484 4400361 4425743 4511943 4619550 4552420 4393221 4346465 4459170
15066 4459170 4531894 4477958 4392334 4399784 4487360 4409336 4357284 4434641 4343886 4478057 4527306
15055 4527306 4520363 4518842 4425378 4493119 4512394 4560274 4536760 4533075 4531977 4521514 4473945 4448678
15043 4448678 4468675 4494143 4530651 4491608 4453086 4480182 4531092 4570526 4635810 4591758 4482202
15032 4482202 4519475 4437564 4432313 4593655 4630121 4510020 4474294 4445171 4466050 4494989 4432486
15021 4432486 4482788 4529655 4442422 4519064 4683391 4688619 4552145 4580297 4516537 4527002 4623419
15010 4623419 4600990 4533176 4402052 4473804 4532097 4508033 4532497 4569745 4588165 4606688 4474087
14999 4474087 4487895 4451523 4484832 4566641 4603161 4580956 4553419 4664544 4532312 4530420 4658715
14988 4658715 4651002 4557475 4464345 4475399 4616483 4659900 4650148 4568577 4524332 4666531 4608485
14977 4608485 4501314 4549522 4617205 4711054 4695008 4605724 4659796 4658292 4552510 4577885 4600440
14966 4600440 4519756 4526345 4526677 4530791 4474424 4488767 4542712 4455270 4410437 4433761 4514299 4376831
14954 4376831 4375513 4519860 4470474 4376274 4474457 4480311 4499453 4559351 4586489 4612168 4576826
14943 4576826 4601647 4491930 4406614 4511830 4663083 4662758 4627882 4602727 4571012 4520346 4433494
14932 4433494 4462215 4481708 4509339 4545643 4607089 4480591 4425081 4468702 4523814 4566894 4614501
14921 4614501 4477333 4528164 4607242 4593726 4610577 4636667 4599096 4545200 4508086 4574093 4548523
14910 4548523 4598623 4550774 4572925 4568872 4531639 4629308 4573659 4553452 4476205 4514279 4553136
14899 4553136 4585157 4445778 4508686 4444018 4415237 4525833 4609108 4592570 4614603 4578267 4534833
14888 4534833 4565476 4643614 4629701 4525623 4440355 4477202 4501720 4549542 4571499 4635605 4671907
14877 4671907 4564485 4558908 4614320 4642707 4657418 4635387 4606773 4594686 4602195 4559248 4685037
14866 4685037 4724883 4653631 4640867 4684685 4651547 4548262 4653314 4658276 4630574 4630381 4626178 4617504
14854 4617504 4648947 4533072 4444362 4552732 4641666 4604523 4571376 4572057 4488325 4586994 4646742
14843 4646742 4542833 4519213 4569954 4559296 4607152 4695038 4709195 4629101 4557294 4562560 4526540
14832 4526540 4633805 4660411 4529950 4613512 4749614 4755976 4644711 4630840 4609083 4584260 4537341
14821 4537341 4506796 4601768 4600411 4572321 4563087 4479292 4586680 4661276 4678914 4667127 4685087
14810 4685087 4690690 4660940 4637426 4669266 4635287 4597539 4599720 4561809 4513380 4559544 4587882 4556927
14798 4556927 4646400 4684594 4707746 4643671 4633476 4594206 4561058 4586602 4583225 4601544 4622123
14787 4622123 4577618 4516074 4543539 4549629 4564803 4617975 4639118 4579528 4657700 4669845 4607772
14776 4607772 4618664 4616117 4622370 4576713 4693734 4733112 4712429 4669367 4625757 4606893 4594680
14765 4594680 4562415 4614947 4614534 4676343 4678489 4620468 4657603 4768148 4674049 4655143 4680697 4672104
14753 4672104 4689395 4639804 4704158 4733400 4679301 4751212 4694395 4648760 4573245 4699405 4788760
14742 4788760 4667609 4655771 4584530 4580536 4697209 4692589 4734339 4693977 4707202 4635862 4583615
14731 4583615 4614857 4641713 4636649 4655582 4594876 4679416 4712017 4760599 4755841 4674219 4615768 4606811
14719 4606811 4611610 4696999 4718603 4701495 4773985 4750042 4752222 4763303 4737130 4726345 4721686 4652585
14707 4652585 4790147 4846556 4789995 4687351 4781671 4687936 4714290 4673666 4770642 4788181 4780331
14696 4780331 4726006 4663755 4693629 4657747 4604685 4635586 4651401 4688066 4672322 4638820 4644569
14685 4644569 4616308 4612284 4612982 4675845 4677695 4625732 4619381 4600347 4752534 4744025 4616546 4668152
14673 4668152 4837080 4736655 4719656 4654529 4677036 4806616 4696668 4640514 4601468 4732808
14663 4732808 4728184 4643657 4675746 4781352 4758088 4675698 4733273 4624294 4638164 4717872 4827685
14652 4827685 4735073 4685871 4682579 4590908 4630891 4628453 4775418 4796974 4815709 4807250 4800486 4731912
14640 4731912 4541160 4536315 4566656 4566086 4639968 4712342 4745082 4662931 4682463 4775481 4709460 4747448
14628 4747448 4687752 4648158 4719340 4781681 4825715 4762356 4880843 4757589 4738579 4748212 4806901
14617 4806901 4727952 4716779 4781651 4680237 4701175 4727582 4682489 4674614 4684421 4826929 4843404
14606 4843404 4709589 4703704 4737372 4828345 4770004 4695687 4686252 4771263 4800189 4716834 4758957
14595 4758957 4808237 4809049 4815081 4758250 4815605 4760003 4705907 4666717 4662518 4774980 4709429 4724212
14583 4724212 4830712 4760745 4662964 4689662 4809430 4757487 4760824 4850456 4816610 4697066 4582000
14572 4582000 4584701 4610122 4678243 4767858 4673321 4616231 4690188 4614669 4624692 4692014 4730239
14561 4730239 4673039 4730397 4772438 4768617 4746349 4829296 4882478 4822853 4872609 4874403 4780604 4717453
14549 4717453 4809604 4850634 4822564 4817672 4792386 4736991 4757652 4767136 4737853 4777322 4756915 4735134
14537 4735134 4788113 4832511 4831570 4780739 4750168 4835980 4848959 4796695 4853277 4773723 4736126 4681031
14525 4681031 4766731 4868206 4852193 4881784 4850983 4750171 4798351 4810403 4726522 4751419 4700220
14514 4700220 4686284 4722471 4747777 4731070 4658429 4646137 4733280 4695971 4796450 4854100 4863674
14503 4863674 4807353 4806310 4816022 4754492 4800032 4664662 4728748 4867455 4831590 4821315 4742799
14492 4742799 4790223 4790082 4755604 4794411 4769511 4800861 4842981 4835121 4812007 4777888 4839893 4796894
14480 4796894 4784143 4894435 4933004 4850533 4843602 4909657 4964941 4927170 4838917 4860564 4814924
14469 4814924 4807681 4702902 4785573 4845105 4774197 4740010 4671024 4743570 4867265 4861415 4807952
14458 4807952 4810600 4849325 4826289 4794054 4796198 4791366 4730367 4701376 4660431 4767247 4799598 4686250
14446 4686250 4807073 4901133 4832128 4768874 4811606 4809735 4747704 4776118 4794460 4696420 4679955
14435 4679955 4645102 4677765 4814368 4816291 4766300 4753683 4798710 4870058 4798695 4754948 4848495
14424 4848495 4838791 4871907 4842478 4848124 4815964 4744806 4781026 4882188 4918535 4840260 4844119 4948582
14412 4948582 4955585 4888167 4841063 4763540 4659933 4793574 4899669 4822794 4806376 4820495 4891626
14401 4891626 4912532 4866406 4808904 4762917 4832591 4882192 4806206 4788575 4769824 4790925 4850271
14390 4850271 4842788 4861113 4881608 4799351 4758470 4856714 4945906 4907999 4888500 4881880 4848942 4896430
14378 4896430 4892564 4826866 4795502 4843202 4925203 4805687 4765843 4823357 4846351 4908979 4891129
$$ [...]
##END NTUPLES=NMR SPECTRUM
##END=
