##TITLE=1H_CA-9444
 200.13Hz, DMSO-d6.
 8 sc
 
19.3.2026
##JCAMPDX= 6.0         $$ Bruker NMR JCAMP-DX V2.0
##DATA TYPE= NMR SPECTRUM
##DATA CLASS= NTUPLES
##ORIGIN= UXNMR, Bruker Analytische Messtechnik GmbH
##OWNER= pz
$$ XWIN-NMR		Version 3.5
$$ Thu Mar 19 13:32:56 2026 Russian Standard Time (UT+4h)  she@DPX200
##.OBSERVE FREQUENCY= 200.1313
##.OBSERVE NUCLEUS= ^1H
##.ACQUISITION MODE= SIMULTANEOUS
##.ACQUISITION SCHEME= undefined
##.AVERAGES= 8
##.DIGITISER RES= 18
##SPECTROMETER/DATA SYSTEM= spect
##.PULSE SEQUENCE= zg30
##.SOLVENT NAME= DMSO
##.SHIFT REFERENCE= (INTERNAL, DMSO, 0, 15.4836)
##AUDIT TRAIL= $$ (NUMBER, WHEN, WHO, WHERE, WHAT)
$$ ##TITLE= Audit trail, XWIN-NMR		Version 3.5
$$ ##JCAMPDX= 5.01
$$ ##ORIGIN= Bruker BioSpin GmbH
$$ ##OWNER= she
$$ F:/spectra/data/she/nmr/H-C/1/pdata/1/auditp.txt
$$ ##AUDIT TRAIL=  $$ (NUMBER, WHEN, WHO, WHERE, WHAT)
(   1,<2026-03-19 13:30:51.59 +0400>,<she>,<DPX200>,
      <created by zg, POWCHK disabled, PULCHK disabled
       configuration hash MD5:
       00 E9 B6 7A A2 85 ED C7 34 08 36 98 17 FE 4E 26
       data hash MD5: 16K
       57 38 F0 73 FC 51 8A F2 18 80 0F 86 B9 DF 93 B0>)
(   2,<2026-03-19 13:30:53.93 +0400>,<she>,<DPX200>,
      <Start of raw data processing
       efp BC_mod = 2 LB = 0.25 FT_mod = 6 PKNL = 1 PHC0 = -3703.985 PHC1 = 5.792301 SI = 16K 
       data hash MD5: 16K
       18 C1 C5 9F 15 EF 50 C4 22 D2 82 C4 2E 29 71 F1>)
(   3,<2026-03-19 13:31:18.48 +0400>,<she>,<DPX200>,
      <pk PHC0 = -6.97472 PHC1 = 14 
       data hash MD5: 16K
       92 D9 1A 51 50 A9 78 58 CE 74 6B 54 92 F5 88 EC>)
(   4,<2026-03-19 13:31:22.48 +0400>,<she>,<DPX200>,
      <abs ABSG = 5 
       data hash MD5: 16K
       14 EE 9B 16 C8 9B 8B 14 D4 D8 EA 0B FF E9 20 CE>)
$$ ##END=
$$ 
$$ hash MD5
$$ 30 71 69 31 C2 1B 28 B9 BB B0 88 01 7D 46 23 8A
##$RELAX= 
##$RELAX= 
##$RELAX= 
##$RELAX= 
##$RELAX= 
##$RELAX= 
$$ Bruker specific parameters
$$ --------------------------
##$DU= <F:/spectra>
##$EXPNO= 1
##$NAME= <H-C>
##$PROCNO= 1
##$TYPE= <nmr>
##$USER= <she>
##$AMP= (0..31)
100 100 100 100 100 100 100 100 100 100 100 100 100 100 100 100 100 100 
100 100 100 100 100 100 100 100 100 100 100 100 100 100 
##$AQSEQ= 0
##$AQ_mod= 1
##$AUNM= <au_zg>
##$AUTOPOS= <>
##$BF1= 200.13
##$BF2= 200.13
##$BF3= 200.13
##$BF4= 200.13
##$BF5= 200.13
##$BF6= 200.13
##$BF7= 200.13
##$BF8= 200.13
##$BYTORDA= 1
##$CFDGTYP= 0
##$CFRGTYP= 5
##$CHEMSTR= <none>
##$CNST= (0..31)
1 1 145 1 1 1 1 1 1 1 1 1 1 1 1 1 1 1 1 1 1 1 1 1 1 1 1 1 1 1 1 1 
##$CPDPRG= <>
##$CPDPRG1= <>
##$CPDPRG2= <>
##$CPDPRG3= <>
##$CPDPRG4= <mlev>
##$CPDPRG5= <mlev>
##$CPDPRG6= <mlev>
##$CPDPRG7= <mlev>
##$CPDPRG8= <mlev>
##$CPDPRGB= <>
##$CPDPRGT= <>
##$D= (0..31)
0 0.7 0 0 0 0 0 0 0 0 0 0.03 0 0 0 0 0 0 0 0 0 0 0 0 0 0 0 0 0 0 0 0 
##$DATE= 1773912650
##$DBL= (0..7)
120 120 120 120 120 120 120 120 
##$DBP= (0..7)
150 150 150 150 150 150 150 150 
##$DBP07= 0
##$DBPNAM0= <>
##$DBPNAM1= <>
##$DBPNAM2= <>
##$DBPNAM3= <>
##$DBPNAM4= <>
##$DBPNAM5= <>
$$ [...]
##$SUBNAM3= <"">
##$SUBNAM4= <"">
##$SUBNAM5= <"">
##$SUBNAM6= <"">
##$SUBNAM7= <"">
##$SUBNAM8= <"">
##$SUBNAM9= <"">
##$SW= 18.0517328524113
##$SWIBOX= (0..15)
0 0 2 0 0 0 0 0 0 0 0 0 0 0 0 0 
##$SW_h= 3612.71676300578
##$TD= 16384
##$TD0= 1
##$TE= 0
##$TE2= 300
##$TE3= 300
##$TEG= 300
##$TL= (0..7)
0 120 120 120 120 120 120 120 
##$TP= (0..7)
150 150 150 150 150 150 150 150 
##$TP07= 0
##$TPNAME0= <>
##$TPNAME1= <>
##$TPNAME2= <>
##$TPNAME3= <>
##$TPNAME4= <>
##$TPNAME5= <>
##$TPNAME6= <>
##$TPNAME7= <>
##$TPOAL= (0..7)
0.5 0.5 0.5 0.5 0.5 0.5 0.5 0.5 
##$TPOFFS= (0..7)
0 0 0 0 0 0 0 0 
##$TUNHIN= 0
##$TUNHOUT= 0
##$TUNXOUT= 0
##$USERA1= <user>
##$USERA2= <user>
##$USERA3= <user>
##$USERA4= <user>
##$USERA5= <user>
##$V9= 5
##$VALIST= <valist>
##$VCLIST= <CCCCCCCCCCCCCCC>
##$VD= 0
##$VDLIST= <DDDDDDDDDDDDDDD>
##$VPLIST= <PPPPPPPPPPPPPPP>
##$VTLIST= <TTTTTTTTTTTTTTT>
##$WBST= 1024
##$WBSW= 4
##$XGAIN= (0..3)
0 0 0 0 
##$XL= 0
##$YL= 0
##$YMAX_a= 255512
##$YMIN_a= -317747
##$ZGOPTNS= <>
##$ZL1= 120
##$ZL2= 120
##$ZL3= 120
##$ZL4= 120
##$ABSF1= 15.49127
##$ABSF2= -2.560579
##$ABSG= 5
##$ABSL= 3
##$ALPHA= 0
##$AQORDER= 0
##$ASSFAC= 0
##$ASSFACI= 0
##$ASSFACX= 0
##$ASSWID= 0
##$AUNMP= <proc_1d>
##$AZFE= 0.1
##$AZFW= 0.1
##$BCFW= 0
##$BC_mod= 2
##$BYTORDP= 0
##$COROFFS= 0
##$CY= -3
##$DATMOD= 1
##$DC= 0
##$DFILT= <>
##$DTYPP= 0
##$F1P= 0
##$F2P= 0
##$FCOR= 1
##$FTSIZE= 16384
##$FT_mod= 6
##$GAMMA= 0
##$GB= 0
##$INTBC= 1
##$INTSCL= 3.241238e-09
##$ISEN= 128
##$LB= 0.25
##$LEV0= 0
##$LPBIN= 0
##$MAXI= 10000
##$MC2= 0
##$MEAN= 0
##$ME_mod= 0
##$MI= 1.114404
##$NCOEF= 0
##$NC_proc= -7
##$NLEV= 6
##$NOISF1= 3.799351
##$NOISF2= 2.8
##$NSP= 0
##$NTH_PI= 0
##$NZP= 0
##$OFFSET= 15.48356
##$PC= 1
##$PHC0= -3710.96
##$PHC1= 19.7923
##$PH_mod= 1
##$PKNL= yes
##$PPARMOD= 0
##$PSCAL= 0
##$PSIGN= 0
##$REVERSE= no
##$SF= 200.130007633402
##$SI= 16384
##$SIGF1= 3
##$SIGF2= 2
##$SINO= 0.751879
##$SIOLD= 32768
##$SREGLST= <19F.Aceton>
##$SSB= 0
##$STSI= 16384
##$STSR= 0
##$SW_p= 3612.71676300578
##$SYMM= 0
##$S_DEV= 0
##$TDeff= 16384
##$TDoff= 0
##$TI= <>
##$TILT= no
##$TM1= 0
##$TM2= 0
##$TOPLEV= 0
##$USERP1= <user>
##$USERP2= <user>
##$USERP3= <user>
##$USERP4= <user>
##$USERP5= <user>
##$WDW= 1
##$XDIM= 16384
##$YMAX_p= 421894954
##$YMIN_p= -1623631
$$ End of Bruker specific parameters
$$ ---------------------------------
##NTUPLES= NMR SPECTRUM
##VAR_NAME=  FREQUENCY,     SPECTRUM/REAL,   SPECTRUM/IMAG
##SYMBOL=    X,             R,               I
##VAR_TYPE=  INDEPENDENT,   DEPENDENT,       DEPENDENT
##VAR_FORM=  AFFN,          ASDF,            ASDF
##VAR_DIM=   16384,         16384,           16384
##UNITS=     HZ,            ARBITRARY UNITS, ARBITRARY UNITS
##FACTOR=    0.220516191357247, 1,           1
##FIRST=     3098.72490263323, 0,            0
##LAST=      -513.991860372551, 0,           0
##MIN=       -513.991860372551, -1623631,    0
##MAX=       3098.72490263323, 421894954,    0
$$ Real data points
##PAGE= N=1
##DATA TABLE= (X++(R..R)), XYDATA
$$ [...]
$$ plain form
6835 -1232429 -1461597 -1338955 -1298484 -1529797 -1130431 -1238047 -1534615 -1560894 -1358342 -1359562
6825 -1359562 -1161495 -1123166 -1135151 -851849 -1111811 -1178555 -1000663 -1147726 -1149728 -1261406
6815 -1261406 -1281436 -1139779 -1392273 -1419086 -1380429 -1358204 -1254780 -1185307 -1322431 -1257981 -1017662
6804 -1017662 -718016 -846948 -778083 -748230 -981841 -1117177 -1217102 -876375 -1054119 -1303306
6794 -1303306 -1242184 -1269899 -1388037 -1486254 -1308297 -1267604 -1048305 -1053410 -1223534 -1023368 -766667
6783 -766667 -954994 -1254725 -1057464 -1015913 -1049260 -1029941 -913957 -1028552 -1033498 -1145533 -1174428
6772 -1174428 -992753 -1087020 -948306 -819038 -945661 -1048258 -1327220 -1225616 -737879 -825188
6762 -825188 -864788 -862491 -1116928 -1165710 -1096927 -1192088 -1011196 -988723 -1169808 -1157195 -1167217
$$ packed form
6835a232429k29168J22642M0471k31313L99366j07616k96568k6279K02552j220
6825a359562J98067L8329j1985K83302k59962o6744J77892j47063k002j11678
6815a261406k0030J41657k52494k6813L8657K2225J03424O9473j37124O4450K40319
6804a017662K99646j28932O8865K9853k33611j35336r9925L40727j77744k49187
6794a303306O1122k7715j18138r8217J77957M0693K19299n105j70124K00166K56701
6783g66667j88327k99731J97261M1551l3347J9319J15984j14595m946j12035k8895
6772a174428J81675r4267J38714J29268j26623j02597k78962J01604M87737q7309
6762h25188l9600K297k54437m8782O8783r5161J80892K2473j81085J2613j0022
$$ plain form
6751 -1167217 -1333170 -1284079 -1064043 -1193698 -1045620 -1149685 -1244214 -1162119 -969895 -1002631
6741 -1002631 -1239527 -1074536 -1219230 -1066293 -878204 -649206 -613211 -751362 -1183945 -1060437
6731 -1060437 -1037445 -1098409 -1078054 -1170269 -1435844 -1169247 -1146542 -1342803 -1389252 -1426128 -1168672
6720 -1168672 -1121906 -1253543 -1313163 -1029876 -922319 -918529 -1157997 -991458 -1263832 -1392786
6710 -1392786 -1166877 -1154546 -919382 -957043 -1144608 -1335489 -1223488 -995684 -1013924 -1178659
6700 -1178659 -1474740 -1319992 -1199606 -1104919 -1251039 -1277822 -1055820 -1055106 -1044228 -1098790 -921203
6689 -921203 -1022605 -1285132 -1163893 -1200303 -1222262 -1061407 -1143551 -1155452 -1181282 -1297884 -1348903
6678 -1348903 -1369765 -1150213 -932498 -961993 -1309103 -1150302 -1170201 -939686 -1016772 -1101155
$$ packed form
6751a167217j65953M9091K20036j29655J48078j04065r4529Q2095J92224l2736
6741a002631k36896J64991j44694J52937J88089K28998L5995j38151m32583J23508
6731a060437K2992o0964K0355r2215k65575K66597K2705j96261m6449l6876K57456
6720a168672M6766j31637n9620K83287J07557L790k39468J66539k72374j28954
6710a392786K25909J2331K35164l7661j87565j90881J12001K27804j8240j64735
6700a178659k96081J54748J20386R4687j46120k6783K22002P14J0878n4562J77587
6689i21203j01402k62527J21239l6410k1959J60855q2144j1901k5830j16602n1019
6678a348903k0862K19552K17715k9495l47110J58801j9899K30515p7086q4383
$$ plain form
6668 -1101155 -1017482 -1044618 -984940 -1185079 -1178801 -1348441 -1082028 -1111951 -1289856 -1086345 -1007155
6657 -1007155 -1124249 -1301031 -1157557 -1105063 -1232852 -1280317 -1363927 -1249771 -1205664 -1357400
6647 -1357400 -1504555 -1472816 -1154513 -1228739 -1168808 -1090820 -1229980 -1332990 -1302949 -1261446 -1223299
6636 -1223299 -1121825 -1059495 -1108017 -1059200 -1187323 -1280885 -1168540 -1231999 -1081081 -756899
6626 -756899 -742194 -768495 -565986 -785451 -946308 -1105831 -1029204 -985634 -1208190 -1012303
6616 -1012303 -1005431 -1122018 -1054014 -1183755 -1158194 -1255181 -1275321 -1294902 -1403393 -1285695 -1268494
6605 -1268494 -1565982 -1569459 -1306969 -1351960 -1178711 -1186020 -1374459 -1287622 -1082856 -951481 -933450
6594 -933450 -875405 -829161 -757577 -982244 -1158274 -1083666 -1153558 -1335790 -877865 -855348 -1153744
$$ packed form
6668a101155Q3673k7136N9678k00139O278j69640K66413k9923j77905K03511P9190
6657a007155j17094j76782J43474N2494j27789m7465q3610J14156M4107j51736
6647a357400j47155L1739L18303p4226N9931P7988j39160j03010L0041M1503L8147
6636a223299J01474O2330m8522M8817j28123r3562J12345o3459J50918L24182
6626g56899J4705k6301K02509k19465j60857j59523P6627M3570k22556J95887
6616a012303O872j16587O8004j29741K5561r6987k0140j9581j08491J17698J7201
6605a268494k97488l477K62490m4991J73249p309j88439Q6837K04766J31375J8031
6594i33450N8045M6244P1584k24667j76030P4608o9892j82232M57925K2517k98396
$$ plain form
6583 -1153744 -1048172 -934413 -780351 -748453 -1041333 -1229381 -1066648 -1198387 -1232811 -1097076
6573 -1097076 -1043739 -1053031 -875643 -995869 -1076986 -1179619 -1439457 -1329980 -1233554 -1319543 -1396777
6562 -1396777 -1422383 -1291270 -1384721 -1484323 -1373318 -1296414 -1254957 -1208010 -1268262 -1268162 -1078474
6551 -1078474 -819014 -898836 -1111191 -1345827 -1443754 -1330958 -1269783 -1270435 -1239748 -1218106 -1052283
6540 -1052283 -965329 -824913 -620777 -703661 -846328 -968406 -1026611 -988741 -1238352 -1338418
6530 -1338418 -1093198 -1129941 -1139836 -1028895 -931902 -1069877 -1127138 -1016891 -1097205 -1087279 -809935
6519 -809935 -926084 -1064224 -1265201 -1117612 -1064209 -1159595 -1175939 -1074555 -1061433 -1412870
6509 -1412870 -1490964 -1372721 -984077 -708811 -1095515 -1028392 -971057 -970434 -924557 -993653 -1163358
$$ packed form
6583a153744J05572J13759J54062L1898k92880j88048J62733j31739l4424J35735
6573a097076N3337r292J77388j20226q1117j02633k59838J09477R6426q5989p7234
6562a396777k5606J31113r3451r9602J11005P6904M1457M6947o0252J00J89688
6551a078474K59460p9822k12355k34636r7927J12796O1175o52L0687K1642J65823
6540a052283Q6954J40416K04136q2884j42667j22078n8205L7870k49611j00066
6530a338418K45220l6743r895J10941R6993j37975n7261J10247q0314R926K77344
6519h09935j16149j38140k00977J47589N3403r5386j6344J01384J3122l51437
6509a412870p8094J18243L88644K75266l86704O7123N7335O23M5877o9096j69705
$$ plain form
6498 -1163358 -1260936 -941925 -996537 -1270902 -1162683 -824302 -867236 -1065837 -919794 -785489
6488 -785489 -925156 -1138859 -1119499 -1014416 -967579 -670495 -931946 -1169233 -1101285 -944128
6478 -944128 -972509 -955342 -727639 -696563 -707343 -653613 -749030 -706737 -588207 -622682 -807834
6467 -807834 -667899 -734586 -945283 -785692 -864405 -729352 -782499 -663263 -562934 -760463
6457 -760463 -780243 -622196 -621935 -594715 -447402 -290658 -367913 -499857 -471106 -501094 -756385
6446 -756385 -747221 -705046 -399342 -523599 -859324 -871341 -708744 -766161 -552095 -378600 -590112
6435 -590112 -566892 -692736 -813431 -648794 -440351 -540947 -499836 -274691 -268167 -484716
6425 -484716 -242606 -391878 -498179 -654674 -738416 -808717 -451792 -297025 -480067 -640171
$$ packed form
6498a163358r7578L19011n4612k74365J08219L38381m2934j98601J46043J34305
6488g85489j39667k13703J9360J05083M6837K97084k61451k37287O7948J57157
6478i44128k8381J7167K27703L1076j0780N3730r5417M2293J18530l4475j85152
6467h07834J39935o6687k10697J59591p8713J35053n3147J19236J00329j97529
6457g60463j9780J58047K61K7220J47313J56744p7255j31944K8751k9988k55291
6446g56385R164M2175L05704j24257l35725j2017J62597n7417K14066J73495k11512
6435e90112K3220j25844j20695J64637K08443j00596M1111K25145O524k16549
6425d84716K42110j49272j06301j56495q3742p0301L56925J54767j83042j60104
$$ plain form
6415 -640171 -836602 -637377 -321329 -188731 -140137 -247368 -277317 -369603 -572598 -512104
6405 -512104 -346123 -336420 -576564 -672659 -485125 -515733 -181968 -223857 -241395 -223539 -402563
6394 -402563 -108328 -109429 -433788 -535851 -205713 -152476 -260579 -484172 -451805 -239964
6384 -239964 -198305 -137279 -299898 -375833 -305934 -224305 -207555 -252083 -385133 -431807 -157904
6373 -157904 -86741 -182043 -161244 -252547 -319677 -296282 -67219 102569 -222560 -345039 -143487
6362 -143487 -270261 -157783 52191 115109 79532 141662 112815 174135 307444 119662 154436
6351 154436 300479 269632 171537 356737 161818 70491 28539 223423 115822 47356 56807
6340 56807 29982 103972 178983 -168842 -117773 77945 79560 112276 44080 -83672 -179155
$$ packed form
6415f40171j96431J99225L16048J32598M8594j07231k9949r2286k02995O0494
6405e12104J65981R703k40144r6095J87534l0608L33765m1889j7538J7856j79024
6394d02563K94235j101l24359j02063L30138N3237j08103k23593L2367K11841
6384b39964M1659O1026j62619p5935O9899Q1629J6750m4528j33050m6674K73903
6373a57904P1163r5302K0799r1303o7130K3395K29063J69788l25129j22479K01552
6362a43487j26774J12478K09974O2918l5577O2130k8847O1320J33309j87782L4774
6351A54436J46043l0847r8095J85200j94919r1327m1952J94884j07601o8466R451
6340E6807k6825P3990P5011l47825N1069J95718J615L2716o8196j27752r5483
$$ plain form
6329 -179155 -38995 -13479 126806 313965 299597 116648 -1667 -10142 112098 157032 119477
6318 119477 -69697 -360933 -481919 -337778 -326078 -52430 33830 52118 21946 -81075
6308 -81075 19306 96556 119762 273721 377617 331798 362222 247414 134762 221769 170707
6297 170707 307306 174679 -51430 171699 187936 121613 242224 58920 273898 333868
6287 333868 53802 100268 46197 -45594 117890 228867 275043 338283 223463 204992 46820
6276 46820 338051 405346 588385 628408 601329 326297 254226 408162 460010 453877 598732
6265 598732 605872 437146 619716 622611 455124 636243 739465 586811 644200 585362 705566
6254 705566 588122 234318 275635 493595 511109 529162 526184 718810 878124 845012 696710
$$ packed form
6329a79155J40160K5516J40285J87159j4368j82949j18315q475J22240M4934l7555
6318A19477j89174k91236j20986J44141J1700K73648Q6260J8288l0172j03021
6308h1075J00381P7250K3206J53959J03896m5819L0424j14808j12652Q7007n1062
6297A70707J36599j32627k26109K23129J6237o6323J20611j83304K14978N9970
6287C33868k80066M6466n4071r1791J63484J10977M6176O3240j14820j8471j58172
6276D6820K91231O7295J83039M0023k7079k75032p2071J53936N1848o133J44855
6265E98732P140j68726J82570K895j67487J81119J03222j52654N7389n8838J20204
6254G05566j17444l53804M1317K17960J7514J8053k978J92626J59314l3112j48302
$$ plain form
6243 696710 759145 714281 952582 1068194 754136 860868 872979 815357 932353 1144591
6233 1144591 1199693 1238673 1178001 1145088 1194056 1202873 1306946 1213579 1075170 1204618 1231552
6222 1231552 1280444 1167390 1259423 1329160 1108425 1348274 1451811 1384029 1339002 1455439
6212 1455439 1651707 1679139 1661477 1570138 1561997 1600247 1748337 1666781 1634215 1816538 1937410
6201 1937410 1773138 1769527 1899497 1982117 2249703 2178494 2350987 2462254 2498308 2449891 2490150
6190 2490150 2470411 2636454 2885167 2985255 2732867 2972331 3035565 3129618 2917708 3134773
6180 3134773 3447425 3690705 3606695 3538214 3741034 3647740 3890129 3929279 4350379 4325480
6170 4325480 4129268 4248114 4614758 4593487 4945560 5311080 5397714 5415165 5362026 5724309
$$ packed form
6243F96710O2435m4864K38301J15612l14058J06732J2111n7622J16996K12238
6233A144591N5102L8980o0672l2913M8968Q817J04073r3367j38409J29448K6934
6222A231552M8892j13054R2033O9737k20735K39849J03537o7782m5027J16437
6212A455439J96268K7432j7662r1339q141L8250J48090q1556l2566J82323J20872
6201A937410j64272l611J29970Q2620K67586p1209J72493J11267L6054m8417M0259
6190B490150j9739J66043K48713J00088k52388K39464O3234R4053k11910K17065
6180C134773L12652K43280q4010o8481K02820r3294K42389L9150M21100k4899
6170D325480j96212J18846L66644k1271L52073L65520Q6634J7451n3139L62283
$$ plain form
6160 5724309 5916660 6044453 6265450 6413474 6818307 7180986 7692603 8224915 8579655 9114862
6150 9114862 9547433 10143255 10412489 11007147 11718515 12315911 13044309 13366144 14307168 15162261
6140 15162261 15904004 17064691 18207383 19098792 20010512 21428865 22328804 23099383 23859256
6131 23859256 24547633 25590268 26094269 26340441 26885416 27551534 28225438 28972728 30076737
6122 30076737 31365482 32447301 33493639 34661457 35623338 36097980 36590900 36647066 36421598
6113 36421598 35699036 34617733 33842036 33299833 32715121 32239147 31892972 31626229 31373670
6104 31373670 31331073 31388102 31449795 31713402 32144081 32583130 32972185 33174437 33520640 33933199
6094 33933199 34528788 35178901 35843979 36526195 37009512 37338400 37944230 38577980 39368706
$$ packed form
6160E724309J92351J27793K20997J48024M04833L62679N11617N32312L54740N35207
6150I114862M32571N95822K69234N94658P11368N97396P28398L21835R41024Q55093
6140A5162261P41743J160687J142692Q91409R11720J418353Q99939P70579P59873
6131B3859256O88377J042635N04001K46172N44975O66118O73904P47290J104009
6122C0076737J288745J081819J046338J167818R61881M74642M92920N6166k25468
6113C6421598p22562j081303p75697n42203n84712m75974l46175k66743k52559
6104C1373670m2597N7029O1693K63607M30679M39049L89055K02252L46203M12559
6094C3933199N95589O50113O65078O82216M83317L28888O05830O33750P90726
$$ plain form
6085 39368706 40055611 40371309 40951267 41936798 42502504 43298049 44224445 45196857 46520566
6076 46520566 47463024 49047097 50525299 51930782 54010652 56105919 58461713 61294289
6068 61294289 63947650 66519321 68571775 70301781 71742836 72219507 71760275 70705931
6060 70705931 69226555 67556077 65807567 64031081 62296618 60805699 59533083 58117531
6052 58117531 57209710 56634455 56171127 55348277 53998781 52878119 51769757 50308083 48714277
6043 48714277 47288826 45759294 43913345 42324366 40925493 39453255 38413320 37420523
6035 37420523 36535212 35801798 35346142 35101194 34575081 34459877 34603851 34687989 34853121 35351769
6025 35351769 36368035 37384221 38682719 40065785 41400212 42832349 43830963 44975477
$$ packed form
6085C9368706O86905L15698N79958R85531N65706P95545R26396R72412J323709
6076D6520566R42458J584073J478202J405483K079870K095267K355794K832576
6068F1294289K653361K571671K052454J730006J441055M76671m59232j054344
6060G0705931j479376j670478j748510j776486j734463j490919j272616j415552
6052E8117531r07821n75255m63328q22850j349496j120662j108362j461674j593806
6043D8714277j425451j529532j845949j588979j398873j472238j039935r92797
6035C7420523q85311p33414m55656k44948n26113j15204J43974Q4138J65132M98648
6025C5351769J016266J016186J298498J383066J334427J432137R98614J144514
$$ plain form
6017 44975477 45666419 45926238 45675798 44797050 43097963 41230006 39424545 36859419 34954826
6008 34954826 32539363 30444839 28807686 27081541 25376951 24052211 22824306 21811022
6000 21811022 20827576 20081411 19635260 19161346 18666421 18579226 18451040 18174637 18021746 18092290
5990 18092290 18141014 18397116 19058277 19425436 19727621 20096136 20732802 21392312 22089190 22972378
5980 22972378 23745698 24294434 24745185 25052150 25016818 24579246 24086378 23210088 22242657 21323938
5970 21323938 19880785 18862131 17787959 16640889 15714403 14885254 14305768 13739918 13363986
5961 13363986 13045066 12829771 12632836 12765649 13048612 13190856 13547862 14296733 14773691
5952 14773691 15413934 16214711 16951362 17875911 18567695 18754091 18591274 18288850 17902994
$$ packed form
6017D4975477O90942K59819k50440q78748j699087j867957j805461k565126j904593
6008C4954826k415463k094524j637153j726145j704590j324740j227905j013284
6000B1811022r83446p46165m46151m73914m94925q7195j28186k76403j52891P0544
5990A8092290M8724K56102O61161L67159L02185L68515O36666O59510O96878Q83188
5980B2972378P73320N48736M50751L06965l5332m37572m92868q76290r67431r18719
5970B1323938j443153j018654j074172j147070r26486q29149n79486n65850l75932
5961A3363986l18920k15295j96935J32813K82963J42244L57006P48871M76958
5952A4773691O40243Q00777P36651R24549O91784J86396j62817l02424l85856
$$ plain form
5943 17902994 17004157 15749378 14587486 13926831 12723659 11651525 10574637 10073851 9621757
5934 9621757 8994588 8442571 8100764 7905198 7575337 7142737 6910878 6921333 7055033 6568085
5924 6568085 6334699 6141471 6187807 6110005 6165363 6526179 6258684 6368013 6686702 6895246
5914 6895246 7211250 7783377 7630289 7737632 8051104 8393529 8573115 8394121 8159924 7853959
5904 7853959 7381369 6837689 6192332 5731816 5267040 4838474 4402644 4204406 4084857 3627630
5894 3627630 3443738 3445014 3014682 2937493 2879789 2675203 2490768 2492379 2445309 2474338 2195746
5883 2195746 2120016 1937287 1832709 1847439 1695079 2014444 1791469 1905407 1700344 1429212
5873 1429212 1655637 1538672 1508519 1633596 1619317 1588616 1482681 1278303 1348520 1336197
$$ packed form
5943A7902994q98837j254779j161892o60655j203172j072134j076888n00786m52094
5934I621757o27169n52017l41807j95566l29861m32600k31859J0455J33700m86948
5924F568085k33386j93228M6336p7802N5358L60816k67495J09329L18689K08544
5914F895246L16004N72127j53088J07343L13472L42425J79586j78994k34197l05965
5904G853959m72590n43680o45357m60516m64776m28566m35830j98238j19549m57227
5894C627630j83892J276m30332p7189n7704k04586j84435J611m7070K9029k78592
5883B195746p5730j82729j04578J4730j52360L19365k22975J13938k05063k71132
5873A429212K26425j16965l0153J25077j4279l0701j05935k04378P0217j2323
$$ plain form
5863 1336197 1448187 1272196 1565147 1453677 1137231 1200836 1266551 1233021 899324 1139056
5853 1139056 1180020 1079702 869241 763748 898802 1060490 1066061 1114809 1111771 1099747 1113730
5842 1113730 1016533 1176757 896585 955599 869794 919834 1034442 1084854 1082544 983727 1004161
5831 1004161 977171 1082898 945250 1037290 1007003 1051489 1007769 1013630 1053080 1140471 1143226
5820 1143226 1097087 900483 1190647 1316056 1279006 1578797 1464076 1401960 1553669 1552594
5810 1552594 1555047 1743441 1822686 1918679 1888659 1886655 1946383 1863018 1804408 1741745 1779127 1987298
5798 1987298 2011054 2044413 2459973 2538029 2329908 2318455 2443840 2532391 2851951 2946519 2929620
5787 2929620 3233700 3175436 3310813 3341889 3571400 4033169 4441671 4656651 4933108 5480303
$$ packed form
5863A336197J11990j75991K92951j11470l16446O3605O5715l3530l33697K39732
5853A139056M0964j00318k10461j05493J35054J61688N571M8748l038j2024J3983
5842A113730r7197J60224k80172N9014q5805N0040J14608N0412k310r8817K0434
5831A004161k6990J05727j37648R2040l0287M4486m3720N861L9450Q7391K755
5820A143226m6139j96604K90164J25409l7050K99791j14721o2116J51709j075
5810A552594K453J88394P9245R5993l0020k004N9728q3365n8610o2663L7382K08171
5798A987298K3756L3359M15560P8056k08121j1453J25385Q8551L19560R4568j6899
5787B929620L04080n8264J35377L1076K29511M61769M08502K14980K76457N47195
$$ plain form
5777 5480303 5903874 6063285 6489006 7204598 7632571 8280667 9161035 9875419 10794145 12141333
5767 12141333 13541470 15391215 17615951 20669139 25262562 32159857 42667133 58316193
5759 58316193 76040232 88273170 88286734 76438907 58045798 41803898 30853366 23394280
5751 23394280 18330258 14793516 12097670 10078359 8575510 7197021 6372902 5676039
5743 5676039 4993520 4535281 4232373 4074298 3855733 3716479 3504348 3403301 3357921 3046889
5733 3046889 2821737 2896607 2823419 2710981 2246230 2340368 2586246 2466658 2182085 1927719
5723 1927719 1923283 1734908 1703751 1442266 1715352 1640277 1791068 1661560 1713000 1544910
5713 1544910 1516197 1751907 1558463 1370689 1352846 1157125 1272314 1214567 1292050 1417521
$$ packed form
5777E480303M23571J59411M25721P15592M27973O48096Q80368P14384R18726J347188
5767A2141333J400137J849745K224736L053188M593423O897295J0507276J5649060
5759E8316193J7724039J2232938J3564j1847827j8393109j6241900j0950532p459086
5751B3394280n064022l536742k695846k019311j502849j378489q24119o96863
5743E676039o82519m58239l02908j58075k18565j39254k12131j01047m5380l11032
5733C046889k25152P4870p3188j12438m64751R4138K45878j19588k84573k54366
5723A927719m436j88375l1157k61485K73086p5075J50791j29508N1440j68090
5713A544910k8713K35710j93444j87774j7843j95721J15189n7747P7483J25471
$$ plain form
5703 1417521 1131283 1303799 1401135 1386578 1598691 1287881 1427692 1445285 1357702 1127464
5693 1127464 709803 793154 1035719 1032471 1056786 911972 995645 1108136 780232 903722
5683 903722 865350 787506 974912 1019850 1021207 956583 868967 788795 500485 555672 918272
5672 918272 934265 832736 747882 1052588 1261094 1054401 838465 680118 566778 539919
5662 539919 742650 645912 516998 327263 210568 349791 429938 451234 602718 634172
5652 634172 643846 698504 696125 732806 759214 718347 738941 438809 462782 523534 580441 628975
5640 628975 521620 377536 472676 263648 441952 500566 576629 510065 330529 291336 350622
5629 350622 280878 147163 225992 241812 321850 171264 127573 222492 441206 517110 552849
$$ packed form
5703A417521k86238J72516R7336j4557K12113l10810J39811J7593q7583k30238
5693A127464m17661Q3351K42565l248K4315j44814Q3673J12491l27904J23490
5683I03722l8372p7844J87406M4938J357o4624q7616q0172k88310N5187L62600
5672I18272J5993j01529q4854L04706K08506k06693k15936j58347j13340k6859
5662E39919K02731r6738j28914j89735j16695J39223Q0147K1296J51484L1454
5652F34172R674N4658k379L6681K6408m0867K0594l00132K3973O0752N6907M8534
5640F28975j07355j44084R5140k09028J78304N8614P6063o6564j79536l9193N9286
5629C50622o9744j33715P8829J5820Q0038j50586m3691R4919K18714P5904L5739
$$ plain form
5618 552849 359498 254847 292118 472872 546436 900244 862818 360471 488085 504269
5608 504269 609330 561848 622889 501899 381815 280955 392038 499373 503158 583191 395546
5597 395546 406905 614967 546680 560240 549525 721329 913544 692963 487413 788196
5587 788196 821710 749761 652790 473986 519429 581909 673801 677598 472349 566954 715342
5576 715342 754509 944069 995012 844458 786076 949629 794121 732434 866846 766093
5566 766093 729465 656764 630190 557131 385014 694141 548798 599745 641521 734149 606399
5555 606399 942761 809727 531547 555452 678598 621504 767759 757444 512125 567238
5545 567238 624448 908258 850597 781878 824519 731708 705338 544773 616901 847611 841727
$$ packed form
5618E52849j93351j04651L7271J80754P3564L53808l7426n02347J27614J6184
5608E04269J05061m7482O1041j20990j20084j00860J11083J07335L785Q0033j87645
5597C95546J1359K08062o8287J3560j0715J71804J92215k20581k05550L00783
5587G88196L3514p1949r6971j78804M5443O2480R1892L797k05249R4605J48388
5576G15342L9167J89560N0943j50554n8382J63553j55508o1687J34412j00753
5566G66093l6628p2701k6574p3059j72117L09127j45343N0947M1776R2628j27750
5555F06399L36362j33034k78180K3905J23146n7094J46255j0315k45319N5113
5545E67238N7210K83810n7661o8719M2641r2811k6370j60565P2128K30710n884
$$ plain form
5534 841727 774834 740515 994957 898063 1070473 1006848 727431 888333 793529 926112 694714
5523 694714 855863 728930 539080 943513 1143418 1018353 839507 893921 929039 840492
5513 840492 665667 746229 724405 854169 933526 808975 759465 938837 1249670 1181815 933628
5502 933628 905122 791565 849355 762081 776676 781488 728673 982651 1009288 740444 555675
5491 555675 951756 1142574 1239119 1232259 995947 1059479 1171444 1199812 1299880 1327279 1190642
5480 1190642 1202069 1269931 1387210 1432467 1415043 1255087 1316710 1135089 1208970 1271035 1150854
5469 1150854 1283897 1265453 1133248 1342946 1257989 1212682 1109329 1213563 1349439 1283677
5459 1283677 1133556 1222708 1393579 1447415 1545279 1390717 1338330 1312990 1340803 1329170 1477606
$$ packed form
5534H41727o6893l4319K54442r6894J72410o3625k79417J60902r4804J32583k31398
5523F94714J61149j26933j89850M04433J99905j25065j78846N4414L5118q8547
5513H40492j74825Q0562k1824J29764P9357j24551m9510J79372L10833o7855k48187
5502I33628k8506j13557N7790q7274J4595M812n2815K53978K6637k68844j84769
5491E55675L96081J90818R6545o860k36312O3532J11965K8368J00068K7399j36637
5480A190642J1427O7862J17279M5257j7424j59956O1623j81621P3881O2065j20181
5469A150854J33043j8444j32205K09698q4957m5307j03353J04234J35876o5762
5459A283677j50121Q9152J70871N3836R7864j54562n2387k5340K7813j1633J48436
$$ plain form
5448 1477606 1289206 1406999 1397376 1285711 1375488 1522957 1602412 1635899 1491168 1582820 1706597
5437 1706597 1583794 1593333 1430016 1688659 1701039 1781291 2121396 2098283 2007037 1873347 1968402
5426 1968402 1820356 1732468 1728361 1719017 1509191 1419793 1452093 1375506 1418297 1488291 1575436
5415 1575436 1607228 1692850 1554706 1806466 2012320 2037500 1900580 1982493 1784349 2030689
5405 2030689 2044481 1921491 1853804 1954298 2096075 1808833 2060566 2022956 1911889 1853378
5395 1853378 2035876 2060171 2025553 2040934 2204638 2138920 1982145 2018759 1985160 1828062 1654000
5384 1654000 1823673 1804221 1871236 1841261 2033025 2059544 1944079 1884722 2021984 2262132
5374 2262132 2138469 1877618 2085014 2130101 1781032 1904491 1854768 2003123 2083209 2106977
$$ packed form
5448A477606j88400J17793r623j11665Q9777J47469P9455L3487j44731R1652J23777
5437A706597j22803R539j63317K58643J2380Q0252L40105k3113r1246j33690R5055
5426A968402j48046q7888m107r344k09826q9398L2300p6587M2791O9994Q7145
5415A575436L1792Q5622j38144K51760K05854K5180j36920Q1913j98144K46340
5405B030689J3792j22990o7687J00494J41777k87242K51733l7610j11067n8511
5395A853378J82498K4295l4618J5381J63704o5718j56775L6614l3599j57098j74062
5384A654000J69673j9452O7015k9975J91764K6519j15465n9357J37262K40148
5374B262132j23663k60851K07396M5087l49069J23459m9723J48355Q0086K3768
$$ plain form
5364 2106977 2207542 2000786 1997875 1996063 2002817 2235116 2032764 2022163 1960268 1934546 1926610
5353 1926610 2265130 2604329 2486046 2229586 2153579 2008688 2006840 1880169 1878563 1958271 2035603
5342 2035603 2220368 2223873 2153094 1943520 2011518 2313737 1999515 2029322 2228908 2211551 2152574
5331 2152574 2228299 2311360 1985494 2216979 2329217 2498549 2369905 2318169 2608651 2358934
5321 2358934 2305312 2249743 2504857 2697395 2474169 2419297 2496550 2213536 2231155 2422328
5311 2422328 2235798 2488550 2526119 2537693 2420370 2552825 2749423 2715629 2647303 2717059
5301 2717059 2506658 2438654 2320300 2427419 2802743 2936235 2609238 2597780 2757125 2798866
5291 2798866 2903479 3021592 2930803 2946995 2915008 2810767 2775495 2908124 2767684 2735138
$$ packed form
5364B106977J00565k06756k911j812O754K32299k02352j0601o1895k5722p936
5353A926610L38520L39199j18283k56460p6007j44891j848j26671j606P9708P7332
5342B035603J84765L505p0779k09574O7998L02219l14222K9807J99586j7357n8977
5331B152574P5725Q3061l25866K31485J12238J69332j28644n1736K90482k49717
5321B358934n3622n5569K55114J92538k23226n4872P7253k83014J7619J91173
5311B422328j86530K52752L7569J1574j17323J32455J96598l3794o8326O9756
5301B717059k10401o8004j18354J07119L75324J33492l26997j1458J59345M1741
5291B798866J04613J18113r0789J6192l1987j04241l5272J32629j40440l2546
$$ plain form
5281 2735138 3008878 2768750 2799481 2993441 3005539 2975198 3282176 3333322 3217330 2876549
5271 2876549 2955607 3181572 3278747 3415309 3437169 3569891 3621701 3745117 3819667 3552603
5261 3552603 3476202 3284769 3377981 3459352 3596007 3567593 3288011 3618780 3788362 3824468
5251 3824468 3877686 3848760 3790450 3705542 3806608 4105599 4033340 4041643 4186948 4303772 4059354
5240 4059354 3948361 4039526 3771632 3608816 3782647 4098796 4135290 4044472 4032283 4372825
5230 4372825 4136474 3999616 3938433 3867996 4251002 4431523 4337469 4515697 4605513 4454584
5220 4454584 4559755 4896731 4839953 4744852 4889990 4973793 4992164 4883832 4573763 4514417
5210 4514417 4766641 4992511 5202061 5123928 5253443 5301184 5424949 5425929 5392652 5635156 5826660
$$ packed form
5281B735138K73740k40128L0731J93960J2098l0341L06978N1146j15992l40781
5271B876549P9058K25965R7175J36562K1860J32722N1810J23416P4550k67064
5261C552603p6401j91433R3212Q1371J36655k8414k79582L30769J69582L6106
5251C824468N3218k8926n8310q4908J01066K98991p2259Q303J45305J16824k44418
5240D059354j10993R1165k67894j62816J73831L16149L6494r0818j2189L40542
5230D372825k36351j36858o1183p0437L83006J80521r4054J78228Q9816j50929
5220D454584J05171L36976n6778r5101J45138Q3803J8371j08332l10069n9346
5210D514417K52224K25870K09550p8133J29515M7741J23765R80l3277K42504J91504
$$ plain form
5199 5826660 6007626 6020781 6134214 6144587 6383274 6623580 6670641 6814002 6737873 6680867
5189 6680867 6961540 7215920 7139586 7269541 7668306 7890113 7924165 8227003 8395321 8583351
5179 8583351 8723243 9116562 9451116 9863111 10303052 10375609 10754022 11208221 11540856 12017142
5169 12017142 12585603 13204168 13878584 14652052 15501832 16356016 17203697 18284333 19405674
5160 19405674 20500854 21636329 22653901 23871498 24941998 25967807 27134779 27636210
5152 27636210 28202029 28496023 28882961 29181709 29077320 29024292 29064308 28671410 27838176 27071880
5142 27071880 25996201 25064450 24093436 23247708 22366110 21283593 20317610 19483589 18720493
5133 18720493 18375922 18051635 17352252 16535743 16193566 15795592 15839553 15951646 15941492 15877094
$$ packed form
5199E826660J80966J3155J13433J0373K38687K40306M7061J43361p6129n7006
5189F680867K80673K54380p6334J29955L98765K21807L4052L02838J68318J88030
5179H583351J39892L93319L34554M11995M39941P2557L78413M54199L32635M76286
5169A2017142N68461O18565O74416P73468Q49780Q54184Q47681J080636J121341
5160A9405674J095180J135475J017572J217597J070500J025809J166972N01431
5152B7636210N65819K93994L86938K98748j04389n3028M0016l92898q33234p66296
5142B7071880j075679r31751r71014q45728q81598j082517r65983q34021p63096
5133A8720493l44571l24287o99383q16509l42177l97974M3961J12093j0154o4398
$$ plain form
5123 15877094 16101372 16348566 16734228 17058873 17618258 18160959 18684576 19376486 19940265
5114 19940265 20645696 21106002 22270484 23470118 24698722 25996761 27421427 28898318
5106 28898318 30558079 32249434 33656376 34948594 36173191 37267210 38173282 38785647
5098 38785647 39193628 39239473 39507909 39458524 38865762 38225259 37509971 36773535 35781895 34854630
5088 34854630 33450859 31739387 30482737 29112284 27459349 25861119 24319659 22633013
5080 22633013 21122761 19830187 18455713 17299195 16311105 15308352 14292133 13759006
5072 13759006 13242248 12385549 11910398 11832057 11279812 10828762 10407511 9985333 9557084 9244221
5062 9244221 9082932 9054076 8892021 8606095 8490847 8139119 8041256 8095868 7986419 7914439
$$ packed form
5123A5877094K24278K47194L85662L24645N59385N42701N23617O91910N63779
5114A9940265P05431M60306J164482J199634J228604J298039J424666J476891
5106B8898318J659761J691355J406942J292218J224597J094019R06072O12365
5098C8785647M07981M5845K68436m9385n92762o40503p15288p36436r91640r27265
5088C4854630j403771j711472j256650j370453j652935j598230j541460j686646
5080B2633013j510252j292574j374474j156518r88090j002753j016219n33127
5072A3759006n16758q56699m75151p8341n52245m51050m21251m22178m28249l12863
5062I244221j61289k8856j62055k85926j15248l51728r7863N4612j09449p1980
$$ plain form
5052 7914439 7812144 7535366 7382020 7140943 6978189 6845875 6984453 6923445 6853710 6761638
5042 6761638 6634393 6505790 6457197 6566786 6774651 6729324 6527449 6524823 6404865 6315312
5032 6315312 6151739 6124450 6259783 6064920 6026101 6081329 6113264 6247138 6299706 6127000
5022 6127000 6283919 6247671 6239222 6065220 6154076 6219746 6167672 6276206 6366006 6323493 6457760
5011 6457760 6883759 6657662 6540222 6771590 6869080 6783028 7026126 7065347 7285599 7107188
5001 7107188 7529526 7838071 8412795 8879113 9086264 9218468 8915196 8413154 8204037 8031474
4991 8031474 8131302 7987525 7917974 8123757 8163451 8229803 8267615 8413380 8599870 8764707
4981 8764707 8841049 8944833 8879267 8865887 8923042 9301159 9668112 9832019 10056257 10533314
$$ packed form
5052G914439j02295k76778j53346k41077j62754j32314J38578o1008o9735r2072
5042F761638j27245j28603m8593J09589K07865m5327k01875k626j19958q9553
5032F315312j63573k7289J35333j94863l8819N5228L1935J33874N2568j72706
5022F127000J56919l6248q449j74002Q8856O5670n2074J08534Q9800m2513J34267
5011F457760M25999k26097j17440K31368R7490q6052K43098L9221K20252j78411
5001G107188M22338L08545N74724M66318K07151J32204l03272n02042k09117j72563
4991H031474R9828j43777o9551K05783L9694O6352L7812J45765J86490J64837
4981H764707P6342J03784o5566j3380N7155L78117L66953J63907K24238M77057
$$ plain form
4971 10533314 10732755 10888011 11209573 11426243 11639132 12159012 12620197 13233224 13587784
4962 13587784 13777406 14012830 14434164 15185838 15559786 15876147 16362633 16918603 17447536
4953 17447536 17996830 18447747 19177567 19960012 20364293 21288288 22371033 23118307 24006759
4944 24006759 25151621 26392991 27527955 28772750 30061973 31265021 32681749 33583588
4936 33583588 34540551 35174918 35562270 35731611 35545754 35310541 35024599 34363993 33485824
4927 33485824 32734409 31988646 31149275 29950947 29110954 28416556 28037107 27610740 26949965
4918 26949965 26420013 26179223 26286182 26552057 26715422 26906420 27298978 27795623 28303216
4909 28303216 28777447 29539426 30156564 31098808 31980027 32906825 34020196 35108822 36311771
$$ packed form
4971A0533314J99441J55256L21562K16670K12889N19880M61185O13027L54560
4962A3587784J89622K35424M21334P51674L73948L16361M86486N55970N28933
4953A7447536N49294M50917P29820P82445M04281R23995J082745P47274Q88452
4944B4006759J144862J241370J134964J244795J289223J203048J416728R01839
4936C3583588R56963O34367L87352J69341j85857k35213k85942o60606q78169
4927C3485824p51415p45763q39371j198328q39993o94398l79449m26367o60775
4918B6949965n29952k40790J06959K65875J63365J90998L92558M96645N07593
4909B8303216M74231P61979O17138R42244Q81219R26798J113371J088626J202949
$$ plain form
4900 36311771 37597422 38922427 40395093 41453260 42705264 43670153 44575564 45418675 46078026
4891 46078026 46716278 47390202 47823345 48201751 48490232 48771186 48911044 49299789 49560112
4882 49560112 49577732 49765429 49602441 49648486 49504974 49201537 48355041 47734564 47399784 47116068
4872 47116068 46738120 46598744 46345975 46347572 46743648 47169361 47879274 48541037 49069067 50130160
4862 50130160 51147625 52135012 53054624 53844938 53966428 53659589 53399630 53125049 52794406
4853 52794406 52505006 52287223 52377068 52164713 52516528 52775919 53072948 53811933 54597843 55231331
4843 55231331 56270867 57692740 59159255 60992303 62659407 65244947 68409010 72865107
4835 72865107 79949153 90536253 102782342 111201584 110570859 101692649 88630755 76751313
$$ packed form
4900C6311771J285651J325005J472666J058167J252004R64889R05411Q43111O59351
4891D6078026O38252O73924M33143L78406K88481K80954J39858L88745K60323
4882D9560112J7620J87697j62988M6045j43512l03437q46496o20477l34780k83716
4872D7116068l77948j39376k52769J597L96076M25713P09913O61763N28030J061093
4862E0130160J017465R87387R19612P90314J21490l06839k59959k74581l30643
4853E2794406k89400k17783Q9845k12355L51815K59391K97029P38985P85910O33488
4843E5231331J039536J421873J466515J833048J667104K585540L164063M456097
4835G2865107P084046J0587100J2246089Q419242o30725q878210j3061894j1879442
$$ plain form
4827 76751313 68299015 62417244 57913418 55139069 52931249 51110190 49795432 48419185
4819 48419185 47803958 47501191 46936296 46648221 46475658 46348494 46366158 46155731 46159245 45971520
4809 45971520 45968521 45651002 45103931 44663113 43811576 42815360 41653016 40642645 39888632
4800 39888632 38618127 37709811 36515745 35348929 34664430 34096684 33274051 32712523 32411940
4791 32411940 31997628 31555222 31167728 30972492 30751160 30406935 30268895 30049937 29680743
4782 29680743 29661352 29290722 29031159 28759545 28377953 28271831 27983667 27291908 26796128 26682861
4772 26682861 26346999 26252085 25996142 25952382 26121832 25890333 25606653 25719747 25922678 26341815
4762 26341815 26933667 27443956 27912898 28610595 29214243 29949889 30753776 31536661 32605926
$$ packed form
4827G6751313q452298n881771m503826k774349k207820j821059j314758j376247
4819D8419185o15227l02767n64895k88075j72563j27164J7664k10427L514j87725
4809D5971520k999l17519n47071m40818q51537r96216j162344j010371p54013
4800C9888632j270505r08316j194066j166816o84499n67746q22633n61528l00583
4791C2411940m14312m42406l87494j95236k21332l44225j38040k18958l69194
4782B9680743j9391l70630k59563k71614l81592j06122k88164o91759m95780j13267
4772B6682861l35862r4914k55943m3760J69450k31499k83680J13094K02931M19137
4762B6341815N91852N10289M68942O97697O03648P35646Q03887P82885J069265
$$ plain form
4753 32605926 33627028 34690304 35651779 36752088 38358154 39761174 41101183 43070569
4745 43070569 44545248 46226523 47739806 49300746 51218574 52640168 54092859 55265777
4737 55265777 56468101 57599768 58736607 59923866 60332595 61014106 61859103 62523157 63216530
4728 63216530 64168631 64885847 65887578 67120245 68234855 69404090 71239077 73049655
4720 73049655 74971629 77042463 78960594 80767382 82354290 83878058 85016583 85817623
4712 85817623 86161077 85867869 85236414 84177828 82754521 80842381 79089527 76648692 74507960
4703 74507960 72304105 70033697 68247568 66632664 64733928 62934955 61618859 60188875
4695 60188875 58959682 57595118 56370657 55159627 54177052 53041705 51788874 50228416
$$ packed form
4753C2605926J021102J063276R61475J100309J606066J403020J340009J969386
4745D3070569J474679J681275J513283J560940J917828J421594J452691J172918
4737E5265777J202324J131667J136839J187259M08729O81511Q44997O64054O93373
4728F3216530R52101P17216J001731J232667J114610J169235J834987J810578
4720G3049655J921974K070834J918131J806788J586908J523768J138525Q01040
4712H5817623L43454k93208o31455j058586j423307j912140j752854k440835k140732
4703G4507960k203855k270408j786129j614904j898736j798973j316096j429984
4695F0188875j229193j364564j224461j211030r82575j135347j252831j560458
$$ plain form
4687 50228416 48607792 47079871 45323188 43209805 41517004 39809639 37965706 36264304
4679 36264304 34618837 32588637 30854768 29106212 27296462 25826618 24349557 23107140
4671 23107140 21991525 20908591 20054760 19138203 18509088 17660914 17002599 16240252 15659667
4662 15659667 15181820 14654852 14348511 13757368 13138064 12849311 12515219 12121822 11950015
4653 11950015 11750386 11318114 11038169 10995858 11018682 10840806 10576658 10311381 10134470 10021141
4643 10021141 10132310 10054812 10313722 10462886 10088115 10300892 10296285 10717139 10758116 10884562
4633 10884562 11090307 11467232 12523876 13611399 15419637 17861458 20283132 21953259
4625 21953259 21961410 20172976 17690706 15611190 14117360 13082267 12592424 12328029 12055298
$$ packed form
4687E0228416j620624j527921j756683k113383j692801j707365j843933j701402
4679C6264304j645467k030200j733869j748556j809750j469844j477061j242417
4671B3107140j115615j082934q53831r16557o29115q48174o58315p62347n80585
4662A5659667m77847n26968l06341n91143o19304k88753l34092l93397j71807
4653A1950015j99629m32272k79945m2311K2824j77876k64148k65277j76911j13329
4643A0021141J11169p7498K58910J49164l74771K12777m607M20854M0977J26446
4633A0884562K05745L76925J056644J087523J808238K441821K421674J670127
4625B1953259Q151j788434k482270k079516j493830j035093m89843k64395k72731
$$ plain form
4616 12055298 12409656 12593887 12948110 13905830 15145817 16540847 17906989 19073829 20096522
4607 20096522 20867587 21367891 21959058 22939997 24927228 27050185 28776975 30205707 30779956
4598 30779956 30615203 30235428 30666710 31705553 33405304 35422963 36463391 36612267 35180784
4589 35180784 32839217 30482830 29009003 28598436 28772710 28898456 28234103 26375431 23865596
4580 23865596 21668862 19839364 18669756 17617370 16782707 16246540 15361161 14016632 12403297
4571 12403297 10864619 9566091 8836095 8003846 7241901 6962950 6440035 5956706 5810380
4562 5810380 5421283 5161638 5048269 4982934 4867717 4738220 4571810 4390813 4338830 4343817
4552 4343817 4263706 4062959 4347282 3791141 3655414 3793861 3833382 3708339 3542045 3292287
$$ packed form
4616A2055298L54358J84231L54223R57720J239987J395030J366142J166840J022693
4607B0096522P71065N00304N91167R80939J987231K122957J726790J428732N74249
4598C0779956j64753l79775M31282J038843J699751K017659J040428J48876j431483
4589C5180784k341567k356387j473827m10567J74274J25746o64353j858672k509835
4580B3865596k196734j829498j169608j052386q34663n36167q85379j344529j613335
4571A2403297j538678j298528p29996q32249p61945k78951n22915m83329j46326
4562E810380l89097k59645j13369o5335j15217j29497j66410j80997n1983M987
4552D343817q0111k00747K84323n56141j35727J38447L9521j25043j66294k49758
$$ plain form
4542 3292287 3389308 3333985 3384663 3261365 3188300 2990820 2798218 2979081 2973408 2878886 2714067
4531 2714067 2837919 2842439 2991621 2917757 2969720 2799214 2662604 2783163 2467070 2416109
4521 2416109 2781358 2630650 2504438 2541613 2723840 2859569 2698424 2502108 2544497 2429029
4511 2429029 2461697 2333497 2140040 2262159 2311630 2024148 1947468 1699498 1725370 1968622
4501 1968622 2238271 2072855 1930557 1658382 1881177 2110269 2052658 1870556 1912497 1887969
4491 1887969 1771171 1751161 1573716 1656501 1622404 1814281 1982243 1799102 1672422 1770068
4481 1770068 1893458 1974916 1853254 1845485 1609716 1467079 1542099 1709588 1725425 1718540 1879598
4470 1879598 1955306 1602964 1618267 1798011 1917059 2131977 2012424 1887533 1926355 2134439
$$ packed form
4542C292287R7021n5323N0678j23298p3065j97480j92602J80863n673r4522j64819
4531B714067J23852M520J49182p3864N1963j70506j36610J20559l16093n0961
4521B416109L65249j50708j26212L7175J82227J35729j61145j96316M2389j15468
4511B429029L2668j28200j93457J22119M9471k87482p6680k47970K5872K43252
4501A968622K69649j65416j42298k72175K22795K29092n7611j82102M1941k4528
4491A887969j16798k0010j77445Q2785l4097J91877J67962j83141j26680R7646
4481A770068J23390Q1458j21662p769k35769j42637P5020J67489J5837o885J61058
4470A879598P5708l52342J5303J79744J19048K14918j19553j24891L8822K08084
$$ plain form
4460 2134439 2252072 2016323 2019656 2013520 2018315 2010143 2118727 2121006 1997069 1868913 2120232
4449 2120232 2279552 2217074 2194712 2185322 2125670 1937613 2257657 2406719 2370074 2460795 2593607
4438 2593607 2356344 2532364 2603475 2588550 2664515 2641706 2728011 2560389 2594252 2816751 2833230
4427 2833230 2804797 3075490 2949125 2857977 2901220 2896469 2825462 2972720 2899686 2889563 3010224
4416 3010224 3144537 3083060 3042526 3381285 3424503 3292484 3145703 3295541 3556867 3593565
4406 3593565 3526586 3587326 3652519 3505003 3578473 3810059 4083506 4024640 3843774 3733660
4396 3733660 3866924 3890413 3921567 3997890 3883332 4074716 4046874 4060559 4473058 4625340
4386 4625340 4664594 4639358 4688009 4735328 4854653 4908216 5211606 5343693 5045848 4931049
$$ packed form
4460B134439J17633k35749L333o136M795q172J08584K279j23937j28156K51319
4449B120232J59320o2478k2362r390n9652j88057L20044J49062l6645R0721J32812
4438B593607k37263J76020P1111j4925P5965k2809Q6305j67622L3863K22499J6479
4427B833230k8433K70693j26365r1148M3243m751p1007J47258p3034j0123J20661
4416C010224J34313o1477m0534L38759M3218j32019j46781J49838K61326L6698
4406C593565o6979O0740O5193j47516P3470K31586K73447n8866j80866j10114
4396C733660J33264K3489L1154P6323j14558J91384k7842J3685M12499J52282
4386D625340L9254k5236M8651M7319J19325N3563L03390J32087k97845j14799
$$ plain form
4376 4931049 5161562 5440179 5836042 6163326 6099949 6063488 6192792 6234611 6606010 7119907
4366 7119907 7006010 7194728 7118186 7324686 7610404 7836560 8066961 8138679 8378801 8487594
4356 8487594 8545980 8934782 9340153 9627280 9782048 10307155 10638955 10729486 10955458 11241967
4346 11241967 11458824 11879241 12698116 13332123 13967078 14421068 14908831 15605009 16425233
4337 16425233 17414409 18150067 18908066 19419232 20366071 21480838 22762050 23811765 25063359
4328 25063359 26525504 27769855 29438359 31109391 32808872 34721124 36783085 38691069
4320 38691069 40951372 43601754 46262259 48632663 51271409 53875135 56684595 59737532
4312 59737532 62627262 65636188 68924301 72309951 75572465 79103994 82686682 86372982
$$ packed form
4376D931049K30513K78617L95863L27284o3377l6461J29304M1819L71399N13897
4366G119907j13897J88718p6542K06500K85718K26156K30401P1718K40122J08793
4356H487594N8386L88802M05371K87127J54768N25107L31800R0531K25972K86509
4346A1241967K16857M20417Q18875O34007O34955M53990M87763O96178Q20224
4337A6425233R89176P35658P57999N11166R46839J114767J281212J049715J251594
4328B5063359J462145J244351J668504J671032J699481J912252K061961J907984
4320C8691069K260303K650382K660505K370404K638746K603726K809460L052937
4312E9737532K889730L008926L288113L385650L262514L531529L582688L686300
$$ plain form
4304 86372982 90008281 93534188 97075878 100584663 104010849 107496628 110626385 113364451
4296 113364451 116240873 118983016 121656636 123736663 125762099 127907966 129393021 130615224
4288 130615224 131732205 132386360 132622974 132695574 132453101 131683867 130796151 129607577 128068987
4279 128068987 126153090 123981816 121704810 119678960 117211012 114428330 111565267 108561002
4271 108561002 105291837 101815257 98309297 94881147 91257552 87457658 83935059 80538002
4263 80538002 77319145 73681402 70367012 67536293 64383593 61003300 57957503 54953051
4255 54953051 52000130 49179049 46693467 44391074 42243079 39979030 38220333 36461272
4247 36461272 34274912 32700536 31273630 29816677 28570912 27219793 26053400 25228866
$$ packed form
4304H6372982L635299L525907L541690L508785L426186L485779L129757K738066
4296A13364451K876422K742143K673620K080027K025436K145867J485055J222203
4288A30615224J116981O54155K36614P2600k42473p69234q87716j188574j538590
4279A28068987j915897k171274k277006k025850k467948k782682k863063l004265
4271A08561002l269165l476580l505960l428150l623595l799894l522599l397057
4263H0538002l218857l637743l314390k830719l152700l380293l045797l004452
4255E4953051k952921k821081k485582k302393k147995k264049j758697j759061
4247C6461272k186360j574376j426906j456953j245765j351119j166393q24534
$$ plain form
4239 25228866 24696147 24213015 24266831 25305126 26492019 27356312 27049454 25496411 23120510
4230 23120510 20552017 18772743 17296642 16364420 15699555 14849836 14232911 13732438 13516732
4221 13516732 13178948 12814279 12578270 12338111 12305009 11853071 11498741 11305027 11098390 11147376
4211 11147376 11284091 11158702 11037142 10836763 10773849 10719580 10651476 10624583 10606529 10539187
4201 10539187 10301302 10286900 10378144 10732581 10565241 10382895 10164260 10198372 10201948 10229987
4191 10229987 10176537 10165168 10079520 10149738 10091944 10390950 10342902 10530586 10544185 10257769 10199969
4180 10199969 10477960 10706304 10692179 10825449 10872293 10900257 10907956 10752946 10860695 11185425
4170 11185425 11348198 11395792 11414547 11276790 11492473 11781439 12123247 12424872 12448314 12448279 12418969
$$ packed form
4239B5228866n32719m83132N3816J038295J186893Q64293l06858j553043k375901
4230B3120510k568493j779274j476101r32222o64865q49719o16925n00473k15706
4221A3516732l37784l64669k36009k40159l3102m51938l54330j93714k06637M8986
4211A1147376J36715j25389j21560k00379o2914n4269o8104k6893j8054o7342
4201A0539187k37885j4402R1244L54437j67340j82346k18635L4112L576K8039
4191A0229987n3450j1369q5648P0218n7794K99006m8048J87684J3599k86416n7800
4180A0199969K77991K28344j4125J33270M6844K7964P699j55010J07749L24730
4170A1185425J62773M7594J8755j37757K15683K88966L41808L01625K3442l5k9310
$$ plain form
4159 12418969 12810221 13232393 13482799 13645611 14077081 14105946 14242721 14513948 14765674 14925321
4149 14925321 15271482 15529607 15870622 16370121 16691746 17028509 17369346 17766037 18077326
4140 18077326 18421985 18875711 19440725 19897738 20341906 21041877 21407294 22128266 22789593
4131 22789593 23540764 24216452 24593363 25138854 26212650 26768770 27464414 28336292 29199268
4122 29199268 30003776 30895465 31877012 32687060 33674562 34862722 35609533 36776990 38062722
4113 38062722 39119508 40517373 41916854 43187692 44658845 45945337 47482768 49084439
4105 49084439 50657918 52154853 53918889 55575042 57223197 59260641 61130646 63542479
4097 63542479 65513824 67457382 69464993 71731042 73767629 75763355 77509650 79490281
$$ packed form
4159A2418969L91252M22172K50406J62812M31470K8865J36775K71227K51726J59647
4149A4925321L46161K58125L41015M99499L21625L36763L40837L96691L11289
4140A8077326L44659M53726N65014M57013M44168O99971L65417P20972O61327
4131B2789593P51171O75688L76911N45491J073796N56120O95644Q71878Q62976
4122B9199268Q04508Q91689R81547Q10048R87502J188160P46811J167457J285732
4113C8062722J056786J397865J399481J270838J471153J286492J537431J601671
4105D9084439J573479J496935J764036J656153J648155K037444J870005K411833
4097F3542479J971345J943558K007611K266049K036587J995726J746295J980631
$$ plain form
4089 79490281 81482530 83399552 85324852 86966362 88630121 90117854 91363516 92460005
4081 92460005 93399621 94289807 95296897 95967613 96640387 97312719 97968075 99020753 99991355
4072 99991355 100680548 101682765 102787926 104026184 105246531 106668691 108408458 110249994
4064 110249994 112414668 115055140 117742694 120875663 124579865 128752638 133363033 138142859
4056 138142859 143260514 148353766 153205695 158152430 162970941 167718820 172525478 177381467
4048 177381467 182690203 188214287 194132641 200095379 206030879 212509951 219186692 225693212
4040 225693212 232039107 238136891 243921852 249500786 255029580 260697557 265789869 270724921
4032 270724921 275158874 278802510 282741072 286184316 289203096 292026997 294544267 296455320
$$ packed form
4089G9490281J992249J917022J925300J641510J663759J487733J245662J096489
4081I2460005R39616Q90186J007090O70716O72774O72332O55356J052678R70602
4072I9991355O89193J002217J105161J238258J220347J422160J739767J841536
4064A10249994K164674K640472K687554L132969L704202M172773M610395M779826
4056A38142859N117655N093252M851929M946735M818511M747879M806658M855989
4048A77381467N308736N524084N918354N962738N935500O479072O676741O506520
4040B25693212O345895O097784N784961N578934N528794N667977N092312M935052
4032B70724921M433953L643636L938562L443244L018780K823901K517270J911053
$$ plain form
4024 296455320 298082771 299016372 299613452 299644404 298937339 297596642 295573174 293012213 289647150
4015 289647150 285907727 281918463 277644359 272918312 267719004 262555005 257055263 251514501
4007 251514501 245466584 239316124 232871412 226203419 219429209 212591441 205701889 199055703
3999 199055703 192147087 185195707 178580065 172133842 165598105 159353873 153401143 147569813
3991 147569813 142178093 137009709 131828728 127161559 122742584 118881940 115729068 112674896
3983 112674896 109875481 107130581 104898270 102699227 100688861 98582499 96843427 95014930
3975 95014930 93228764 92149881 90704832 89253738 87938212 86818243 86220392 85240294
3967 85240294 84483114 84135985 83790601 83604083 84271005 85045645 86355608 86859305 85706678
$$ packed form
4024B96455320J627451R33601N97080L0952p07065j340697k023468k560961l365063
4015B89647150l739423l989264m274104m726047n199308n163999n499742n540762
4007B51514501o047917o150460o444712o667993o774210o837768o889552o646186
3999A99055703o908616o951380o615642o446223o535737o244232n952730n831330
3991A47569813n391720n168384n180981m667169m418975l860644l152872l054172
3983A12674896k799415k744900k232311k199043k010366k106362j739072j828497
3975I5014930j786166j078883j445049j451094j315526j119969n97851r80098
3967H5240294p57180l47129l45384j86518O66922P74640J309963N03697j152627
$$ plain form
3958 85706678 83195173 80197339 77743079 75311273 73094516 71409174 69676312 68146303
3950 68146303 66548398 64840384 63692924 62070993 60573530 59135620 57531323 56061566
3942 56061566 54578349 53198311 51738188 50498637 49310117 48254002 47641487 46909253
3934 46909253 46600576 46520524 46622132 47396468 48824289 49862519 49824193 48215393 45934395
3925 45934395 43932438 42391455 41394546 40426627 40149839 39705852 39590360 39531817 39453954
3916 39453954 39799939 39939369 39861243 39834783 40404286 40695255 40790864 41043053 41210071 41627036
3906 41627036 41619034 41875653 42464955 42841018 43484207 44044537 44737623 45464619 45855736 46653131
3896 46653131 47417707 48283645 49250308 50335949 51712971 53167460 54758123 56151307 57834539
$$ packed form
3958H5706678k511505k997834k454260k431806k216757j685342j732862j530009
3950F8146303j597905j708014j147460j621931j497463j437910j604297j469757
3942E6061566j483217j380038j460123j239551j188520j056115o12515p32234
3934D6909253l08677q0052J01608P74336J427821J038230l8326j608800k280998
3925D5934395k001957j540983r96909r67919k76788m43987j15492n8543p7863
3916C9453954L45985J39430p8126k6460N69503K90969R5609K52189J67018M16965
3906D1627036q002K56619N89302L76063O43189N60330O93086P26996L91117P97395
3896D6653131P64576Q65938R66663J085641J377022J454489J590663J393184J683232
$$ plain form
3887 57834539 60136083 62432394 64664604 67265651 70277014 73213356 76750394 80633391
3879 80633391 84668931 89443904 94588443 99801860 105675506 112026685 119014158 126623942
3871 126623942 134748286 143281538 152181540 161699175 171490404 181202671 190911373 200456868
3863 200456868 209770672 218610873 227116867 235070577 242341981 249674337 256377076 262486881
3855 262486881 268446731 273614544 277918733 281662461 284270211 285832165 286372379 285658810
3847 285658810 283546813 279961270 275513296 270139420 263905665 257163123 249822487 241941396
3839 241941396 233822867 225459614 216993412 208148311 199116757 190391416 181311245 172086312
3831 172086312 163010176 153889824 144873162 136213492 127587193 119235595 111479277 104362016
$$ packed form
3887E7834539K301544K296311K232210K601047L011363K936342L537038L882997
3879H0633391M035540M774973N144539N213417N873646O351179O987473P609784
3871A26623942Q124344Q533252Q900002R517635R791229R712267R708702R545495
3863B00456868R313804Q840201Q505994P953710P271404P332356O702739O109805
3855B62486881N959850N167813M304189L743728K607750J561954N40214p13569
3847B85658810k111997l585543m447974n373876o233755o742542p340636p881091
3839B41941396q118529q363253q466202q845101r031554q725341r080171r224933
3831A72086312r076136r120352r016662q659670q626299q351598p756318p117261
$$ plain form
3823 104362016 97824784 91979948 86143405 80927597 76350426 72357315 68620497 65202272
3815 65202272 61817377 58657651 56115091 53803995 51606403 49584105 47758828 46149849
3807 46149849 44700199 43350154 42139175 40922790 39676537 38508468 37378622 36705287
3799 36705287 35789557 35147891 34527042 33817391 32617535 31891152 31348118 30885815 30371613
3790 30371613 29783245 29018062 28270653 27600177 27158612 26632765 25918139 25370650 24512103
3781 24512103 24025635 23503015 22964528 22297524 21764013 21546219 20956915 20255105 19739266
3772 19739266 19217862 18950849 18268766 17852143 17285892 16811274 16227835 16170918 15782653 15364162
3762 15364162 15176042 14550660 14061678 13892047 13900994 13704082 13320689 13218277 13215220 12766763
$$ packed form
3823A04362016o537232n844836n836543n215808m577171l993111l736818l418225
3815F5202272l384895l159726k542560k311096k197592k022298j825277j608979
3807D6149849j449650j350045j210979j216385j246253j168069j129846o73335
3799C6705287r15730o41666o20849p09651j199856p26383n43034m62303n14202
3790C0371613n88368p65183p47409o70476m41565n25847p14626n47489q58547
3781B4512103m86468n22620n38487o67004n33511k17794n89304p01810n15839
3772A9739266n21404k67013o82083m16623n66251m74618n83439n6917l88265m18491
3762A5364162j88120o25382m88982j69631Q947j96912l83393j02412l057m48457
$$ plain form
3752 12766763 12659817 12052611 11759566 11766678 11502950 11497780 11219440 10884814 10655228 10457249
3742 10457249 10264160 10008644 9983164 10013722 9608443 9542875 9469768 9532961 9424404 9354756
3732 9354756 9118930 8863853 8786249 8754718 8327700 8057960 8074572 7844731 7630207 7540479
3722 7540479 7671245 7308663 7197711 6988983 6681330 6876594 6711597 6639607 6349026 6480783
3712 6480783 6386679 6395123 6276984 6069027 5994085 5928098 6018717 5953571 5787911 5458738 5210830
3701 5210830 5378132 5234061 4980665 5027675 4883004 4937419 4737526 4739846 4759220 4490859
3691 4490859 4194369 4073622 4211050 4414780 4585436 4436612 4312695 4363638 4088582 3680790
3681 3680790 3727848 3916900 3981163 3749805 3592817 3781670 3933619 3746233 3832254 3752012
$$ packed form
3752A2766763j06946o07206k93045P112k63728n170k78340l34626k29586j97979
3742A0457249j93089k55516k5480L0558m05279o5568p3107O3193j08557o9648
3732I354756k35826k55077p7604l1531m27018k69740J6612k29841k14524q9728
3722G540479J30766l62582j10952k08728l07653J95264j64997p1990k90581J31757
3712F480783r4104Q444j18139k07957p4942o5987R0619o5146j65660l29173k47908
3701E210830J67302j44071k53396M7010j44671N4415j99893K320J9374k68361
3691D490859k96490j20747J37428K03730J70656j48824j23917N0943k75056m07792
3681C680790M7058J89052O4263k31358j56988J88853J51949j87386Q6021q0242
$$ plain form
3671 3752012 3493795 3541602 3726457 3694667 3580726 3752151 3491525 3400039 3204033 3101004
3661 3101004 3233960 3148661 2876574 2725301 3043075 3139080 3027449 3154745 3244213 3234094
3651 3234094 3072296 3350568 3038200 3028217 2667613 2704175 2651638 2517885 2479905 2378476
3641 2378476 2489995 2513429 2550366 2500502 2225455 2273704 2180728 2271942 2407200 2293481 2383609
3630 2383609 2371426 2224076 1851013 1989608 2196033 2097130 1945959 1884789 1726248 1806775
3620 1806775 1902252 2115300 2199211 1893783 2005314 2035398 1785710 1523516 1592098 1742546
3610 1742546 1863500 1830832 1474143 1326464 1600148 1648433 1604413 1776950 1672162 1657910
3600 1657910 1627719 1625026 1727064 1769441 1841225 1855213 1762409 1880605 1756928 1739227 1670027
$$ packed form
3671C752012k58217M7807J84855l1790j13941J71425k60626r1486j96006j03029
3661C101004J32956q5299k72087j51273L17774R6005j11631J27296Q9468j0119
3651C234094j61798K78272l12368r983l60604L6562n2537j33753l7980j01429
3641B378476J11519K3434L6937m9864k75047M8249r2976R1214J35258j13719R0128
3630B383609j2183j47350l73063J38595K06425r8903j51171o1170j58541Q0527
3620A806775R5477K13048Q3911l05428J11531L0084k49688k62194O8582J50448
3610A742546J20954l2668l56689j47679K73684M8285m4020J72537j04788j4252
3600A657910l0191k693J02038M2377P1784J3988r2804J18196j23677j7701o9200
$$ plain form
3589 1670027 1595770 1515192 1900591 1952572 1728157 1713449 1963172 1914654 1940483 2001148 2118887
3578 2118887 2188195 2011623 1903089 2076817 2296967 2290071 2121252 1750161 1814312 2187271
3568 2187271 2208287 2160960 2081552 2062566 2277857 2163509 2059109 2124341 2146518 2032935 1970993
3557 1970993 2207127 2254104 2247177 2443872 2231146 2007897 1955765 1936091 1808742 1847972 1777696
3546 1777696 1626461 1917063 1941545 1841928 2105720 1974621 1856776 1539774 1535364 1662189
3536 1662189 1667502 1770742 1552790 1456145 1344063 1468190 1480776 1483795 1483912 1434097 1319217
3525 1319217 1106422 1006385 1000325 1169463 1115522 925323 1066067 1184563 1263308 1097809
3515 1097809 976298 1055517 816900 793952 829055 818277 898732 916644 927091 957117 1037546
$$ packed form
3589A670027p4257q0578L85399N1981k24415j4708K49723m8518K5829O0665J17739
3578B118887O9308j76572j08534J73728K20150o896j68819l71091O4151L72959
3568B187271K1016m7327p9408j8986K15291j14348j04400O5232K2177j13583o1942
3557A970993K36134M6977o927J96695k12726k23249n2132j9674j27349L9230p0276
3546A777696j51235K90602K4482r9617K63792j31099j17845l17002m410J26825
3536A662189N313J03240k17952r6645j12082J24127J2586L019J17m9815j14880
3525A319217k12795j00037o060J69138n3941j90199J40744J18496P8745j65499
3515A097809j21511P9219k38617k2948L5103j0778Q0455J7912J0447L0026Q0429
$$ plain form
3504 1037546 1148940 1044520 873050 802632 934649 1004434 856383 871636 815475 810915 866779
3493 866779 743140 826905 1002241 909289 1029762 1034442 1094736 1190572 1031791 1082658 1206743
3482 1206743 1406273 1396523 1416129 1427771 1378310 1476469 1606355 1751370 1666768 1599914 1475088
3471 1475088 1666838 1816029 1690416 1756738 1987106 2065442 2024115 1908969 2048141 2559329
3461 2559329 2322344 2292833 2484629 2759083 2811991 2532962 2551041 2280865 2091361 2062199
3451 2062199 1998137 1889713 1830818 1571870 1438514 1164192 1056672 1216248 1150121 859823
3441 859823 874644 894374 695165 199099 141400 845060 625723 528874 672215 739131 689887
3430 689887 384531 517125 923302 872612 842679 743570 633859 408902 703216 766645
$$ packed form
3504A037546J11394j04420j71470p0418J32017O9785j48051J5253n6161m560N5864
3493H66779j23639Q3765J75336r2952J20473M680O0294R5836j58781N0867J24085
3482A206743J99530r750J9606J1642m9461R8159J29886J45015q4602o6854j24826
3471A475088J91750J49191j25613O6322K30368P8336m1327j15146J39172N11188
3461B559329k36985k9511J91796K74454N2908k79029J8079k70176j89504k9162
3451B062199o4062j08424n8895k58948j33356k74322j07520J59576o6127k90298
3441H59823J4821J9730j99209m96066n7699P03660k19337r6849J43341O6916m9244
3430F89887l05356J32594M06177n0690k9933r9109j09711k24957K94314O3429
$$ plain form
3420 766645 532388 610390 773470 501350 573659 655045 593278 434445 355318 458579 349749
3409 349749 481599 539436 646852 585441 477948 354032 235958 503353 706731 729759
3399 729759 682403 549922 407628 372699 458271 530749 470062 280993 442839 700485 705077
3388 705077 576674 383184 251044 439935 314589 667006 732778 606007 818878 742421
3378 742421 649628 727132 766985 1031097 846472 484121 477852 428418 453988 558896 535039
3367 535039 616881 528920 484359 397336 490701 438983 507285 391991 583098 688283 273191
3356 273191 290279 494089 388724 336691 211138 356003 569279 506171 593394 539465 845065
3345 845065 1017844 1102405 1364736 1277596 880275 533577 327148 476000 212053 179638
$$ packed form
3420G66645k34257P8002J63080k72120P2309Q1386o1767j58833p9127J03261j08830
3409C49749J31850N7837J07416o1411j07493j23916j18074K67395K03378K3028
3399G29759m7356j32481j42294l4929Q5572P2478o0687j89069J61846K57646M592
3388G05077j28403j93490j32140J88891j25346L52417O5772j26771K12871p6457
3378G42421r2793P7504L9853K64112j84625l62351o269m9434K5570J04908k3857
3367E35039Q1842q7961m4561q7023R3365n1718O8302j15294J91107J05185m15092
3356B73191J7088K03810j05365n2033j25553J44865K13276o3108Q7223n3929L05600
3345H45065J72779Q4561K62331q7140l97321l46698k06429J48852k63947l2415
$$ plain form
3335 179638 215536 439064 518679 462927 387769 318531 386882 435767 255661 266989 361139
3324 361139 48120 -42883 37653 241980 258999 138531 355555 400516 364833 363060 385448
3313 385448 398940 510470 722214 776852 761898 647302 741953 712945 454696 501015 867675
3302 867675 876112 728169 975333 907050 784122 582558 363877 147915 317724 461512
3292 461512 637129 723348 374943 232642 192504 186710 132973 146026 152137 63736 100404
3281 100404 247195 165684 164062 -33460 -90621 252216 661807 922663 844595 757637 661587
3270 661587 255766 154616 149067 63145 5193 74851 -16302 128956 4958 -199119 -326571
3259 -326571 -281234 -275614 -254654 -177747 -132391 -103117 -36303 149987 15980 -20295 277182
$$ packed form
3335A79638L5898K23528P9615n5752p5158o9238O8351M8885j80106J1328R4150
3324C61139l13019r1003Q0536K04327J7019j20468K17024M4961l5683j773K2388
3313C85448J3492J11530K11744N4638j4954j14596R4651k9008k58249M6319L66660
3302H67675Q437j47943K47164o8283j22928k01564k18681k15962J69809J43788
3292D61512J75617Q6219l48405j42301m0138n794n3737J3053O111q8401L6668
3281A00404J46791q1511j622j97522n7161L42837M09591K60856p8068q6958r6050
3270F61587m05821j01150n549q5922n7952O9658r1153J45258j23998k04077j27452
3259c26571M5337N620K0960P6907M5356K9274O6814J86290j34007l6275K97477
$$ plain form
3248 277182 336160 219913 205693 196421 20407 -61245 -72252 -76827 -112180 -204213 -116765 -148904
3236 -148904 -122033 -30563 50902 -149983 -5349 -83369 -132503 -118332 -42011 -282211 -408485
3225 -408485 -288007 -214286 -282254 -187348 232317 178916 1126 1050 -12312 -71707 141151
3214 141151 439518 272107 340353 53010 170210 20004 121571 251317 97177 72970
3204 72970 32038 -73438 -187995 156897 214198 225128 58325 7130 87390 79934 38911
3193 38911 -83664 -29672 328727 406977 509198 325149 209751 114384 73828 -1172 241609
3182 241609 334895 304311 183688 7562 -185167 57865 292116 183294 100954 353622
3172 353622 311136 291520 237820 133347 91291 312718 230775 126948 390030 454787 282843
$$ packed form
3248B77182N8978j16247j4220r272j76014q1652j1007m575l5353r2033Q7448l2139
3236a48904K6871R1470Q1465k00885J44634p8020m9134J4171P6321k40200j26274
3225d08485J20478P3721o7968R4906M19665n3401j77790p6j3362n9395K12858
3214A41151K98367j67411O8246k87343J17200j50206J01567J29746j54140k4207
3204G2970m0932j05476j14557L44892N7301J0930j66803n1195Q0260p456m1023
3193C8911j22575N3992L58399P8250J02221j84049j15398r5367m0556p5000K42781
3182B41609R3286l0584j20623j76126j92729K43032K34251j08822q2340K52668
3172C53622m2486j9616n3700j04473m2056K21427q1943j03827K63082O4757j71944
$$ plain form
3161 282843 -117734 -73399 73864 319519 331650 168197 13818 92196 151686 186895 136426
3150 136426 293736 303829 556275 433864 473370 498162 555311 410806 83986 181771 441849
3139 441849 422088 361556 486378 226721 308781 340660 373064 338693 273890 436970 281321
3128 281321 43384 342523 541823 484314 261703 278959 93373 251057 327752 407334
3118 407334 695189 522206 540705 229273 170626 574566 383082 78268 58719 208828
3108 208828 378247 527312 667344 620298 700350 650443 554002 348490 180925 192288 438400
3097 438400 542967 188773 15881 130981 12849 104604 -19357 139155 497344 394819
3087 394819 474992 521561 393260 306365 306687 149420 89968 -147044 -23285 -71095 111274
$$ packed form
3161B82843m00577M4335J47263K45655J2131j63453j54379P8378N9490L5209n0469
3150A36426J57310J0093K52446j22411L9506K4792N7149j44505l26820R7785K60078
3139D41849j9761o0532J24822k59657Q2060L1879L2404l4371o4803J63080j55649
3128B81321k37937K99139J99300n7509k22611J7256j85586J57684P6695P9582
3118D07334K87855j72983J8499l11432n8647M03940j91484l04814j9549J50109
3108B08828J69419J49065J40032m7046Q0052m9907r6441k05512j67565J1363K46112
3097D38400J04567l54194j72892J15100j18132R1755j23961J58512L58189j02525
3087C94819Q0173M6569j28301q6895L22j57267n9452k37012J23759m7810J82369
$$ plain form
3076 111274 -156198 -292895 -150147 42960 233633 -117828 -122210 -68730 -88379 4958 119334
3065 119334 52858 110405 -120283 -194516 63309 -319263 -334149 -276156 -442650 -287572 -315071
3054 -315071 -329606 -188471 -188461 -138303 -28573 -151503 -169743 -255162 -286301 -111280 1602
3043 1602 -175821 -257503 -195403 -49920 -119594 26714 -14565 -52892 23463 163847 234746
3032 234746 -85480 -111084 -56118 -198908 -361104 -287003 -185935 -143391 -190034 -316117 -539330
3021 -539330 -376745 -188325 -135297 92260 141502 35159 -340465 -330642 -277872 -220810 -216934
3010 -216934 -14426 -40459 -198117 -190038 23298 -144396 -232871 -243866 -281765 -238387 -374574
2999 -374574 -179526 -10478 -27750 -251929 -229754 164487 -80912 -83284 -66816 -134815 58158
$$ packed form
3076A11274k67472j36697J42748J93107J90673l51461m382N3480j9649R3337J14376
3065A19334o6476N7547k30688p4233K57825l82572j4886N7993j66494J55078k7499
3054c15071j4535J41135J0N0158J09730j22930j8240q5419l1139J75021J12882
3043A602j77423q1682O2100J45483o9674J46308m1279l8327P6355J40384P0899
3032B34746l20226k5604N4966j42790j62196P4101J01068M2544m6643j26083k23213
3021e39330J62585J88420N3028K27557M9242j06343l75624R823N2770N7062L876
3010b16934K02508k6033j57658Q079K13336j67694q8475j0995l7899M3378j36187
2999c74574J95048J69048j7272k24179K2175L94241k45399k372J6468o7999J92973
$$ plain form
2988 58158 -192663 -230568 -343727 -279010 -225541 -308985 -232470 -399525 -308585 -391277 -432565
2977 -432565 -295723 -281116 -312605 -282222 -243702 -204521 -211907 -157526 -179458 -298053 -344830
2966 -344830 -396672 -242203 3378 193805 -89936 -391818 -344625 -108815 -74840 -85493
2956 -85493 -251648 -440512 -311484 -318399 -290486 -373586 -575093 -466922 -442765 -50305 -556951
2945 -556951 -535531 -503048 -304313 -243531 -447364 -466406 -623781 -479437 -202211 -308690
2935 -308690 -222467 -289653 -405000 -497191 -719260 -646760 -339580 -232981 -154863 -150514 -327822
2924 -327822 -447561 -711002 -570266 -325170 -322702 -424518 -504533 -604898 -338408 -334674 -221346
2913 -221346 -489566 -508176 -384933 -335612 -384583 -403971 -387989 -390882 -404162 -603296 -445906
$$ packed form
2988E8158k50821l7905j13159O4717N3469q3444P6515j67055R0940q2692m1288
2977d32565J36842J4607l1489L0383L8520L9181p386N4381k1932j18595m6777
2966c44830n1842J54469K45581J90427k83741l01882M7193K35810L3975j0653
2956h5493j66155j88864J29028o915K7913q3100k01507J08171K4157L92460n06646
2945e56951K1420L2483J98735O0782k03833j9042j57375J44344K77226j06479
2935c08690Q6223o7186j15347r2191k22069P2500L07180J06599P8118M349j77308
2924c27822j19739k63441J40736K45096K468j01816q0015j00365K66490L734J13328
2913b21346k68220j8610J23243M9321m8971j9388J5982k893j3280j99134J57390
$$ plain form
2902 -445906 43067 -139605 -516346 -254804 -369997 -564912 -610675 -400135 -377592 -262761
2892 -262761 -259097 -374337 -508502 -523517 -439411 -326197 -312247 -358635 -300493 -217857 -231050
2881 -231050 -344643 -412053 -367213 -270207 -505230 -563161 -618641 -566500 -443558 -505750 -261890
2870 -261890 -330199 -312513 -327040 -267733 -270927 -357663 -463070 -577936 -469114 -510386 -360896
2859 -360896 -479603 -322653 -470137 -690035 -839306 -689911 -590821 -437278 -455621 -493930
2849 -493930 -478463 -299631 -449289 -537133 -484848 -382452 -355172 -282387 -236076 -489090 -533306
2838 -533306 -464681 -425725 -351513 -338752 -385157 -411153 -391759 -320646 -164724 -194478 -313137
2827 -313137 -349467 -346006 -356942 -309057 -453680 -410328 -239347 -465419 -303191 -163144 -258729
$$ packed form
2902d45906M88973j82672l76741K61542j15193j94915m5763K10540K2543J14831
2892b62761L664j15240j34165j5015Q4106J13214J3950m6388N8142Q2636j3193
2881b31050j13593o7410M4840R7006k35023n7931n5480N2141J22942o2192K43860
2870b61890o8309J7686j4527N9307l194q6736j05407j14866J08822m1272J49490
2859c60896j18707J56950j47484k19898j49271J49395R9090J53543j8343l8309
2849d93930J5467J78832j49658q7844N2285J02396K7280P2785M6311k53014m4216
2838e33306O8625L8956P4212J2761m6405k5996J9394P1113J55922k9754j18659
2827c13137l6330L461j0936M7885j44623M3352J70981k26072J62228J40047r5585
$$ plain form
2816 -258729 -369927 -413056 -430140 -412317 -721427 -661105 -732709 -659768 -268018 -397116 -445969
2805 -445969 -448117 -269195 -236289 -254920 -343164 -428239 -491206 -695687 -486649 -350752 -403989
2794 -403989 -258160 -432582 -486842 -464343 -443757 -355833 -741688 -557537 -357551 -273842 -262052
2783 -262052 -381982 -412111 -270749 -201480 -214642 -177286 -279646 -332264 -274422 -417940 -512556
2772 -512556 -80061 -63347 -371861 -519461 -486460 -358425 -294030 -397822 -284333 -201608
2762 -201608 -500957 -414922 -294100 -254112 -241978 -375543 -464244 -382296 -399893 -408287 -302265
2751 -302265 -428829 -634443 -539041 -442499 -325054 -312437 -322911 -236770 -230727 -236430 -325767
2740 -325767 -421381 -334939 -138681 -306143 -452023 -270297 -187877 -613678 -657772 -486063
$$ packed form
2816b58729j11198m3129j7084J7823l09110O0322p1604P2941L91750j29098m8853
2805d45969k148J78922L2906j8631q8244q5075o2967k04481K09038J35897n3237
2794d03989J45829j74422n4260K2499K0586Q7924l85855J84151J99986Q3709J1790
2783b62052j19930l0129J41362O9269j3162L7356j02360n2618N7842j43518r4616
2772e12556M32495J6714l08514j47600L3001J28035O4395j03792J13489Q2725
2762b01608k99349Q6035J20822L9988J2134j33565q8701Q1948j7597q394J06022
2751c02265j26564k05614R5402R6542J17445J2617j0474Q6141O043n703q9337
2740c25767r5614Q6442J96258j67462j45880J81726Q2420m25801m4094J71709
$$ plain form
2730 -486063 -567424 -183917 -240414 -262186 -377694 -489150 -528474 -281614 -262271 -409911 -329841
2719 -329841 -47960 -115491 -341854 -258563 -152964 -399462 -395434 -501387 -472697 -435426 -785998
2708 -785998 -848655 -770430 -649900 -780417 -730688 -551665 -418467 -387483 -285522 -413184
2698 -413184 -563012 -508517 -708381 -624100 -383237 -593129 -492504 -498940 -228279 -24186
2688 -24186 -166994 -290359 -348855 -61328 -12381 -252575 -386804 -441496 -451462 -480451 -221681
2677 -221681 -217086 -262408 -355830 -428691 -290234 -109873 -202739 -325723 -450298 -612270 -339721
2666 -339721 -261035 -299490 -407204 -659617 -666933 -366310 -229769 -350743 -314076 -133193 -151671
2655 -151671 -3021 -342389 -738959 -501618 -611073 -548250 -606671 -345570 -173305 -370974
$$ packed form
2730d86063q1361L83507n6497k1772j15508j11456l9324K46860J9343j47640Q0070
2719c29841K81881o7531k26363Q3291J05599k46498M028j05953K8690L7271l50572
2708g85998o2657P8225J20530j30517M9729J79023J33198L0984J01961j27662
2698d13184j49828N4495j99864Q4281K40863k09892J00625o436K70661K04093
2688b4186j42808j23365n8496K87527M8947k40194j34229n4692r966k8989K58770
2677b21681M595m5322r3422p2861J38457J80361r2866j22984j24575j61972K72549
2666c39721P8686l8455j07714k52413p316L00623J36541j20974L6667J80883j8478
2655a51671J48650l39368l96570K37341j09455O2823n8421K61101J72265j97669
$$ plain form
2645 -370974 -470620 -380674 -345781 -315327 -176900 -3023 -263282 -230531 -277984 -362669 -311573
2634 -311573 -276475 -326049 -293382 -321611 -438393 -440205 -227552 -400439 -359886 -350111 -360166
2623 -360166 -345049 -225259 -107369 -207158 43133 -118075 -22594 -39228 50501 66961 192445
2612 192445 11882 110996 149648 150605 -36206 88159 -17177 -12922 230059 417774 646854
2601 646854 503975 870443 1614477 1894163 2058372 1605013 1140844 1002460 780175 207217
2591 207217 -27252 22406 -10091 151063 205501 214113 131230 66470 214195 230743 8716
2580 8716 73672 -108576 -250750 -560414 -451448 -242008 -348413 -196458 202455 29613
2570 29613 67666 28699 71925 -147219 -257181 -211912 -372275 -509332 -476894 -77076 74177
$$ packed form
2645c70974r9646Q9946L4893L0454J38427J73877k60259L2751m7453q4685N1096
2634c11573L5098m9574L2667k8229j16782j812K12653j72887M0553R775j0055
2623c60166J5117J19790J17890r9789K50291j61208R5481j6634Q9729J6460J25484
2612A92445j80563R9114L8652R57j86811J24365j05336M255K42981J87715K29080
2601F46854j42879L66468P44034K79686J64209m53359m64169j38384k22285n72958
2591B07217k34469M9658l2497J61154N4438Q612q2883o4760J47725J6548k22027
2580H716O4956j82248j42174l09664J08966K09440j06405J51955L98913j72842
2570B9613L8053l8967M3226k19144j09962M5269j60363j37057L2438L99818J51253
$$ plain form
2559 74177 191379 41469 22264 -104841 -160723 -41151 -23008 -65567 -284653 -354476 -198213
2548 -198213 -188492 -229613 -280783 -144024 -194427 -260701 -259845 -383929 -124441 -185168 -87840 -128429
2536 -128429 -242173 -584508 -545801 -440672 -508655 -509159 -274951 -236998 -357871 -431552 -408349
2525 -408349 -315797 -591016 -552996 -455337 -224620 -76311 86218 40501 210229 -19284
2515 -19284 -305045 -381217 -326012 -105973 78299 54346 87697 -253935 -237059 -30925 47295
2504 47295 1822 -5337 -179236 -168527 36785 26950 -136643 -46965 -91347 -24354 60750 -3128
2492 -3128 234650 328892 306957 260435 265258 318912 415066 304961 831209 944184 887114
2481 887114 900866 752329 657526 439929 333555 617285 573351 412486 231819 224240 288265
$$ packed form
2559G4177J17202j49910j9205j27105n5882J19572J8143m2559k19086o9823J56263
2548a98213R721m1121n1170J36759n0403o6274Q56j24084K59488o0727R7328m0589
2536a28429j13744l42335L8707J05129o7983n04K34208L7953j20873p3681K3203
2525d08349R2552k75219L8020R7659K30717J48309J62529m5717J69728k29513
2515a9284k85761p6172N5205K20039J84272k3953L3351l41632J6876K06134P8220
2504D7295m5473p159j73899J0709K05312r835j63593Q9678m4382O6993Q5104o3878
2492c128K37778R4242k1935m6522M823N3654R6154j10105N26248J12975n7070
2481H87114J3752j48537r4803k17597j06374K83730m3934j60865j80667p579O4025
$$ plain form
2470 288265 262952 336473 527372 792276 706179 724693 568985 439218 735533 671321 621462
2459 621462 552424 521705 750704 566215 448630 554926 703726 776950 779638 848423 832449
2448 832449 724692 723157 496537 406119 336954 367575 338371 672034 1049460 1007080 818752
2437 818752 779841 1158314 1125521 1087596 1188344 1106085 1087827 1075716 903832 1037339 1003380
2426 1003380 955255 986512 894018 948904 1016502 914503 1179667 1238691 1368752 1650875 1643360
2415 1643360 1994685 1784805 1545683 1564355 1675000 1385527 1277690 1572152 1746549 1912621
2405 1912621 2142285 1914373 1667648 2180154 2121148 1883023 1962718 2499082 2884040 2905492
2395 2905492 2873544 2647449 2869548 3111473 3357268 3720010 3948418 4180336 4518105 4821055
$$ packed form
2470B88265k5313P3521J90899K64904q6097J8514j55708j29767K96315o4212m9859
2459F21462o9038l0719K28999j84489j17585J06296J48800P3224K688O8785j5974
2448H32449j07757j535k26620r0418o9165L0621k9204L33663L77426m2380j88328
2437H18752l8911L78473l2793l7925J00748q2259j8258j2111j71884J33507l3959
2426A003380m8125L1257r2494N4886O7598j01999K65164N9024J30061K82123p515
2415A643360L51325k09880k39122J8672J10645k89473j07837K94462J74397J66072
2405A912621K29664k27912k46725N12506n9006k38125P9695N36364L84958K1452
2395B905492l1948k26095K22099K41925K45795L62742K28408K31918L37769L02950
$$ plain form
2385 4821055 4795809 4583104 4476809 4736274 5114365 5234470 5644864 5993902 6134921 6353630
2375 6353630 6591461 6992377 7398683 7559817 7467027 7824022 8373207 8837876 9307973 9870329
2365 9870329 10293526 10889453 11243140 11754670 12248788 13022730 13857083 14560296 15114844 15833583
2355 15833583 16650696 18053100 19553692 21343000 23371383 25853483 28879986 32679852
2347 32679852 37189048 42309104 45752094 47918194 49219633 51581907 55065563 60709134
2339 60709134 69162535 80554415 95543431 116497895 147537989 196216601 268831213
2332 268831213 355175449 418742734 421894954 366440704 282052417 208954886 157192519
2325 157192519 121935506 97156930 79097563 65835573 56051032 48824073 43338747
$$ packed form
2385D821055k5246k12705j06295K59465L78091J20105M10394L49038J41019K18709
2375F353630K37831M00916M06306J61134r2790L56995N49185M64669M70097N62356
2365I870329M23197N95927L53687N11530M94118P73942Q34353P03213N54548P18739
2355A5833583Q17113J402404J500592J789308K028383K482100L026503L799866
2347C2679852M509196N120056L442990K166100J301439K362274L483656N643571
2339F0709134Q453401J1391880J4989016K0954464L1040094M8678612P2614612
2332B68831213Q6344236O3567285L152220n5454250q4388287p3097531n1762367
2325A57192519l5257013k4778576j8059367j3261990r784541p226959n485326
$$ plain form
2318 43338747 40077220 38175145 36823372 34559616 31475318 27915349 25060432 22628345
2310 22628345 20956883 19867794 18888885 17809764 16514595 15472488 14361898 13289145
2302 13289145 12583678 12098278 11925146 11510903 11329025 10911250 10403181 10086411 9432144
2293 9432144 9061528 8926982 8843592 8495175 8175708 8046933 7927605 7772456 7426334 7265816
2283 7265816 7105245 6738492 6731524 6619632 6694592 6448583 6232030 5520833 5309345 5302725
2273 5302725 4997462 4959761 4784049 4706879 4644526 4618874 4708304 4638872 4322896 4272657 4162569
2262 4162569 4005278 3863874 4127888 3837009 3732195 3784887 3830670 3526014 3346028 3493777
2252 3493777 3349588 3200928 3321401 3450385 3104877 2932345 3053539 2859835 2797950 2800831
$$ packed form
2318D3338747l261527j902075j351773k263756l084298l559969k854917k432087
2310B2628345j671462j089089r78909j079121j295169j042107j110590j072753
2302A3289145p05467m85400j73132m14243j81878m17775n08069l16770o54267
2293I432144l70616j34546q3390l48417l19467j28775j19328j55149l46122j60518
2283G265816j60571l66753o968j11892P4960k46009k16553p11197k11488o620
2273E302725l05263l7701j75712p7170o2353k5652Q9430o9432l15976n0239j10088
2262D162569j57291j41404K64014k90879j04814N2692M5783l04656j79986J47749
2252C493777j44189j48660J20473J28984l45508j72532J21194j93704o1885K881
$$ plain form
2242 2800831 2859415 2623451 2796933 2810643 2859338 2893162 2874339 2660993 2484620 2288113
2232 2288113 2368231 2294474 2250394 2205567 1924991 2095365 1855150 1643807 1803462 1854394
2222 1854394 1731651 1843437 1853794 1771313 1969691 1996203 1751388 1818759 1582487 1591691 1368893
2211 1368893 1050991 1419624 1246323 1035297 1118753 1363978 1111397 865134 727552 963444
2201 963444 1078830 830617 860961 818635 430854 504692 718013 855086 583511 282327
2191 282327 667170 800212 900843 923319 1047142 970563 878130 670319 514012 536958
2181 536958 411563 622751 533828 251931 341729 623185 690896 426563 425016 566861 557651
2170 557651 559409 594998 568816 485407 615147 723203 774918 767511 656999 738698 552469
$$ packed form
2242B800831N8584k35964J73482J3710M8695L3824j8823k13346j76373j96507
2232B288113Q0118p3757m4080m4827k80576J70374k40215k11343J59655N0932
2222A854394j22743J11786J0357q2481J98378K6512k44815O7371k36272R204k22798
2211A368893l17902L68633j73301k11026Q3456K45225k52581k46263j37582K35892
2201I63444J15386k48213L0344m2326l87781P3838K13321J37073k71575l01184
2191B82327L84843J33042J00631K2476J23823p6579r2433k07811j56307K2946
2181E36958j25395K11188q8923k81897Q9798K81456O7711k64333j547J41845r210
2170E57651J758L5589k6182q3409J29740J08056N1715p407j10512Q1699j86229
$$ plain form
2159 552469 783723 781205 822627 874329 818454 757500 637762 747886 951948 1070908 982933
2148 982933 860214 789834 770505 493488 285016 414091 382092 688299 641478 528757
2138 528757 453357 487596 297984 272942 319140 524437 756741 405052 359591 604471 659303
2127 659303 334951 296048 522508 536691 308283 237949 465545 345276 388668 521986
2117 521986 357391 408375 464286 246440 304560 304721 430938 540582 459960 274882 46416
2106 46416 6695 166580 208651 289799 482024 181963 101258 377592 313560 169441 32196
2095 32196 157042 239170 268550 365243 366020 183844 135648 161958 224444 344726 161392
2084 161392 1019 66738 406846 322630 237714 26629 155495 212044 93957 318610
$$ packed form
2159E52469K31254k518M1422N1702n5875o0954j19738J10124K04062J18960q7975
2148I82933j22719p0380j9329k77017k08472J29075l1999L06207m6821j12721
2138E28757p5400L4239j89612k5042M6198K05297K32304l51689m5461K44880N4832
2127F59303l24352l8903K26460J4183k28408p0334K27596j20269M3392J33318
2117E21986j64595N0984N5911k17846N8120J61J26217J09644q0622j85078k28466
2106D6416l9721J59885M2071Q1148J92225l00061q0705K76334o4032j44119j37245
2095C2196J24846Q2128K9380R6693P77j82176m8196K6310O2486J20282j83334
2084A61392j60373O5719L40108q4216q4916k11085J28866N6549j18087K24653
$$ plain form
2074 318610 556497 519991 485780 433505 785041 772076 705332 640123 813654 865547 1149110
2063 1149110 1374796 1848428 1773257 1897888 1894912 1670584 1215423 736255 691891 361703
2053 361703 253892 353030 164792 -14472 72251 165677 98048 61658 80648 175813 299521
2042 299521 167562 286294 305055 296910 200215 102109 -87098 11318 75616 152448 424381
2031 424381 106328 40444 259474 135111 255177 -38849 -220724 -83119 104279 -190297
2021 -190297 21607 79914 -40265 -21971 -41901 24575 -54009 5691 -42446 -1931 51271
2010 51271 -278204 -350280 -69968 99224 -74804 -12612 -6479 291605 561650 326558 -9500
1999 -9500 -126698 -202875 -45381 190742 95666 -82013 -65563 206231 296480 -113260 -260221
$$ packed form
2074C18610K37887l6506l4211n2275L51536j2965o6744o5209J73531N1893K83563
2063A149110K25686M73632p5171J24631k976k24328m55161m79168m4364l30188
2053C61703j07811R9138j88238j79264Q6723R3426o7629l6390J8990R5165J23708
2042B99521j31959J18732J8761q145r6695r8106j89207R8416O4298P6832K71933
2031D24381l18053o5884K19030j24363J20066k94026j81875J37605J87398k94576
2021a90297K11904N8307j20179J8294j9930O6476p8584N9700m8137M0515N3202
2010E1271l29475p2076K80312J69192j74028O2192O133K98084K70045k35092l36058
1999i500j17198p6177J57494K36123r5076j77679J6450K71794R0249m09740j46961
$$ plain form
1988 -260221 -195807 -223461 -79751 -146882 -301094 -235735 -198532 -56801 57675 76731 116679
1977 116679 -87611 -180082 -238883 -196625 -45725 64858 108191 208523 222763 -57379 -211710
1966 -211710 -59224 256100 23030 28489 -81966 -245080 -206334 74538 52295 46340 -40866
1955 -40866 20180 -73878 1621 263646 90077 68425 317889 529852 -11949 -89741 216759
1944 216759 173751 137738 211697 34785 -99973 8690 -46759 -48030 129281 -9702 129515
1933 129515 29090 -73857 137068 77173 -175978 -90596 -165528 -131297 -249367 -13749
1923 -13749 -117437 -109319 -76094 -272137 -312950 -344719 -230968 174437 -30729 -127889 -135535
1912 -135535 -367887 -394157 -395105 -288746 -151131 -52462 -140870 -396482 -268531 -30512 53656
$$ packed form
1988b60221O4414k7654J43710o7131j54212O5359L7203J41731J14476J9056L9948
1977A16679k04290r2471n8801M2258J50900J10583M3333J00332J4240k80142j54331
1966b11710J52486L15324k33070N459j10455j63114L8746K80872k2243n955q7206
1955d0866O1046r4058P5499K62025j73569k1652K49464K11963n41801p7792L06500
1944B16759m3008l6013P3959j76912j34758J08663n5449j271J77311j38983J39217
1933A29515j00425j02947K10925n9895k53151Q5382p4932L4231j18070K35618
1923a3749j03688Q118L3225j96043m0813l1769J13751M05405k05166r7160p646
1912a35535k32352k6270r48J06359J37615R8669q8408k55612J27951K38019Q4168
$$ plain form
1901 53656 -94558 -107661 -134602 -11105 -19013 58279 179466 255915 279515 96126 -57242
1890 -57242 -166578 -267018 -44210 77291 140319 111648 -55487 -179505 -117095 39518
1880 39518 -137631 4446 253237 189298 202772 -54042 -11816 285938 125466 263194
1870 263194 115415 -51094 -161810 50595 131969 87936 -76729 84226 -185946 -209651
1860 -209651 -7850 -128549 -213882 -73970 27702 -77191 -218406 -219756 -238039 -163508 -29104
1849 -29104 -196 -94298 -89484 15594 95770 225335 335927 224905 -55638 148829 424786
1838 424786 235950 133512 220455 20453 -143790 -21010 -133293 66475 106430 46152
1828 46152 257906 16209 -271644 -212387 175424 98793 -18852 -130974 -194961 93235
$$ packed form
1901E3656j48214j3103k6941J23497p908P7292J21187P6449K3600j83389j53368
1890e7242j09336j00440K22808J21501O3028k8671j67135j24018O2410J56613
1880C9518j77149J42077K48791o3939J3474k56814M2226K97754j60472J37728
1870B63194j47779j66509j10716K12405Q1374m4033j64665J60955k70172k3705
1860b09651K01801j20699q5333J39912J01672j04893j41215j350j8283P4531J34404
1849b9104K8908r4102M814J05078Q0176J29565J10592j11022k80543K04467K75957
1838D24786j88836j02438Q6943k00002j64243J22780j12283J99768L9955o0278
1828D6152K11754k41697k87853N9257L87811p6631j17645j12122o3987K88196
$$ plain form
1818 93235 -2954 58190 -28634 -109442 -128470 43090 81733 195858 204783 36020 -332095
1807 -332095 71057 185704 -123035 -140709 -113280 23915 188681 -91692 -110194 31844
1797 31844 77038 308614 343713 128560 164803 256737 -18918 -92512 79679 -64079 -291396
1786 -291396 -204655 -259785 -235575 -415581 -75914 -64041 -299696 -234905 53477 71090 -89357
1775 -89357 -416083 -222471 -149290 -174306 -223387 -52539 71250 164187 104781 87084 165191
1764 165191 -129914 -310930 -230766 -380795 -243688 -10909 -133220 -107168 -264128 116301
1754 116301 141974 -56774 -11768 -89136 -53435 -26249 -51298 174457 49608 -300116 -181744
1743 -181744 -264305 -159951 -61202 -1634 100404 191900 358096 80136 -69213 -79253 1470
$$ packed form
1818I3235r6189O1144q6824q0808j9028J71560L8643J14125Q925j68763l68115
1807c32095M03152J14647l08739j7674K7429J37195J64766k80373j8502J42038
1797C1844M5194K31576L5099k15153L6243R1934k75655p3594J72191j43758k27317
1786b91396Q6741n5130K4210j80006L39667J1873k35655O4791K88382J7613j60447
1775h9357l26726J93612P3181k5016m9081J70848J23789R2937n9406j7697P8107
1764A65191k95105j81016Q0164j50029J37107K32779j22311K6052j56960L80429
1754A16301K5673j98748M5006p7368L5701K7186k5049K25755j24849l49724J18372
1743a81744q2561J04354R8749N9568J02038R1496J66196k77960j49349j0040Q0723
$$ plain form
1732 1470 -110228 -248884 -263657 -177818 35619 120423 156046 114693 56652 -173958 -129312
1721 -129312 19551 -7887 -160274 -18829 1250 222030 312524 165592 -66535 -120491
1711 -120491 -87890 -97711 -131961 -99661 -9176 82006 -74461 -166440 -87789 -441948 -629762
1700 -629762 -373637 -392090 -514039 -372087 -245331 -324272 -78898 15981 13306 93164 265116
1689 265116 39150 -235604 -244157 -134695 -191433 -107191 -17644 -118359 -47398 53004 59750
1678 59750 -189916 -228616 -77561 -102598 -312007 -332702 -329304 -390879 -371290 106577 -79208
1667 -79208 -113120 -48888 -57535 -18526 -87585 21027 183587 57723 -96203 -82566 45020
1656 45020 100153 178437 -129838 86799 269574 -57263 171758 164410 123067 236713 32962
$$ packed form
1732A470j11698j38656j4773Q5839K13437Q4804L5623m1353n8041k30610M4646
1721a29312J48863k7438j52387J41445K0079K20780R0494j46932k32127n3956
1711a20491L2601r821l4250L2300R0485R1182j56467r1979P8651l54159j87814
1700f29762K56125j8453j21949J41952J26756p8941K45374R4879k675P9858J71952
1689B65116k25966k74754q553J09462n6738Q4242Q9547j00715P0961J00402O746
1678E9750k49666l8700J51055k5037k09409k0695L398o1575J9589M77867j85785
1667g9208l3912O4232q647L9009o9059J08612J62560j25864j53926J3637J27586
1656D5020N5133P8284l08275K16637J82775l26837K29021p348m1343J13646k03751
$$ plain form
1645 32962 4844 2679 11889 38584 256316 35708 57912 336901 213737 125103 49168
1634 49168 -45783 1000 128381 -13080 -169272 -95322 -125212 -115416 56604 -168878 -443653
1623 -443653 -532252 -228979 88182 65020 47126 3947 68947 -173689 -51416 -250136 -289309
1612 -289309 -314765 -284487 -149342 -92876 112068 67239 -104589 118530 225929 54639
1602 54639 25060 -19121 -70617 -99523 276525 307239 143972 206816 214140 -30224 -148960
1591 -148960 -153647 -161648 -125671 124981 -161398 -289323 49009 123818 150309 107204 123854
1580 123854 21167 -12652 -195620 -142872 -103714 -165165 -184484 -235066 -218449 880 15900
1569 15900 -145018 -108373 -280185 -207122 -161058 -104986 -135452 -183921 -190319 -102377 -160712 -145288
$$ packed form
1645C2962k8118k165R210K6695K17732k20608K2204K78989j23164q8634p5935
1634D9168r4951M6783J27381j41461j56192P3950k9890R796J72020k25482k74775
1623d43653q8599L03273L17161k3162j7894m3179O5000k42636J22273j98720l9173
1612b89309k5456L0278J35145N6466K04944m4829j71828K23119J07399j71290
1602E4639k9579m4181n1496k8906L76048L0714j63267O2844P324k44364j18736
1591a48960m687q001L5977K50652k86379j27925L38332P4809K6491m3105J6650
1580A23854j02687l3819j82968N2748L9158o1451j9319n0582J6617K19329J5020
1569A5900j60918L6645j71812P3063M6064N6072l0466m8469o398Q7942n8335J5424
$$ plain form
1557 -145288 -312195 -366114 -257822 -145915 12274 79285 147742 87058 -22038 182221
1547 182221 151389 109469 -48143 -266729 -148516 48535 -79269 -61754 -5652 -141979
1537 -141979 -133652 74133 -79461 -163644 -227752 6142 -30298 29738 196289 256389 -57228
1526 -57228 -148992 -46539 -84221 162278 132853 -9868 -141589 -381091 -182412 84240
1516 84240 -37807 -97127 -360845 -287217 -392747 -212657 -232598 -341825 10821 -75350 -80367
1505 -80367 -31025 132095 259183 35891 -45947 95411 9029 83090 -139205 -305377 -12346
1494 -12346 -4699 -94573 -308941 -205422 -206429 -211728 -191603 -67502 52647 -25954 42343 -79578
1482 -79578 -198807 -56661 -179892 -14111 113245 -49129 17049 74216 148924 -118476
$$ packed form
1557a45288j66907n3919J08292J11907J58189O7011O8457o0684j09096K04259
1547A82221l0832m1920j57612k18586J18213J97051j27804J7515N6102j36327
1537a41979Q327K07785j53594q4183o4108K33894l6440O0036J66551O0100l13617
1526e7228r1764J02453l7682K46499k9425j42721j31721k39502J98679K66652
1516H4240j22047n9320k63718P3628j05530J80090j9941j09227L52646q6171n017
1505h0367M9342J63120J27088k23292q1838J41358q6382P4061k22295j66172K93031
1494a2346P647q9874k14368J03519j007n299K0125J24101J20149p8601O8297j21921
1482g9578j19229J42146j23231J65781J27356j62374O6178N7167P4708k67400
$$ plain form
1472 -118476 24541 58501 49095 -32731 -262673 -237255 -232279 -138661 -253450 24912 -212098
1461 -212098 5581 296087 82929 -88196 -183333 -211168 145097 54787 -478185 -227802
1451 -227802 -310056 -86700 18257 -195992 58964 17728 33588 -58301 -97309 -196010 159083
1440 159083 -136095 -205880 -145698 -226244 -122350 -281158 -183740 -125777 46494 -72249 -259598
1429 -259598 -158298 -162422 -35320 8691 52401 -221508 -117618 -311788 -262093 -89154 -369374
1418 -369374 -42153 110985 51339 72878 -49005 -145961 -89307 170051 421969 400168 135340
1407 135340 -13332 -102379 -153284 202511 270653 180168 217401 157187 -184063 -306729 -389823
1396 -389823 -184746 8712 191084 209914 -33467 -143975 -63410 154764 179745 114407
$$ packed form
1472a18476J43017L3960r406q1826k29942K5418M976R3618j14789K78362k37010
1461b12098K17679K90506k13158j71125r5137k7835L56265r0310n32972K50383
1451b27802q2254K23356J04957k14249K54956m1236J5860r1889l9008r8701L55093
1440A59083k95178o9785O0182q0546J03894j58808R7418N7963J72271j18743j87349
1429b59598J01300m124J27102M4011M3710k73909J03890j94170M9695J72939k80220
1418c69374L27221J53138n9646K1539j21883r6956N6654K59358K51918k1801k64828
1407A35340j48672q9047n0905L55795O8142r0485L7233o0214l41250j22666q3094
1396c89823K05077J93458J82372J8830k43381j10508Q0565K18174K4981o5338
$$ plain form
1386 114407 87007 27704 -162146 -107491 -56932 -424093 -242166 -76813 27364 66981 171240
1375 171240 228490 221199 290907 255960 191672 -105211 -253684 -89018 213653 203548 80372
1364 80372 46228 -50650 -127088 -271624 -22098 -122033 -44750 -272813 -52800 73430 -118820
1353 -118820 -228269 -62500 232229 333245 132528 -50724 215120 35619 -117940 -58644
1343 -58644 -71283 -25371 -136028 -121065 -234814 -155897 -133098 -164356 -242282 -37700 100697
1332 100697 -155293 -192972 -392933 -202279 -42260 -40241 21154 252758 255313 81585 -122788
1321 -122788 -215352 -126234 -64969 -289174 -146819 -110893 -124005 -63567 -52554 79608 291308
1310 291308 109962 23912 -113224 -146108 -162648 -34231 -143342 -238210 -291421 -291659 -198833
$$ packed form
1386A14407k7400n9303j89850N4655N0559l67161J81927J65353J04177L9617J04259
1375A71240N7250p291O9708l4947o4288k96883j48473J64666L02671j0105j23176
1364H0372l4144r6878p6438j44536K49526r9935P7283k28063K20013J26230j92250
1353a18820j09449J65769K94729J01016k00717j83252K65844j79501j53559N9296
1343e8644j2639M5912j10657J4963j13749P8917K2799l1258p7926K04582J38397
1332A00697k55990l7679j99961J90654J60019K019O1395K31604K555j73728k04373
1321a22788r2564Q9118O1265k24205J42355L5926j3112O0438J1013J32162K11700
1310B91308j81346q6050j37136l2884j6540J28417j09111r4868n3211k38R2826
$$ plain form
1299 -198833 -63387 44642 167351 139522 83860 235762 184867 140371 124967 283903 257621
1288 257621 146292 160990 51577 102299 161451 45119 129166 39866 121762 -85831 44719
1277 44719 -56033 -212795 -126792 -182616 -91497 113498 -1267 -87925 -207250 -137273 -143742
1266 -143742 -232124 -200484 -186749 -180875 -81903 -124984 -192998 -25440 169456 277100 261778
1255 261778 -7370 -61241 87805 -175742 28147 115114 324258 322017 70638 -201823
1245 -201823 -218011 -98068 -202982 62160 38654 -172572 -329577 -605810 -348777 -176522
1235 -176522 -172561 -207297 -78373 -223143 -184934 -166780 -140179 -124608 -62593 -213823 -130595
1224 -130595 -167916 -86679 -110190 -209277 -184999 -133681 35397 34239 -170056 40208 -92218
$$ packed form
1299a98833J35446J08029J22709k7829n5662J51902n0895m4496j5404J58936k6282
1288B57621j11329J4698j09413N0722N9152j16332Q4047q9300Q1896k07593J30550
1277D4719j00752j56762Q6003n5824R1119K04995j14765q6658j19325O9977o469
1266a43742q8382L1640J3735N874R8972m3081o8014J67558J94896J07644j5322
1255B61778k69148n3871J49046k63547K03889Q6967K09144k241k51379k72461
1245b01823j6188J19943j04914K65142k3506k11226j57005k76233K57033J72255
1235a76522L961l4736J28924j44770L8209J8154K6601J5571O2015j51230Q3228
1224a30595l7321Q1237k3511r9087K4278N1318J69078j158k04295K10264j32426
$$ plain form
1213 -92218 -246046 -35737 -24281 5765 -35844 -17702 -246464 -193333 -258357 -329010 -323642
1202 -323642 -73306 -349117 -369730 -368143 -290783 -128293 -71160 -37905 -198540 -46167 -100376
1191 -100376 50582 -52106 -66174 159368 333390 285631 132368 123389 -74566 -91273 8232
1180 8232 55759 -2161 24907 71071 71637 -79442 -181496 -152721 91448 -138816 -58327 -173804
1168 -173804 -195833 -31430 37997 -242339 -324681 -65106 -61008 -13732 332071 236942 129441
1157 129441 10205 -114381 -28261 63344 242478 118739 75695 -71105 -32376 165247
1147 165247 51871 -678 50001 145366 -30870 -360435 -255641 -84950 -69103 -46279 23823
1136 23823 57093 50888 119479 211329 47957 -132746 53304 -112574 29581 140028 17686
$$ packed form
1213i2218j53828K10309J1456L0046m1609J8142k28762N3131o5024p0653N368
1202c23642K50336k75811k0613J587P7360J62490N7133L3255j60635J52373n4209
1191a00376J50958j02688j4068K25542J74022m7759j53263q979j97955j6707R9505
1180H232M7527n7920K7068M6164N66j51079j02054K8775K44169k30264Q0489j15477
1168a73804k2029J64403O9427k80336q2342K59575M098M7276L45803r5129j07501
1157A29441j19236j24586Q6120R1605J79134j23739m3044j46800L8729J97623
1147A65247j13376n2549N0679R5365j76236l29565J04794J70691J5847K2824P0102
1136B3823L3270o205O8591R1850j63372j80703J86050j65878J42155J10447j22342
$$ plain form
1125 17686 258770 77321 -98509 12837 46479 69298 25904 61108 247109 17096 -33992
1114 -33992 184778 33245 -136559 -91939 -96355 -199330 -263991 -129828 -122755 -6029 -89375
1103 -89375 -53666 -17625 -133358 -187543 -54526 24824 -10291 6135 -50997 -234972 -170743
1092 -170743 -117494 47923 185689 113131 147698 261872 86148 202329 104710 -323611
1082 -323611 -255475 -213400 -355108 -335830 -188981 -116346 39747 55407 -101496 -161864 -215379
1071 -215379 -230070 -55836 -220270 -132411 56891 -218720 -224805 -124654 -318944 -219756 -219439
1060 -219439 -65946 73157 -9794 32492 -171650 -112019 -97662 -240899 -421937 -134054
1050 -134054 -119876 -11273 -115934 -29347 -58060 98700 417961 7030 -186465 -158711
$$ packed form
1125A7686K41084j81449j75830J11346L3642K2819m3394L5204J86001k30013n1088
1114c3992K18770j51533j69804M4620m416j02975o4661J34163P073J16726q3346
1103h9375L5709L6041j15733n4185J33017P9350l5115J6426n7132j83975O4229
1092a70743N3249J65417J37766p2558L4567J14174j75724J16181r7619m28321
1082c23611O8136M2075j41708J9278J46849P2635J56093J5660j56903o0368n3515
1071b15379j4691J74234j64434Q7859J89302k75611o085J00151j94290R9188L17
1060b19439J53493J39103q2951M2286k04142N9631J4357j43237j81038K87883
1050a34054J4178J08603j04661Q6587k8713J56760L19261m10931j93495K7754
$$ plain form
1040 -158711 -53992 -5873 57264 -15933 28492 12735 -89371 -20292 71748 79971 113324
1029 113324 109911 97822 70100 32163 -211532 -109758 -1073 28874 204586 125985 -29832
$$ packed form
1040a58711J04719M8119O3137p3197M4425j5757j02106O9079R2040Q223L3353
1029A13324l413j2089k7722l7937k43695J01774J08685K9947J75712p8601j55817
$$ [...]
##END NTUPLES=NMR SPECTRUM
##END=
