##TITLE=1H_CA-9436-2
 200.13Hz, CDCl3.
 8 sc
 
18.3.2026
##JCAMPDX= 6.0         $$ Bruker NMR JCAMP-DX V2.0
##DATA TYPE= NMR SPECTRUM
##DATA CLASS= NTUPLES
##ORIGIN= UXNMR, Bruker Analytische Messtechnik GmbH
##OWNER= pz
$$ XWIN-NMR		Version 3.5
$$ Wed Mar 18 15:38:27 2026 Russian Standard Time (UT+4h)  she@DPX200
##.OBSERVE FREQUENCY= 200.1313
##.OBSERVE NUCLEUS= ^1H
##.ACQUISITION MODE= SIMULTANEOUS
##.ACQUISITION SCHEME= undefined
##.AVERAGES= 8
##.DIGITISER RES= 18
##SPECTROMETER/DATA SYSTEM= spect
##.PULSE SEQUENCE= zg30
##.SOLVENT NAME= D2O
##.SHIFT REFERENCE= (INTERNAL, D2O, 0, 15.4119)
##AUDIT TRAIL= $$ (NUMBER, WHEN, WHO, WHERE, WHAT)
$$ ##TITLE= Audit trail, XWIN-NMR		Version 3.5
$$ ##JCAMPDX= 5.01
$$ ##ORIGIN= Bruker BioSpin GmbH
$$ ##OWNER= she
$$ F:/spectra/data/she/nmr/H-C/1/pdata/1/auditp.txt
$$ ##AUDIT TRAIL=  $$ (NUMBER, WHEN, WHO, WHERE, WHAT)
(   1,<2026-03-18 15:36:54.00 +0400>,<she>,<DPX200>,
      <created by zg, POWCHK disabled, PULCHK disabled
       configuration hash MD5:
       00 E9 B6 7A A2 85 ED C7 34 08 36 98 17 FE 4E 26
       data hash MD5: 16K
       55 23 EA B0 D9 66 FC A9 43 7E 35 1C D7 CE F9 5F>)
(   2,<2026-03-18 15:37:05.65 +0400>,<she>,<DPX200>,
      <Start of raw data processing
       efp BC_mod = 2 LB = 0.25 FT_mod = 6 PKNL = 1 PHC0 = -3708.136 PHC1 = 10.9923 SI = 16K 
       data hash MD5: 16K
       53 29 36 8D A5 43 DB 2B 2B 97 89 65 11 F3 04 64>)
(   3,<2026-03-18 15:37:28.35 +0400>,<she>,<DPX200>,
      <pk PHC0 = -154.0552 PHC1 = -1.4 
       data hash MD5: 16K
       86 7C 58 97 65 19 03 7B B2 54 FD 21 3D FB 92 A7>)
(   4,<2026-03-18 15:37:34.67 +0400>,<she>,<DPX200>,
      <abs ABSG = 5 
       data hash MD5: 16K
       DC 96 B7 E0 6E CA 92 DB EA 9B 73 00 39 0F 8B C8>)
$$ ##END=
$$ 
$$ hash MD5
$$ E8 76 9E F8 A4 87 30 74 C2 C0 72 94 8B F7 3C 84
##$RELAX= 
##$RELAX= 
##$RELAX= 
##$RELAX= 
##$RELAX= 
##$RELAX= 
$$ Bruker specific parameters
$$ --------------------------
##$DU= <F:/spectra>
##$EXPNO= 1
##$NAME= <H-C>
##$PROCNO= 1
##$TYPE= <nmr>
##$USER= <she>
##$AMP= (0..31)
100 100 100 100 100 100 100 100 100 100 100 100 100 100 100 100 100 100 
100 100 100 100 100 100 100 100 100 100 100 100 100 100 
##$AQSEQ= 0
##$AQ_mod= 1
##$AUNM= <au_zg>
##$AUTOPOS= <>
##$BF1= 200.13
##$BF2= 200.13
##$BF3= 200.13
##$BF4= 200.13
##$BF5= 200.13
##$BF6= 200.13
##$BF7= 200.13
##$BF8= 200.13
##$BYTORDA= 1
##$CFDGTYP= 0
##$CFRGTYP= 5
##$CHEMSTR= <none>
##$CNST= (0..31)
1 1 145 1 1 1 1 1 1 1 1 1 1 1 1 1 1 1 1 1 1 1 1 1 1 1 1 1 1 1 1 1 
##$CPDPRG= <>
##$CPDPRG1= <>
##$CPDPRG2= <>
##$CPDPRG3= <>
##$CPDPRG4= <mlev>
##$CPDPRG5= <mlev>
##$CPDPRG6= <mlev>
##$CPDPRG7= <mlev>
##$CPDPRG8= <mlev>
##$CPDPRGB= <>
##$CPDPRGT= <>
##$D= (0..31)
0 0.7 0 0 0 0 0 0 0 0 0 0.03 0 0 0 0 0 0 0 0 0 0 0 0 0 0 0 0 0 0 0 0 
##$DATE= 1773833813
##$DBL= (0..7)
120 120 120 120 120 120 120 120 
##$DBP= (0..7)
150 150 150 150 150 150 150 150 
##$DBP07= 0
##$DBPNAM0= <>
##$DBPNAM1= <>
##$DBPNAM2= <>
##$DBPNAM3= <>
##$DBPNAM4= <>
##$DBPNAM5= <>
$$ [...]
##$SUBNAM3= <"">
##$SUBNAM4= <"">
##$SUBNAM5= <"">
##$SUBNAM6= <"">
##$SUBNAM7= <"">
##$SUBNAM8= <"">
##$SUBNAM9= <"">
##$SW= 18.0517328524113
##$SWIBOX= (0..15)
0 0 2 0 0 0 0 0 0 0 0 0 0 0 0 0 
##$SW_h= 3612.71676300578
##$TD= 16384
##$TD0= 1
##$TE= 0
##$TE2= 300
##$TE3= 300
##$TEG= 300
##$TL= (0..7)
0 120 120 120 120 120 120 120 
##$TP= (0..7)
150 150 150 150 150 150 150 150 
##$TP07= 0
##$TPNAME0= <>
##$TPNAME1= <>
##$TPNAME2= <>
##$TPNAME3= <>
##$TPNAME4= <>
##$TPNAME5= <>
##$TPNAME6= <>
##$TPNAME7= <>
##$TPOAL= (0..7)
0.5 0.5 0.5 0.5 0.5 0.5 0.5 0.5 
##$TPOFFS= (0..7)
0 0 0 0 0 0 0 0 
##$TUNHIN= 0
##$TUNHOUT= 0
##$TUNXOUT= 0
##$USERA1= <user>
##$USERA2= <user>
##$USERA3= <user>
##$USERA4= <user>
##$USERA5= <user>
##$V9= 5
##$VALIST= <valist>
##$VCLIST= <CCCCCCCCCCCCCCC>
##$VD= 0
##$VDLIST= <DDDDDDDDDDDDDDD>
##$VPLIST= <PPPPPPPPPPPPPPP>
##$VTLIST= <TTTTTTTTTTTTTTT>
##$WBST= 1024
##$WBSW= 4
##$XGAIN= (0..3)
0 0 0 0 
##$XL= 0
##$YL= 0
##$YMAX_a= 444775
##$YMIN_a= -419332
##$ZGOPTNS= <>
##$ZL1= 120
##$ZL2= 120
##$ZL3= 120
##$ZL4= 120
##$ABSF1= 15.52653
##$ABSF2= -2.525319
##$ABSG= 5
##$ABSL= 3
##$ALPHA= 0
##$AQORDER= 0
##$ASSFAC= 0
##$ASSFACI= 0
##$ASSFACX= 0
##$ASSWID= 0
##$AUNMP= <proc_1d>
##$AZFE= 0.1
##$AZFW= 0.1
##$BCFW= 0
##$BC_mod= 2
##$BYTORDP= 0
##$COROFFS= 0
##$CY= -3
##$DATMOD= 1
##$DC= 0
##$DFILT= <>
##$DTYPP= 0
##$F1P= 0
##$F2P= 0
##$FCOR= 1
##$FTSIZE= 16384
##$FT_mod= 6
##$GAMMA= 0
##$GB= 0
##$INTBC= 1
##$INTSCL= 3.241238e-09
##$ISEN= 128
##$LB= 0.25
##$LEV0= 0
##$LPBIN= 0
##$MAXI= 10000
##$MC2= 0
##$MEAN= 0
##$ME_mod= 0
##$MI= 1.114404
##$NCOEF= 0
##$NC_proc= -7
##$NLEV= 6
##$NOISF1= 3.799351
##$NOISF2= 2.8
##$NSP= 0
##$NTH_PI= 0
##$NZP= 0
##$OFFSET= 15.41194
##$PC= 1
##$PHC0= -3862.191
##$PHC1= 9.5923
##$PH_mod= 1
##$PKNL= yes
##$PPARMOD= 0
##$PSCAL= 0
##$PSIGN= 0
##$REVERSE= no
##$SF= 200.130021966923
##$SI= 16384
##$SIGF1= 3
##$SIGF2= 2
##$SINO= 0.751879
##$SIOLD= 32768
##$SREGLST= <19F.Aceton>
##$SSB= 0
##$STSI= 16384
##$STSR= 0
##$SW_p= 3612.71676300578
##$SYMM= 0
##$S_DEV= 0
##$TDeff= 16384
##$TDoff= 0
##$TI= <>
##$TILT= no
##$TM1= 0
##$TM2= 0
##$TOPLEV= 0
##$USERP1= <user>
##$USERP2= <user>
##$USERP3= <user>
##$USERP4= <user>
##$USERP5= <user>
##$WDW= 1
##$XDIM= 16384
##$YMAX_p= 549002765
##$YMIN_p= -770196
$$ End of Bruker specific parameters
$$ ---------------------------------
##NTUPLES= NMR SPECTRUM
##VAR_NAME=  FREQUENCY,     SPECTRUM/REAL,   SPECTRUM/IMAG
##SYMBOL=    X,             R,               I
##VAR_TYPE=  INDEPENDENT,   DEPENDENT,       DEPENDENT
##VAR_FORM=  AFFN,          ASDF,            ASDF
##VAR_DIM=   16384,         16384,           16384
##UNITS=     HZ,            ARBITRARY UNITS, ARBITRARY UNITS
##FACTOR=    0.220516191357247, 1,           1
##FIRST=     3084.39181489795, 0,            0
##LAST=      -528.324948107827, 0,           0
##MIN=       -528.324948107827, -770196,     0
##MAX=       3084.39181489795, 549002765,    0
$$ Real data points
##PAGE= N=1
##DATA TABLE= (X++(R..R)), XYDATA
$$ [...]
5977D1801849l299043k677839k215410j799010j254089q10426l93297J87334O36701
$$ 41801849 38502806 35824967 33609557 31810547 30556458 29746032 29352735 29540069 30176770
5968C0176770O76176J59494p68988j483307j827423j821029j557652j306015j041351
$$ 30176770 30852946 31012440 30243452 28760145 26932722 25111693 23554041 22248026 21206675
5959B1206675r23688q31195p19227o22773o09219n53326n59890m17071l91109
$$ 21206675 20282987 19451792 18732565 18109792 17500573 16947247 16387357 15970286 15579177
5950A5579177l43205k81130l08514k01640j07003j02561j3409q191m6623P259
$$ 15579177 15235972 14954842 14646328 14444688 14337685 14235124 14221715 14213524 14166901 14174160
5940A4174160L5379J70461J67699K70434K30320J4499r423j10761k39389k39158
$$ 14174160 14209539 14380000 14547699 14818133 15048453 15062952 15053529 14942768 14703379 14464221
5930A4464221j82321j06593j37382n3031P8859J63906J88031L21911M83302O19391
$$ 14464221 14281900 14175307 14037925 13984894 14063753 14227659 14415690 14737601 15220903 15840294
5920A5840294P24057Q64330Q53735O80439N19535K01462j24988k99084k71936
$$ 15840294 16564351 17428681 18282416 18962855 19482390 19683852 19558864 19259780 18987844
5911A8987844k74458j86454j11437o9647O112J00153K44980M33962N42132Q03696
$$ 18987844 18713386 18526932 18415495 18345848 18351960 18452113 18697093 19131055 19673187 20476883
5901B0476883J006701J182380J470247J520101J549372J417847J168435P12799
$$ 20476883 21483584 22665964 24136211 25656312 27205684 28623531 29791966 30504765
5893C0504765L09439l6699l73588l64987l22088j68682n5122N6671L54461O42134
$$ 30504765 30814204 30777505 30403917 30038930 29716842 29548160 29493038 29549709 29904170 30546304
5883C0546304P49305Q22552Q58525Q41387Q68434J107408J215255J164643Q35307
$$ 30546304 31295609 32118161 32976686 33818073 34686507 35793915 37009170 38173813 39009120
5874C9009120O25080M32209M44437L81411J57343q483j96443k60997k43921R51
$$ 39009120 39634200 40066409 40510846 40892257 41049600 41041117 40844674 40583677 40339756 40340707
5864D0340707J92183N06895P72583J012888Q65079N05655k3385l32480m67759
$$ 40340707 40532890 41039785 41812368 42825256 43690335 44195990 44172605 43840125 43372366
5855D3372366k90650j42903j5873m7181k80310p45715j021271j088082r75212
$$ 43372366 43081716 42938813 42922940 42875759 42595449 41849734 40828463 39740381 38765169
5846C8765169o77881k54912J88482L93049N03970O20852M93554L07253K16302
$$ 38765169 38087288 37832376 38020858 38413907 38917877 39538729 40032283 40339536 40555838
5837D0555838K11270Q1251l36602r97359j501319j874376k014664j837659j617791
$$ 40555838 40767108 40848359 40511757 39514398 38013079 36138703 34124039 32286380 30668589
5828C0668589j391004j169950r63202p92129o87143n36630k19672N0224M09299
$$ 30668589 29277585 28107635 27144433 26352304 25665161 25128531 24908859 24959083 25368382
5819B5368382O68938O31205L80053k2746n28153q67859j177103j236677j174282
$$ 25368382 26037320 26668525 27048578 27025832 26497679 25629820 24452717 23216040 22041758
5810B2041758j185873j167032j273960j166210j073373r94202o79144o00266m67892
$$ 22041758 20855885 19688853 18414893 17248683 16175310 15181108 14501964 13901698 13433806
5801A3433806l38110j99770k19327j81462j59404j14457j30201j39211j11370
$$ 13433806 13095696 12895926 12676599 12495137 12335733 12221276 12091075 11951864 11840494
5792A1840494k23257l44419m75519n38137n16132o02575m94978m30232n03673
$$ 11840494 11617237 11272818 10797299 10259162 9743030 9140455 8645477 8215245 7711572
5783G711572m18989k26951j74672j38878j53937r5629m9080j76883j09548j08170
$$ 7711572 7292583 7065632 6890960 6752082 6598145 6502516 6453436 6276553 6167005 6058835
5773F058835j33277r5728j96169j05599q3686r2045k15464j73441k6638j25976
$$ 6058835 5925558 5829830 5633661 5528062 5444376 5352331 5136867 4963426 4936788 4810812
5763D810812r2073p9606o2103p0603j01327M581l6999J0226k064p5654j13487
$$ 4810812 4718739 4639133 4577030 4506427 4405100 4409681 4372682 4382908 4380844 4305190 4191703
5752D191703j0300R0379K3341o0464K9140k826q8825k9911m1680P329q7389n484
$$ 4191703 4181403 4271782 4295123 4234659 4263799 4260973 4172148 4142237 4100557 4107886 4020497 4015013
5740D015013l1666p7676l8117j7730q160P3759o488K0875k610k443j31460o2964
$$ 4015013 3983347 3905671 3867554 3849824 3841664 3915423 3908935 3929810 3927200 3924757 3793297 3730333
5728C730333J811m3511L5903J6906O6046J7348J8188l3350L018M2756Q1577K6589
$$ 3730333 3732144 3688633 3724536 3741442 3807488 3824836 3843024 3809674 3812692 3855448 3937025 3963614
5716C963614j845O311R021L2046M0310L5753l3388j0242n98N6594M0750l548m8606
$$ 3963614 3961769 3968080 3977101 4009147 4049457 4085210 4051822 4041580 4040982 4097576 4138326 4134778 4086172
5703D086172Q7237R9477R4608M0960k2025l721p7164j02117k7069l2130n3761
$$ 4086172 4173409 4272886 4367494 4408454 4386429 4382708 4305544 4203427 4176358 4144228 4090467
5692D090467j1588n6772p228m4853l1572L0409K6351k8545j9418L422j7853m3581
$$ 4090467 4078879 4022107 4014879 3970026 3938454 3968863 3995214 3966669 3947251 3950673 3932820 3889239
5680C889239n6260k7916k6363k1229J1690l7773n9904J4016J2772k8529O1338
$$ 3889239 3832979 3805063 3778700 3757471 3769161 3731388 3671484 3685500 3698272 3669743 3731081
5669C731081M7350k3238j1995o0200r3015o6183p6493J9191p121Q134J4749m2231
$$ 3731081 3778431 3755193 3743198 3682998 3589983 3523800 3447307 3466498 3459377 3467511 3482260 3440029
5657C440029l9503j548p9219p1738O6246J7363l0986L5337j2355l3244L0027O2106
$$ 3440029 3400526 3398978 3319759 3248021 3314267 3331630 3300644 3335981 3323626 3290382 3320409 3382515
5645C382515q341n9829P648O1049p908j9075l0639P0006J1429j03595J8523k0846
$$ 3382515 3374174 3314345 3321993 3383042 3375134 3356059 3325420 3395426 3406855 3303260 3321783 3300937
5633C300937l2778k1900j4578R0133L099j911J6268k8228O7419L8966M823J9863
$$ 3300937 3268159 3246259 3231681 3321814 3324913 3323002 3339270 3311042 3378461 3417427 3422250 3442113
5621C442113O5063o2285L6934M4423Q552R770O3173N4487K2041m6614N873L4508
$$ 3442113 3507176 3444891 3481825 3526248 3534800 3544570 3607743 3662230 3684271 3637657 3643530 3678038
5609C678038r7508m9300J4542K6347j6112l1488O3145j3028J746N287l594P8957
$$ 3678038 3580530 3531230 3545772 3572119 3556007 3524519 3587664 3574636 3576382 3581669 3578075 3657032
5597C657032m1110P1952N1609J6624M1625q6925M8052r081j34471q7527K1759
$$ 3657032 3615922 3687874 3739483 3756107 3797732 3710807 3758859 3749778 3615307 3527780 3549539
5586C549539J789o656n2422J4375J7218j9433k9465j7190O2529K1392M4326L8271
$$ 3549539 3551328 3544672 3492250 3506625 3523843 3504410 3474945 3457755 3520284 3541676 3586002 3624273
5574C624273K1585j6544l3259R7803J02877R0956J64236J74219J08055J59820
$$ 3624273 3645858 3629314 3596055 3693858 3796735 3887691 4051927 4226146 4334201 4494021
5564D494021J67676M8285N7544l3115J6783r395J5384K2541n0414N6282O4082
$$ 4494021 4661697 4709982 4767526 4734411 4751194 4741799 4757183 4779724 4729310 4785592 4849674
5553D849674j4675l5970K001k7042M7551L3566n7943k3356m7912Q2k4688L459
$$ 4849674 4834999 4799029 4801030 4773988 4821539 4855105 4797162 4773806 4725894 4725976 4701288 4704747
5541D704747J3344j2555r7285p2944p5530K9904J12560R5073J20070Q9365J01057
$$ 4704747 4718091 4705536 4608251 4535307 4459777 4489681 4602241 4697314 4817384 4906749 5007806
5530E007806j535p4115j0576k2598l5040p7936K1901m1820k211R4139L3628K2034
$$ 5007806 5006271 4932156 4921580 4898982 4863942 4786006 4807907 4766087 4763876 4858015 4891643 4913677
5518D913677k2952O40o6378l9113K5655M5933K7805n2287l8134o0463q063k5164
$$ 4913677 4890725 4891365 4824987 4785874 4811529 4857462 4885267 4832980 4794846 4734383 4726320 4701156
5506D701156r3128j09132j60101p2766j20273j19503j37022q0690l1929n3265
$$ 4701156 4608028 4498896 4338795 4266029 4145756 4026253 3889231 3808541 3776612 3723347
5496C723347L0256p384r3848r3685Q2349O292m1140m4764k4554n048L8567L4521
$$ 3723347 3753603 3746219 3652371 3558686 3641035 3647327 3606187 3561423 3536869 3531821 3570388 3604909
5484C604909o1321p99k7946N6106J41300P45o0813m1697O2073K4605j3201m850
$$ 3604909 3543588 3542789 3514843 3570949 3712249 3712994 3652181 3610484 3672557 3697162 3683961 3679111
5472C679111k784l6024r4827K6629Q2868O3768o987k5349n9201m4263Q1753m1797
$$ 3679111 3676327 3640303 3545476 3572105 3654973 3718741 3711754 3686405 3627204 3582941 3664694 3622897
5460C622897k8235j0117O0743m8483M2118L069j05721n8293m2051P609m3062k5664
$$ 3622897 3594662 3584545 3645288 3596805 3638923 3641992 3536271 3477978 3435927 3443536 3400474 3374810
5448C374810J1941K8671p511j0589q2135J2594K2193J8007K1410J0907k9245O5892
$$ 3374810 3386751 3415422 3407911 3397322 3315187 3327781 3349974 3367981 3389391 3400298 3371053 3436945
5436C436945j4567r839P813K4567l2376o4760J3176R3744p619j4135L8866p053
$$ 3436945 3422378 3412539 3420352 3444919 3412543 3347783 3360959 3454703 3447084 3432949 3471815 3464762
5424C464762j1248Q3841J5498l3586o4605J9565o479k7450N607L613M7173J1245
$$ 3464762 3453514 3537355 3552853 3519267 3454662 3474227 3467748 3440298 3445905 3449518 3496691 3507936
5412C507936n3786o2041n8182l9030j7801N8916M4217L3988P3854J8676p5116
$$ 3507936 3454150 3392109 3333927 3294897 3277096 3336012 3380229 3414217 3488071 3506747 3431631
5401C431631K956j0441N9664P8907K4631o701m6985n5674j4278n8352j9417L2111
$$ 3431631 3434587 3424146 3483810 3562717 3587348 3580647 3533662 3477988 3463710 3405358 3385941 3418052
5389C418052m39k8199m4035L0544N0225L9933l885J5430L1734p644o073O1280
$$ 3418052 3417613 3389414 3345379 3375923 3426148 3466081 3462196 3477626 3509360 3501716 3495643 3556923
5377C556923Q272o1172j2657L6349k6584K7927P0638J24370o8571P1470N8634
$$ 3556923 3565195 3504023 3491366 3527715 3501131 3529058 3599696 3724066 3655495 3726965 3785599
5366C785599q32j5395Q0856m0250l2993N6511k7689j5934R4814N0211P3452K7993
$$ 3785599 3784767 3769372 3850228 3809978 3776985 3833496 3805807 3789873 3884687 3934898 4008350 4036343
5354D036343n0782K6380l746q391M5561J7425M1076R934k2678M5886j9859l0907
$$ 4036343 3985561 4011941 4008195 3999804 4045365 4062790 4103866 4113800 4091122 4137008 4117149 4086242
5342D086242J03328M2842M7460l5773n2893J3979n7411J4672Q4875M4255j9138
$$ 4086242 4189570 4232412 4279872 4244099 4191206 4205185 4147774 4162446 4247321 4291576 4272438
5331D272438j8235J0225n9564K3278J9614m2711M1952L5623k7569j1143n8262
$$ 4272438 4254203 4264428 4204864 4228142 4247756 4205045 4246997 4282620 4255051 4243908 4185646
5320D185646n6917O2791l3841j05061r259Q0982N6388N9576j408J10224l1032
$$ 4185646 4128729 4191520 4157679 4052618 4043359 4124341 4180729 4240305 4238897 4349121 4318089
5309D318089R4524J54696n9362k7343J0071P254J4260J7435K7259n1456k0799
$$ 4318089 4412613 4567309 4507947 4480604 4490675 4497929 4512189 4529624 4556883 4505427 4484628
5298D484628j2960N0827J2709m1703J5657q787P0782N0914J0150L17l2699m19
$$ 4484628 4471668 4522495 4535204 4493501 4509158 4500371 4571153 4622067 4632217 4632534 4599835 4599416
5286D599416N1157J32697j2107Q3275R3983j2775O5430O9978M6014L905J4162
$$ 4599416 4650573 4783270 4771163 4854438 4948421 4935646 5001076 5071054 5117068 5120973 5135135
5275E135135J31577P8863R3865J92083J56207J31297K85517L95185M96958N37190
$$ 5135135 5266712 5345575 5439440 5631523 5787730 5919027 6204544 6599729 7096687 7633877
5265G633877N91525N00203J86518j77902k54625k45931j59731L2289K43850L81129
$$ 7633877 8225402 8725605 8912123 8734221 8479596 8233665 8073934 8106223 8350073 8731202
5255H731202O31261R21749J016596R65022P96604N79352K30503N8972J23445Q1165
$$ 8731202 9362463 10284212 11300808 12265830 13062434 13641786 13872289 13931261 14054706 14135871
5245A4135871r3739n4544O3464K59991J98234J90612K25656L53321K90948K91351
$$ 14135871 14042132 13987588 14051052 14311043 14509277 14699889 14925545 15278866 15569814 15861165
5235A5861165K89096N87161O10860M92770L92623m8740l93834n78556o83762m43368
$$ 15861165 16150261 16737422 17348282 17841052 18233675 18184935 17791101 17212545 16528783 16085415
5225A6085415j80774o6745l07286m02506l08562k34094k89284l81895j63730k0402
$$ 16085415 15904641 15837896 15530610 15128104 14819542 14585448 14296164 13914269 13750539 13730137
5215A3730137Q0808M4352J27763J27254j23957m87281q95090j029611j078047
$$ 13730137 13810945 13855297 13983060 14110314 13986357 13499076 12603986 11574375 10496328
5206A0496328r17077o48652n15269l54972o4282Q5434J80671L10409K26706j03135
$$ 10496328 9579251 8930599 8415330 8060358 7996076 8081510 8262181 8572590 8799296 8696161
5196H696161m16074n46021n87429m53219m46169k92261k10742j64802j50484j91004
$$ 8696161 8280087 7734066 7146637 6693418 6247249 5954988 5744246 5579444 5428960 5237956
5186E237956q6866n4904R452p1763r3680L8428n0931j5967J0089n1065o0977o475
$$ 5237956 5151090 5096186 5105638 5033875 4940195 4978623 4927692 4911725 4921814 4870749 4809772 4803297
5174D803297l9979p2205k2950O2832l972Q36j8879l6067J0923K6527J1907O258
$$ 4803297 4763318 4691113 4668163 4730995 4727023 4727859 4708980 4672913 4683836 4710363 4722270 4728528
5162D728528M6182l337M794K4144j0068K5622K2574J6856q2664n3039P1216J829
$$ 4728528 4774710 4771373 4776167 4800311 4790243 4815865 4838439 4855295 4772631 4719592 4790808 4792637
5150D792637K6065Q3265k5530O3931Q522J1078m087M731M323p149M1723l1541
$$ 4792637 4818702 4901967 4876437 4940368 4948890 4959968 4955881 4960612 4964935 4957786 4999509 4967968
5138D967968m2591J7128K2434L5621M6950O3056m0888k3546O0969R7812K115o9413
$$ 4967968 4925377 4942505 4964939 5000560 5047510 5110566 5069678 5046132 5107101 5204913 5207028 5137615
5126E137615O1875k9639P1291J06367L4340k1334L0029J19605K7663L4998R9781
$$ 5137615 5199490 5169851 5241142 5347509 5381849 5360515 5390544 5510149 5537812 5572810 5672591
5115E672591J27277J95734J35748Q1709J25185N0957n0626j06739k4882l0609
$$ 5672591 5799868 5995602 6131350 6213059 6338244 6389201 6338575 6231836 6206954 6176345
5105F176345q6424J4739m2139J564M6582Q6265N0677N8281J08064J11127R1696
$$ 6176345 6089921 6104660 6062521 6064085 6110667 6196932 6247609 6305890 6413954 6525081 6616777
5094F616777o678L5380J00363L8326P4324k2611k9970L9156k6855o7156Q6197
$$ 6616777 6610099 6645479 6745842 6784168 6858492 6835881 6805911 6845067 6818212 6751056 6837253
5083F837253l8587R6844R3579Q6941J44361J20329K22542N0437O3094L6237J02532
$$ 6837253 6798666 6895510 6989089 7076030 7220391 7340720 7563262 7613699 7676793 7713030 7815562
5072G815562J4521J8635k4752j8273n754j04663L7797P0407J33736J37374J14491
$$ 7815562 7830083 7848718 7823966 7805693 7799939 7695276 7733073 7803480 7937216 8074590 8189081
5061H189081P1532J64007J02118K0498p2871r7171m9819M997J1220m7761o0879
$$ 8189081 8260613 8424620 8526738 8547236 8474365 8377194 8327375 8332372 8343592 8295831 8234952
5050H234952j10357m9793L0796P2508M2775J11985N4300P1359J3338O1883J0664
$$ 8234952 8124595 8074802 8105598 8178106 8220881 8332866 8387166 8458525 8471863 8533746 8544410
5039H544410l1463O0934j0022o1996L3383N3460n0424O488P640O7307O5844L0247
$$ 8544410 8512947 8573881 8563859 8501863 8535246 8588706 8538282 8544770 8552410 8619717 8685561 8715808
5027H715808J33276P3372J65423K37745J29547J96604L04987L53456L87150M14216
$$ 8715808 8849084 8922456 9087879 9325624 9455171 9651775 9956762 10310218 10697368 11111584
5017A1111584M88305N79545O91743R40870J241897J531281J848311K078203K264391
$$ 11111584 11599889 12179434 12871177 13812047 15053944 16585225 18433536 20511739 22776130
5008B2776130J991139J195246J12777r06536j386168j496263j355935j176071
$$ 22776130 24767269 25962515 26075292 25168756 23782588 22286325 20930390 19754319
5000A9754319r45077o82978l50531r0708J92362M43663Q21645J173343J512567
$$ 19754319 18809242 18126264 17775733 17685025 17877387 18321050 19142695 20316038 21828605
4991B1828605J848320J773980J284179K67584p80551j526971j720060j668282
$$ 21828605 23676925 25450905 26735084 27002668 26222117 24695146 22975086 21306804
4983B1306804j387888j145625r58646p31720m88989l13449j64564M7923O6659
$$ 21306804 19918916 18773291 17814645 17082925 16593936 16280487 16115923 16163846 16230505
4974A6230505K16891L65083N26992N89680O79923P20857O10218M19488K39503
$$ 16230505 16447396 16812479 17339471 17929151 18609074 19329931 19940149 20359637 20599140
4965B0599140K30842J62007K55564M65201N74442P92796J048164J406033J860225
$$ 20599140 20829982 20991989 21247553 21712754 22287196 23079992 24128156 25534189 27394414
4956B7394414K293647K789116L119869L156092K296037R87947m37612j589567
$$ 27394414 29688061 32477177 35597046 38753138 41049175 42037122 41599510 40009943
4948D0009943k062033k074308j817339j375385r75572n57649k29242P5971M79335
$$ 40009943 37947910 35873602 34056263 32680878 31705306 31147657 30918415 30994386 31473721
4939C1473721Q64396J200750J649784K056523J984568J460514M48892q83582j897939
$$ 31473721 32338117 33538867 35188651 37245174 39229742 40690256 41139148 40255566 38357627
4930C8357627k237082k299575j981988j651593j377955j086107p28364m30310
$$ 38357627 36120545 33820970 31838982 30187389 28809434 27723327 26994963 26564653
4922B6564653k70757j00693J90064K85905M94036O47591P38621R05745J050082
$$ 26564653 26293896 26193203 26383267 26669172 27163208 27810799 28549420 29455165 30505247
4913C0505247J022778R18132P31841N44926M11975M47806O72838Q28197J112180
$$ 30505247 31528025 32446157 33177998 33722924 34134899 34582705 35255543 36083740 37195920
4904C7195920J332064J514437J818359K007526K271009K511587K772566K962344
$$ 37195920 38527984 40042421 41860780 43868306 46139315 48650902 51423468 54385812
4896E4385812L189967L135495K896129K516706K021425J568729J122601R78303
$$ 54385812 57575779 60711274 63607403 66124109 68145534 69714263 70836864 71815167
4888G1815167Q58168Q66296J047676J219191J388216J502213J613263J905436
$$ 71815167 72673335 73539631 74587307 75806498 77194714 78696927 80310190 82215626
4880H2215626J997230K237711K386351K592361K835337L157350L390621L665992
$$ 82215626 84212856 86450567 88836918 91429279 94264616 97421966 100812587 104478579
4872A04478579L847122M005141M470470N124379N538934N094746L278312O81535
$$ 104478579 108325701 112330842 116801312 121925691 127464625 132559371 135837683 136519218
4864A36519218j103988j706276j382163j089365r03493q95511r50398r74423r64465
$$ 136519218 135415230 133708954 132326791 131237426 130333933 129438422 128488024 127513601 126549136
4855A26549136p07475n34812j0723N46204J565937K450571K889546K402713J665066
$$ 126549136 125841661 125306849 125296126 125842330 127408267 129858838 132748384 135151097 136816163
4846A36816163J114742L22429j431184l072386l435954k789553j722526q33762
$$ 136816163 137930905 138253334 136822150 133749764 130313810 127524257 125801731 124967969
4838A24967969k02957J51455N50058Q47029R81901Q90561J087602J491320K190103
$$ 124967969 124765012 124916467 125466525 126313554 127295455 128186016 129273618 130764938 132955041
4829A32955041L044630L685530K811144L98651j796234k569992k050624r88158
$$ 132955041 135999671 139685201 142496345 142894996 141098762 138528770 136478146 135489988
4821A35489988p7860P18145J319582J875392K107211K192387K061998J706463
$$ 135489988 135412128 136130273 137449855 139325247 141432458 143624845 145686843 147393306
4813A47393306J388476R03393K79897m08558j085960j839179k171246k272254
$$ 147393306 148781782 149685175 149965072 149556514 148470554 146631375 144460129 142187875
4805A42187875k302123j810600j174407o9797J081568K352632L648302M938745
$$ 142187875 139885752 138075152 136900745 136830948 137912516 140265148 143913450 148852195
4797A48852195O060318O959911P742899Q420014R033335R229306Q918834P493050
$$ 148852195 154912513 161872424 169615323 178035337 187068672 196297978 205216812 212709862
4789B12709862M984809K171534k45982k160518l360213m152683m765635n289505
$$ 212709862 217694671 219866205 219620223 217459705 214099492 209946809 205181174 199891669
4781A99891669o000925o410149o582682o381347n686144m539829l276575k004030
$$ 199891669 193890744 187480595 180897913 174516566 168830422 164290593 161014018 159009988
4773A59009988j097001r63890j569244k665930l598579m067536m002650l762402
$$ 159009988 157912987 156949097 155379853 152713923 149115344 145047808 141045158 137282756
4765A37282756l480033l269902l208609l469821l919494m259875m684769m884876
$$ 137282756 133802723 130532821 127324212 123854391 119934897 115675022 110990253 106105377
4757A06105377m793315m743596m612485m406934m394656m290139m137511l858812
$$ 106105377 101312062 96568466 91955981 87549047 83154391 78864252 74726741 70867929
4749G0867929l463965l083229k473462k012816j517971r25823l78720K05002Q77161
$$ 70867929 67403964 64320735 61847273 59834457 58316486 57390663 57011943 57216945 58094106
4740E8094106J345801J524105R41320j88406j530900k666638l281784l434457
$$ 58094106 59439907 60964012 61905332 61716926 60186026 57519388 54237604 50803147
4732E0803147l130101k805377k406273k006565j568607j238768j045921p05240
$$ 50803147 47673046 44867669 42461396 40454831 38886224 37647456 36601535 35896295
4724C5896295l13588j33568k9622l4092k95657m55296o71214q32509o79338n01699
$$ 35896295 35582707 35449139 35419517 35385425 35089768 34634472 33963258 33130749 32451411 31949712
4714C1949712l22518j73389Q4865L03197O01908R04048J160831J542724K049947
$$ 31949712 31627194 31453805 31538670 31841867 32443775 33347823 34508654 36051378 38101325
4705C8101325K357256K301005J632169N13209q58192j941113k295311k346890
$$ 38101325 40458581 42759586 44391755 44904964 44046772 42105659 39810348 37463458
4697C7463458k107787j659001j239942q48309m07216j00960K57929M79943N66168
$$ 37463458 35355671 33696670 32456728 31608419 31201203 31100243 31358172 31838115 32404283
4688C2404283N20960N95812P09114P55387P47619O63178N10362K41175k66844
$$ 32404283 32925243 33521055 34230169 34985556 35733175 36396353 36906715 37147890 36881046
4679C6881046m66462m09681J5532N66007J141565J520957J172619L85129p52330
$$ 36881046 36414584 36004903 36020435 36586442 37728007 39248964 40421583 40806712 40054382
4670D0054382j712356k156444k233118j978913j529845j181676j133812r92873
$$ 40054382 38342026 36185582 33952464 31973551 30443706 29262030 28128218 27135345
4662B7135345q87472p40381o92689m11382j94158P1430L55085N57306O21540O39678
$$ 27135345 26247873 25507492 24814803 24403421 24209263 24280693 24635778 25193084 25814624 26454302
4652B6454302N87061N07540O84549Q62413J016700R02264N69369p362k22686m4614
$$ 26454302 27041363 27548903 28233452 29095865 30112565 31014829 31584198 31576836 31354150 31309536
4642C1309536M01622R34806J359206J632805J276262M38913n65905j402268j754706
$$ 31309536 31711158 32645964 34005170 35637975 36914237 37353150 36787245 35384977 33630271
4633C3630271j782944j631236j486821j284376j286760j171717r66950q99414
$$ 33630271 31847327 30216091 28729270 27444894 26158134 24986417 24019467 23120053
4625B3120053o43329l79076M6989M16853P22038J192447J512579J358341P94489
$$ 23120053 22476724 22097648 22144637 22561490 23283528 24475975 25988554 27346895 28141384
4616B8141384j18779j163562j770871j922841j816107j563774j338510j113818
$$ 28141384 28022605 26859043 25088172 23165331 21349224 19785450 18446940 17333122
4608A7333122r33657n99535n36367m55043k13483q7811J00760J40010K85168K57983
$$ 17333122 16399465 15799930 15263563 14808520 14595037 14507226 14607986 14747996 15033164 15291147
4598A5291147J70245P0712j0869j52163j49428k02137j9934J20250L14130M82857
$$ 15291147 15461392 15532104 15521235 15369072 15219644 15017507 14997573 15117823 15431953 15914810
4588A5914810P77428R72195J345410J592617J649208J505302Q08423j91904j015363
$$ 15914810 16692238 17664433 19009843 20602460 22251668 23756970 24565393 24373489 23358126
4579B3358126j407513j396796j324704j152475q42035n14864k13515J58583O87092
$$ 23358126 21950613 20553817 19229113 18076638 17234603 16719739 16506224 16664807 17351899
4570A7351899J331959K122037K777640K468347Q37252j035236k100190k171332
$$ 17351899 18683858 20805895 23583535 26051882 26889134 25853898 23753708 21582376
4562B1582376j627963j038224l25570L59570J091344J804671K353181J942606
$$ 21582376 19954413 18916189 18590619 18950189 20041533 21846204 24199385 26141991
4554B6141991J82271j479628k194952j996674j320971m42594M98658J374631J882577
$$ 26141991 26324262 24844634 22649682 20653008 19332037 18889443 19388101 20762732 22645309
4545B2645309J398030o0685j470004k113774k028236j474229q98248k93135K42685
$$ 22645309 24043339 23982654 22512650 20398876 18370640 16896411 15998163 15705028 15947713
4536A5947713R49498J578112J826618J263073m53076j817703k334905k170382
$$ 15947713 16897211 18475323 20301941 21565014 21111938 19294235 16959330 14788948
4528A4788948j682799j243318j008229q19222n83878m22206m07084l02502k16404
$$ 14788948 13106149 11862831 10854602 10035380 9451502 9029296 8622212 8319710 8103306
4519H103306j54206j83908j72733j80863p8123j82267j24740q8394j08494j22426
$$ 8103306 7949100 7765192 7592459 7411596 7333473 7151206 7026466 6938072 6829578 6707152
4509F707152r7494o4547o0206l6724m8164p2085l6436L045J054n4488j7623r9443
$$ 6707152 6609658 6545111 6484905 6448181 6400017 6327932 6291496 6294541 6295595 6241107 6223484 6124041
4497F124041M2947k3791j5464o7133r8975K8870l0907j4905k6857l8282n5350
$$ 6124041 6166988 6143197 6127733 6060600 5961625 5990495 5959588 5944683 5917826 5879544 5824194
4486E824194n9626j8451J8996l8759L060p0340p0867l7500l5084r011l9451R128
$$ 5824194 5764568 5746117 5765113 5726354 5729414 5659074 5588207 5550707 5515623 5506612 5467161 5476289
4474E476289J2011k3545K9344L7897n5354L8589J4342m9398K3989L9753o0592
$$ 5476289 5488300 5464755 5494099 5531996 5476642 5515231 5529573 5480175 5504164 5543917 5483325
4463E483325o2728k0594n8598J6535q9758n8570p850q6101K840M52r975J7654
$$ 5483325 5420597 5400003 5341405 5357940 5268182 5209612 5201762 5115661 5118501 5118953 5108978 5126632
4451E126632M2563r5592j8025N7516L4650K9798K2127k6750P727P3409J5641L778
$$ 5126632 5169195 5073603 5055578 5113094 5147744 5177542 5199669 5172919 5180646 5254055 5269696 5273474
4439E273474R900K8236N5367K0339N2567j2109J3893J24899N3075J09289R5855
$$ 5273474 5283374 5311610 5366977 5387316 5439883 5427774 5441667 5566566 5619641 5728930 5824785
4428E824785K40303K20754J58753J2972j53476k65412k34505j06784K1535j6210
$$ 5824785 6065088 6285842 6444595 6457567 6304091 6038679 5804174 5697390 5718925 5702715
4418E702715J7479j6269n9223k6099L9599Q6590l3506l7996J10434N9609J4837
$$ 5702715 5720194 5703925 5644702 5618603 5658202 5744792 5711286 5673290 5783724 5843333 5858170
4407E858170o185N2931R0397m7777j0685R6666k3737J6182N0996L2265K5300M1749
$$ 5858170 5851985 5904916 5995313 5947536 5936851 6033517 6009780 6025962 6076958 6109223 6134523 6176272
4395F176272M6495J00306L7145k1666O310N1600J4318m492N3190O7291N8625j537
$$ 6176272 6222767 6323073 6360218 6338552 6344862 6396462 6410780 6406288 6459478 6526769 6585394 6583857
4383F583857O526J09744j9806Q553J7444P9947N4776l1795R6683P5887M6053N8518
$$ 6583857 6590383 6700127 6680321 6688874 6706318 6786265 6841041 6809246 6905929 6981816 7027869 7086387
4371G086387J8739L1344J11745J50943l113K4975M1939J3998p566L6725M9579
$$ 7086387 7105126 7136470 7248215 7399158 7396045 7421020 7462959 7476957 7469391 7506116 7555695
4360G555695M3525Q4545m3121Q6188J31504L2202R3019P0173M5838N3803M7517
$$ 7555695 7599220 7683765 7640644 7726832 7858336 7890538 7983557 8053730 8099568 8153371 8200888
4349H200888K3946M4539Q7310L1089M4474n702O9731J10939N1144n4818L3900
$$ 8200888 8224834 8269373 8356683 8387772 8432246 8426544 8496275 8607214 8658358 8603540 8637440
4338H637440J48456Q0293L3937M9748J02905J01614R0048J95394J00037J39658
$$ 8637440 8785896 8866189 8900126 8949874 9052779 9154393 9244441 9439835 9539872 9679530
4328I679530R6998J48839J36025J79386K37778K50775K86569K67996K06421K84643
$$ 9679530 9776528 9925367 10061392 10240778 10478556 10729331 11015900 11283896 11490317 11774960
4318A1774960K92855L17963L09038K40115K79078J93760J38323K4453L7982Q5323
$$ 11774960 12067815 12385778 12694816 12934931 13214009 13407769 13546092 13570545 13608527 13693850
4308A3693850O691O3970L2469M047J41684M4821J1787L7113J8021k5294N124J5178
$$ 13693850 13700541 13764511 13796980 13801027 13942711 13987532 13999319 14036432 14054453 14029159 14034283 14049461
4296A4049461L4227P4980R2549Q2076J71595J45376R7181P1107J84762K84533
$$ 14049461 14083688 14158668 14251217 14333293 14504888 14650264 14747445 14818552 15003314 15287847
4286A5287847K02282L21120L42070M09130M92768N44700P00612P28645P75807
$$ 15287847 15490129 15811249 16153319 16562449 17055217 17599917 18300529 19029174 19804981
4277A9804981Q90349R26882J115744J330055J584948J753301K207869K574081
$$ 19804981 20695330 21622212 22737956 24068011 25652959 27406260 29614129 32188210
4269C2188210K957713L703784M609941N662511P094288Q637832J0410499J1494274
$$ 32188210 35145923 38849707 43459648 49122159 56216447 64854279 75264778 86759052
4261H6759052J1150373R051597N507096K026982m9162n11322L85893J174239Q42855
$$ 86759052 97909425 106961022 112468118 114495100 114445938 113934616 114320509 115494748 116337603
4252A16337603j325154m955469q590680j0861116j1382667j0496230q989597p469585
$$ 116337603 115012449 110056980 101466300 90605184 79222517 68726287 59736690 52267105
4244E2267105o050804m939632m073597l253679k745207k197637j811068j436178
$$ 52267105 46216301 41276669 37203072 33949393 31204186 29006549 27195481 25759303
4236B5759303j246227j194781r06586q32533p05531o29461n93941n70003l51584
$$ 25759303 24513076 23318295 22411709 21579176 20873645 20244184 19650243 19080240 18728656
4227A8728656l67986l32880l66556k48237l03199j23355j49112k12340j61196
$$ 18728656 18360670 18027790 17661234 17412997 17109798 16986443 16837331 16624991 16463795
4218A6463795j00486q9781m7459n4744J1091K3133J9624K3791L5070J02496M7841
$$ 16463795 16363309 16273528 16226069 16171325 16182416 16205549 16225173 16248964 16284034 16386530 16434371
4207A6434371J29897L8303L0728J08504J9658J72800J31299J65149K01124L02707
$$ 16434371 16564268 16602571 16633299 16741803 16761461 16934261 17065560 17230709 17431833 17734540
4197A7734540K89454K54107L02634K87223L46874M16983N14732N72448N54585
$$ 17734540 18023994 18278101 18580735 18867958 19214832 19631815 20146547 20718995 21273580
4188B1273580O64101P29317Q15783R13113R81157J010513J210194J136004J113816
$$ 21273580 21937681 22666998 23482781 24395894 25377051 26387564 27597758 28733762 29847578
4179B9847578J184434J114392R88825R45628R50494Q28975P84482P45749P54555
$$ 29847578 31032012 32146404 33135229 34080857 35031351 35860326 36644808 37390557 38145112
4170C8145112P87674Q83879J125213J169527J494651J573382J492304J441622
$$ 38145112 38932786 39816665 40941878 42111405 43606056 45179438 46671742 48113364
4162D8113364J246073J294903J210756J242208J146579J217395J295002J125828
$$ 48113364 49359437 50654340 51865096 53107304 54253883 55471278 56766280 57892108
4154E7892108J362085J393468J361901J399794J452650J573715J561382J609507
$$ 57892108 59254193 60647661 62009562 63409356 64862006 66435721 67997103 69606610
4146F9606610J681358J550801J467228J588929J682908K096487K755286L205637
$$ 69606610 71287968 72838769 74305997 75894926 77577834 79674321 82429607 85635244
4138H5635244L450852L403176K987998K406102J921684J388244J164658J261632
$$ 85635244 89086096 92489272 95477270 97883372 99805056 101193300 102357958 103619590
4130A03619590J317619J467001J730943K291766L426989N361606P898881P832142
$$ 103619590 104937209 106404210 108135153 110426919 113853908 119215514 127114395 134946537
4122A34946537J206189l999668n214592m093028k512158j539394q33752j24108
$$ 134946537 136152726 132153058 126938466 122845438 120333280 118793886 117960134 117836026
4114A17836026P50296J684034K766547L775816M515288M824276M860797M490075
$$ 117836026 118586322 120270356 123036903 126812719 131328007 136152283 141013080 145503155
4106A45503155M157693L764464L522270L249784K968205K502029J998402J762345
$$ 145503155 149660848 153425312 156947582 160197366 163165571 165667600 167666002 169428347
4098A69428347J391422J060307P19088J27743l98521q98029r68141p46187l65918
$$ 169428347 170819769 171880076 172599164 172726907 172328386 171430357 170462216 169716029 169350111
4089A69350111L7698L52340M21666L34238J97500k02167l76946n23199p70616
$$ 169350111 169387809 169740149 170161815 170496053 170693553 170491386 170114440 169591241 168820625
4080A68820625p82094o39049k37338J84806Q86940J314968J568124J408348R87298
$$ 168820625 168038531 167399482 167162144 167346950 168233890 169548858 171116982 172525330 173512628
4071A73512628M23662k92624q30588j391471j863899k395024k682845k802936
$$ 173512628 173936290 173643666 172813078 171421607 169557708 167162684 164479839 161676903
4063A61676903l039785l197097l664835m334569m981620n348181n156970m692580
$$ 161676903 158637118 155440021 151775186 147440617 142458997 137110816 131953846 127261266
4055A27261266l790661k935853k178277j484717j142626p66685n32988l31583
$$ 127261266 123470605 120534752 118356475 116871758 115729132 114962447 114429459 114097876
4047A14097876o6480M8050K57031L52069K19040N536k91098n73993p55546o46388
$$ 114097876 114031396 114079446 114336477 114688546 114907586 114913122 114622024 114048031 113292485 112646097
4037A12646097m23581j4840J69463N7955o62518j715829k818167l780651m271090
$$ 112646097 112222516 112207676 112377139 112435094 111772576 110056747 107238580 103457929 99186839
4028I9186839m122295l667779l033801k467936j984759j693890j503872j291617
$$ 99186839 95064544 91396765 88362964 85895028 83910269 82216379 80712507 79420890
4020G9420890j026099r21017p60443q20000r37722j057965j145244j097325r36534
$$ 79420890 78394791 77473774 76713331 75893331 74955609 73897644 72752400 71655075 70718541
4011G0718541q67864r54408j103441j426016j790698k165638k510189k675520
$$ 70718541 69850677 68896269 67792828 66366812 64576114 62410476 59900287 57224767
4003E7224767k651778k651556k395653k196969j884875j605608j612044j498126
$$ 57224767 54572989 51921433 49525780 47328811 45443936 43838328 42226284 40728158
3995D0728158j230682j121006j046284r05417p66572p55185p61212p17258o75213
$$ 40728158 39497476 38376470 37330186 36424769 35658197 34903012 34141800 33424542 32749329
3986C2749329o63558p01833p91692q47820r15672q17103p85929p38647o33315
$$ 32749329 32085771 31383938 30592246 29744426 28828754 28011651 27225722 26487075 25853760
3977B5853760m50526l32243m26109m08513m68908m50828l39033k41221j70446
$$ 25853760 25403234 25070991 24644882 24236369 23767461 23316633 22977600 22736379 22565933
3968B2565933j14044l079r3557j83179l76034m17788l91826l57657k30004k65562
$$ 22565933 22451889 22448810 22355253 22172074 21796040 21378252 20986426 20628769 20398765 20133203
3958B0133203o9548j58403j88646j36222o0128q7755j27817j57037k55304k80507
$$ 20133203 20063655 19905252 19716606 19580384 19520256 19432501 19304684 19147647 18892343 18611836
3948A8611836j91688k23302k34299k5007L29q9237j51414k32248k87715k27180
$$ 18611836 18420148 18196846 17962547 17937540 17937869 17848632 17697218 17464970 17177255 16950075
3938A6950075k68333k10828k05430j83391k31971n7653o2390j8873j7152L5118
$$ 16950075 16681742 16470914 16265484 16082093 15850122 15792469 15730079 15711206 15694054 15729172
3928A5729172R0802O3234l2327p0786j59475o4346N9874J15229J17083Q7280P2954
$$ 15729172 15819974 15883208 15850881 15780095 15620620 15556274 15616148 15731377 15848460 15935740 16008694
3917A6008694O1042m9763j47738j72819j48185j01629m0688l6208K3130N4928
$$ 16008694 16069736 16019973 15872235 15699416 15551231 15449602 15408914 15372706 15395836 15450764
3907A5450764R7871K14900J72483J24236J66337J83635K58977K10231R6623P6915
$$ 15450764 15548635 15763535 15936018 16060254 16226591 16410226 16669203 16879434 16976057 17052972
3897A7052972L9052P7803J15200K67188K10799K91450L39690M15705M17610L84438
$$ 17052972 17092024 17169827 17285027 17552215 17763014 18054464 18394154 18809859 19227469 19611907
3887A9611907L50517L29805L78046L11205L48825L80378K93655L00542L73362
$$ 19611907 19962424 20292229 20670275 20981480 21330305 21710683 22004338 22304880 22678242
3878B2678242L86388L65022L72790L94134L88506M50791N29929N61134N83421
$$ 22678242 23064630 23429652 23802442 24196576 24585082 25035873 25565802 26126936 26710357
3869B6710357O30601P90149R86706J099865J335418J626032J826475J964574K084049
$$ 26710357 27340958 28131107 29117813 30217678 31553096 33179128 35005603 36970177 39054226
3860C9054226K431592K391902K492726K660406K681734K737473K603886K532984
$$ 39054226 41485818 43877720 46370446 49030852 51712586 54450059 57053945 59586929
3852E9586929K483183K372492K246317K345881K463603K640617K858924K776762
$$ 59586929 62070112 64442604 66688921 69034802 71498405 74139022 76997946 79774708
3844G9774708K719794K463992K418390K487157K609648K499838K094069J538732
$$ 79774708 82494502 84958494 87376884 89864041 92473689 94973527 97067596 98606328
3836I8606328O64714j02922p74300j228661j395054j447684j703707k014303k156531
$$ 98606328 99271042 99168120 98393820 97165159 95770105 94322421 92618714 90604411 88447880
3827H8447880k192959k091924j867758j780805j688742j593211j627438j806115
$$ 88447880 86254921 84162997 82295239 80514434 78825692 77232481 75605043 73798928
3819G3798928j948194k188751k289944k426705k452568k322386k216557k081721
$$ 73798928 71850734 69661983 67372039 64945334 62492766 60170380 57953823 55872102
3811E5872102j963962j661462j360211r48602n48470k57071j45526K64846L53424
$$ 55872102 53908140 52246678 50886467 49937865 49389395 49132324 48986798 49251644 49605068
3802D9605068L94738M99274M73408N73441N52289O13943P70047J013864J234673
$$ 49605068 49999806 50499080 50972488 51545929 52098218 52712161 53482208 54496072 55730745
3793E5730745J333886J485983J458133J293670J095066R50222O61506M17798K26986
$$ 55730745 57064631 58550614 60008747 61302417 62397483 63347705 64009211 64427009 64653995
3784F4653995K12389J00581K8873j2119j13115k32776l14473l77400l82048m51944
$$ 64653995 64866384 64966965 64995838 64983719 64870604 64637828 64323355 63945955 63563907 63111963
3774F3111963n35503o34852q84425j010763j217400j285987j274086j084491j061767
$$ 63111963 62576460 61941608 61057183 60046420 58829020 57543033 56268947 55184456 54122689
3765E4122689q53048r00676r63254r48595r80012r69520r66500q91192p36793
$$ 54122689 53269641 52368965 51405711 50457116 49477104 48507584 47541084 46649892 45913099
3756D5913099m75852n0508P6387K93676N78552O30485P42553P01106O59423Q03391
$$ 45913099 45437247 45386739 45463126 45756802 46335354 46965839 47708392 48409498 49068921 49872312
3746D9872312P95352Q60963R02509R07632Q75239Q07678Q75229J074083J242665
$$ 49872312 50667664 51528627 52431136 53338768 54214007 55021685 55896914 56970997 58213662
3737E8213662J335411J331106J194780R70837O38272L28895m8335k16088j91853
$$ 58213662 59549073 60880179 62074959 63045796 63684068 64012963 63964628 63748540 63556687
3728F3556687j35662j94438j80965k89515m88174o48588p50959r07358r90890
$$ 63556687 63421025 63226587 63045622 62756107 62267933 61619345 60868386 59961028 58970138
3719E8970138j117802j160473j212511j319697j413761j268205j243493j174498
$$ 58970138 57852336 56691863 55479352 54159655 52745894 51477689 50234196 49059698
3711D9059698j105324j053434j008079j063472r38038q69909p10061n73623k01487
$$ 49059698 47954374 46900940 45892861 44829389 43891351 43021442 42311381 41737758 41536271
3702D1536271j34516J50754N22087P09667N40927M99373M61156O00682P53451
$$ 41536271 41401755 41552509 42074596 42784263 43325190 43824563 44285719 44886401 45639852
3693D5639852J071315J456529J676716J861548J947444J911228J812954J826330
$$ 45639852 46711167 48167696 49844412 51705960 53653404 55564632 57377586 59203916
3685E9203916J863038J793860J749813J516222J324968R61721P04056L99103J30650
$$ 59203916 61066954 62860814 64610627 66126849 67451817 68413538 69117594 69516697 69647347
3676F9647347k16004l94960l39139m59710m27504m72592m58458l71700k98240
$$ 69647347 69431343 69036383 68697244 68237534 67810030 67337438 66878980 66507280 66209040
3667F6209040l32058l01612m88692m40034m68213n48281o79641o74938p14512
$$ 66209040 65876982 65575370 65086678 64646644 64178431 63630150 62950509 62275571 61561059
3658F1561059o06366o77501o44711o76712q52646j028252j303361j504456j595124
$$ 61561059 60954693 60277192 59632481 58955769 58103123 57074871 55771510 54267054 52671930
3649E2671930j715923j632778j333355j017831p25909l27470L6514M33696Q83978
$$ 52671930 50956007 49323229 47989874 46972043 46246134 45918664 45955178 46388874 47272852
3640D7272852J119057J219556J116075R38171Q64799Q10950P87998O71155P79258
$$ 47272852 48391909 49611465 50727540 51665711 52530510 53341460 54129458 54800613 55579871
3631E5579871J003365J137734J109422Q32563M29297J57941k1589q7060l28912
$$ 55579871 56583236 57720970 58830392 59662955 60092252 60250193 60228604 60141544 59812632
3622E9812632n06274o16987q19849q50460q27952p95512p39292o13548m20858
$$ 59812632 59306358 58689371 57869522 57019062 56191110 55395598 54656306 54042758 53621900
3613E3621900j23116K96946O82166J077446J133675J158670J301658J438482J317744
$$ 53621900 53498784 53795730 54477896 55555342 56689017 57847687 59149345 60587827 61905571
3604F1905571J042582P93088M38632L24067J19278q9812m43588p96487j171425
$$ 61905571 62948153 63741241 64179873 64503940 64623218 64533406 64089818 63293331 62121906
3595F2121906j725918j997759k045189k077258j777315j289382o74894j41589
$$ 62121906 60395988 58398229 56353040 54275782 52498467 51209085 50534191 50392602
3587E0392602J87167P15716R08884Q57845N16465k7349o66256j262016j616987
$$ 50392602 50579769 51295485 52204369 53062214 53578679 53551330 52885074 51623058 50006071
3578E0006071k025687k296017k345001k125761j687318j239152r99994q44676
$$ 50006071 47980384 45684367 43339366 41213605 39526287 38287135 37287141 36442465
3570C6442465p87417p32136o14737n42092o58311o15336o93461n09436k72205
$$ 36442465 35655048 34922912 34308175 33766083 33107772 32492436 31798975 31289539 31017334
3561C1017334j98317l8J77172L07284M73470O92219P70628R12604J047710J088911
$$ 31017334 30819017 30818979 30996151 31303435 31776905 32469124 33239752 34152356 35200066 36288977
3551C6288977J227067J413175J478780J450952J499875J501317J447251J430714
$$ 36288977 37516044 38929219 40407999 41858951 43358826 44860143 46307394 47738108
3543D7738108J409736J329204J250619J124453J184475J404534J927081K459682
$$ 47738108 49147844 50477048 51727667 52852120 54036595 55441129 57368210 59827892
3535E9827892K957936L486413L620061L154306J766240l04098k032409k856083
$$ 59827892 62785828 66272241 69892302 73046608 74812848 74508750 72476341 69620258
3527F9620258k972361k703122k526238k536823k435568k421718k373040k217914
$$ 69620258 66647897 63944775 61418537 58881714 56446146 54024428 51651388 49433474
3519D9433474k012498j744378j474164j392904j135341j039664r60297j054453
$$ 49433474 47420976 45676598 44202434 42809530 41674189 40634525 39674228 38619775
3511C8619775j056845j099111j097759j026464r73727p93365o49949l81581k40088
$$ 38619775 37562930 36463819 35366060 34339596 33365869 32572504 31922555 31540974 31300886
3502C1300886l2447K2971P9534K17284K06284K05227L02254L04118L47989L41120
$$ 31300886 31268439 31291410 31370944 31588228 31794512 31999739 32301993 32606111 32954100 33295220
3492C3295220L46351K79093L32932L48776K84551K10811J39615J32731M1243k8083
$$ 33295220 33641571 33920664 34253596 34602372 34886923 35097734 35237349 35370080 35411323 35383240
3482C5383240K6737j9784P0431J92717K94103L78495M30397O18711O87152P50353
$$ 35383240 35409977 35390193 35460624 35653341 35947444 36325939 36756336 37375047 38062199 38812552
3472C8812552Q26313R26847R17465R41810Q58217Q28279P40399O36765P01167
$$ 38812552 39638865 40565712 41483177 42424987 43283204 44111483 44851882 45488647 46189814
3463D6189814O26722M60134L27905J70827K6878Q2446P5426p3748m3288k04070
$$ 46189814 46816536 47276670 47604575 47775402 47802280 47884726 47960152 47886404 47843116 47639046
3453D7639046n24667p97195r01992r46171q47067l34797m1346J85125M11986N07250
$$ 47639046 47114379 46317184 45415192 44469021 43621954 43287157 43245811 43430936 43842922 44350172
3443D4350172O42799O71435O37592O72946P17680Q30427Q43131R71687J031309
$$ 44350172 44992971 45664406 46301998 46974944 47692624 48523051 49366182 50337869 51369178
3434E1369178R60912P92319P40752N77728M96709K97366m7118j59064k05216k47067
$$ 51369178 52330090 53122409 53863161 54440889 54937598 55234964 55187846 55028782 54823566 54576499
3424E4576499j02970q560K18525M76612Q12270J214234J614461K252363L252851
$$ 54576499 54473529 54464969 54683494 55160106 55972376 57186610 58801071 61053434 64306285
3415F4306285L863199L425948J342070j462078l390531l983071l508337k609060
$$ 64306285 68169484 71595432 72937502 71475424 68084893 64101822 60593485 57984425
3407E7984425j862472j109874o47962l32470j45621O3494K43651L06909M50714
$$ 57984425 56121953 55012079 54364117 54031647 53886026 53949520 54193171 54500080 54950794
3398E4950794N20010N74036O01135O73520O29586L99986K87479K39260K05865
$$ 54950794 55470804 56044840 56645975 57319495 57949081 58349067 58636546 58875806 59081671
3389E9081671J05829r2772m9375Q5451M31091Q09330J245960J703365K361054
$$ 59081671 59187500 59094728 59045353 59130804 59561895 60371225 61617185 63320550 65681604
3380F5681604L163033L765894M172885M356464L836467K891351J878118J460225
$$ 65681604 68844637 72610531 76783416 81139880 84976347 87867698 89745816 91206041
3372I1206041J823642K644379L322711L587403K566092Q49959j016275k332021
$$ 91206041 93029683 95674062 98996773 102584176 105150268 106000227 104983952 102651931
3364A02651931k597593k178769j090825j71531o1317o29222j619552k366478k469441
$$ 102651931 100054338 97875569 96784744 96613213 96551896 95922674 94303122 91936644 89467203
3355H9467203k058532j237420j94338Q91980J950297L044262M042669M724745
$$ 89467203 87408671 86171251 85976913 86868893 88819190 91863452 95906121 100630866
3347A00630866N482863O312699P665509R756720J2911700J7584285K3723950L0977930
$$ 100630866 106113729 112426428 120091937 129848657 142760357 160344642 184068592 215046522
3339B15046522L6922328L7323493K7968911R658272j0157478k3647817k8300366
$$ 215046522 251968850 289292343 317261254 326919526 316762048 293114231 264813865
3332B64813865k6387276k1961846j7330791j3407990j0011019o778772l887509
$$ 264813865 238426589 216464743 199133952 185725962 175714943 168936171 165048662
3325A65048662j645611k06705O65841N66705N43129R82403K137526M130163O559467
$$ 165048662 163403051 163196346 163862187 164428892 164972021 165954424 168091950 172222113 178781580
3316A78781580R126705J2219618J6068209K0639358K4646483K6367416K7639081
$$ 178781580 187908285 200127903 216196112 236835470 261481953 287849369 315488450
3309C15488450K8604244K4914301J2067587p384417k5128927l4280304l4569213
$$ 315488450 344092694 369006995 381074582 373690165 348561238 314280934 279711721
3302B79711721k9433234k2524771j5857282r772908m418670j34300K789657L732273
$$ 279711721 250278487 227753716 211896434 202123526 197704856 197570556 200360213 204092486
3294B04092486K803518Q26418j223567l156158m943479o582820p720313p708664
$$ 204092486 206896004 207722422 206498855 203342697 198399218 191816398 184096085 176387421
3286A76387421o741738m432825j442483J641061M025879M879480L729581J352442
$$ 176387421 169645683 165212858 163770375 165411436 169437315 174316795 178046376 179398818
3278A79398818r35528j847649q78396J247636M060849P103872J0156987J3335971
$$ 179398818 178463290 176615641 175737245 176984881 181045730 188149602 198306589 211642560
3270B11642560J6483275J9638480K2980163K6967790L2280968L9077279M6009735
$$ 211642560 228125835 247764315 270744478 297712268 329993236 369070515 415080250
3263D15080250M9271226M4542485L0688389R420415j4489549l5282194m8371494
$$ 415080250 464351476 508893961 539582350 549002765 534513216 499231022 450859528
3256D50859528n2532181m9748502m3511961l6464790l0064821k4734104k0274452
$$ 450859528 398327347 348578845 305066884 268602094 238537273 213803169 193528717
3249A93528717j6609186j3560590j1228862r400984q112670p216585o772358o511809
$$ 193528717 176919531 163358941 152130079 142729095 134616425 127399840 120627482 114115673
3241A14115673o090737n674074n269391m736644m287673l912923l659015l446902
$$ 114115673 108024936 102350862 97081471 92344827 88057154 84144231 80485216 77038314
3233G7038314l167051k891669k568593k206156j895516j546082j282671j040968
$$ 77038314 73871263 70979594 68411001 66204845 64309329 62763247 61480576 60439608
3225F0439608q30258p87345o10784l25834j85381N0296J67579K50708K69867K34732
$$ 60439608 59609350 58822005 58211221 57885387 57700006 57750302 57917881 58168589 58438456 58673188
3215E8673188J68663J80258J23523J01931Q5736m8153k81455m30440o81017q24920
$$ 58673188 58841851 59022109 59145632 59247563 59333299 59285146 59003691 58573251 57892234 57067314
3205E7067314j010337j029586r84511r76893q57641o58659o77974q05351q04116
$$ 57067314 56056977 55027391 54042880 53065987 52208346 51549687 50871713 50066362 49262246
3196D9262246r41503r11838p57673p24699o77752p30999p99464p67245q57877
$$ 49262246 48320743 47408905 46651232 45926533 45248781 44517782 43718318 42951073 42093196
3187D2093196r27564r47394q24166o75601n24672l48649j72573j45149j04847
$$ 42093196 41165632 40218238 39394072 38718471 38193799 37845150 37672577 37527428 37422581
3178C7422581j81136k26709j60761j01055j39390L0587K03006J17679K03768L20920
$$ 37422581 37241445 37014736 36853975 36752920 36613530 36644117 36847123 36964802 37168570 37489490
3168C7489490M06705N43805P06883P78422R69254J130068J429450J700247K186930
$$ 37489490 37896195 38440000 39146883 39925305 40894559 42024627 43454077 45154324 47341254
3159D7341254K855758L640213M816512O065059P574750R066140R712055R327099
$$ 47341254 50197012 53837225 58653737 64718796 72293546 81359686 91071741 100398840
3151A00398840P460144M583251K035863K82263j397106l533887o136667q376779
$$ 100398840 107858984 112442235 114478098 114760361 113363255 109829368 103692701 95315922
3143I5315922r349122r075374p933173o565341n329909m399282l453213k896169
$$ 95315922 85966800 76891426 68958253 62392912 57063003 52663721 49210508 46314339
3135D6314339k335239j853670j476140j202446r50885o69600m87659k59273m7510
$$ 46314339 43979100 42125430 40649290 39446844 38495959 37826359 37338700 37079427 37031917
3126C7031917m6506L6103J18411L45599K79788K57146L07588L95288N07919O01930
$$ 37031917 36985411 37021514 37139925 37485524 37765312 38022458 38330046 38725334 39233253 39835183
3116C9835183P44116P87427R11206J034513J360509J592997J791003K183599K378529
$$ 39835183 40579299 41366726 42277932 43312445 44672954 46265951 48056954 50240553 52619082
3107E2619082K838901L227440L671628M214144M870953N656633O569769P969126
$$ 52619082 55457983 58685423 62357051 66571195 71442148 77098781 83668550 91637676
3099I1637676R534509J1894349J5030027J8984566K3137312K6539471K7192348
$$ 91637676 101172185 113066534 128096561 147081127 170218439 196757910 223950258
3092B23950258K3400299J4932814L395058p704848j5099455j7695337j6254499
$$ 223950258 247350557 262283371 265678429 257973581 242874126 225178789 208924290
3085B08924290j2109260o475192j36778O494549J2724657J7536947J9011080J5584487
$$ 208924290 196815030 190339838 190203060 196697609 209422266 226959213 245970293 261554780
3077B61554780O935222m490554j5441787k3050483k6195774k5685035k3031228
$$ 261554780 268490002 263999448 248557661 225507178 199311404 173626369 150595141
3070A50595141j9701578j6245265j3418875j0978463r052730p584686o253574
$$ 150595141 130893563 114648298 101229423 90250960 81198230 73613544 67359970
3063F7359970n176881m244011l256564k582504k029839j479713j220670j170181
$$ 67359970 62183089 57939078 54682514 52100010 50070171 48590458 47369788 46199607
3055D6199607j352643j705701j957111k218923k299042k206799k013946j877615
$$ 46199607 44846964 43141263 41184152 38965229 36666187 34459388 32445442 30567827
3047C0567827j617425j377937j176820j118411j016392r02163q85144p59631p57368
$$ 30567827 28950402 27572465 26395645 25277234 24260842 23358679 22473535 21713904 20956536
3038B0956536o92637n70587n02492n30348m58044m03530l77075l26760k87974
$$ 20956536 20263899 19693312 19190820 18660472 18202428 17798898 17421823 17095063 16807089
3029A6807089k98513k21447k31009k20442k57586j88692l00929m63050n02416
$$ 16807089 16508576 16287129 16056120 15835678 15578092 15389400 15088471 14625421 14123005
3020A4123005m34517m11182m48849l83648m13213k97095k30418k32024j67580
$$ 14123005 13688488 13277306 12828457 12444809 12031596 11734501 11504083 11272059 11104479
3011A1104479j77284j66649k08181k37426k35738k98445j53900k13742k04615
$$ 11104479 10927195 10760546 10552365 10314939 10079201 9780756 9626856 9413114 9208499
3002I208499k13048k13962j54566p7751o7495j12459j89915j71937j60916j55070
$$ 9208499 8995451 8781489 8626923 8549172 8481677 8369218 8179303 8007366 7846450 7691380
2992G691380j77871o2078n3004r603J5950j49Q4306J718J906m3283J6493K9156
$$ 7691380 7513509 7451431 7398427 7388824 7404774 7404625 7488931 7490649 7492555 7449272 7465765 7494921
2980G494921J07458J36405J30873j3908l7542j04380k26221l01280k27223k84633
$$ 7494921 7602379 7738784 7869657 7855749 7818207 7713827 7487606 7186326 6959103 6674470
2970F674470l44740k57966k16436j88204j29560j16626q7542o6976m7732j60304
$$ 6674470 6329730 6071764 5855328 5667124 5537564 5420938 5333396 5266420 5218688 5058384
2960E058384r7324p8458j16626o5779r5536n4108l9162j22595q0824o5356J5857
$$ 5058384 4961060 4882602 4765976 4700197 4604661 4550553 4511391 4388796 4307972 4242616 4258473
2949D258473m1285o1294j00172r3917N682r5238J6501J2760l0598o5498o4204
$$ 4258473 4217188 4155894 4055722 3961805 3967487 3872249 3888750 3901510 3870912 3805414 3741210
2938C741210p340o2614l5689K4678l8114j06210q020k0865J5074P9728K7282O6634
$$ 3741210 3733870 3671256 3635567 3660245 3622131 3515921 3507901 3487036 3502110 3581838 3609120 3675754
2926C675754o5821k3065r7266k5465J1205Q796j1413r3758o597o7970r5125M788
$$ 3675754 3609933 3586868 3489602 3464137 3475342 3484138 3472725 3378967 3372370 3304400 3209275 3214063
2914C214063J0593K2818l7410L5146m4815k5187j3675o2580l7734l8763l5268
$$ 3214063 3224656 3247474 3210064 3245210 3200395 3175208 3161533 3098953 3061219 3022456 2987188
2903B987188k547q2356j7661j2901O2737L8782j09671N0888o3103l3435o8975
$$ 2987188 2984641 2902285 2884624 2871723 2934460 2973242 2863571 2914459 2851356 2817921 2748946
2892B748946m7180l551K8685o256k9443j13560j12023n6060j6955j1311q523L8739
$$ 2748946 2701766 2698215 2726900 2720644 2691201 2577641 2465618 2409558 2392603 2381292 2372769 2411508
2880B411508k7138n1786O856K3154J4108J8750R071L0151p7541l8628N5031J5791
$$ 2411508 2384370 2332584 2339440 2362594 2376702 2395452 2404523 2434674 2357133 2318505 2373536 2389327
2868B389327N9048L8642J7693m2649K9704j7989m9093m4612N2886n7521m3668
$$ 2389327 2448375 2487017 2504710 2462061 2491765 2473776 2424683 2380071 2432957 2375436 2331768
2857B331768J0349q2233j05729j05361l9424n2973M1272J9080m5169q740L7919
$$ 2331768 2342117 2259884 2154155 2048794 2009370 1956397 1997669 2016749 1971580 1962840 2000759
2846B000759j31124o1152k5597R477l703J8267k0425n53k3547o6911n1665N6688
$$ 2000759 1869635 1808483 1782886 1792363 1788660 1806927 1786502 1785949 1762402 1695491 1643826 1700514
2834A700514M6327m5292Q5710M9915n2497M3222k5918l8790l6172l0244j2785
$$ 1700514 1746841 1701549 1787259 1837174 1784677 1827899 1801981 1763191 1727019 1696775 1683990
2823A683990l3916j9080l5053l672L8555Q5355P9881K0908P7157J16370J1735
$$ 1683990 1650074 1630994 1595941 1592269 1630824 1716179 1796060 1816968 1894125 2010495 2022230
2812B022230M3810J38741M2012P3644J59088P7802l6147K8131o9223j31103k4118
$$ 2022230 2066040 2204781 2246793 2320437 2479525 2557327 2521180 2549311 2480088 2348985 2324867
2801B324867k4952o5946j1925m9171K1604P8943J5835N9756K8967M2396r7838
$$ 2324867 2299915 2233969 2222044 2172873 2194477 2273420 2289255 2349011 2377978 2420374 2322536
2790B322536j78935k0392j32589j52526p2122j50240n1037j06949j42444P0188
$$ 2322536 2143601 2123209 1990620 1838094 1765972 1615732 1564695 1457746 1315302 1385490
2780A385490l8932o6093k5896n3093j2844n9228m772K3561j9666k7585R9950j7343
$$ 1385490 1346558 1280465 1254569 1201476 1188632 1129404 1124632 1148193 1128527 1100942 1200892 1183549
2768A183549l1404J7358l4606J2772o5179p3123O1306l522J3283l7563M81O268
$$ 1183549 1152145 1169503 1134897 1147669 1082490 1009367 1070673 1067151 1080434 1042871 1043352 1049620
2756A049620j5097K395r1388K3738N5233p4836q5566n9254P3929J1720j0829J9266
$$ 1049620 1034523 1036918 945530 969268 1024501 949665 864099 804845 878774 890494 879665 898931
2744H98931j9437n0103M184p2837L0682L1639R23l7626J5609j2225k5557l1562
$$ 898931 879494 829391 833575 760738 791420 823059 823982 786356 801965 789740 764183 732621
2732G32621O2675k99k295J5676K6400o3622j0831N0015l4972j1980n0914j3285
$$ 732621 795296 794997 792702 808378 834778 771156 760325 810340 775368 763388 712474 699189
2720F99189L6997M643o613N2320K015m4200m2067J7413J8469O5685k6794l3452
$$ 699189 736186 740829 734216 786536 788551 744351 702284 719697 738166 803851 777057 743605
2708G43605Q332k2404K7608J3730k9333j4202J7003o08J3991O3747j27800K4689
$$ 743605 751937 729533 757141 770871 741538 727336 744339 743731 757722 821469 693669 718358
2696G18358l2576r279J00179L4753j7309O4657P9388o5083J3879K2997N4767L0071
$$ 718358 685782 676503 776682 811435 794126 858783 938171 873088 886967 909964 964731 994802
2684I94802m0064m7295j8382M0661K3065l8045m0533J4311l1117N773p1389J3982
$$ 994802 954738 907443 889061 929722 952787 914742 874209 888520 857403 863176 791787 805769
2672H05769J9k0868j7532r348m2313l1226O8281O6039J15506P7848M210o0700
$$ 805769 805788 784920 767388 758040 715727 684501 752782 818821 934327 1012175 1016385 955685
2660I55685m7866J4510l2350l7613L3126K6689j04867L3078m3621r626k7869o594
$$ 955685 907819 922329 889979 852366 885492 912181 807314 840392 796771 787145 759276 752682
2648G52682L880K7897j9744j3878q163n0459l7240r599R0108k4853n1801r3385
$$ 752682 756562 784459 764715 750837 742674 692215 654975 645376 735484 710631 658830 565445
2636E65445M5375L2270L9961L2698l2783p7805k1025k789M8424l5811l4648k9115
$$ 565445 610820 643090 683051 715749 682966 605161 584136 581347 629771 593960 559312 530197
2624E30197j323L452k5070l7286k0613N4006J4735L8030M7929k670M5694l1836
$$ 530197 528874 532326 507256 469970 449357 503363 518098 556128 604057 601387 647081 615245
2612F15245p5070J6232m1332J4264K7205o8256k1459K8494M8930J5369j3256Q948
$$ 615245 540175 556407 515075 529339 556544 488288 466829 495323 544253 559622 546366 555314
2600E55314q6428K8105L857n172k0963O0147K8291j0312j1584l7353k4667J633
$$ 555314 468886 496991 500848 495676 474713 534860 563151 552839 541255 503902 479235 480868
2588D80868L1512j6033Nj5273M2321r9613O2921J8884k6246J7342m0985k6769
$$ 480868 512380 496347 496352 481079 523400 423787 486708 505592 479346 496688 455703 428934
2576D28934p975L0114J0644m9422o3081Q972o3112R2836j4883L531M6185l7467
$$ 428934 420959 451073 461717 412295 349214 358186 295074 387910 373027 376558 422743 385276
2564C85276m3968j8843N4689M5098J4554k1468J8967l125j0798l5090m0463K741
$$ 385276 341308 322465 377154 422252 436806 415338 434305 431180 420382 385292 344829 347570
2552C47570n435J337o8102N0485J3736m6630M2688Q784n982n4437L0470j4377
$$ 347570 342135 343472 275370 325855 339591 292961 335649 344433 338451 284014 314484 300107
2540C00107O3643l2053N1124m9258k7318M5131k5633k7774M761J5284j1681M9113
$$ 300107 363750 331697 382821 333563 306245 351376 325743 297969 302730 318014 306333 355446
2528C55446K3681k6764k6460J02128l2244l5385J7265m0067M46K6206M436M023
$$ 355446 379127 352363 325903 428031 395787 360402 377667 337600 338046 364252 368688 372711
2516C72711l7405k2132O0804k3375k329r171N5337M5836p2073k341P0276n920
$$ 372711 335306 313174 373978 350603 348274 339103 394440 440276 368203 365862 436138 430218
2504D30218k7672J00048L0121k9948n7481n1738K3063p251k4315l273M4693N0692
$$ 430218 402546 502594 532715 502767 445286 393548 416611 409360 385045 381772 426465 477157
2492D77157k0883k3780j1203l0103K2863J2475m4599k862L8143o2680N4584J40797
$$ 477157 456274 432494 421291 391188 414051 426526 381927 379065 417208 354528 409112 549909
2480E49909k6504N05L1234R3564J17946j7623p2204q4956p047p0111L4607j1237
$$ 549909 523405 523910 555144 648708 766654 749031 676827 591871 584824 514713 549320 538083
2468E38083k9515m5231M4470J15790n9483l5088m2261r195m0776L0937O2447l0077
$$ 538083 508568 463337 507807 623597 564114 529026 486765 477570 436794 467731 530178 500101
2456E00101N4965O6933J063j8168L3074k9982p790j4690N8735P7691q4146n4976
$$ 500101 555066 621999 623062 604894 637968 607986 600196 585506 644241 721932 637786 582810
2444E82810J44296l9293r2610K7336j3238P4086k7385O4697m4096n6123J10724
$$ 582810 727106 687813 595203 622539 609301 683387 656002 720699 676603 620480 731204
2433G31204J03486Q0706K1526n3091R7134k8246L8525J45595q689J2005L2894
$$ 731204 834690 915396 936922 883831 980965 952719 991244 1136839 1128150 1140155 1173049
2422A173049J19995l236P2952J06245J04393K01245J10459J49284J30894L18886
$$ 1173049 1293044 1289808 1362760 1469005 1573398 1774643 1885102 2034386 2165280 2484166
2412B484166M37771L44335J53349N7891j4832J94888M04865M82073O05801R25931
$$ 2484166 2921937 3266272 3419621 3477512 3462680 3657568 4062433 4544506 5150307 6076238
2402F076238J253629J912737K808338M958691P673994J0460138M280899m982228
$$ 6076238 7329867 9242604 12050942 17009633 24683627 35143765 39424664 34442436
2394C4442436p883955p222612m725584l127406k150942j916952j437959j090442
$$ 34442436 26558481 19335869 14610285 11482879 9331937 7414985 5977026 4886584
2386D886584p35306n56760k24105j30194N4517j15588j96272l31209k62852k57612
$$ 4886584 4151278 3594518 3370413 3240219 3294736 3179148 2982876 2651667 2388815 2131203
2376B131203l08254j47385o4630j11707o7897o644q6545k5301o9333j27307n8702
$$ 2131203 1822949 1675564 1610934 1499227 1431330 1424686 1338141 1312840 1243507 1116200 1057498
2365A057498n0186j4900k2044j5838l9907k7999j1745n5778l3612l1520q1153
$$ 1057498 1007312 992412 970368 954530 914623 886624 874879 819101 785489 753969 672816
2354F72816J8567k3888l3663K1680k661p1155O4072R671m2958k9120o2402l337
$$ 672816 691383 667495 633832 655512 652851 581696 645768 655439 612481 583361 520959 517622
2342E17622J7279p772l7449O2005p9552n5712o487j8770J3836o2347O974J5289
$$ 517622 534901 527129 489680 551685 472133 416421 409934 391164 405000 342653 349627 364916
2330C64916n397R4816n9720j04621j5491K1139J8411N7078k789j8093l0598j3794
$$ 364916 359519 454335 394615 289994 274503 295642 314053 371131 368342 350249 319651 305857
2318C05857k2101N439L4632l3221L4846l1257L9622j6807K7554L0881k0975l0614
$$ 305857 283756 289195 323827 290606 325452 294195 333817 317010 344564 375445 354470 323856
2306C23856L921n5154m3965L3702k3133K5465K0967R639o3925m3761m009r2623
$$ 323856 327777 272623 228658 262360 239227 264692 285659 295298 231373 187612 183603 90980
2294I0980l8302Q6455M9866p098N781l4204j6008n944l4868N4901K7235k8551
$$ 90980 52678 139133 188999 181901 187682 153478 137470 131526 96658 151559 178794 150243
2282A50243J9456m878P612m016M6406k6585r300o395J2928N8053o1641M2941K148
$$ 150243 169699 164821 172433 168417 214823 188238 178938 172543 185471 243524 181883 224824 226972
2269B26972J4417n6512n3567l9760P7952R5722l5208p0246k0121j8684J4375k2134
$$ 226972 241389 184877 131310 91550 169502 265224 230016 159770 139649 120965 135340 113206
2257A13206p344O1539j4096k5637k3277J4629J9448l7824m0070m9728J04232N6180
$$ 113206 105862 167401 153305 127668 104391 119020 138468 100644 60574 10846 115078 171258
2245A71258l3279L6628n8788p3901M9901L9137m5168q711j9863K8122M2137o8104
$$ 171258 137979 174607 115819 41918 91819 130956 85788 77077 57214 85336 127473 59369
2233E9369N6595Q3226r3628o8867N9930M3283j3664J242J337o1755m9927M8344
$$ 59369 115964 199190 105562 36695 96625 139908 126244 127486 128823 67068 17141 65485
2221F5485M8979m4671k2418K8382m5953K6056m6469K4632N339m6547Q2005L034
$$ 65485 114464 69793 47375 75757 29804 55860 9391 34023 39362 -7185 74820 77854
2209G7854l3273k0632K2316M2857m5616n9146J801l5898P235l4079J7736N4566
$$ 77854 44581 23949 46265 89122 43506 -15640 -13839 -49737 -42502 -76581 -58845 -4279
2197d279O636m6093M2585N7985J5228n3965Q78N9272r827n682j07641o213j154
$$ -4279 2357 -43736 -1151 56834 72062 18097 18975 78247 68420 62738 -44903 -51116 -52270
2184e2270O0799m2003J8526N1145J4341p319J1826n1711l5627J29417M7298n7134
$$ -52270 8529 -33474 -14948 36197 50538 43219 55045 3334 -32293 97124 144422 87288
2172H7288R88K1452n2999m9089Q436J8611n838k6269J9288l5358M0046m948j9936
$$ 87288 88276 109728 56729 7640 16076 34687 28849 2580 21868 -13490 26556 21608 1672
2159A672K9870j2244N2581o9834J1486L2384K3203l5014n3312L1353N0478m3784
$$ 1672 31542 19298 71879 2045 13531 45915 69118 34104 -19208 12145 62623 18839
2147A8839O547j5890J7032J0897L7655n3129j0414j666l8463r626j2376N8686
$$ 18839 25386 9496 26528 37425 75080 21951 11537 9871 -28592 -38218 -50594 8092
2135H092L1279Q143k5946j48K7249R1214J2222P961Q186L3153K8090o8881m3982
$$ 8092 39371 47514 21568 21420 48669 139883 152105 160066 168252 201405 229495 160614 116632
2122A16632l4323o3637k9072l3949K1153l015j5569L6282R01M4125k5034k5850
$$ 116632 82309 18672 -10400 -44349 -23196 -26211 -41780 -5498 -4597 39528 14494 -11356
2110a1356l0511M5496M5604K6521k9593J8774K7602l2901k2778l3057J8113o5723
$$ -11356 -41867 3629 49233 75754 46161 64935 92537 59636 36858 3801 21914 -43809
2098d3809l8917K4721K0059J4910l0575J4147O1035R756k9815J4535j2636j9266
$$ -43809 -82726 -58005 -37946 -23036 -53611 -39464 21571 31327 1512 16047 3411 -15855
2086a5855p50l6471O868l5172k3195M6561J01432J3608j4763m0178o5731n6521
$$ -15855 -16605 -53076 -46208 -81380 -104575 -58014 43418 57026 42263 2085 -63646 -120167
2074a20167O6978L49J2725j5661N805N1714k2080L3233K265q036j9573K7554M4895
$$ -120167 -53189 -52840 -40115 -55776 -49971 1743 -20337 12896 15161 7125 -12448 15106 60001
2061F0001m2790m8758r578j0454N4031j15574j3043Q8423n5780L94J2072l030
$$ 60001 17211 -31547 -41125 -51579 2452 -113122 -126165 -37742 -93522 -93128 -81056 -84086
2049h4086m946J2549j4986N9789L3633L2132j6579n1763Q18R315l2914J7204L2533
$$ -84086 -89032 -76483 -91469 -31680 1953 34085 17506 -34257 -33439 -24124 -57038 -39834 -7301
2036g301j4311l9235q536J4253M2726J4552o2768M9681L3991r3372p4758J9597
$$ -7301 -21612 -60847 -69383 -55130 -12404 2148 -60620 -10939 23052 -70320 -145078 -125481
2024a25481P7163l0709M8550Q10m191L1123O85j05491k2610R0375J2467J2452
$$ -125481 -48318 -79027 -30477 -29667 -33858 -2735 -2050 -107541 -130151 -39776 -27309 -14857
2012a4857m0016K4483l3100j8677k519k1455P7658M1731m9093l3887L147N489
$$ -14857 -54873 -30390 -63490 -82167 -84686 -106141 -28483 13248 -35845 -69732 -66585 -61096
2000f1096J9936p641p7563K3370J1069K599M820L6783K5530p0035J6066J7654
$$ -61096 -41160 -48801 -126364 -102994 -91925 -89326 -84506 -47723 -22193 -92228 -76162 -58508
1988e8508k8350Q4755j7998m0810j5547m173L1006l1513j5310Q1254l0785j2590
$$ -58508 -86858 -2103 -20101 -60911 -76458 -80631 -49625 -81138 -96448 -15194 -45979 -58569
1976e8569L8799p985j1022K364k2419K7156K2959J1003q160o7142k7934J381L8929
$$ -58569 -19770 -27755 -38777 -36413 -58832 -31676 -8717 2286 -5874 -73016 -100950 -99569 -60640
1963f0640K1136J4245M095J0997j9949l407n1692m6606M7201P1794n334q664L6728
$$ -60640 -39504 -25259 -21164 -10167 -30116 -33523 -85215 -131821 -84620 -12826 -18160 -26824 9904
1950I904o6311M1702P4053m2773j5191K0933k8166j4789j7760Q256n2844o9931
$$ 9904 -56407 -14705 59348 16575 1384 22317 -5849 -20638 -38398 -30142 -82986 -152917
1938a52917Q8344L477K8878l4138m8069P3357L2816n1968p5608P2204l9382L3610
$$ -152917 -64573 -61096 -32218 -66356 -114425 -41068 -8252 -60220 -135828 -63624 -103006 -69396
1926f9396M2912n8737m3165M1379N0257N0170j5727k9243n7753l8501p426K2200
$$ -69396 -26484 -85221 -128386 -87007 -36750 13420 -2307 -31550 -89303 -127804 -135230 -113030
1914a13030j6718j7309M4306K6885P6551p6860l0120O4331j7097k5667K8936k4533
$$ -113030 -129748 -147057 -102751 -75866 685 -76175 -106295 -41964 -59061 -84728 -55792 -80325
1902h0325L9148r935J5147N021m6055o2732J2856j9451q92M771J9465J0480m3180
$$ -80325 -41177 -51112 -35965 -30944 -76999 -139731 -126875 -146326 -147218 -142447 -122982 -112502 -155682
1889a55682J7456j3268L4997N2564m8063k5339N1159j5387O392J8840L8171N0020
$$ -155682 -138226 -151494 -116497 -63933 -111996 -137335 -86176 -101563 -95171 -76331 -38160 11860
1877A1860n127p152k7101o1174J6798J78O7741J0280j23448k8118j8107O1076
$$ 11860 6733 -419 -27520 -88694 -71896 -71718 -3977 6303 -117145 -145263 -163370 -102294
1865a02294P8349K8284j2614j0110M9141p0718m7182N1102J9207J3247m6813N291
$$ -102294 -23945 4339 -8275 -18385 30756 -39962 -87144 -36042 -16835 -3588 -50401 -45110
1853d5110J2908n9937J0255k7901j1565j9894K2494M8186L3206L427m6758J7652
$$ -45110 -32202 -92139 -81884 -109785 -121350 -141244 -118750 -70564 -37358 -33931 -80689 -63037
1841f3037P7461j4331p7614k5834K2341O6235m7795j4857M370M0076M0015k690
$$ -63037 14424 93 -77521 -103355 -81014 -14779 -62574 -77431 -73061 -32985 7030 4340
1829D340p8383o536J4651M0712j1377k6960l8309Q074J7081j690j2423q0886P2456
$$ 4340 -74043 -80579 -65928 -25216 -36593 -63553 -101862 -93788 -76707 -78397 -90820 -171706 -99250
1816i9250J5887k1673M1209L9308o1888J4809Q7347J104r3887j5539M139j9797
$$ -99250 -83363 -105036 -63827 -24519 -86407 -71598 15749 16853 -77034 -92573 -88434 -108231
1804a08231m3000k3956L1107M1701K8064o0944L572K620J3533l8393j4365j6839
$$ -108231 -151231 -175187 -144080 -102379 -74315 -135259 -131687 -129067 -115534 -153927 -168292 -185131
1792a85131L1850R8206M1249N211k0444j9024j6845k8474N74K3344N0147l1201
$$ -185131 -153281 -55075 -13826 -8615 -29059 -48083 -64928 -93402 -92828 -69484 -19337 -50538
1780e0538n6669K567k1343J4046J785L7734L1135k911k4113m8394J6101K9742
$$ -50538 -107207 -104640 -125983 -111937 -110152 -72418 -41283 -44194 -68307 -116701 -100600 -70858
1768g0858q649J0729O1905k951n9310O018O5660q1574k9002O2700o647o3534J3042
$$ -70858 -79507 -68778 -6873 -9824 -69134 -63116 2544 -79030 -108032 -45332 -51979 -115513 -102471
1755a02471L7746l0103j7820k5580P6864P0134k3985j9778p5047P371Q350l1300
$$ -102471 -64725 -94828 -112648 -138228 -61364 8770 -15215 -34993 -110040 -102669 -94319 -125619
1743a25619K5824l411j1780K1270M5948l7988N951J9254J4761N5960l7236m6998
$$ -125619 -99795 -103206 -114986 -93716 -47768 -85756 -79805 -60551 -45790 10170 -27066 -74064
1731g4064Q8888m1977m9137m431R278k1594j3641L8228J665m3985n121P8838M4333
$$ -74064 14824 -27153 -76290 -80721 -71443 -93037 -106678 -68450 -66785 -110770 -115891 -37053 7280
1718G280n2148L2381J8701q4790J2867k5943k7305M8339k7316k4822M563J4624
$$ 7280 -44868 -12487 6214 -78576 -65709 -91652 -118957 -70618 -97934 -122756 -118193 -103569
1706a03569K6653J0639r691K1384J3481l5364m5066J4528N097R274j5868j6568
$$ -103569 -76916 -66277 -75968 -54584 -41103 -76467 -121533 -107005 -101908 -92634 -108502 -125070
1694a25070P223O7179j2298j7960K9345K7624J4308L673m1085M8976k9069n2849
$$ -125070 -117847 -50668 -62966 -80926 -51581 -23957 -9649 -5976 -47061 1915 -27154 -80003
1682h0003M3452N459k1697j4103m7844j3087K9759r53k7479K2864L4606k3445
$$ -80003 -36551 -31092 -52789 -66892 -114736 -127823 -98064 -99017 -126496 -103632 -69026 -92471
1670i2471J7223l013o2337l8941N2289J7868O898Q663R556K3197J3748m7013k0270
$$ -92471 -75248 -78261 -140598 -179539 -127250 -109382 -102484 -93821 -84265 -61068 -47320 -94333 -114603
1657a14603N6121j9772j5853p116M9612j8793j4111K8429n3487J0123J26912j2105
$$ -114603 -58482 -78254 -94107 -101223 -51611 -70404 -84515 -56086 -109573 -99450 27462 15357
1645A5357r0256M646L4788N190l2222N1632l9931j2315J3481L3374m0143R522
$$ 15357 -74899 -70253 -35465 -30275 -62497 -10865 -50796 -63111 -49630 -16256 -56399 -46877
1633d6877j2317J4780J2302m7336l2532J6307L3074K8571n3561K0596J1706k8409
$$ -46877 -59194 -44414 -32112 -79448 -111980 -95673 -62599 -34028 -87589 -66993 -55287 -83696
1621h3696N0248P1917k2344k2448k8472R382M0154j2040l8711q303j1429l7959
$$ -83696 -33448 38469 16125 -6323 -34795 -25413 14741 2701 -36010 -44313 -55742 -93701
1609i3701J038L6148K7635K8712J0712l7347p560p5139p3424P7599J2798L1757
$$ -93701 -92663 -56515 -28880 -168 10544 -26803 -34363 -109502 -182926 -105327 -92529 -60772
1597f0772M1164o8161l1527j8699P872N1879J0461N1043M0852j9462k2030P346
$$ -60772 -19608 -87769 -119296 -137995 -130123 -78244 -67783 -16740 24112 4650 -17380 -10034
1585a0034m7996o3476J7147M8382O2646N31n9135K998q075L986o400l6262M7999
$$ -10034 -58030 -121506 -104359 -55977 6669 7200 -51935 -48937 -57012 -53026 -59426 -95688 -47689
1572d7689K4452m1392o129L7380M1058k9889K2075o52p3764J8411k2769J3363
$$ -47689 -23237 -64629 -70758 -33378 7680 -22209 -134 -786 -74550 -56139 -78908 -65545
1560f5545M3997r34j0068o3771Q594M8475q9865k2793p476N5049R639n7236o71
$$ -65545 -21548 -22482 -32550 -96321 -87727 -39252 -129117 -151910 -159386 -104337 -94698 -151934 -152605
1547a52605M6396N7515n8822Q193k4218r731M9696L1626J3886l8969K5588o422
$$ -152605 -106209 -48694 -107516 -99323 -123541 -133272 -83576 -51950 -38064 -77033 -51445 -57867
1535e7867o7962K7844L0843p847Q549M4694l7011r6221N6577j6078k0617L144
$$ -57867 -125829 -97985 -67142 -74989 -66440 -21746 -58757 -154978 -98401 -114479 -135096 -131952
1523a31952O630L4799k0119j8816O6591L5797j8598L4370k2335q30r55k3225p586
$$ -131952 -125322 -90523 -110642 -129458 -62867 -27070 -45668 -11298 -33633 -34463 -35418 -58643 -66229
1510f6229R215P7337p1397j6956m3757m8972l1198P8061r801j540J14595k0997
$$ -66229 -57014 20323 -51074 -68030 -111787 -160759 -191957 -113896 -123697 -125237 -10642 -31639
1498c1639p0499L7522P65j5826p2204k9143J2804M3009J6991K8239P1321r8246
$$ -31639 -102138 -64616 -63851 -79677 -151881 -181024 -168220 -125211 -108220 -79981 -8660 -106906
1486a06906m5385J0952l437n0514L6764O9322K112l7461j5625N5823K2129k7395
$$ -106906 -152291 -141339 -144776 -195290 -158526 -89204 -87092 -124553 -140178 -84355 -62226 -89621
1474h9621K1386M654j0661j3866J6969N6161m6413j0372K2998N2069l0036k8922
$$ -89621 -68235 -63581 -74242 -88108 -71139 -14978 -61391 -71763 -48765 3304 -26732 -55654
1462e5654M9597j8844m2785M313k7576J2444l7182N7443N9767l4000n1429K9153
$$ -55654 -6057 -24901 -67686 -63373 -90949 -78505 -115687 -58244 1523 -32477 -83906 -54753
1450e4753M8582L6284o8408n2191j8584m0075K8530j097p938K5885O9293M9482
$$ -54753 -6171 30113 -38295 -90486 -109070 -149145 -120615 -121712 -129650 -103765 -34472 15010
1438A5010o237o3166j0483k1155K0616j9217O4867q554l8666M1971p385k7057
$$ 15010 8773 -54393 -64876 -86031 -65415 -84632 -19765 -28319 -66985 -25014 -32399 -59456
1426e9456k5221J3258L3710j5963N5015l5420l0749n8430l3451m693M4392L2028
$$ -59456 -84677 -71419 -37709 -53672 1343 -34077 -64826 -123256 -156707 -161400 -117008 -84980
1414h4980J8577K5535K0362r5556l5313O1549N6909q5660J7572P9415k5283M4802
$$ -84980 -66403 -40868 -20506 -116062 -151375 -89826 -32917 -118577 -101005 -21590 -46873 -2071
1402b071n576m3928j2124K1834K355l9248q473J2022R263M2069J2999r493J587
$$ -2071 -7647 -51575 -63699 -41865 -39510 -78758 -87231 -75209 -65946 -23877 -10878 -20371 -18784
1389a8784k0824k7691M287j5370N9648L6868l4543L6044q8793K6740l5603J9459
$$ -18784 -39608 -67299 -63012 -78382 -18734 18134 -16409 19635 -69158 -42418 -78021 -58562
1377e8562r664J641J9314j0437p1629R287K7304l5374R8758K5250j1115l0652
$$ -58562 -68226 -66585 -47271 -57708 -129337 -120050 -92746 -128120 -29362 -4112 -15227 -45879
1365d5879J7592O768m2689n7229P4828K6994l6629o518j5659J7263J17457j441
$$ -45879 -28287 -21519 -64208 -121437 -46609 -19615 -56244 -62762 -78421 -61158 56299 54858
1353E4858n3862k3360m2211j5765K7694P3104K1859m3811o8957R0350L7588j18546
$$ 54858 996 -22364 -64575 -80340 -52646 20458 42317 -1494 -70451 19899 57487 -61059
1341f1059N3038M6469N109l6930m1602o8193O499N6007k209k4885o011l0086M4771
$$ -61059 -8021 38448 43557 6627 -34975 -103168 -96669 -40662 -42871 -67756 -73767 -103853 -59082
1328e9082Q9766m3564L7326k982k6110j3260j04494M5225M5906l0168o2719Q7987
$$ -59082 30684 -12880 24446 21464 -4646 -17906 -122400 -77175 -31269 -61437 -124156 -36169
1316c6169L2942j284k341J1140o2389j4009M9651r686l3946L1958o0595J2154
$$ -36169 -3227 -4511 -6852 4288 -58101 -72110 -22459 -32145 -66091 -34133 -94728 -82574
1304h2574L9913m4799l6933L8247K4415o6699M7997M9890o054K2242l6292k5426
$$ -82574 -42661 -87460 -124393 -86146 -61731 -128430 -80433 -30543 -36597 -14355 -50647 -76073
1292g6073J02101p1206p7863Q4120N5637r6253J3244M7724l2314M9540p5899p6653
$$ -76073 26028 -45178 -123041 -38921 16716 -79537 -66293 -18569 -50883 -1343 -77242 -153895
1280a53895N6642Q5978l9447j02093N2455O1884k5767J589M8383l8837o1646l0213
$$ -153895 -97253 -11275 -50722 -152815 -100360 -38476 -64243 -62654 -14271 -53108 -114754 -144967
1268a44967J0632N2007K8482q3167J7577L3751L1307K8685J7582O825l5849j6793
$$ -144967 -134335 -82328 -53846 -137013 -119436 -85685 -54378 -25693 -8111 -1286 -37135 -53928
1256e3928J9486R043l151p2992J9299R665k6508P0987J2680K5557o6011L2924
$$ -53928 -34442 -25399 -28550 -101542 -82243 -72578 -99086 -28099 -15419 10138 -55873 -22949
1244b2949k8700L6593m7195M29L5718l3738M5197m1124K1961J9448K7170n0088
$$ -22949 -51649 -15056 -62251 -61822 -26104 -59842 -14645 -55769 -33808 -14360 12810 -37278
1232c7278P755L6697l2141k5587L1762J8883L8972j2345n172k7449N4479M886
$$ -37278 -29523 7174 -24967 -50554 -18792 91 39063 26718 21546 -5903 48576 53462
1220E3462j3633l0120n3595K2609p0787P1457N3442n5915O45l5775q4401K6629
$$ 53462 39829 9709 -43886 -21277 -92064 -20607 32835 -23080 -22435 -58210 -142611 -115982
1208a15982Q4642l0366k8449Q9064l9621l454M8900l4405J4057L0866j8157L726
$$ -115982 -31340 -61706 -90155 -1091 -40712 -44166 4734 -29671 -15614 15252 -2905 821
1196H21O3330k1628p0025N4885L0015M0845j06045p6930Q2004j5813K0133j131
$$ 821 64151 42523 -27502 27383 57398 98243 -7802 -84732 -2728 -18541 1592 461
1184D61o6308k5561P5306L4767N3843o3564P0441n2197j9645k7411m0139M7606
$$ 461 -65847 -91408 -16102 18665 72508 8944 79385 27188 7543 -19868 -60007 -12401
1172a2401j6290j481J9560K2526n747J6359k4669k6970q471M7736J8867j5839
$$ -12401 -28691 -30172 -10612 11914 6167 22526 -2143 -29113 -37584 10152 29019 13180
1160A3180l8066k6445m9062N8161L5259k7634j8973j3311j6902q4502J0585K5966
$$ 13180 -24886 -51331 -100393 -42232 -6973 -34607 -53580 -66891 -83793 -168295 -157710 -131744
1148a31744J3489P4233M4613k2718k6240P786j1723p9586K6421J11264n7320L91
$$ -131744 -118255 -44022 591 -22127 -48367 -40581 -52304 -131890 -105469 5795 -51525 -51134
1136e1134J7876o5117K364n1373J10490Q1963k9625n726L193k4360p2851L8332
$$ -51134 -33258 -98375 -96011 -147384 -36894 45069 15444 9718 12911 -11449 -84300 -45968
1124d5968J4929P9266l1326K2339J3987J3109k3214L871p8047j9646J06927o2123
$$ -45968 -31039 48227 16901 39240 53227 66336 43122 46993 -31054 -50700 56227 -5896
1112e896L1930m913R502p5350m4415K995k0056M7577l755k7145O20K9280N5060
$$ -5896 26034 21121 30623 -44727 -89142 -86147 -106203 -58626 -62381 -89526 -88906 -59626 -4566
1099d566N7782J669o0119l144l298p277j3808l369q634l0561J9666L780J04187
$$ -4566 53216 54885 -5234 -8378 -11676 -18953 -32761 -36130 -44764 -75325 -55659 -51879 52308
1086E2308N055p1051p997Q609M5659m5363o6027n8920R4808M430k2681P3238m8899
$$ 52308 57363 -13688 -21685 -13076 32583 -12780 -78807 -137727 -42919 -38489 -61170 12068 -36831
1073c6831K0782N8990q110o364k3597K5436k3772p0412L0125p3321J5710M057
$$ -36831 -16049 42941 34831 28467 4870 30306 6534 -63878 -33753 -107074 -91364 -87307
1061h7307j0552L4666P6686L7822o6214J2883O202p8185N2414M6066m4824n6972
$$ -87307 -97859 -63193 13493 51315 -14899 -2016 4186 -73999 -21585 24481 -20343 -77315
1049g7315O4336k494k2427M3099n2604j1496j4303N4016M7089l7473n017L3029
$$ -77315 -12979 -15473 -37900 5199 -47405 -58901 -73204 -19188 27901 -9572 -14589 18440
1037A8440j9356M2631m4741j5176m0195p3456P6260P1233Q784l9543P902R097
$$ 18440 -916 41715 -3026 -18202 -58397 -131853 -55593 15640 24424 -15119 -7217 1880
1025A880j1884n0078M728K6972P5705k4205m4897o0045m0149J7448L2782J7141
$$ 1880 -10004 -60082 -55354 -28382 47323 23118 -21779 -81824 -121973 -104525 -71743 -54602
1013e4602N4220m291j3166J8503l6881J0186K2126M8537n1688M6460M2707k5505
$$ -54602 -382 -4673 -17839 664 -36217 -26031 -3905 44632 -7056 39404 82111 56606
1001E6606p1435L5772N3402l6133k3475L794K2482l0863N2832j1438r5533r360
$$ 56606 -14829 20943 74345 38212 14737 18531 41013 10150 62982 51544 -43989 -53349
989e3349K2471J2891j743j8979J6870o6163l4157P0400K633K170R646j3423j1306
$$ -53349 -30878 -17987 -19730 -38709 -21839 -88002 -122159 -51759 -49126 -46956 -37310 -50733 -62039
976f2039R486J7738p090O92N0240p533k0678k0498L9887l7284N2649m926K7391
$$ -62039 -52553 -34815 -41905 -41213 9027 1494 -19184 -39682 205 -37079 15570 10644 38035
963C8035m256J7394O0303l1797k0444p6539j1721m502L8134R975k4927n7303l7406
$$ 38035 33779 51173 111476 79679 59235 -17304 -29025 -33527 4607 14582 -10345 -67648 -105054
950a05054J4200N1716N6955k7892n373O0856l2165J7132K5255k0572m7963l4676
$$ -105054 -90854 -39138 17817 -10075 -15448 45408 13243 30375 55630 35058 -12905 -47581
938d7581M0915N2877j4902k461P656K152m1102o1182R0678o05m2896p451J6309
$$ -47581 -6666 46211 31309 28848 36504 38656 -2446 -63628 27050 26445 -16451 -23902 -7593
925g593K6795J128j4113q702M837j6282n833L3388L8813j9903k0224R423K4902
$$ -7593 19202 20330 6217 -2485 2352 -13930 -19763 13625 52438 32535 12311 21734 46636
912D6636j624l411M1993l9968o5952J9343m8477M0511K5173J6718M724J09224
$$ 46636 45012 41601 83594 43626 -22326 -2983 -51460 -10949 14224 30942 35666 144890
900A44890L895q4700M2254K979j6249j8750j8846N747k2574M9999j966m902L4664
$$ 144890 148785 64085 106339 109318 93069 74319 55473 61220 38646 88645 86679 81777 116441
887A16441q0477j7488J0273O846J3949J7804p1710m7745j842R1697K5665k2775
$$ 116441 35964 18476 28749 35595 49544 67348 -4362 -52107 -53949 37748 63413 40638
875D0638j9758M946l8413N8802j6480k3571Q881N6204j6529m314Q121o7517M3873
$$ 40638 20880 25826 -12587 46215 29735 6164 15045 71249 54720 50406 58527 -8990 34883
862C4883N2204N948j7898K0338j8995l4114L5946n647J8726j9458k6977K3279
$$ 34883 87087 93035 75137 95475 76480 42366 78312 72665 91391 71933 44956 68235
850F8235Q19j5635J8324k2205p4650J6072M1276l0988M7620N0164m414j3997j0119
$$ 68235 69054 53419 71743 49538 -25112 -9040 32236 1248 48868 99032 94618 80621 70502
837G0502n2916m6282M1062n145j6333J8067k1770R558O8951l9289L0518l8226
$$ 70502 17586 -28696 12366 7221 -9112 8955 -12815 -3257 65694 26405 56923 18697
825A8697p9m306J4289j8214j0480j9643L874M0328k8004o194P0240j02333K1942
$$ 18697 18618 14312 28601 10387 -93 -19736 -15862 24466 -3538 -9732 60508 -41825 -19883
812a9883J0953J0368L7683J8808n8068L0074M072m1511j9032M9776L2438M2531
$$ -19883 -8930 1438 39121 57929 -139 29935 34007 -7504 -26536 23240 55678 98209
800I8209Q887o5268N2697j8876p1647o1334N4427j4127J4891M5530j5456O412
$$ 98209 107096 41828 94525 75649 4002 -57332 -2905 -17032 -2141 43389 27933 34345
788C4345k963J1057J5729J8789m3461M8327k9984l9580Q646K039L2498J7117n8135
$$ 34345 31382 42439 58168 76957 33496 81823 51839 12259 20905 22944 55442 72559 14424
775A4424J6976j4292l9080L4579j5030L7336j2223J589J0836L9922j8942o4919
$$ 14424 31400 17108 -21972 12607 -2423 34913 22690 24279 35115 75037 56095 -8824
763h824O149J6868N9668M7652j03426l0109j1107N8133J8622j2085n0274L0804
$$ -8824 -2675 14193 73861 121513 18087 -12022 -23129 35004 53626 41541 -8733 22071
751B2071O347J8m542k450j4277P4857j7930l480m0429n8961j6769j3511M4046
$$ 22071 28418 28436 23894 21444 7167 82024 64094 60614 20185 -38776 -55545 -69056 -25010
738b5010P1155J1559n324R572O6628p879l7906k4656J8285m633n1693M9728J5377
$$ -25010 46145 57704 52380 61952 128580 120701 82795 58139 76424 71791 20098 69826 85203
725H5203k7299o9020N9297o555l0732n957j1256L8641n0463R0404K0590p5957
$$ 85203 57904 -11116 48181 41626 10894 4937 -6319 32322 -18141 72263 92853 16896
713A6896K336R683M6236j6551m4216j1106k5140k4300Q0536L6051K1063k4904
$$ 16896 19232 28915 75151 58600 14384 3278 -21862 -46162 34374 70425 91488 66584
701F6584M027Q3115M2689o0123n6636j5363J1208l690l7631J6659j2255l9553
$$ 66584 70611 153726 196415 136292 79656 64293 75501 71811 34180 50839 38584 -969
689i69q383N408J4549M397N97l3169P166k9750n52p349N615p4N6997J0315M1746
$$ -969 -9352 -3944 10605 15002 15599 -17570 -10404 -40154 -40706 -48055 -42440 -42514 14483 24798 66544
674F6544n697o6375L2250J1670J3471L7815j7045j9874J8039r547k8962k829R2451
$$ 66544 60847 -5528 26722 38392 51863 89678 72633 52759 70798 61251 32289 29460 121911
661A21911l2475L557j4414J3362q102o4155k7180L2567L2817j014M3381K8188
$$ 121911 89436 92993 78579 91941 83839 19684 -7496 25071 57888 56874 100255 128443
649A28443j2765o9073J3620N8522k6417k2697P954j6585N1222o1609k2754L2955
$$ 128443 115678 46605 60225 118747 92330 69633 77587 61002 112224 50615 27861 60816
637F0816q5676J1492n793K4427k224J414O007N2817j1501r400q587r864R316L7071
$$ 60816 -24860 -13368 -19161 5266 3042 4456 10463 63280 51779 42379 33792 23928 33244 70315
623G0315j2539L662P725o0671L7976N182K1101j9672m8359q001j6946K0296j8417
$$ 70315 57776 61438 69163 8492 46468 51650 72751 53079 4720 -3281 -20227 69 -18348
610a8348L9385K7262p958P3021o1258n2005N2524K7489k1619L8748l2803k1177
$$ -18348 21037 48299 40341 113362 52104 99 52623 80112 58493 97241 64438 43261
598D3261J5281P2728l1787j7628o6046J3233L5721L0744p3718R732l4834j2654
$$ 43261 58542 131270 99483 81855 15809 29042 64763 95507 21789 31521 -3313 -15967
586a5967O2714O1563L2177m438l7302M1940N6452p9277n4697j6700J2464O5695
$$ -15967 46747 108310 140487 136049 98747 140687 197139 117862 63165 46465 58929 124624
574A24624k7176q251j9985K8124n435m9650K2607l6347K8101N4855j5751k3422
$$ 124624 97448 89197 69212 97336 91901 42251 64858 28511 56612 111467 95716 72294
562G2294J01741P385m3424m3064k493j0623L0097K1459m6194o3551k2037M3811
$$ 72294 174035 181420 137996 94932 92439 81816 111913 133372 87178 23627 1590 45401
550D5401J7880M8785O6984j19008M9740j6785N3610n5734k1031k157o2013K4815
$$ 45401 63281 112066 179050 60042 109782 92997 146607 90873 69842 67685 5672 30487
538C0487K0116Q6661J5016l1418k5581j073L1432l0758m8783m770L4751l499R261
$$ 30487 50603 137264 152280 120862 95281 94208 125640 94882 46099 41329 76080 72581 81842
525H1842N1136r652j9107L0390r527O174j0722k5514l3697J1530l60M8939L4909
$$ 81842 132978 123326 104219 134609 125082 131256 120534 95020 61323 72853 72493 121432 156341
512A56341o5869l5208K9886K6860n186k337l2890m8054M7258j9999j270K0434
$$ 156341 90472 55264 85150 112010 106824 104487 71597 23543 70801 50802 49532 69966
500F9966M521p703M3666J3559k3302M748J6265J5260o6938K0340K2788k2680k6317
$$ 69966 74487 66784 110450 124009 100707 105455 121720 136980 70042 90382 113170 90490 64173
487F4173N1697O929k6421n5851P321O1086J375k6218j4417N0904L8321k194k4109
$$ 64173 115870 122799 96378 40527 47848 108934 110309 84091 69674 120578 158899 156705 132596
474A32596m0295K1285k7335Q0841J5766r9671N7000N2478p8278q4183k7512J10215
$$ 132596 92301 113586 86251 167092 182858 83187 140187 192665 114387 30204 2692 112907
462A12907j0253K4339m174l6929L6813J5019j2260M5441rj3922l1774j3438j3742
$$ 112907 102654 126993 122819 85890 122703 137722 125462 170903 170894 156972 125198 111760 98018
449I8018O765M4012k6214q6546m1396O5176P0372J450q6669L9559J129l8404P778
$$ 98018 104783 148795 122581 36035 -5361 59815 130187 131637 44968 84527 85656 47252 55030
436E5030K9324l1102K5913j6433k2188J6574M2996n735j6167L9400l7820n4385
$$ 55030 84354 53252 79165 62732 40544 57118 100114 94379 78212 117612 79792 25407
424B5407K797L3549K5231L3854p0902L7339r547J6961M7869M6020k1115k6547
$$ 25407 28204 61753 86984 120838 49936 87275 77728 94689 142558 188578 167463 140916
412A40916j5764J1750o5163k7690R4101L479n6815R580j5208k2962J8850K0942
$$ 140916 125152 136902 71739 44049 138150 141629 84814 94394 79186 56224 75074 96016
400I6016O4405p839j6571k1097j1569O948L5128j9983j5940L361o8901O9238R7227
$$ 96016 160421 152582 136011 114914 103345 110293 145421 125438 109498 112859 43958 113196 210423
387B10423n2661k2945j8915K8453m5393P729k2853k4621J1241J0325n404P4237
$$ 210423 157762 134817 115902 144355 98962 106691 83838 59217 70458 80783 75379 149616
375A49616k1855q5979R722L5113J0713J4215k1023p420L8734M4167k6187K1289
$$ 149616 127761 41782 51504 86617 97330 111545 90522 83102 121836 166003 139816 161105
363A61105l590n3154M40N7682K126j5418K1357j5142l2297o2043J1637R6094p3618
$$ 161105 157515 104361 104801 162483 164609 149191 170548 155406 123109 61066 72703 168797 95179
350I5179n308Q1348k3561J9727K470l7887r828M2108P342q933q7848L7626J0664
$$ 95179 89871 171219 147658 167385 169855 131968 122140 164248 171590 162657 74809 112435 123099
337A23099L7190J4268o4517J7157l4043K2078J1556P255o4922o1789Q5839K1070
$$ 123099 160289 174557 110040 127197 93154 115232 126788 134043 69121 7332 93171 114241
325A14241l4231K7005J2081m1559O1028N02K0752m7323n7439K8076J8102Q1409
$$ 114241 80010 107015 119096 77537 138565 139067 159819 112496 55057 83133 101235 182644
313A82644O225J498p8092n0643P6796l1112M5306r517m8626J8511P52L4452k230
$$ 182644 188869 190367 112275 61632 138428 107316 152622 143105 94479 112990 113742 148194 145964
300A45964K6299m9617k6104J6295M698k5719n2996K5334j3077O1354n6142n93
$$ 145964 172263 122646 96542 112837 117535 91816 38820 64154 51077 112431 56289 55696
288E5696M6294k1142k7K3870j9127M0507m5358o824P0576j2479k3424o0017j8930
$$ 55696 101990 80848 80821 104691 85564 126071 80713 73889 144465 131986 108562 48545 29615
275B9615M5615P3250J9529n0684j8242L1094L6880L4405q0219j6203O765K6730
$$ 29615 75230 148480 168009 117325 99083 130177 167057 201462 121243 105040 111805 138535
263A38535k845j100j4333m4157L9419r793j204K2412P304J8786L4774k576J9147
$$ 138535 135690 134590 120257 76100 115519 105726 104522 126934 134238 153024 187798 185222 204369
250B04369J3951K830k7221L1621J2585j19663r1182L0343O2137l3693J8782j900
$$ 204369 218320 221150 193929 225550 238135 118472 27290 57633 119770 86077 104859 102959
238A02959Q494j0121J8915J8847j7104N7428Q2154o3142q9347k9594k497P2019
$$ 102959 111453 101332 120247 139094 121990 179418 261572 198430 109083 79489 76992 149011
226A49011k5702j901r912q5748L9153N9307N6719n6233k2253k2255O65m7563M9370
$$ 149011 123309 121408 111496 25748 64901 124208 180927 124694 102441 80186 80851 33288 82658
213H2658P9828j4845j2925m7243k1612K8530P0972k6112k4981Q213J1554m6434
$$ 82658 162486 147641 134716 87473 65861 94391 165363 139251 114270 122483 134037 87603
201H7603m9474O0886J8728m3070N9317K5622J7423M032q1231o277O432k530J455
$$ 87603 38129 99015 117743 74673 133990 159612 177035 181067 99836 93559 99991 97461 98916
188I8916O7153j2131q4260L1878l8275k0221Q7806L8710K6185m8810r485m934
$$ 98916 166069 153938 69678 101556 63281 43060 130866 169576 195761 146951 137466 132532
176A32532J3274R204p3655l2741M6222J0360j0808N4456J6986o5021P3923J7876
$$ 132532 145806 155010 81355 48614 94836 105196 94388 148844 165830 100809 174732 192608
164A92608q290O412r1954O8496M2431j3250j0412j6808j2480Q238o6153k4269
$$ 192608 184318 190730 98776 167272 209703 196453 186041 169233 156753 164991 98838 74569
152G4569J886Q5086M3976k4310j0222m3158m4810K6242J1702K2698N8040O1009
$$ 74569 76455 161541 205517 181207 170985 127827 83017 109259 120961 143659 201699 262708
140B62708k5475n5569l4800J1407M9681o92m4190m0250m9170O9587J7182k7832
$$ 262708 237233 181664 146864 158271 207952 207260 163070 122820 73650 143237 160419 132587
128A32587K8719K8845K9913k0094l9056K1506l8378q6689O2623K8112m1671r928
$$ 132587 161306 190151 220064 199970 160914 182420 144042 57353 119976 148088 106417 96489
116I6489L3890P841k0224q701m278j4872m0683K7995O2827J4284p321n9924k6624
$$ 96489 130379 138220 117996 109295 105017 90145 49462 77457 140284 154568 147247 87323 60699
103F0699j6126P0551K6591k5588k7847R058O540N853j4394o610M3976J5457p833
$$ 60699 44573 115124 141715 116127 88280 97338 103878 109731 95337 88727 132703 148160 140327
90A40327K4346k8787j127J2052J7258k6947J2723M5738m0335m164n3954K182r404
$$ 140327 164673 135886 134759 146811 164069 137122 149845 195583 155248 151084 97130 99312 89908
77H9908j3679n935J4181M5792j2900K36K0285O45Q64M0489J4406l4910N2129q463
$$ 89908 76229 70294 84475 130267 117367 117603 137888 138533 139397 179886 194292 159382 211511 203048
63B03048j9161J705m9358k1847j9789j0436K5956L0448J30r501l152r169J5217
$$ 203048 183887 185592 136234 114387 94598 84162 110118 140566 140696 131195 128043 118874 134091
50A34091k5119m0030j6877N0375N4682R91K6346l752j1939J8068l3080k0533m3123
$$ 134091 108972 68942 52065 102440 157122 158113 184459 180707 168768 186836 153756 133223 90100
37I0100M001l9196M2081N8941K7975j2280J7592k7533n0001Q736J9744O1584k6507
$$ 90100 94101 54905 96986 155927 183902 171622 189214 161681 111680 120416 140160 201744 175237
24A75237k050J9564l3648k412p052K1616n474r843j1858n5606L1169k4001l0296
$$ 175237 173187 192751 159103 156691 149639 171255 165781 155938 144080 88474 119643 95642 65346
11F5346N7713M1086m2310L0569K0772J0039m4347k7842R637M7973m913
$$ 65346 123059 164145 121835 152404 173176 183215 138868 111026 120663 168636 163723
0A63723
$$ 163723
$$ Imaginary data points
##PAGE= N=2
##DATA TABLE= (X++(I..I)), XYDATA
16383c770525O8307O4765K1642Q6516P8376L8940M8360O4091N8957L4960N4472
$$ -3770525 -3702218 -3637453 -3615811 -3529295 -3450919 -3411979 -3363619 -3299528 -3240571 -3205611 -3151139
16372c151139L3798Q1769M5420O5975P3899L2950J7697M9633R3935M3955J03923
$$ -3151139 -3117341 -3035572 -2990152 -2924177 -2850278 -2817328 -2799631 -2749998 -2656063 -2612108 -2508185
16361b508185M2000R117K6232L7207R8128O5329j9592Q4406O3554J13170r689
$$ -2508185 -2466185 -2457068 -2430836 -2393629 -2295501 -2230172 -2249764 -2165358 -2101804 -1988634 -1998323
16350a998323N5387K4539N1251Q8416Q7794L2502M6245P0480J2647K4858N0946
$$ -1998323 -1942936 -1918397 -1867146 -1778730 -1690936 -1658434 -1612189 -1541709 -1529062 -1504204 -1453258
16339a453258M2890J0101N6517Q9848P4395Q9636K8776M842j1669R9610Q6936
$$ -1453258 -1410368 -1400267 -1343750 -1253902 -1179507 -1089871 -1061095 -1056253 -1067922 -968312 -881376
16328h81376K2896P6523M4326K0489K2740O3325O2122Q1883M7299M7186P9828
$$ -881376 -858480 -781957 -737631 -717142 -694402 -631077 -568955 -487072 -439773 -392587 -312759
$$ [...]
##END NTUPLES=NMR SPECTRUM
##END=
