##TITLE=1H_CA-9433-2
 200.13MHz,DMSO-d6.
 8 sc
 
 3.3.2026
##JCAMPDX= 6.0         $$ Bruker NMR JCAMP-DX V2.0
##DATA TYPE= NMR SPECTRUM
##DATA CLASS= NTUPLES
##ORIGIN= UXNMR, Bruker Analytische Messtechnik GmbH
##OWNER= pz
$$ XWIN-NMR		Version 3.5
$$ Tue Mar  3 13:31:03 2026 Russian Standard Time (UT+4h)  she@DPX200
##.OBSERVE FREQUENCY= 200.1313
##.OBSERVE NUCLEUS= ^1H
##.ACQUISITION MODE= SIMULTANEOUS
##.ACQUISITION SCHEME= undefined
##.AVERAGES= 8
##.DIGITISER RES= 18
##SPECTROMETER/DATA SYSTEM= spect
##.PULSE SEQUENCE= zg30
##.SOLVENT NAME= DMSO
##.SHIFT REFERENCE= (INTERNAL, DMSO, 0, 15.358)
##AUDIT TRAIL= $$ (NUMBER, WHEN, WHO, WHERE, WHAT)
$$ ##TITLE= Audit trail, XWIN-NMR		Version 3.5
$$ ##JCAMPDX= 5.01
$$ ##ORIGIN= Bruker BioSpin GmbH
$$ ##OWNER= she
$$ F:/spectra/data/she/nmr/H-C/1/pdata/1/auditp.txt
$$ ##AUDIT TRAIL=  $$ (NUMBER, WHEN, WHO, WHERE, WHAT)
(   1,<2026-03-03 13:29:30.65 +0400>,<she>,<DPX200>,
      <created by zg, POWCHK disabled, PULCHK disabled
       configuration hash MD5:
       00 E9 B6 7A A2 85 ED C7 34 08 36 98 17 FE 4E 26
       data hash MD5: 16K
       9E 8C BB D1 CB 7D B0 85 D3 15 B0 57 97 C9 50 0D>)
(   2,<2026-03-03 13:29:33.21 +0400>,<she>,<DPX200>,
      <Start of raw data processing
       efp BC_mod = 2 LB = 0.25 FT_mod = 6 PKNL = 1 PHC0 = -3858.379 PHC1 = 7.792321 SI = 16K 
       data hash MD5: 16K
       02 2F FD 08 57 A5 5C 5F 91 CE 45 DB 12 76 4A F0>)
(   3,<2026-03-03 13:30:02.39 +0400>,<she>,<DPX200>,
      <pk PHC0 = 156.7172 PHC1 = 1.2 
       data hash MD5: 16K
       C4 FD 15 CA D2 51 DF 57 D4 61 EC 83 9C E8 22 0B>)
(   4,<2026-03-03 13:30:07.67 +0400>,<she>,<DPX200>,
      <abs ABSG = 5 
       data hash MD5: 16K
       A6 26 23 68 4C 78 52 EE 25 95 CC A8 B6 70 F0 1A>)
$$ ##END=
$$ 
$$ hash MD5
$$ 70 FC FA 0A 97 B5 C2 B6 28 66 F1 BF 0E 32 87 A5
##$RELAX= 
##$RELAX= 
##$RELAX= 
##$RELAX= 
##$RELAX= 
##$RELAX= 
$$ Bruker specific parameters
$$ --------------------------
##$DU= <F:/spectra>
##$EXPNO= 1
##$NAME= <H-C>
##$PROCNO= 1
##$TYPE= <nmr>
##$USER= <she>
##$AMP= (0..31)
100 100 100 100 100 100 100 100 100 100 100 100 100 100 100 100 100 100 
100 100 100 100 100 100 100 100 100 100 100 100 100 100 
##$AQSEQ= 0
##$AQ_mod= 1
##$AUNM= <au_zg>
##$AUTOPOS= <>
##$BF1= 200.13
##$BF2= 200.13
##$BF3= 200.13
##$BF4= 200.13
##$BF5= 200.13
##$BF6= 200.13
##$BF7= 200.13
##$BF8= 200.13
##$BYTORDA= 1
##$CFDGTYP= 0
##$CFRGTYP= 5
##$CHEMSTR= <none>
##$CNST= (0..31)
1 1 145 1 1 1 1 1 1 1 1 1 1 1 1 1 1 1 1 1 1 1 1 1 1 1 1 1 1 1 1 1 
##$CPDPRG= <>
##$CPDPRG1= <>
##$CPDPRG2= <>
##$CPDPRG3= <>
##$CPDPRG4= <mlev>
##$CPDPRG5= <mlev>
##$CPDPRG6= <mlev>
##$CPDPRG7= <mlev>
##$CPDPRG8= <mlev>
##$CPDPRGB= <>
##$CPDPRGT= <>
##$D= (0..31)
0 0.7 0 0 0 0 0 0 0 0 0 0.03 0 0 0 0 0 0 0 0 0 0 0 0 0 0 0 0 0 0 0 0 
##$DATE= 1772530170
##$DBL= (0..7)
120 120 120 120 120 120 120 120 
##$DBP= (0..7)
150 150 150 150 150 150 150 150 
##$DBP07= 0
##$DBPNAM0= <>
##$DBPNAM1= <>
##$DBPNAM2= <>
##$DBPNAM3= <>
##$DBPNAM4= <>
##$DBPNAM5= <>
$$ [...]
##$SUBNAM3= <"">
##$SUBNAM4= <"">
##$SUBNAM5= <"">
##$SUBNAM6= <"">
##$SUBNAM7= <"">
##$SUBNAM8= <"">
##$SUBNAM9= <"">
##$SW= 18.0517328524113
##$SWIBOX= (0..15)
0 0 2 0 0 0 0 0 0 0 0 0 0 0 0 0 
##$SW_h= 3612.71676300578
##$TD= 16384
##$TD0= 1
##$TE= 0
##$TE2= 300
##$TE3= 300
##$TEG= 300
##$TL= (0..7)
0 120 120 120 120 120 120 120 
##$TP= (0..7)
150 150 150 150 150 150 150 150 
##$TP07= 0
##$TPNAME0= <>
##$TPNAME1= <>
##$TPNAME2= <>
##$TPNAME3= <>
##$TPNAME4= <>
##$TPNAME5= <>
##$TPNAME6= <>
##$TPNAME7= <>
##$TPOAL= (0..7)
0.5 0.5 0.5 0.5 0.5 0.5 0.5 0.5 
##$TPOFFS= (0..7)
0 0 0 0 0 0 0 0 
##$TUNHIN= 0
##$TUNHOUT= 0
##$TUNXOUT= 0
##$USERA1= <user>
##$USERA2= <user>
##$USERA3= <user>
##$USERA4= <user>
##$USERA5= <user>
##$V9= 5
##$VALIST= <valist>
##$VCLIST= <CCCCCCCCCCCCCCC>
##$VD= 0
##$VDLIST= <DDDDDDDDDDDDDDD>
##$VPLIST= <PPPPPPPPPPPPPPP>
##$VTLIST= <TTTTTTTTTTTTTTT>
##$WBST= 1024
##$WBSW= 4
##$XGAIN= (0..3)
0 0 0 0 
##$XL= 0
##$YL= 0
##$YMAX_a= 619376
##$YMIN_a= -865176
##$ZGOPTNS= <>
##$ZL1= 120
##$ZL2= 120
##$ZL3= 120
##$ZL4= 120
##$ABSF1= 15.39982
##$ABSF2= -2.652027
##$ABSG= 5
##$ABSL= 3
##$ALPHA= 0
##$AQORDER= 0
##$ASSFAC= 0
##$ASSFACI= 0
##$ASSFACX= 0
##$ASSWID= 0
##$AUNMP= <proc_1d>
##$AZFE= 0.1
##$AZFW= 0.1
##$BCFW= 0
##$BC_mod= 2
##$BYTORDP= 0
##$COROFFS= 0
##$CY= -3
##$DATMOD= 1
##$DC= 0
##$DFILT= <>
##$DTYPP= 0
##$F1P= 0
##$F2P= 0
##$FCOR= 1
##$FTSIZE= 16384
##$FT_mod= 6
##$GAMMA= 0
##$GB= 0
##$INTBC= 1
##$INTSCL= 3.241238e-09
##$ISEN= 128
##$LB= 0.25
##$LEV0= 0
##$LPBIN= 0
##$MAXI= 10000
##$MC2= 0
##$MEAN= 0
##$ME_mod= 0
##$MI= 1.114404
##$NCOEF= 0
##$NC_proc= -6
##$NLEV= 6
##$NOISF1= 3.799351
##$NOISF2= 2.8
##$NSP= 0
##$NTH_PI= 0
##$NZP= 0
##$OFFSET= 15.35795
##$PC= 1
##$PHC0= -3701.662
##$PHC1= 8.992321
##$PH_mod= 1
##$PKNL= yes
##$PPARMOD= 0
##$PSCAL= 0
##$PSIGN= 0
##$REVERSE= no
##$SF= 200.130032770949
##$SI= 16384
##$SIGF1= 3
##$SIGF2= 2
##$SINO= 0.751879
##$SIOLD= 32768
##$SREGLST= <19F.Aceton>
##$SSB= 0
##$STSI= 16384
##$STSR= 0
##$SW_p= 3612.71676300578
##$SYMM= 0
##$S_DEV= 0
##$TDeff= 16384
##$TDoff= 0
##$TI= <>
##$TILT= no
##$TM1= 0
##$TM2= 0
##$TOPLEV= 0
##$USERP1= <user>
##$USERP2= <user>
##$USERP3= <user>
##$USERP4= <user>
##$USERP5= <user>
##$WDW= 1
##$XDIM= 16384
##$YMAX_p= 409121921
##$YMIN_p= -878978
$$ End of Bruker specific parameters
$$ ---------------------------------
##NTUPLES= NMR SPECTRUM
##VAR_NAME=  FREQUENCY,     SPECTRUM/REAL,   SPECTRUM/IMAG
##SYMBOL=    X,             R,               I
##VAR_TYPE=  INDEPENDENT,   DEPENDENT,       DEPENDENT
##VAR_FORM=  AFFN,          ASDF,            ASDF
##VAR_DIM=   16384,         16384,           16384
##UNITS=     HZ,            ARBITRARY UNITS, ARBITRARY UNITS
##FACTOR=    0.220516191357247, 1,           1
##FIRST=     3073.58707893623, 0,            0
##LAST=      -539.129684069545, 0,           0
##MIN=       -539.129684069545, -878978,     0
##MAX=       3073.58707893623, 409121921,    0
$$ Real data points
##PAGE= N=1
##DATA TABLE= (X++(R..R)), XYDATA
$$ [...]
7706b99492O1589n41k03520j23474J61190Q2824P5826R652p4461K7834j7482M9418
$$ -299492 -237903 -238444 -441964 -565438 -404248 -321424 -245598 -235946 -310407 -282573 -300055 -250637
7694b50637m0932o2498O5961q8640m9731J06971l6444o72L6237j10648R8878Q5267
$$ -250637 -291569 -354067 -288106 -376746 -426477 -319506 -355950 -356622 -320385 -431033 -332155 -246888
7682b46888q1983m3193P0984n0371m4821k1709J16184M54n7435l6601L246j2739
$$ -246888 -328871 -372064 -301080 -351451 -396272 -417981 -301797 -301343 -358778 -395379 -392133 -404872
7670d04872J09196J093r4762q713O487O9363l1326J3821j00713N2247p479J8229
$$ -404872 -295676 -294583 -389345 -398058 -391571 -322208 -353534 -339713 -440426 -388179 -395658 -377429
7658c77429K491o4301o2709O6899m601q1935J33154J04250p1786p7650J5391J9410
$$ -377429 -374938 -439239 -501948 -435049 -439650 -521585 -388431 -284181 -355967 -433617 -418226 -398816
7646c98816J2659k8482j0629q287L9317j058K8295J7123p6270N4606L864n7363
$$ -398816 -386157 -414639 -425268 -433555 -394238 -395296 -367001 -349878 -426148 -371542 -367678 -425041
7634d25041K5238O9233O863N0140o7609o6430R287K846j1718L9080J07232l4211
$$ -425041 -399803 -330570 -323707 -273567 -341176 -407606 -398319 -395473 -407191 -368111 -260879 -295090
7622b95090n3864O2038N6611j38373j02220L1462L4467o1308p1999l6868j7727
$$ -295090 -348954 -286916 -230305 -368678 -470898 -439436 -404969 -466277 -538276 -575144 -592871
7611e92871L8318P9142J2943j10255P5331M8817j26591L5492o4906j8875m6528
$$ -592871 -554553 -475411 -462468 -572723 -497392 -448575 -575166 -539674 -604580 -623455 -669983
7600f69983Q1971j2985k0379P3382N7470m8514n1184q3908J08557J8514m4130
$$ -669983 -588012 -600997 -621376 -547994 -490524 -539038 -590222 -674130 -565573 -547059 -591189
7589e91189K3547O3107K5172r3541J457J15275N6503O198n8432k9039r291j17398
$$ -591189 -567642 -504535 -479363 -572904 -571447 -456172 -399669 -393471 -451903 -480942 -490233 -607631
7577f07631k2306M540R0574q9569j1476M3403j6180r6795l4551J03572J37847
$$ -607631 -629937 -625397 -534823 -624392 -635868 -592465 -608645 -705440 -739991 -636419 -498572
7566d98572l1759J107j5544J8111j01881K526K4727L2278J9275L933j36691o1844
$$ -498572 -530331 -529224 -544768 -526657 -628538 -626012 -601285 -569007 -549732 -545799 -682490 -744334
7554g44334J6673O9498j7300q11k3538J665K6052N7804J0790R7908j5240o9419
$$ -744334 -727661 -658163 -675463 -676274 -699812 -698147 -672095 -614291 -603501 -505593 -520833 -590252
7542e90252o54J48035j0560j78363J834j6082P1713M546K8261q945K1318m4689
$$ -590252 -590906 -442871 -453431 -631794 -629960 -646042 -574329 -569783 -541522 -550467 -529149 -573838
7530e73838O3769O3241l1489J01148P0781j8502P035m9136p4751j6822M6592R974
$$ -573838 -510069 -446828 -478317 -377169 -306388 -324890 -317855 -366991 -441742 -458564 -411972 -401998
7518d01998N7615L1853R7699k9918p8751N814J01465L350m4123n3940n0756J01326
$$ -401998 -344383 -312530 -214831 -244749 -323500 -317686 -216221 -212871 -256994 -310934 -361690 -260364
7506b60364q3296K5707J16355J6889o1014m5788j2167K5219L1951m6977J34094
$$ -260364 -343660 -317953 -201598 -184709 -245723 -291511 -303678 -278459 -246508 -293485 -159391
7495a59391l879n9829O955R9481P7314Q97J7912l0930O956m0493M1554J12050
$$ -159391 -163270 -223099 -216144 -116663 -39349 -38452 -20540 -51470 -44514 -85007 -43453 68597
7483F8597J3410p5873P388O7798O2433M0241L4905n3193n5908r500o5761K2062
$$ 68597 82007 6134 13522 81320 143753 183994 218899 165706 109798 100298 34537 56599
7471E6599J24748m6387j8906P2551o3733k0407q3753J2025m2729J4066J09262
$$ 56599 181347 134960 116054 188605 124872 104465 20712 32737 -9992 4074 113336
7460A13336O76j35810r3059M6580N6389J7571K0185K0391K5938o4602L1989n0607
$$ 113336 114012 -21798 -114857 -68277 -11888 5683 25868 46259 72197 7595 39584 -11023
7448a1023m1558q8811J6728r467K8408m1258O7121Q1635q2334r0510l369o121
$$ -11023 -52581 -141392 -124664 -134131 -105723 -146981 -79860 1775 -80559 -171069 -174438 -180559
7436a80559n4486R6107o1663o4381m341n9124M5934Q3495m7036q7936k3981p9528
$$ -180559 -235045 -138938 -200601 -264982 -269323 -328447 -282513 -199018 -246054 -333990 -357971 -437499
7424d37499n2519J18741L7636l240Q103l5497l1345j8364J1345p1139L2277j703
$$ -437499 -490018 -371277 -333641 -336881 -328778 -364275 -395620 -413984 -402639 -473778 -441501 -443204
7412d43204o727Q4727L001Q7573p5305l7568L2877n0942l8065N6812r713o5181
$$ -443204 -449931 -365204 -362203 -274630 -349935 -387503 -354626 -405568 -443633 -386821 -396534 -461715
7400d61715j30880N4323J30302j36232o006L6422m5432P4819m5760j18880R1298
$$ -461715 -592595 -538272 -407970 -544202 -550208 -513786 -559218 -484399 -530159 -649039 -557741
7389e57741L3927O7504L7851n2094J8634l6577K4001N147k9288J0174l73r1656
$$ -557741 -523814 -456310 -418459 -470553 -451919 -488496 -464495 -459348 -488636 -478462 -478835 -570491
7377e70491m6266J14391J4954J5307P4154n3382O3533J9967l1224j3220q1985
$$ -570491 -616757 -502366 -487412 -472105 -397951 -451333 -387800 -367833 -399057 -412277 -494262
7366d94262j03084J00526Q2353l064K0600R20M0573L3816j07992l9876q0016L3061
$$ -494262 -597346 -496820 -414467 -417531 -396931 -396011 -355438 -321622 -429614 -469490 -549506 -516445
7354e16445p090J5743K5213N4321p3377O2431P1622M0813k338j12615j1718J03304
$$ -516445 -523535 -507792 -482579 -428258 -501635 -439204 -367582 -326769 -329107 -441722 -453440 -350136
7342c50136q7565l155J66936K560m2638K8407M0305O9832R8372Q0853L3014n1604
$$ -350136 -437701 -440856 -273920 -271360 -313998 -285591 -245286 -175454 -77082 3771 36785 -14819
7330a4819q3662m2552J12505k1394n037n9511k4k5407n7664J6342o1991o4799
$$ -14819 -98481 -141033 -28528 -49922 -54959 -114470 -114494 -139901 -197565 -181223 -243214 -308013
7318c08013n970O8859Q1098k1503l7467M7049Q5648R076j29290N1283n395p6265
$$ -308013 -313983 -245124 -164026 -185529 -222996 -175947 -90299 -81223 -210513 -159230 -164625 -240890
7306b40890j2815M7313K4328k6775K928l7847J66429R4098j38254n1259P5245
$$ -240890 -253705 -206392 -182064 -208839 -205911 -243758 -77329 16769 -121485 -172744 -97499
7295i7499K3992L8309j13682L625j1717n9587L5966J71744O7051p7009k7946j16
$$ -97499 -73507 -35198 -148880 -145255 -156972 -216559 -180593 -8849 58202 -18807 -46753 -46869
7283d6869J41806r6894r9482K6127K6311N5846j5699l0595K1715r732O3394J71549
$$ -46869 94937 -1957 -101439 -75312 -49001 6845 -8854 -39449 -17734 -27466 35928 207477
7271B07477N3417K95o1486O4813m8990J8942J2049O9865O4441j8303m1827o6295
$$ 207477 260894 261189 199703 264516 215526 234468 246517 316382 380823 362520 320693 254398
7259B54398K8744J9883P5918j254n2901J20429j9458M6772m1063K0223n8337p3651
$$ 254398 283142 303025 378943 377689 324788 445217 425759 472531 431468 451691 393354 319703
7247C19703J26084O0215J19932J8052j51307O1961J8439j9775K9751o002l7185
$$ 319703 445787 506002 625934 643986 492679 554640 573079 553304 583055 577053 539868
7236E39868m3763M3164Q3332k5549J778l7700K9296M7775j9402Q0598L269L2597
$$ 539868 496105 539269 622601 597052 598830 561130 590426 638201 618799 699397 702666 735263
7224G35263l115l6389M0027R0172M2399J51415J17391l356K8779O2198m2767M1732
$$ 735263 732148 695759 735786 825958 868357 1019772 1137163 1133807 1162586 1224784 1182017 1223749
7212A223749k7327k3575O8130J9023O3725J48450J76789n3224k2244k7364k0282
$$ 1223749 1196422 1172847 1240977 1260000 1323725 1472175 1648964 1595740 1573496 1546132 1525850
7201A525850Q3624j2959j64R8339J37282J02075J52305J0187M5497Q3953L9574
$$ 1525850 1609474 1596515 1596351 1694690 1831972 1934047 2086352 2096539 2142036 2225989 2265563
7190B265563J31011J7138M8097J27524%J52096P6349R4837J25790J22672Q4881
$$ 2265563 2396574 2413712 2461809 2589333 2589333 2741429 2817778 2912615 3038405 3161077 3245958
7179C245958R8888J01038Q5383J01315J09341J50940J48136K60674J43525R5116
$$ 3245958 3344846 3445884 3531267 3632582 3741923 3892863 4040999 4301673 4445198 4540314
7169D540314J21340J82584K41270J15170J95065J67594K76244K32842K84708K44857
$$ 4540314 4661654 4844238 5085508 5200678 5395743 5563337 5839581 6072423 6357131 6601988
7159F601988L23651K82099L52749M10420L69116M80184N86580O10117N70646P53528
$$ 6601988 6925639 7207738 7560487 7970907 8340023 8820207 9406787 10016904 10587550 11341078
7149A1341078Q17216R41003J107145J203853J416841J433376J667797J881632
$$ 11341078 12158294 13099297 14206442 15410295 16827136 18260512 19928309 21809941
7141B1809941K266547K658324K850911L086133L282130L535026L574025L487485
$$ 21809941 24076488 26734812 29585723 32671856 35953986 39489012 43063037 46550522
7133D6550522L031547K578074J922172J118699K74267k64861q28698j030967j202395
$$ 46550522 49582069 52160143 54082315 55201014 55475281 55210420 54381722 53350755 52148360
7124E2148360j191671j082772q69669o73791l13612J38009M21277R58582J163913
$$ 52148360 50956689 49873917 49004248 48330457 48016845 48154854 48576131 49534713 50698626
7115E0698626J469438J884836K005140J954882J913617J390540O07608j01255
$$ 50698626 52168064 54052900 56058040 58012922 59926539 61317079 61924687 61823432
7107F1823432r82337j915731k798228l215473l417915l510369l509611l353331
$$ 61823432 60841095 58925364 56127136 52911663 49493748 45983379 42473768 39120437
7099C9120437l178791k835286k616342k498207k312043j978985j626547j558338
$$ 39120437 35941646 33106360 30490018 27991811 25679768 23700783 22074236 20515898
7091B0515898j416268j222877j165747j161303r55192r16513p35090p14408p78608
$$ 20515898 19099630 17876753 16711006 15549703 14594511 13677998 12942908 12228500 11449892
7082A1449892o47121o27117o11560m82976m37840l29375m08913n06692m05691
$$ 11449892 10802771 10175654 9564094 9081118 8643278 8313903 7904990 7398298 6992607
7073F992607l94823l54814k53937k37990k97306k39968j69860j96446k04652k06798
$$ 6992607 6597784 6242970 5989033 5751043 5453737 5213769 5043909 4847463 4642811 4436013
7063D436013k21318j97014k74085k18655j07499k18138j61432q4724j47337k15725
$$ 4436013 4214695 4017681 3743596 3524941 3417442 3199304 3037872 2953148 2805811 2590086
7053B590086o6221k09138j11142j4734j06265Q13l4383j32715o0702k1757k10296
$$ 2590086 2523865 2314727 2203585 2188851 2082586 2083399 2049016 1916301 1855599 1833842 1623546
7042A623546k1104j5391j6033L592r0036N1712q9028l68m7412q2366J2841o8392
$$ 1623546 1602442 1587051 1571018 1574610 1484574 1536286 1447258 1446890 1399478 1317112 1329953 1261561
7030A261561J6940M69j11001l9588L5975q7754j4945N1839n2899m4580o242q3889
$$ 1261561 1278501 1278970 1167969 1128381 1164356 1076602 1061657 1113496 1060597 1016017 1009775 925886
7018I25886L971o0709n9989j29290L0197O2024K3986n2619j67443N9966K9596
$$ 925886 929857 869148 809159 679869 710066 772090 796076 743457 576014 635980 665576
7007F65576n3035l9893n5152q2329o4608Q6312P7650j8500j76374j2911L6696
$$ 665576 612541 572648 517496 435167 370559 456871 534521 516021 339647 326736 363432
6996C63432j84366J4312j7643j160k0998o644N6210n5170j1643o9199j24712K8863
$$ 363432 179066 193378 175735 174575 153577 146933 203143 147973 136330 67131 -57581 -28718
6984b8718L4048P5383j01512r2257M7182J24188J7716j00646P2726j58469k909
$$ -28718 5330 80713 -20799 -113056 -65874 58314 76030 -24616 48110 -110359 -113268
6973a13268M6359o0258l6331l172J4891j7875J3778l083N1944o764q5262M6677
$$ -113268 -66909 -127167 -163498 -166670 -151779 -169654 -155876 -158959 -107015 -113779 -199041 -152364
6961a52364j62709m88R2006L2312l0526j08995Q882L6863L0372J5356L645Q34
$$ -152364 -315073 -315561 -223555 -191243 -221769 -330764 -321882 -285019 -254647 -239291 -235646 -234812
6949b34812j26997J2568m3479K8907m7462k1226K1761M303j9982K1288l0707Q0071
$$ -234812 -361809 -349241 -392720 -363813 -411275 -432501 -410740 -406437 -426419 -405131 -435838 -355767
6937c55767p800L3323k014J1004L4643j45971l8908q0326J8480M8788J65099l1436
$$ -355767 -363567 -330244 -332258 -321254 -286611 -432582 -471490 -551816 -533336 -484548 -319449 -350885
6925c50885o8090k736n1267p8141R2534p2187p8852K4762l3798M391L6299M788
$$ -350885 -418975 -421711 -472978 -551119 -458585 -530772 -609624 -584862 -618660 -614269 -577970 -573182
6913e73182K1762P7436Q2466q9827j03056N314L3067m9745M424L6782K9594k1185
$$ -573182 -551420 -473984 -391518 -481345 -584401 -579087 -546020 -595765 -591341 -554559 -524965 -546150
6901e46150k5013r972M7523p2273J2858J14075O118r5032N863k8542Q508J9344
$$ -546150 -571163 -581135 -533612 -605885 -593027 -478952 -472834 -567866 -562003 -590545 -582037 -562693
6889e62693J0315Q504p9118N4775n9842r9631R7196n8799k7090j589P9705p7310
$$ -562693 -552378 -543874 -622992 -568217 -628059 -727690 -630494 -689293 -716383 -717972 -638267 -715577
6877g15577J74297n1986n8479k7034K1280M7681K3549j01727O0526M1226k1089
$$ -715577 -541280 -593266 -651745 -678779 -657499 -609818 -586269 -687996 -627470 -586244 -607333
6866f07333l549j33688j03808J43777L0249o3767J6270M6404q704k9420M3092
$$ -607333 -610882 -744570 -848378 -704601 -674352 -738119 -721849 -675445 -684149 -713569 -670477
6855f70477j22155N0734J9135M2587Q6611O0016p5476O2266j08736o0853l42m6367
$$ -670477 -792632 -741898 -722763 -680176 -593565 -533549 -609025 -546759 -655495 -716348 -716690 -763057
6843g63057L4896L895l2601P5302Q3859k2580m6878L2843j15503J0827P7080M3569
$$ -763057 -728161 -724266 -756867 -681565 -597706 -620286 -667164 -634321 -749824 -738997 -661917 -618348
6831f18348j8019L6009L5188M392m4304n0634o6094P5911K9114k8471N9357j00456
$$ -618348 -636367 -600358 -565170 -560778 -605082 -655716 -721810 -645899 -616785 -645256 -585899 -686355
6819f86355j17608N7749q8401Q1868J66225j659j26372O0188m6292l549O7588
$$ -686355 -803963 -746214 -834615 -752747 -586522 -588181 -714553 -654365 -700657 -704206 -636618
6808f36618L661l8911r272j31190J20906N876O5348j8247J3228J20005m7333p8609
$$ -636618 -632957 -671868 -681140 -812330 -691424 -685548 -620200 -638447 -625219 -505214 -552547 -631156
6796f31156j38555J00291K9076n4381k730p39m0144m2194m1609n460k2507L1949
$$ -631156 -769711 -669420 -640344 -694725 -697455 -698194 -738338 -780532 -822141 -827601 -850108 -818159
6784h18159J14024q6717q8126P457J40067K9780j5376j1540J2734J5814q6428
$$ -818159 -704135 -790852 -878978 -871521 -731454 -701674 -717050 -728590 -715856 -700042 -786470
6773g86470N4523J6845n653k2927m8725l3577L2597m7049R5643m0118o203P8196
$$ -786470 -731947 -715102 -720755 -743682 -792407 -825984 -793387 -840436 -744793 -784911 -791114 -712918
6761g12918J06739p2733j30897J03094M7307r6937L6286l1129J05312o151k0335
$$ -712918 -606179 -678912 -809809 -706715 -659408 -756345 -720059 -751188 -645876 -652027 -672362
6750f72362j4704l126J12228L8404o7861o704N0587L1395p1415n2509Q1573m3788
$$ -672362 -687066 -690192 -577964 -539560 -607421 -614125 -563538 -532143 -603558 -656067 -574494 -618282
6738f18282o4210j2576P3303m5816m3101N1393J9186J8318l0533j107m0200n2973
$$ -618282 -682492 -695068 -621765 -667581 -710682 -659289 -640103 -621785 -652318 -653425 -693625 -746598
6726g46598j0542R4463M0322P3055N3600L1979j35360o4640J38149O8118k8560
$$ -746598 -757140 -662677 -622355 -549300 -495700 -463721 -599081 -663721 -525572 -457454 -486014
6715d86014j51656l3636L0298R8027o1666r4307O129p561M8365J6575o0355n162
$$ -486014 -637670 -671306 -641008 -542981 -604647 -698954 -692825 -700386 -652021 -635446 -695801 -700963
6703g00963L5869L3350j03449k819P4322J31260k8247n6228J2886n9746q644Q6840
$$ -700963 -665094 -631744 -735193 -738012 -663690 -532430 -560677 -616905 -604019 -663765 -672409 -585569
6691e85569K3928N9999L1229K3693L0394l9649j08809o5256Q7926K0127R246O6529
$$ -585569 -561641 -501642 -470413 -446720 -416326 -455975 -564784 -630040 -542114 -521987 -512741 -446212
6679d46212j8402o2281N6068r0143O600q5730N5137P7240k2602K6572L9096r6096
$$ -446212 -464614 -526895 -470827 -560970 -554370 -640100 -584963 -507723 -530325 -503753 -464657 -560753
6667e60753J29751m3340p1525l2216P6343R5561K7243j23032M2130J45006J6111
$$ -560753 -431002 -474342 -545867 -578083 -501740 -406179 -378936 -501968 -459838 -314832 -298721
6656b98721m1314q1683R9615M3399j22182q2541M625J9412O6169K4837R2789n4584
$$ -298721 -340035 -421718 -322103 -278704 -400886 -483427 -478802 -459390 -393221 -368384 -275595 -330179
6644c30179M6798j07524L1055O4375k8394n9330K2736M9208m1173k7308M4572
$$ -330179 -283381 -390905 -359850 -295475 -323869 -383199 -360463 -311255 -352428 -379736 -335164
6633c35164j1772o3194m7644M9972l0868K5078M8112N01l2077O6822p1507p0002
$$ -335164 -346936 -410130 -457774 -407802 -438670 -413592 -365480 -364979 -397056 -330234 -401741 -471743
6621d71743M4289k687J52128K2739k4979q1315r7713k8427N1044N4892K2369J1403
$$ -471743 -427454 -430141 -278013 -255274 -280253 -361568 -459281 -487708 -436664 -381772 -359403 -348000
6609c48000m7686o5658O9069l0229O6154j8553K6709p1978M1028M1879k16J35540
$$ -348000 -395686 -461344 -392275 -422504 -356350 -374903 -348194 -420172 -379144 -337265 -337481 -201941
6597b01941m1510o6283L0407L6690l478R2195q1061K7900N0703N8237j9270p242
$$ -201941 -243451 -309734 -279327 -242637 -246115 -153920 -234981 -207081 -156378 -98141 -117411 -124653
6585a24653K9742J8952N2698O3551r42J5437K9836j3152r0831R600J85509m0099
$$ -124653 -94911 -75959 -23261 40290 39348 54785 84621 71469 -19362 -9762 175747 135648
6573A35648K9476J6694l6046J6543R0522N864j3830Q1070r9714Q9558L4163O09
$$ 135648 165124 181818 145772 162315 252837 258701 244871 325941 226227 315785 349948 350557
6561C50557J54838R2498P8067K32477K6607J17821P8776R8446J09170J06916J42424
$$ 350557 505395 597893 675960 908437 935044 1052865 1131641 1230087 1339257 1446173 1588597
6550A588597K26729L5387J61464N1244J6364J00949K244j30948m8712P1017J681
$$ 1588597 1815326 1850713 2012177 2063421 2079785 2180734 2182978 2052030 2003318 2074335 2076016
6539B076016J8085l6744R1331R827K1987m4434Q2775R8706k4162k4175M992k3905
$$ 2076016 2094101 2057357 2148688 2158515 2180502 2136068 2218843 2317549 2293387 2269212 2274204 2250299
6527B250299n8747j03935j14517j41157o7348K4680r9270j87649m9732m1869J7821
$$ 2250299 2191552 2087617 1973100 1831943 1764595 1789275 1690005 1502356 1452624 1410755 1428576
6516A428576j34269n2247k0880j17342p7929o2591R766p4892r7405l7909l0059
$$ 1428576 1294307 1242060 1221180 1103838 1025909 963318 973084 898192 800787 762878 732819
6505G32819L1918L876J5517o6809p6656p8557k6963k9140O3223p4738r2414L0001
$$ 732819 764737 768613 784130 717321 640665 562108 535145 506005 569228 494490 402076 432077
6493D32077N746n2039q0276j0790L0526l4999O4381Q4146q3677q5923Q1830O0463
$$ 432077 437823 385784 305508 294718 325244 290245 354626 438772 355095 269172 351002 411465
6481D11465p1491l5738l9399Q3172J13615o0750p5538p511M9374J8934j7920p4610
$$ 411465 339974 304236 264837 348009 461624 400874 325336 317825 367199 386133 368213 293603
6469B93603k1338n1970m7674n827n2854l449K3236q0358R3015R8495l3250r0513
$$ 293603 272265 220295 172621 166794 113940 110491 133727 53369 146384 244879 211629 121116
6457A21116J2070M4860r721Q1377M0023J7060l1482Q1599L1997N8749J12579L9135
$$ 121116 133186 178046 168325 249702 289725 306785 275303 356902 388899 447648 560227 599362
6445E99362J2325K4648M3027Q6554k133J2996J46161K0063m610M2245Q0295j9591
$$ 599362 611687 636335 679362 765916 763783 776779 922940 943003 938393 980638 1060933 1041342
6433A041342l1147N5829J5435m93m959j8608J1285J21190J16657o0782n393j5410
$$ 1041342 1010195 1066024 1081459 1080966 1076007 1057399 1068684 1189874 1306531 1245749 1240356 1224946
6421A224946r1724k5575J57450R7058J28633o3582K5206P8870m8167N4673J9688
$$ 1224946 1133222 1107647 1265097 1362155 1490788 1427206 1452412 1531282 1483115 1537788 1557476
6410A557476R5153l0442j03796j01296J92465r5957J08080j1633j513O1346p8899
$$ 1557476 1652629 1622187 1518391 1417095 1609560 1513603 1621683 1610050 1608537 1669883 1590984
6399A590984k4473O8658L7166l5944j34383J3012P0357J13239L0569q9058L8542
$$ 1590984 1566511 1635169 1672335 1636391 1502008 1515020 1585377 1698616 1729185 1640127 1678669
6388A678669K2190J18262r9115o4457J23570M3967j8873J42268O3088J20969M5225
$$ 1678669 1700859 1819121 1720006 1655549 1779119 1823086 1804213 1946481 2009569 2130538 2175763
6377B175763J14384M133P4822K04766J38123K10406J76914J93906K54248K07431
$$ 2175763 2290147 2294280 2369102 2573868 2711991 2922397 3099311 3293217 3547465 3754896
6367C754896K92074L28367N29438N77557O32803R16092Q66804J233830J597825
$$ 3754896 4046970 4375337 4904775 5482332 6115135 7031227 7898031 9131861 10729686
6358A0729686K172157K650987L129955L182649K624957J780584O38307m27553
$$ 10729686 12901843 15552830 18682785 21865434 24490391 26270975 26909282 26481729
6350B6481729j308202j495825j400892r94957l52151K94251J177303K072289K277794
$$ 26481729 25173527 23677702 22276810 21281853 20929702 21223953 22401256 24473545 26751339
6341B6751339K034405J075536o1767j294459k200533k563702k751255k556223
$$ 26751339 28785744 29861280 29799513 28505054 26304521 23740819 20989564 18433341
6333A8433341k369589j945430j519648j118962j052218q04404o70226n43194n37507
$$ 18433341 16063752 14118322 12598674 11479712 10427494 9623090 8952864 8409670 7872163
6324G872163m13844l30202l18298k93898k51283r5957k09871j70755n5782J8361
$$ 7872163 7458319 7128117 6809819 6515921 6264638 6168681 5958810 5788055 5732273 5750634
6314E750634p7413r3741p8141L5282N0448L7714J58474J04009k8463N8745J64980
$$ 5750634 5673221 5579480 5501339 5536621 5587069 5624783 5783257 5887266 5858803 5917548 6082528
6303F082528J99093J87883J43143K18840K44291L37633L44699N43306N07461N83653
$$ 6082528 6281621 6469504 6612647 6831487 7075778 7413411 7758110 8301416 8808877 9392530
6293I392530P19237R49080J250253J525146J768159K300888L212257M016765M689853
$$ 9392530 10111767 11060847 12311100 13836246 15604405 17905293 21117550 25134315 29824168
6284B9824168N181825M608858L136071J345796l39647j625103k348867k191345
$$ 29824168 35005993 39614851 42750922 44096718 43757071 42131968 39783101 37591756
6276C7591756j811888r72345N7435J348841K419551L129138K743145J684045r230
$$ 37591756 35779868 34807523 34864958 36213799 38633350 41762488 44505633 46189678 46180448
6267D6180448j611883k986278l824626m083923l999482l555954l018715k533289
$$ 46180448 44568565 41582287 37757661 33673738 29674256 26118302 23099587 20566298
6259B0566298k101091j765184j465298j248510j010596r02073p05824o22811o18846
$$ 20566298 18465207 16700023 15234725 13986215 12975619 12073546 11367722 10744911 10126065
6250A0126065m44739m62970m43131l99519k29364k62264j69505r3673k47560j18278
$$ 10126065 9681326 9218356 8775225 8375706 8146342 7884078 7714573 7620900 7373340 7255062
6240G255062n9897r5990m4315j57602m4182q7709j24773L300r706n920J0841j9509
$$ 7255062 7195165 7099175 7054860 6897258 6853076 6765367 6640594 6643894 6634188 6628268 6639109 6619600
6228F619600j9141N7954o8219j25351J6900K367j23604j05943l2412m48k3814
$$ 6619600 6600459 6658413 6590194 6464843 6481743 6484110 6360506 6254563 6222151 6221703 6197889
6217F197889L8756J38383K3732J9449J49010J18997O2350P6265J01089J05210
$$ 6197889 6236645 6375028 6398760 6418209 6567219 6686216 6748566 6824831 6925920 7031130
6207G031130J46923K02175J12074m5871R5040K03525M8872J09094K54264K14416
$$ 7031130 7178053 7380228 7492302 7446431 7541471 7744996 7793868 7902962 8157226 8371642
6197H371642O8058J29102K45667K61621J46556K73562K95698R6777K06827M10818
$$ 8371642 8439700 8568802 8814469 9076090 9222646 9496208 9791906 9888683 10095510 10506328
6187A0506328K41659J84678J61932J36786K02552J00907K50607K94023P0977K80500
$$ 10506328 10747987 10932665 11094597 11231383 11433935 11534842 11785449 12079472 12150449 12430949
6177A2430949K78565L45227M30699K59098L72123N33095N65005N10318N20579
$$ 12430949 12709514 13054741 13485440 13744538 14116661 14649756 15214761 15725079 16245658
6168A6245658O02541M48192N65014M65638M76660M86948N18858M89543K41497
$$ 16245658 16848199 17296391 17861405 18327043 18803703 19290651 19809509 20299052 20540549
6159B0540549L34331L73623L52454L12885L91967M57855M87914N00634N29595
$$ 20540549 20874880 21248503 21600957 21913842 22305809 22763664 23251578 23752212 24281807
6150B4281807P04160O82872O66425Q03644J048616R91941J033957J099768J080384
$$ 24281807 24985967 25668839 26335264 27138908 28187524 29179465 30213422 31313190 32393574
6141C2393574J116544J099152J098145J083315R59293P79284P47483P43299O23214
$$ 32393574 33510118 34609270 35707415 36790730 37750023 38529307 39276790 40020089 40643303
6132D0643303L97939M42921L65751M10024K31350K65433K13785M12075L92305
$$ 40643303 41041242 41484163 41849914 42259938 42491288 42756721 42970506 43382581 43774886
6123D3774886K46685L71863N04225O77581O54041P94952O69378O66440P15201
$$ 43774886 44021571 44393434 44897659 45575240 46229281 47024233 47693611 48360051 49075252
6114D9075252O91597P22232O76320O94036O19652O44852O18253O00879O08686
$$ 49075252 49766849 50489081 51165401 51859437 52479089 53123941 53742194 54343073 54951759
6105E4951759N62909N29232L81899L11498M46174L79084J77258J87946K27540
$$ 54951759 55514668 56043900 56425799 56737297 57183471 57562555 57739813 57927759 58155299
6096E8155299K06853J68819K58239M47184M87593N75626P91970J219567J218751
$$ 58155299 58362152 58530971 58789210 59236394 59723987 60299613 61091583 62311150 63529901
6087F3529901J541974J848848K177406K466368K630355K807523K690230K569688
$$ 63529901 65071875 66920723 69098129 71564497 74194852 77002375 79692605 82262293
6079H2262293K362046J716047J157104L51208n10365r63303j674315k255908k152109
$$ 82262293 84624339 86340386 87497490 87848698 87338333 86375030 84700715 82444807 80292698
6070H0292698k091308k104250j868098j310805o27259j57265P89825J869944K575231
$$ 80292698 78201390 76097140 74229042 72918237 72290978 72133713 72923538 74793482 77368713
6061G7368713K632244J955451L94339j191630k793122l755029m004087l958974
$$ 77368713 80000957 81956408 82350747 81159117 78365995 74610966 70606879 66647905
6053F6647905l390385k896531k442983j713242j259555q03760m64789Q4372M58514
$$ 66647905 63257520 60360989 57918006 56204764 54945209 54141449 53676660 53761032 54219546
6044E4219546Q09816J293740J887809K733351L665458M707930N364579N094479
$$ 54219546 55029362 56323102 58210911 60944262 64609720 69317650 74682229 79776708
6036G9776708L774202J920910r4848j545147k271159k337267j845728j153993
$$ 79776708 83550910 85471820 85376972 83831825 81560666 79223399 77377671 76223678
6028G6223678l16449L15420J185600K019616K838757L668414M406888N083194
$$ 76223678 75907229 76222649 77408249 79427865 82266622 85935036 90341924 95425118
6020I5425118N744948O189334O453451O508252O180956N327218L995077K546741
$$ 95425118 101170066 107359400 113812851 120321103 126502059 131829277 135824354 138371095
6012A38371095R46584p06881j838391k943695l569283l679470l669745l358705
$$ 138371095 139317679 138610798 136772407 133828712 130259429 126579959 122910214 119551509
6004A19551509k902021k281890j476057o51831M9924R77996J729345K779940L930281
$$ 119551509 116649488 114367598 112891541 112239710 112289634 113267630 114996975 117776915 121707196
5995A21707196M749563O083009P215746Q386149R420936R869415R453372P966673
$$ 121707196 126456759 132539768 139755514 148141663 157562599 167432014 176885386 184852059
5987A84852059O014876L747414J715020j86286j870851l197747m217777n193650
$$ 184852059 190866935 194614349 196329369 196143083 194272232 191074485 186856708 181663058
5979A81663058n425832n789347n804542n628900n157785m669472m281615l517140
$$ 181663058 176237226 170447879 164643337 159014437 153856652 149187180 144905565 141388425
5971A41388425k738014j868710r23584P4864O95128Q85704P1051j241365k722001
$$ 141388425 138650411 136781701 135858117 135932981 136628109 137513813 137584864 136343499 133621498
5962A33621498m066921n004164n416244n770242n942889n670875n580378n574881
$$ 133621498 129554577 124550413 119134169 113363927 107421038 101750163 96169785 90594904
5954I0594904n333707m940567m917052m594307m368261l998205l505074l274210
$$ 90594904 85261197 80320630 75403578 70809271 66441010 62442805 58937731 55663521
5946E5663521l097217k776679k396037k207590k045487j817525j554674j505737
$$ 55663521 52566304 49789625 47393588 45185998 43140511 41322986 39768312 38262575
5938C8262575j468142j255274j115526r07004q24423o18827m57355l13719j15997
$$ 38262575 36794433 35539159 34423633 33516629 32692206 32073379 31616024 31302305 31186308
5929C1186308J10813M02389O05680P29776Q21009J047738R55918N67527L09306
$$ 31186308 31297121 31699510 32305190 33034966 33855975 34903713 35859631 36427158 36736464
5920C6736464q6148m85140r13761j268894j331867j430478j394566j268148j132148
$$ 36736464 36650316 36165176 35251415 33982521 32650654 31220176 29825610 28557462 27425314
5911B7425314j043771q52355q71947o17042m91075l89946l13758j65648n5900
$$ 27425314 26381543 25529188 24657241 24040199 23549124 23159178 22845420 22679772 22623872
5902B2623872m3048R7901L7419L2465k69082l32508m62911n32548n92334p39937
$$ 22623872 22580824 22678725 22716144 22748609 22479527 22147019 21684108 21151560 20559226 19819289
5892A9819289p96286r04251q60281q18389q55995o77067o09833o82594o99206
$$ 19819289 19023003 18118752 17258471 16440082 15584087 14907020 14297187 13614593 12915387
5883A2915387n01079n63764m63216m37818l96795l62731m26083k72644j72712
$$ 12915387 12414308 11850544 11387328 10949510 10552715 10189984 9763901 9491257 9318545
5874I318545l24083l92748k32367k30855k17896k81461k46407k28781r2321j53638
$$ 9318545 8994462 8601714 8369347 8138492 7920596 7639135 7392728 7163947 7071626 6917988
5864F917988k11009k19269j89260m3835r2360j53358j22475l1791j21267j81439
$$ 6917988 6706979 6487710 6298450 6254615 6162255 6008897 5886422 5854631 5733364 5551925
5854E551925p0542j13119j91973r9856j45602n8269J0335j11272p2295q6218o2548
$$ 5551925 5481383 5368264 5176291 5076435 4930833 4872564 4882899 4771627 4699332 4613114 4550566
5843D550566K579O953j32705j4867j57091q4609k0266l7335o7040l7544j58130
$$ 4550566 4553145 4560098 4427393 4412526 4255435 4170826 4150560 4113225 4046185 4008641 3850511
5832C850511p1180j47292O888M9810O8326K7884K3052J6381q9435J8601L2188
$$ 3850511 3779331 3632039 3638927 3688737 3757063 3784947 3807999 3824380 3734945 3753546 3785734
5821C785734j11534k3933j43926J32858j8087j31388J1396M4282J47082M2534
$$ 3785734 3674200 3650267 3506341 3639199 3621112 3489724 3501120 3545402 3692484 3735018
5811C735018K0753R5555J23641J5421j4153L2380L6265P7603M7204R8215J59933
$$ 3735018 3755771 3851326 3974967 3990388 3976235 4008615 4044880 4122483 4169687 4267902 4427835
5800D427835Q4203J18377L31652N10113N40690Q61120J025967J598723K698370
$$ 4427835 4512038 4630415 4962067 5472180 6012870 6873990 7899957 9498680 12197050
5791A2197050N160293P371418O041663J340000r58061k692638m174255m558300
$$ 12197050 17357343 24728761 30770424 32110424 31152363 28459725 24285470 19727170
5783A9727170l820552k899604k313909j498941j135383q87233o97901l91840m05699
$$ 19727170 15906618 13007014 10693105 9194164 8058781 7171548 6473647 6081807 5676108
5774E676108l32732k68542j0110j59439k17821K972j05675Q339r9649j58902j29428
$$ 5676108 5343376 5074834 5064724 4905285 4687464 4690436 4584761 4593100 4493451 4334549 4205121
5763D205121K7574j12250j56745j2126o6407j25219j23175o6230q1280n0842k11612
$$ 4205121 4232695 4120445 3963700 3951574 3885167 3759948 3636773 3570543 3489263 3438421 3226809
5752C226809j1048k2307k8555o0986O36K6860l6132r5771Q8536j60464j37127
$$ 3226809 3215761 3193454 3164899 3103913 3104549 3131409 3095277 2999506 3088042 2927578 2790451
5741B790451k69962j05072k0973o5102M9755m3522j41626j63939k898m5422l9386
$$ 2790451 2520489 2415417 2394444 2329342 2379097 2335575 2193949 2030010 2027112 1981690 1942304
5730A942304j04822J12672R6854m8524N707J1325j03285j03036j3431m7609p949
$$ 1942304 1837482 1950154 2047008 1998484 2004191 2015516 1912231 1809195 1795764 1748155 1740206
5719A740206M2188n9748P5749M425l2683N9305J22340M6776L5054J06629J00482
$$ 1740206 1782394 1722646 1798395 1802820 1770137 1829442 1951782 1998558 2033612 2140241 2240723
5708B240723J93713N982q1276P4229M5380K6246N6327n680P3428l1566J778n5380
$$ 2240723 2434436 2440418 2359142 2433371 2478751 2504997 2561324 2555644 2629072 2597506 2599284 2543904
5696B543904n691M6018q1401m6047o6513O6994n0054j59219l6789q710K040J39918
$$ 2543904 2538213 2584231 2502830 2456783 2390270 2457264 2407210 2247991 2211202 2202492 2204532 2344450
5684B344450N2420N3128M7938P9100N5842Q1019J68555J61593j13358R8289K57131
$$ 2344450 2396870 2449998 2497936 2577036 2632878 2713897 2882452 3044045 2930687 3028976 3286107
5673C286107J74838P892p7913j2366K7599j3957K1831r1677j42782p5846j21639
$$ 3286107 3460945 3468837 3390924 3378558 3406157 3392200 3414031 3322354 3179572 3103726 2982087
5662B982087j55312q9856j0674j03784j84745j36753J8725j7548j24422j12906
$$ 2982087 2826775 2736919 2726245 2622461 2437716 2300963 2319688 2302140 2177718 2064812
5652B064812o5174O1194k3690J11j55739k51975j03126N4698k7229L8475J08911
$$ 2064812 1999638 2060832 2037142 2037253 1881514 1629539 1526413 1581111 1553882 1592357 1701268
5641A701268l6156N683l5580m8226J08175N8701p373Q8408J2281K18226J5224
$$ 1701268 1665112 1670795 1635215 1586989 1695164 1753865 1746492 1834900 1847181 2065407 2080631
5630B080631M3791M6540L2304J38154J77319L4457J98685R8359L5443L8410J63905
$$ 2080631 2124422 2170962 2203266 2341420 2518739 2553196 2751881 2850240 2885683 2924093 3087998
5619C087998K02770J28421J24243J04046R1791r8610m8617n18O7009M102m4437
$$ 3087998 3290768 3419189 3543432 3647478 3739269 3640659 3592042 3591524 3658533 3662635 3618198
5608C618198J0843j99082O9254o029j93053j88749k2025K4353j30830r9956j33287
$$ 3618198 3629041 3429959 3499213 3493184 3300131 3111382 3089357 3113710 2982880 2882924 2749637
5597B749637o804k9309j88791j50591O5437M6186m5135j60090j91531L1376K7387
$$ 2749637 2742833 2713524 2524733 2374142 2439579 2485765 2440630 2280540 2089009 2120385 2147772
5586B147772K2830q5079l1251r7742o4378J0752q5593j21138P5554l9964j00788
$$ 2147772 2170602 2085523 2054272 1956530 1892152 1902904 1817311 1696173 1771727 1731763 1630975
5575A630975j7711K0159r4980R303k9882r2582Q1816O590j46081j20205m0292
$$ 1630975 1613264 1633423 1538443 1547746 1517864 1425282 1507098 1513688 1367607 1247402 1207110
5564A207110L7721O0744l4989q0969j20970p1872K8677m6569m7751p1625k9257
$$ 1207110 1244831 1305575 1270586 1189617 1068647 996775 1025452 978883 931132 859507 830250
5553H30250J11681j00534r1022P898r170k8629P4189R2860m8399r6338j01450
$$ 830250 941931 841397 750375 758273 749103 720474 794663 887523 839124 742786 641336
5542F41336q7040P6731k5005N04O9017k0587P1238K8241j13855j9131j56264R373
$$ 641336 554296 631027 606022 606526 675543 654956 726194 754435 640580 621449 465185 474558
5530D74558P7132J2074j48799q7951L0761R1851j5875k7063p1357O9565J1416
$$ 474558 551690 563764 414965 327014 357775 449626 433751 406688 335331 404896 416312
5519D16312R565L01k9013j6580j0715l1188R9000n5357j54721J6960J33803o082
$$ 416312 425877 426178 397165 380585 369870 338682 437682 382325 227604 244564 378367 372285
5507C72285o3595J7436M6383l2693M5467L8823l1146j1416n3314J8820M6301N3674
$$ 372285 308690 326126 372509 339816 385283 424106 392960 381544 328230 347050 393351 447025
5495D47025j28142j30577o604k5297L3136J79507o2171p0619N7874r0357p998
$$ 447025 318883 188306 181702 156405 189541 369048 306877 236258 294132 203775 195777
5484A95777Q411J05989j3486p8318k1594K0164p5813P1623J09256r6535j9388
$$ 195777 204188 310177 296691 218373 196779 216943 141130 212753 322009 225474 206086
5473B06086P2996j1138q24N6666q4175j3715l3612m8312N7552P4488l0116k3924
$$ 206086 279082 267944 267120 323786 239611 225896 192284 143972 201524 276012 245896 221972
5461B21972N3766l6655J0591J0838j8954o5731r5997P5201P5503J451O4908M7243
$$ 221972 275738 239083 249674 260512 241558 175827 79830 155031 230534 231985 296893 344136
5449C44136p9320m9717o211l4505K9072P7047M448m4885m0874P6349k7915R6195
$$ 344136 264816 215099 208888 174383 203455 280502 284950 240065 199191 275540 247625 343820
5437C43820M8343m2475L332N9375r6046N5314n4378p3282J8076K6162P0891j4378
$$ 343820 392163 349688 353020 412395 316349 371663 317285 244003 262079 288241 359132 344754
5425C44754M9756K5656r3482O2716p85N4216M7112o8806q4751j0756o1669o233
$$ 344754 394510 420166 326684 389400 388615 442831 489943 421137 336386 325630 263961 257728
5413B57728O0000M5338J19122m6060l121k7809O3235j816j10557M1109Q0700K6247
$$ 257728 317728 363066 482188 436128 433007 405198 468433 466617 356060 397169 477869 504116
5401E04116P4027J11189J2455q1778r5756L3300n4515K8966O6175l1446n6573
$$ 504116 578143 689332 701787 620009 524253 557553 503038 532004 598179 566733 510160
5390E10160M0245m6494R1103n2925L071r0395k0706Q4420J11390j1859j4227R4610
$$ 510160 550405 503911 595014 542089 545160 454765 434059 518479 629869 618010 603783 698393
5378F98393j3310M6326N2453Q022k8330m3604j0925J27671J15181k3164l3275
$$ 698393 685083 731409 783862 791884 763554 719950 709025 836696 951877 928713 895438
5367H95438J2870j6405P8420l8065R9278l7996j01988Q0320j8699O3688J31436
$$ 895438 908308 891903 970323 932258 1031536 993540 891552 971872 953173 1016861 1148297
5356A148297P0195M9235M8302N7002r579M5879K9651J07398M804M2735J00230
$$ 1148297 1218492 1267727 1316029 1373031 1363452 1409331 1438982 1546380 1551184 1593919 1694149
5345A694149J23823J1375N2716O5502J14484M7520R1435J7790O3078Q7499n7074
$$ 1694149 1817972 1829347 1882063 1947565 2062049 2109569 2201004 2218794 2281872 2369371 2312297
5334B312297O7481j4548J10758L3437k3767K6494K4053M7798J32802L997M6788
$$ 2312297 2379778 2365230 2475988 2509425 2485658 2512152 2536205 2584003 2716805 2720802 2767590
5323B767590J58426J13508J14104k2808K2680K10139J16037J9873J35851R9170
$$ 2767590 2926016 3039524 3153628 3130820 3153500 3363639 3479676 3499549 3635400 3734570
5313C734570J20204O729M5152Q1251l6535J56740N0581P6040J16645O4827K11385
$$ 3734570 3854774 3861503 3906655 3987906 3951371 4108111 4158692 4234732 4351377 4416204 4627589
5302D627589M7258P8078N8917J79767N3876J38641J72219J03973M3332R3093J63665
$$ 4627589 4674847 4752925 4811842 4991609 5045485 5184126 5356345 5460318 5503650 5596743 5760408
5291E760408K74364P2544P2794J03473K56464J82492J94628J78605J43658K65943
$$ 5760408 6034772 6107316 6180110 6283583 6540047 6722539 6917167 7095772 7239430 7505373
5281G505373K33328J07722K43809J69096J54265L13930L20757K44618K37397K71295
$$ 7505373 7738701 7846423 8090232 8259328 8413593 8727523 9048280 9292898 9530295 9801590
5271I801590J25747K36277L52857K60314J22584K88833K94225L04217L78780K77753
$$ 9801590 9927337 10163614 10516471 10776785 10899369 11188202 11482427 11786644 12165424 12443177
5261A2443177K60496M17812L98237N18072M66482O52886Q62826J143511J112120
$$ 12443177 12703673 13121485 13519722 14037794 14504276 15157162 16019988 17163499 18275619
5252A8275619J140847P41087L25855K65682M2167l8750K9268L77577O80520J049580
$$ 18275619 19416466 20157553 20483408 20749090 20791257 20752507 20781775 21159352 21839872 22889452
5242B2889452J627221K049197K058311J748735J200890P43556N87990K46572J70827
$$ 22889452 24516673 26565870 28624181 30372916 31573806 32317362 32905352 33151924 33322751
5233C3322751N3426J74021N65165R95078J412234J473409J109343O61365L42348
$$ 33322751 33376177 33550198 34115363 35110441 36522675 37996084 39105427 39766792 40109140
5224D0109140M59775N49622M47046M03674L51498J74503P5201P7673k49359n18465
$$ 40109140 40568915 41118537 41565583 41969257 42320755 42495258 42570459 42648132 42398773 41880308
5214D1880308n62846l72854j36346K38270J13108m86277j105217j346674j537514
$$ 41880308 41317462 40944608 40808262 41046532 41159640 40673363 39568146 38221472 36683958
5205C6683958j460785j104852r26273o51793k28148J51227J23954k88323r65861
$$ 36683958 35223173 34118321 33192048 32540255 32312107 32463334 32587288 32298965 31333104
5196C1333104j466158j948095k182252k109221j848710j704396j279361o99396
$$ 31333104 29866946 27918851 25736599 23627378 21778668 20074272 18794911 18095515
5188A8095515k47597j93943j27014l17222o81008r36424j218888j318700j176311
$$ 18095515 17847918 17653975 17526961 17209739 16528731 15592307 14373419 13054719 11878408
5179A1878408j020789r08449p80387o55666m71263m58789m38900l91050k47437
$$ 11878408 10857619 9949170 9168783 8513117 8041854 7583065 7144165 6753115 6505678
5170F505678j89866j68898k00001j85716k08944r7931j45925k34699j20276j8261
$$ 6505678 6315812 6146914 5946913 5761197 5552253 5454322 5308397 5073698 4953422 4935161
5160D935161n2842j59747J3668p0401o3615m4437J0729j090n5829k9017q8727
$$ 4935161 4882319 4722572 4736240 4665839 4602224 4557787 4568516 4567426 4511597 4482580 4393853
5149D393853l2812J0255m5367p7061l6377J04409N5110J9327j5511j33530p5146
$$ 4393853 4361041 4371296 4325929 4248868 4212491 4316900 4372010 4391337 4375826 4242296 4167150
5138D167150J892N6622J5820J3297J05239r8198k4842L8440n5836n0426M0916
$$ 4167150 4169042 4225664 4241484 4254781 4360020 4261822 4236980 4275420 4219584 4169158 4210074
5127D210074L793K230O6071J3683Q1527q2811J28149J33624J08157l4680O2089
$$ 4210074 4213867 4216097 4282168 4295851 4377378 4294567 4422716 4556340 4664497 4629817 4691906
5116D691906J8096n5313O2218O2789M2690P8284j7287M4461K550K2478M0517K7840
$$ 4691906 4710002 4654689 4716907 4779696 4822386 4900670 4883383 4927844 4930394 4952872 4993389 5021229
5104E021229q614L7130O5449o1199J83496M6321r722J56245J81645L7510Q890
$$ 5021229 5012615 5049745 5115194 5053995 5237491 5283812 5274090 5430335 5611980 5649490 5658380
5093E658380L8561N0693M3654r7553J74039J72949R3654K04651R5278K0516J77305
$$ 5658380 5696941 5747634 5791288 5693735 5867774 6040723 6134377 6339028 6434306 6454822 6632127
5082F632127J26116J06825J20379Q0806J90258O6540J35212Q4335j4789P806J00658
$$ 6632127 6758243 6865068 6985447 7066253 7256511 7323051 7458263 7542598 7527809 7535615 7636273
5071G636273J16568k5690L8349J71504J09131m4083j25922O67N9395J18367N7685
$$ 7636273 7752841 7727151 7765500 7937004 8046135 8002052 7876130 7876797 7936192 8054559 8112244
5060H112244q6000r867M4172P9473R8973O3620Q3554K7010J19659N9219l8636
$$ 8112244 8026244 8016377 8060549 8140022 8238995 8302615 8386169 8413179 8532838 8592057 8553421
5049H553421j8854P9957L5253L9741M3995K6187J09588M4537J01332Q4541J90152
$$ 8553421 8534567 8614524 8649777 8689518 8733513 8759700 8869288 8913825 9015157 9099698 9289850
5038I289850J08636J56350K7187K18826K66815J18617K34678J69280Q9477K94435
$$ 9289850 9398486 9554836 9582023 9800849 10067664 10186281 10420959 10590239 10679716 10974151
5028A0974151K42839J17154K40896K26670Q1905J84339J61077J94435K39232J94307
$$ 10974151 11216990 11334144 11575040 11801710 11883615 12067954 12229031 12423466 12662698 12857005
5018A2857005K03750J80206K87421L27406L69395M83366L69145L86173L36409
$$ 12857005 13060755 13240961 13528382 13855788 14225183 14708549 15077694 15463867 15800276
5009A5800276L01476K19637k3771k5437m7415M3891J91481J88094J67593L83164
$$ 15800276 16101752 16321389 16297618 16272181 16224766 16268657 16460138 16648232 16815825 17198989
4999A7198989M27227M85425N24147L48395K58810J21990L4546P2613k1472O9493
$$ 17198989 17626216 18111641 18635788 18984183 19242993 19364983 19399529 19472142 19450670 19520163
4989A9520163M3217J42675J44732K93507K85084L18024M39430N08972M81207O50935
$$ 19520163 19563380 19706055 19850787 20144294 20429378 20747402 21186832 21695804 22177011 22827946
4979B2827946O34384O11359O23071P66743Q12846N46499P90249P86073P47692
$$ 22827946 23462330 24073689 24696760 25463503 26276349 26822848 27613097 28399170 29146862
4970B9146862P79688O55291P60452Q00315Q97879P69177R75538J061939R12201
$$ 29146862 29926550 30581841 31342293 32142608 33040487 33809664 34785202 35847141 36759342
4961C6759342J147679J134522J116859J023151P24289P56255N24607O63755O10512
$$ 36759342 37907021 39041543 40158402 41181553 41905842 42662097 43186704 43850459 44460971
4952D4460971M89370Q54831J018849J089970J090680J106782J202946J067327
$$ 44460971 44950341 45805172 46824021 47913991 49004671 50111453 51314399 52381726
4944E2381726O70543N45079Q6672k25007n32595o76033r06771j027252p97271
$$ 52381726 53052269 53597348 53684020 53459013 52926418 52250385 51343614 50316362 49519091
4935D9519091p38918o25276m17433n63671m36987k36402j29891Q0271J28209K03925
$$ 49519091 48780173 48154897 47737464 47173793 46736806 46500404 46370513 46450784 46578993 46782918
4925D6782918K65198L89586M90060L65806L31297M46698N31738N40116N36316
$$ 46782918 47048116 47437702 47927762 48293568 48624865 49071563 49603301 50143417 50679733
4916E0679733N98726M97283N26911O86689P60255Q27035R10594R60270J076388
$$ 50679733 51278459 51775742 52302653 52989342 53749597 54576632 55487226 56447496 57523884
4907E7523884J127409J288371J273080J414175J520158J570950J713739J749216
$$ 57523884 58651293 59939664 61212744 62626919 64147077 65718027 67431766 69180982
4899F9180982J888840J970257K065008K386970K895252M047015N682914O881842
$$ 69180982 71069822 73040079 75105087 77492057 80387309 84434324 90117238 96999080
4891I6999080N107465K106443J103889k3457o73637l54442M40684J276837K049647
$$ 96999080 102106545 104212988 105316877 105293420 104619783 104265341 104706025 105982862 108032509
4882A08032509K791893L225726L759570M027116M175920M153002M034488L710950
$$ 108032509 110824402 114050128 117809698 121836814 126012734 130165736 134200224 137911174
4874A37911174L395640K903869K366810J647158J179182P06360J11043j62950
$$ 137911174 141306814 144210683 146577493 148224651 149403833 150110193 150221236 150058286
4866A50058286n15956p59055p93230p32475m75431k04116L08203Q97613J210748
$$ 150058286 149542330 148783275 147990045 147257570 146782139 146578023 146886226 147783839 148994587
4857A48994587J793291K323691K868882L041325L464413L822189M158507L957003
$$ 148994587 150787878 153111569 155980451 159021776 162486189 166308378 170466885 174423888
4849A74423888L725512L373968K682945J966805J671130J253066R71624J155718
$$ 174423888 178149400 181523368 184206313 186173118 187844248 189097314 190068938 191224656
4841A91224656J607791K640847M008016M528062L005751O34274j102831k360439
$$ 191224656 192832447 195473294 199481310 204009372 207015123 207649397 206546566 204186127
4833B04186127k789139k251354q63745O21992J949747L507618M708733N816861
$$ 204186127 201396988 199145634 198281889 198903881 200853628 204361246 209069979 214886840
4825B14886840P118817Q384313R750736J1222716J2627554J2988619J1585133
$$ 214886840 222005657 230389970 240140706 251363422 263990976 276979595 288564728
4818B88564728J0036775R020890Q401770O578492L336177P0785k292379l966424
$$ 288564728 298601503 307622393 316024163 322602655 325938832 326009617 323717238 319750814
4810C19750814m343795l629774k175826n98699J095486K803614M231735N656573
$$ 319750814 315407019 311777245 309601419 309002720 310098206 312901820 317133555 322790128
4802C22790128O978687Q437602J0042674J2170491J3571195J3018098J0109762
$$ 322790128 329768815 338206417 348249091 360419582 373990777 387008875 397118637
4795C97118637O769226L944527J289531m29798j241326j701245k256398k918934
$$ 397118637 403887863 407832390 409121921 408692123 407450797 405749552 403493154 400574220
4787D00574220l887944m941693n981176o967818p716343q431904q727896q857769
$$ 400574220 396686276 391744583 385763407 378795589 371079246 362647342 353919446 345061677
4779C45061677q640279q231229q107022p872443p509286p087415o838140o663765
$$ 345061677 336421398 328190169 320083147 312210704 304701418 297614003 290775863 284112098
4771B84112098o419660o335553o131284o100084o055339o056293o112352o266966
$$ 284112098 277692438 271356885 265225601 259125517 253070178 247013885 240901533 234634567
4763B34634567o388509o628890o961219p430775p796882p952977q117088q089686
$$ 234634567 228246058 221617168 214655949 207225174 199428292 191475315 183358227 175268541
4755A75268541q120800p781603p508819p197730o882119o401476o044636n559516
$$ 175268541 167147741 159366138 151857319 144659589 137777470 131375994 125331358 119771842
4747A19771842n106940m703485m373830m062305l664483l327746l047551k881466
$$ 119771842 114664902 109961417 105587587 101525282 97860799 94533053 91485502 88604036
4739H8604036k589531k472556k230269k145328k076610j820166j693929j672340
$$ 88604036 86014505 83541949 81311680 79166352 77089742 75269576 73575647 71903307
4731G1903307j732764j494698j515274j276435j175580j122623q69392p23045
$$ 71903307 70170543 68675845 67160571 65884136 64708556 63585933 62716541 61993496
4723F1993496o71493n44960l58029j31564j52876K2405m1538J39107J66642J21488
$$ 61993496 61322003 60777043 60419014 60287450 60134574 60156979 60115441 60254548 60421190 60542678
4713F0542678K5458k42148k79577n57595p28670r06197j165677j418016j502096
$$ 60542678 60568136 60325988 60046411 59488816 58760146 57853949 56688272 55270256 53768160
4704E3768160j549316j531776j601668j454934j325061j324640j198241j104141
$$ 53768160 52218844 50687068 49085400 47630466 46305405 44980765 43782524 42678383
4696D2678383j024294p89805p44688p11340p34854n09360n41613n52818n44283
$$ 42678383 41654089 40864284 40119596 39408256 38673402 38164042 37622429 37069611 36525328
4687C6525328n17915n02591n55126p36222p09582o12851r16302r36572q99656
$$ 36525328 36007413 35504822 34949696 34213474 33503892 32891041 31974739 31038167 30138511
4678C0138511q23080r99528r77037q61962r59452r33935r79519p66429o13833
$$ 30138511 29315431 28315903 27338866 26476904 25517452 24583517 23603998 22837569 22223736
4669B2223736p39698p00763o15517n75720p05141n78067m69107m64924l00479
$$ 22223736 21484038 20783275 20167758 19592038 18886897 18308830 17839723 17374799 17074320
4660A7074320m13465n10634m46740l57383l40553k65596l17323k55948k95035
$$ 17074320 16660855 16150221 15703481 15346098 15005545 14739949 14422626 14166678 13871643
4651A3871643k35571l97901k01439j96216k49128j47001j65483j69739k66710
$$ 13871643 13636072 13238171 13036732 12840516 12591388 12444387 12278904 12109165 11842455
4642A1842455k02438j27068j19226j35229m9021r468m4464j43793L3083J0872
$$ 11842455 11640017 11512949 11393723 11258494 11209473 11200005 11155541 11011748 11044831 11055703
4632A1055703r278P8856L25904N32853J031619J005312L10316r3143l44221o11020
$$ 11055703 11046425 11125281 11451185 11984038 13015657 14020969 14331285 14238142 13893921 13282901
4622A3282901p52477o13085n30587k22775j81228j83487m1100L5632J46419L25948
$$ 13282901 12530424 11917339 11386752 11163977 10982749 10799262 10758162 10793794 10940213 11266161
4612A1266161L07858L57658M11859L23154L89870K54976K53410N37804N79681
$$ 11266161 11574019 11931677 12343536 12666690 13056560 13311536 13564946 14102750 14682431
4603A4682431Q13068P81457M23569J46058K2362J67483L11811M82864O74139P01547
$$ 14682431 15495499 16276956 16700525 16846583 16868945 17036428 17348239 17831103 18505242 19206789
4593A9206789L38719O3625k91763l95212l17036j46792n3912R6239J39048j13633
$$ 19206789 19545508 19609133 19317370 18922158 18605122 18458330 18404418 18500657 18639705 18526072
4583A8526072l22001m18603n19594m79458l93666k04975j01101j05554j35703
$$ 18526072 18204071 17785468 17265874 16786416 16392750 16187775 16086674 15981120 15845417
4574A5845417o6161k4787J13635K07187M95717Q52269J034240J690292K158540
$$ 15845417 15779256 15754469 15868104 16075291 16571008 17423277 18457517 20147809 22306349
4565B2306349L055867M358549N659844O782570O090675L665298J054870j064893
$$ 22306349 25362216 29720765 35380609 42163179 48253854 51919152 52974022 51909129
4557E1909129k498199l027486k362625j458624J10892K265428L971328M743506
$$ 51909129 49410930 46383444 44020819 42562195 42673087 44938515 48909843 53653349
4549E3653349L610329J101161r97584k958532l809959l621524k670226j144422
$$ 53653349 57263678 58364839 57367255 54408723 50598764 46977240 44307014 43162592
4541D3162592N66607K673446L854422L164393J276246o38638k257080l426009
$$ 43162592 43729199 46402645 50257067 53421460 54697706 54059068 51801988 48375979
4533D8375979l521340k856596j800423j35898J627222L108495L373752J835941
$$ 48375979 44854639 41998043 40197620 40061722 41688944 44797439 48171191 50007132
4525E0007132l52343k177717l633140m345447m492938m022450l476088k820979
$$ 50007132 49654789 47477072 43843932 39498485 35005547 30983097 27507009 24686030
4517B4686030k096834j701103j204377q58880l19637l7429P0179j07949l82182
$$ 24686030 22589196 20888093 19683716 18824836 18505199 18467770 18537949 18430000 18047818
4508A8047818n37826q96465q91294j010471q86761q16455o18233m88472l93610
$$ 18047818 17509992 16613527 15722233 14711762 13825001 13008546 12390313 11901841 11508231
4499A1508231l04995j53056j04949l1906J64032J73621L08250L10802M21329N19984
$$ 11508231 11203236 11050180 10945231 10913325 11077357 11250978 11559228 11870030 12291359 12811343
4489A2811343M01882M01697J51248k76345n68952n53216p19198p27575o91190
$$ 12811343 13213225 13614922 13766170 13489825 12920873 12367657 11648459 10920884 10229694
4480A0229694n56228m04067k67835l31317k31582J9924m5541Q0805K33825L59794
$$ 10229694 9673466 9269399 9001564 8670247 8438665 8458589 8413048 8493853 8727678 9087472
4470I087472L72416L16846k617m9928j77930l77692l39081m27958l32970j80000
$$ 9087472 9459888 9776734 9774117 9724189 9546259 9168567 8829486 8401528 8068558 7888558
4460G888558j26509r4045j87386k01356j84986K2364J44541J2426J6054J05896
$$ 7888558 7762049 7668004 7480618 7279262 7094276 7116640 7261181 7273607 7289661 7395557
4450G395557J86346K44990L55353M65587O15028R22549P90872L17878j04609m24559
$$ 7395557 7581903 7826893 8182246 8647833 9262861 10185410 10976282 11294160 11189551 10764992
4440A0764992n70930n06050n29697l29467l70795k78000j87091j79702k02441
$$ 10764992 10194062 9688012 9158315 8828848 8458053 8180053 7992962 7813260 7610819
4431G610819k49403n1775l2859o3660j80565p5092p9861L1909P0882R103l4459
$$ 7610819 7361416 7309641 7276782 7213122 7032557 6957465 6877604 6909513 6980395 6989498 6955039
4420F955039O5187M3101m6670J63758J24950Q3996N8795l160l1730l852j02464
$$ 6955039 7020226 7063327 7016657 7180415 7305365 7389361 7448156 7444996 7413266 7409414 7306950
4409G306950j14294K2886k3611l5761j5069n1398k1653j5960m3400Q80m2220p484
$$ 7306950 7192656 7215542 7191931 7156170 7141101 7089703 7068050 7052090 7008690 7009570 6967350 6959866
4397F959866J1825J33739L6153j02028P2075P086j558j2033m6342J3653k2045
$$ 6959866 6971691 7105430 7141583 7039555 7111630 7118716 7117158 7105125 7058783 7072436 7050391
4386G050391j30556P8650m1502J16943J48515o0492p7704q6772p1993m4113J5908
$$ 7050391 6919835 6998485 6956983 7073926 7222441 7161949 7084245 6997473 6925480 6881367 6897275
4375F897275o501l0532k7479m4481j07232O2047j23552p2814J22871L7876N7038
$$ 6897275 6890774 6860242 6832763 6788282 6681050 6743097 6619545 6546731 6669602 6707478 6764516
4364F764516O3210j06855o9325l2892m8399j80642m3112L4713O8205Q6610j0012
$$ 6764516 6827726 6720871 6651546 6618654 6570255 6389613 6346501 6381214 6449419 6536029 6526017
4353F526017j4696Q4234R7185k9368j54188J8098l5593q0204n6432O0485P5744
$$ 6526017 6511321 6595555 6692740 6663372 6509184 6527282 6491689 6411485 6355053 6415538 6491282
4342F491282Q5159j33179Q926J25682q4376O3338o8271m8893L5809Q4352P49k0937
$$ 6491282 6576441 6443262 6452188 6577870 6493494 6556832 6488561 6439668 6475477 6559829 6560578 6539641
4330F539641M8847P6066l7496l0740j2227L1362J4351M4166K9133P0492j2627
$$ 6539641 6588488 6664554 6627058 6596318 6584091 6615453 6629804 6673970 6703103 6773595 6760968
4319F760968O4482L1788J59J6469J28664n448J9549N0405K0779M7121J03130J3336
$$ 6760968 6825450 6857238 6857397 6873866 7002530 6997082 7016631 7067036 7087815 7134936 7238066 7251402
4307G251402P6888k5690m8965J45904J50614O466k6628R0751N5628J76279O8288
$$ 7251402 7328290 7302600 7253635 7399539 7550153 7556619 7529991 7620742 7676370 7852649 7920937
4296G920937N8261K02410K14358J86400K61471J85731J00376J49120J3745q0531
$$ 7920937 7979198 8181608 8395966 8582366 8843837 9029568 9129944 9279064 9292809 9212278
4286I212278k62061k885J86754N9609K0688Q0234R3683J10140Q8382M4901R1961
$$ 9212278 8950217 8947332 9134086 9193695 9214383 9294617 9388300 9498440 9586822 9631723 9723684
4275I723684M2782J2287L3344J33868J2288J81076K25447J24447N1253J35076
$$ 9723684 9766466 9778753 9812097 9945965 9958253 10139329 10364776 10489223 10540476 10675552
4265A0675552R4445J17128J70396P9506J67077J94556J17935J6302J58183J97715
$$ 10675552 10769997 10887125 11057521 11137027 11304104 11498660 11616595 11632897 11791080 11988795
4255A1988795R0578K68949J39610P5002K18685J78829J30117J94645J61703J72749
$$ 11988795 12079373 12348322 12487932 12562934 12781619 12960448 13090565 13285210 13446913 13619662
4245A3619662K32039J96181K30326K96762J16988J97590L08609K84715L54708
$$ 13619662 13851701 14047882 14278208 14574970 14691958 14889548 15198157 15482872 15837580
4236A5837580L44629K95377L31884M67973N64265O28467P77276Q76044Q53613
$$ 15837580 16182209 16477586 16809470 17277443 17841708 18470175 19247451 20123495 20977108
4227B0977108R82872P20627M60047K61181Q8557J13611Q8422L17696L63806P04247
$$ 20977108 21959980 22680607 23140654 23401835 23490392 23604003 23692425 24010121 24373927 25078174
4217B5078174Q78150J116373J032250Q24863P91836M76388M73217N12112O18814
$$ 25078174 25956324 27072697 28104947 28929810 29721646 30198034 30671251 31183363 31802177
4208C1802177O81879R17453J330057J387623J281519J011422Q97137Q76081Q19311
$$ 31802177 32484056 33401509 34731566 36119189 37400708 38412130 39309267 40185348 41004659
4199D1004659O73897P85910R71278J127367J363376J693885J811281J988171J961720
$$ 41004659 41678556 42464466 43435744 44563111 45926487 47620372 49431653 51419824 53381544
4190E3381544J874221J586061J495134J645041J521291J391978J521051J725057
$$ 53381544 55255765 56841826 58336960 59982001 61503292 62895270 64416321 66141378
4182F6141378J859993J967719J872195J990017K181221K191566K068969K202781
$$ 66141378 68001371 69969090 71841285 73831302 76012523 78204089 80273058 82475839
4174H2475839K242015K445680K511425K513208K571995K704824K845311L098586
$$ 82475839 84717854 87163534 89674959 92188167 94760162 97464986 100310297 103408883
4166A03408883L295536L535509L735216L898035L721923L473526K942404K392832
$$ 103408883 106704419 110239928 113975144 117873179 121595102 125068628 128011032 130403864
4158A30403864K231771K035061K018677K150221K200654K417070K743149K740216
$$ 130403864 132635635 134670696 136689373 138839594 141040248 143457318 146200467 148940683
4150A48940683K991404K997554K967018L317436L501927L613673L858009L752038
$$ 148940683 151932087 154929641 157896659 161214095 164716022 168329695 172187704 175939742
4142A75939742L921907M189462M126985M438213M591641M766784N103802N249555
$$ 175939742 179861649 184051111 188178096 192616309 197207950 201974734 207078536 212328091
4134B12328091N143697N003684M908977M816188M828779M962040M965468N011120
$$ 212328091 217471788 222475472 227384449 232200637 237029416 241991456 246956924 251968044
4126B51968044M976422N020910N014738N110277N076854N321530N493761N781295
$$ 251968044 256944466 261965376 266980114 272090391 277167245 282488775 287982536 293763831
4118B93763831O157743O534800O972916P209926P593198P474373P223544O738806
$$ 293763831 299921574 306456374 313429290 320639216 328232414 335706787 342930331 349669137
4110C49669137O077333N315404M558443L747768K899634K262790J779285J186087
$$ 349669137 355746470 361061874 365620317 369368085 372267719 374530509 376309794 377495881
4102C77495881R33832O44539K68476R9258j65098k22375l61262n55324m65999
$$ 377495881 378429713 379074252 379342728 379441986 379276888 379054513 378693251 378137927 377671928
4093C77671928l77619n13356o20777n13349o80621j210049j500154k222171k809258
$$ 377671928 377294309 376780953 376160176 375646827 374966206 373756157 372256003 370033832 367224574
4084C67224574l624594m369326n008498n453727o041225o515253o925674p193324
$$ 367224574 363599980 359230654 354222156 348768429 342727204 336211951 329286277 322092953
4076C22092953p338619p354307p348705p216952o953717o723417o397200o155656
$$ 322092953 314754334 307400027 300051322 292834370 285880653 279157236 272760036 266604380
4068B66604380n835301n613892n321578m906959m671084m505536m174303l824691
$$ 266604380 260769079 255155187 249833609 244926650 240255566 235750030 231575727 227751036
4060B27751036l624025l616651l784632l954889m288116m455630m423841m466016
$$ 227751036 224127011 220510360 216725728 212770839 208482723 204027093 199603252 195137236
4052A95137236m460967m413085m395883m478160m547174m663965m555496m671131
$$ 195137236 190676269 186263184 181867301 177389141 172841967 168178002 163622506 158951375
4044A58951375m565682m312443m247197m220748m081811l777978l588691l502173
$$ 158951375 154385693 150073250 145826053 141605305 137523494 133745516 130156825 126654652
4036A26654652l281736k987006l063641k804882k883340k907186k735967k815255
$$ 126654652 123372916 120385910 117322269 114517387 111634047 108726861 105990894 103175639
4028A03175639k705540k694875k443245k300417j936201j872263j994437k634955
$$ 103175639 100470099 97775224 95331979 93031562 91095361 89223098 87228661 84593706
4020H4593706k716335k858637k916634k794150k604688k565108k378216k166691
$$ 84593706 81877371 79018734 76102100 73307950 70703262 68138154 65759938 63593247
4012F3593247k236576k175559k000028j983910j936589j846307j740619j701636
$$ 63593247 61356671 59181112 57181084 55197174 53260585 51414278 49673659 47972023
4004D7972023j504938j608585j527099j457504j356057j311451j262159j225560
$$ 47972023 46467085 44858500 43331401 41873897 40517840 39206389 37944230 36718670
3996C6718670j061393j014915p49792m04145j06247l71814r40746r02130j135946
$$ 36718670 35657277 34642362 33892570 33488425 33382178 33010364 32069618 31167488 30031542
3987C0031542j298757j277398j089586q95000r31711p69761o22114o37303n95217
$$ 30031542 28732785 27455387 26365801 25470801 24539090 23769329 23147215 22509912 21914695
3978B1914695m89649n13501o64388m46724m78134m96289m28718m64917l66496
$$ 21914695 21425046 20911545 20247157 19800433 19322299 18826010 18397292 17932375 17565879
3969A7565879l63988n04585l93500l47965l36329l47452k15338k67636l77155
$$ 17565879 17201891 16697306 16303806 15955841 15619512 15272060 15056722 14789086 14411931
3960A4411931k72096k71548l07223k29246r3363k58778k17407k00268l32854j46784
$$ 14411931 14139835 13868287 13561064 13331818 13238455 12979677 12762270 12562002 12229148 12082364
3950A2082364j87789k49758k39638j42122l13753j59562q7252j80751j82291k11646
$$ 12082364 11894575 11644817 11405179 11263057 10949304 10789742 10702490 10521739 10339448 10127802
3940A0127802j06490j23235k29418j84906j42510j50458j15406j02763j77640
$$ 10127802 10021312 9898077 9668659 9483753 9341243 9190785 9075379 8972616 8794976
3931H794976m0721j72864o9573o1186r3297j69757K9856l1376j63000j83396j49958
$$ 8794976 8754255 8581391 8511818 8450632 8357335 8187578 8217434 8186058 8023058 7839662 7689704
3920G689704j59362o6712j95257j26495O7078L080j82627j63548j80675r5305
$$ 7689704 7530342 7463630 7268373 7141878 7208956 7212036 7029409 6865861 6685186 6589881
3910F589881q535k8234j17934j30894q7442J1199r8061q6797m9336j57074l3239
$$ 6589881 6581346 6553112 6435178 6304284 6216842 6228041 6129980 6043183 5993847 5836773 5803534
3899E803534j42888p2219M6083j7709l9115j23506p1378P9562q5236r0910n9740
$$ 5803534 5660646 5588427 5634510 5616801 5577686 5454180 5382802 5462364 5377128 5286218 5226478
3888E226478m5557J5269o2460j09600j06674K1335L2825q2271m6050q4009M499
$$ 5226478 5180921 5196190 5133730 5024130 4917456 4938791 4971616 4889345 4843295 4759286 4763785
3877D763785k2742J5720m0421m3218M3871j32665p3890M9550M874n1102m8793
$$ 4763785 4741043 4756763 4716342 4673124 4716995 4584330 4510440 4559990 4564864 4513762 4464969
3866D464969K3147m5850m2822j18831j745Q8830m2410r1323O7874j02663k472
$$ 4464969 4488116 4442266 4399444 4280613 4278868 4367698 4325288 4233965 4301839 4199176 4196704
3855D196704P911r007n657J4675l5473k6699q322j3140m2037k3373q4669K0174
$$ 4196704 4204615 4195608 4189951 4204626 4169153 4142454 4134132 4120992 4078955 4055582 3970913 3991087
3843C991087N9089O7418l8827n5270j5691K5707L6170j1379J749J5663q2850J573
$$ 3991087 4050176 4117594 4078767 4023497 4007806 4033513 4069683 4058304 4060053 4075716 3992866 3994439
3831C994439n9805l2397m0041l4369J30962j5753k2232l1651q6331j05686P2605
$$ 3994439 3934634 3902237 3862196 3827827 3958789 3943036 3920804 3889153 3802822 3697136 3769741
3820C769741k5572P3237l8092J385K0850L85L916k8874p2548m0637o1516j8129
$$ 3769741 3744169 3817406 3779314 3780699 3801549 3801934 3805850 3776976 3704428 3663791 3602275 3584146
3808C584146O469N2944L3543P252l7660j13217k6198M5141J0319N0925M4493j42987
$$ 3584146 3590615 3643559 3677102 3684354 3646694 3533477 3507279 3552420 3562739 3613664 3658157 3515170
3796C515170J5241J7333N1036l2667n4674n5614k5913o6216k6372M7415p973k3710
$$ 3515170 3530411 3547744 3598780 3566113 3511439 3455825 3429912 3363696 3337324 3384739 3376766 3353056
3784C353056n7198K4822o0108j59558m3489L6331j1655J21660J29825o6176q2920
$$ 3353056 3295858 3320680 3260572 3101014 3057525 3093856 3082201 3203861 3333686 3267510 3184590
3773C184590j35218R664k8612K718o5986r602o6985k4789O7824o7172j9050M119
$$ 3184590 3049372 3059036 3030424 3033142 2967156 2957554 2890569 2865780 2933604 2866432 2847382 2851501
3761B851501j03294N3988K2311r6913j0401j7583m7207j7242r883j09l0594m1057
$$ 2851501 2748207 2802195 2824506 2727593 2717192 2699609 2652402 2635160 2625277 2625168 2594574 2553517
3749B553517o5194p3997R2680l3025l3842j89253M6736J12097L5371k9494j3107
$$ 2553517 2488323 2414326 2507006 2473981 2440139 2250886 2297622 2409719 2445090 2415596 2402489
3738B402489o8602p6682K3244M380M4604N7172O6140m6947n1675J3119M8994K5493
$$ 2402489 2333887 2257205 2280449 2284829 2329433 2386605 2452745 2405798 2354123 2367242 2416236 2441729
3726B441729j00294k1372n7653L7260J1393o0716k3334r5757Q7136P1871k0076
$$ 2441729 2341435 2320063 2262410 2299670 2311063 2250347 2227013 2131256 2218392 2290263 2270187
3715B270187P0386o5928k6436L4993q2736J543N663j6333J03486J09544j10535
$$ 2270187 2340573 2274645 2248209 2283202 2200466 2202009 2207672 2191339 2294825 2404369 2293834
3704B293834n0917P4541L3967J4734p495p3559l6839M5862K0365l6633L8403j991
$$ 2293834 2242917 2317458 2351425 2366159 2358664 2285105 2248266 2294128 2314493 2277860 2316263 2314272
3692B314272n746L7698N6935L7292N1146P1167p9859j00956L8558N2805M4512
$$ 2314272 2308526 2346224 2403159 2440451 2491597 2562764 2482905 2381949 2420507 2473312 2517824
3681B517824J60139K9551n2689k6991L4702J04527L6056L2639J13923K1060n6560
$$ 2517824 2677963 2707514 2654825 2627834 2662536 2767063 2803119 2835758 2949681 2970741 2914181
3670B914181N0664P3425K8744J04614J28353Q1911J47035P2330M1312M5102J63413
$$ 2914181 2964845 3038270 3067014 3171628 3299981 3381892 3528927 3601257 3642569 3687671 3851084
3659C851084N5053M2316P9428J1163J03741q95q9636O5045K47724j17374q3314
$$ 3851084 3906137 3948453 4027881 4039044 4142785 4141890 4052254 4117299 4365023 4247649 4164335
3648D164335L9657R9664R7659O4326J04053J31585Q4876J73345K29359J28559
$$ 4164335 4203992 4303656 4401315 4465641 4569694 4701279 4786155 4959500 5188859 5317418
3638E317418P0727J87589J10627J71099J64593J92153J57286J43824J52852K57438
$$ 5317418 5388145 5575734 5686361 5857460 6022053 6214206 6371492 6515316 6668168 6925606
3628F925606K49687N1967J50056P2637P8361J24751O7388R5882N699k0623J00832
$$ 6925606 7175293 7227260 7377316 7449953 7528314 7653065 7720453 7816335 7822034 7801411 7902243
3617G902243J63615J41385K33124Q3800J46755M45123L42614L94538L84247L10261
$$ 7902243 8065858 8207243 8440367 8524167 8670922 9116045 9458659 9853197 10237444 10547705
3607A0547705M06747M13463K65371K69596L00940L08917L37517N21491N29365
$$ 10547705 10954452 11367915 11633286 11902882 12203822 12512739 12850256 13371747 13901112
3598A3901112O88740P69260R86418J149909J478543J567840J719493J854307J849156
$$ 13901112 14589852 15359112 16345530 17495439 18973982 20541822 22261315 24115622 25964778
3589B5964778J874246J712948J618845J235593P37432K99943L0628n53948j083247
$$ 25964778 27839024 29551972 31170817 32406410 33143842 33443785 33474413 32920465 31837218
3580C1837218j159767j106218j208238j130461j026569j003248r15830q98268
$$ 31837218 30677451 29571233 28362995 27232534 26205965 25202717 24286887 23388619
3572B3388619r25965r87021j011303r65799j052267j048423j000604r54958r13004
$$ 23388619 22462654 21475633 20464330 19498531 18446264 17397841 16397237 15442279 14529275
3563A4529275q27628p98601r33015n72771o05913p18643o31471n01230n03676
$$ 14529275 13701647 12903046 11970031 11397260 10791347 10072704 9441233 8940003 8436327
3554H436327m79941m50118l54484l07575k91186l46786k10078k96566j89422k20138
$$ 8436327 7956386 7506268 7151784 6844209 6553023 6206237 5996159 5699593 5510171 5290033
3544E290033k80761p0195j56708k37591j48885k46448j99947j30055k01570j27341
$$ 5290033 5009272 4939077 4782369 4544778 4395893 4149445 3949498 3819443 3617873 3490532
3534C490532k00596j98045k5726o3007j36057l6673j32387j13268J7327k55956
$$ 3490532 3289936 3091891 3066165 3003158 2867101 2830428 2698041 2584773 2602100 2346144
3524B346144m6811K2659p3873n8543r7909j95799p9280q484j41441Q0844J7606
$$ 2346144 2299333 2321992 2248119 2189576 2091667 1895868 1816588 1808104 1666663 1747507 1765113
3513A765113j11808j00825P5572l6618j25899o2138j4193Q1538p4672j21973k4450
$$ 1765113 1653305 1552480 1628052 1591434 1465535 1403397 1389204 1470742 1396070 1274097 1249647
3502A249647p4099k2791N3366Q6702j0469l7491Q805j13019r3302K12447j36228
$$ 1249647 1175548 1152757 1206123 1292825 1282356 1244865 1253670 1140651 1047349 1259796 1123568
3491A123568j18394M1842P2150k380j56745n70l0560j16147R0774R3465R027j13273
$$ 1123568 1005174 1047016 1119166 1116786 960041 959471 928911 812764 903538 997003 1006030 892757
3479H92757k8616j8398p3112j8460J3211j20585o2243J02919r2543j47098J42101
$$ 892757 864141 845743 772631 754171 767382 646797 584554 687473 594930 447832 589933
3468E89933J19744r6679j09744N7781R3120P5540o1430q505n2173l2358R146n964
$$ 589933 709677 612998 503254 561035 654155 729695 668265 659760 607587 575229 584375 578411
3456E78411L2765k9453m7609j5978P998m3405J01127N9581l3343j0511n3268k9659
$$ 578411 611176 581723 534114 518136 526134 482729 583856 643437 610094 599583 546315 516656
3444E16656O6942N2216j05739j63691P0266j7082J1553J539l7387q8375j2338
$$ 516656 583598 635814 530075 366384 436650 419568 431121 432660 395273 306898 294560
3433B94560M3311J4963O4708j9934m6976m7387k2315o5417m2480L1630M0002J48171
$$ 294560 337871 352834 417542 397608 350632 303245 280930 215513 173033 204663 244665 392836
3421C92836L6823p7279j6987O1799J00880M0511R4133M470k9034j13511K7053
$$ 392836 429659 352380 335393 397192 498072 538583 632716 637186 608152 494641 521694
3410E21694J9086k25787J2558P5327k190R342j13683J8896L7707q817L9278P6650
$$ 521694 540780 314993 327551 402878 400688 410030 296347 315243 352950 344133 383411 460061
3398D60061j42879l1468L3519k7678k1688m5894J0266R5332j4232k8307P3625
$$ 460061 317182 285714 319233 291555 269867 223973 234239 329571 315339 287032 360657
3387C60657q3978L9788j7285o3170L2892M9095P5465M6235o074n2525o529J5269
$$ 360657 276679 316467 299182 236012 268904 317999 393464 439699 433625 381100 374571 389840
3375C89840j11588q0582N9273P7556R6667m8787j21215L0234J03272K7897m9781
$$ 389840 278252 197670 256943 334499 431166 382379 261164 291398 394670 422567 372786
3364C72786m2802j5991o4130O9044J23561m7974n2772M0729N654m69M4070P191
$$ 372786 329984 313993 249863 318907 442468 394494 341722 382451 388105 387636 431706 438897
3352D38897L2466J413m008J7894J7387J2976j35305J13713Q7787j18661O8481
$$ 438897 471363 472776 468768 486662 504049 517025 381720 495433 583220 464559 533040
3341E33040r126n0158Q0759n9870r314J37634q7199Q3527P0581P6222P527l2099
$$ 533040 523914 473756 554515 494645 485331 622965 535766 619293 689874 766096 773623 741524
3329G41524M1550J59790r0317k563M9714O8657n8173J4023J7564O2148R1502L1760
$$ 741524 783074 942864 852547 849984 899698 968355 910182 924205 941769 1003917 1095419 1127179
3317A127179k6183R3276M2765m2167n2153J00368K9976Q8986J77120L440o4809
$$ 1127179 1100996 1194272 1237037 1194870 1142717 1243085 1273061 1362047 1539167 1542607 1477798
3306A477798k7274N5441J80113R9768N6966J2565J7312J0771O6698Q9780l881
$$ 1477798 1450524 1505965 1686078 1785846 1842812 1855377 1872689 1883460 1950158 2039938 2036057
3295B036057M4276O8859J9445J81748Q5919Q2329L02422J10619J86864K35163
$$ 2036057 2080333 2149192 2168637 2350385 2436304 2518633 2821055 2931674 3118538 3353701
3285C353701L00866K37973L51847L49775M71261N52949O28001N82543P20469O46902
$$ 3353701 3654567 3892540 4244387 4594162 5065423 5618372 6246373 6828916 7549385 8196287
3275H196287P49584O94125N06092L56744K18426J28222l3471q6264l5469K8459
$$ 8196287 8945871 9639996 10146088 10502832 10721258 10849480 10816009 10729745 10694276 10722735
3265A0722735o1207j01671n849o0779j5435m9639j8277P2672K92199J58852J10877
$$ 10722735 10661528 10559857 10554008 10493229 10477794 10428155 10409878 10482550 10774749 10933601 11044478
3254A1044478J58131J67709L70572O21989Q00860J035821J563644K413944L170067
$$ 11044478 11202609 11370318 11740890 12362879 13163739 14199560 15763204 18177148 21347215
3245B1347215K929114J442941K44881p59734j688263k221564k336300k171801
$$ 21347215 24276329 25719270 25964151 25204417 23516154 21294590 18958290 16786489
3237A6786489j780837j474582j093408q57719o69261o06462n76006m46354m17733
$$ 16786489 15005652 13531070 12437662 11579943 10910682 10304220 9728214 9281860 8864127
3228H864127l15058j69831r6853q0677o9052m7962Q0965N2421J60747K16792K59798
$$ 8864127 8549069 8379238 8282385 8201708 8132656 8084694 8165659 8218080 8378827 8595619 8855417
3217H855417M53185N46440M10952K54064O6726j86825n04012n56186o22468q00297
$$ 8855417 9308602 9855042 10265994 10520058 10586784 10399959 9895947 9339761 8717293 7916996
3207G916996p77548n38477m67056n00306m30388m11517l39471l18952k52897k40370
$$ 7916996 7139448 6600971 6133915 5633609 5203221 4791704 4452233 4133281 3880384 3640014
3197C640014k35456j71278j77498j56857k54364o1636k46458k09594j04050j29755
$$ 3640014 3404558 3233280 3055782 2898925 2644561 2582925 2336467 2126873 2022823 1893068
3187A893068j88524p2529R6390o2443j89115j20326p7379j19098l3657o2632L0222
$$ 1893068 1704544 1632015 1728405 1665962 1476847 1356521 1279142 1160044 1126387 1063755 1093977
3176A093977K7658j50010l4441K2480l1741p0488k7740l0640K4846M9408q8692
$$ 1093977 1121635 971625 937184 959664 927923 857435 829695 799055 823901 873309 784617
3165G84617q5227j11946o4346o6559O6153j3416l6086L608J5717j0168j14243
$$ 784617 699390 587444 523098 456539 522692 509276 473190 476798 492515 482347 368104
3154C68104q44M17M5691j6985m133R504K9632l3525j21095K7205k3795m7738q346
$$ 368104 367260 367677 413368 396383 392250 401754 431386 397861 276766 303971 280176 232438 224092
3141B24092j7495R1936N0493l0280p9059n8197K7346m9685p0657J1553M3290M8371
$$ 224092 206597 298533 349026 318746 239687 181490 208836 159151 88494 100047 143337 191708
3129A91708j5064r502K6072l0157n9703R5145J3621j42110k7774k7411n8811J19724
$$ 191708 176644 167142 193214 163057 103354 198499 212120 70010 42236 14825 -43986 75738
3117G5738O1131m6237q0014J5676J20473n2608o8599k6569K4495J4655r7741K5813
$$ 75738 136869 90632 10618 26294 146767 94159 25560 -1009 23486 38141 -59600 -33787
3105c3787P4330o1250o326l0524j664K7211M8764j4268j545o983N5058q6830l8148
$$ -33787 40543 -20707 -27033 -57557 -59221 -32010 16754 2486 941 -6042 49016 -37814 -75962
3092g5962J5411q2005K3393N65l7089L4761M6788o5907R7229m7808L1813k476
$$ -75962 -60551 -142556 -119163 -118598 -155687 -120926 -74138 -140045 -42816 -90624 -58811 -61287
3080f1287n0122m3820p8854J7025J6218L3763O9822n9977l6171J09561j5776k0497
$$ -61287 -111409 -155229 -234083 -217058 -200840 -167077 -97255 -157232 -193403 -83842 -99618 -120115
3068a20115K6169J5584j23176o0193K2595J193J28537l8112R0715l6439m0740
$$ -120115 -93946 -78362 -201538 -261731 -239136 -237943 -109406 -147518 -56803 -93242 -133982
3057a33982k278K685k7875P1901M3250o1038l7014n649O952n2054K3983k9468
$$ -133982 -136260 -133575 -161450 -89549 -46299 -107337 -144351 -150000 -143048 -195102 -171119 -200587
3045b00587j11067m2480J07420J37276K4115m269l0398n8282O7792J5576o1097
$$ -200587 -311654 -354134 -246714 -109438 -85323 -89592 -119990 -178272 -110480 -94904 -156001
3034a56001p3992K0604j3124J0007l0368k4904L1172J5953O6987K3247R9689j16154
$$ -156001 -229993 -209389 -222513 -212506 -242874 -267778 -236606 -220653 -153666 -130419 -30730 -146884
3022a46884r8081l5415Q351K5518Q7843J5585p6955N1846m1960M3862o0728p1431
$$ -146884 -244965 -280380 -272029 -246511 -158668 -143083 -220038 -168192 -210152 -166290 -227018 -298449
3010b98449J0030R200L320O2600l4254K4216L1649M967k0356M553L664l534K9671
$$ -298449 -288419 -279219 -275899 -213299 -247553 -223337 -191688 -186721 -207077 -202524 -198860 -202394 -172723
2997a72723P526O496Q773L5091j4628r0981J9858q792l5679k3659J08781q0301
$$ -172723 -165197 -158701 -149928 -114837 -129465 -220446 -200588 -209380 -245059 -268718 -159937 -240238
2985b40238p29J0787k864N91l3407o5659L8229R4767m7901o7520J12384k2614
$$ -240238 -240967 -230180 -233044 -232453 -265860 -331519 -293290 -198523 -246424 -313944 -201560 -224174
2973b24174K9560M0714j4008K2699O3009M3792l1578K6980k3292p9925Q5913o066
$$ -224174 -194614 -153900 -167908 -145209 -82200 -38408 -69986 -43006 -66298 -146223 -60310 -66376
2961f6376J8008K1209j11567J24040O5489j06892p2170o771N9372p585p3872P1897
$$ -66376 -48368 -27159 -138726 -14686 50803 -56089 -128259 -135030 -75658 -83243 -157115 -85218
2949h5218J2425m0947o9205P483j0546k7493O01o0410K2772M7605L2942m654P9227
$$ -85218 -72793 -113740 -182945 -175462 -186008 -213501 -212900 -273310 -250538 -202933 -169991 -174645 -95418
2936i5418j3880k4474k0751M095K4339n4446r254P4121p6848n6308k8423J8206
$$ -95418 -109298 -133772 -154523 -150428 -126089 -180535 -189789 -115668 -192516 -248824 -277247 -259041
2924b59041M6378r7166L6083J6538L4883Q672r7755r6713J90296k5761M5903r702
$$ -259041 -212663 -309829 -273746 -257208 -222325 -213653 -311408 -408121 -217825 -243586 -197683 -207385
2912b07385j20234n2656M2343J46117j9349L5938M4433q0743L5744N2470j2110
$$ -207385 -327619 -380275 -337932 -191815 -211164 -175226 -130793 -211536 -175792 -123322 -135432
2901a35432q6621j6624O777Q0933N643r4607p0832J11335R1520j19267j390J093
$$ -135432 -222053 -238677 -231900 -150967 -145324 -239931 -310763 -199428 -107908 -227175 -228565 -227472
2889b27472M7349P1372k2065R581p3391O9190o4383p5996M1436n6075M8303J25750
$$ -227472 -180123 -108751 -130816 -121235 -194626 -125436 -189819 -265815 -224379 -280454 -232151 -106401
2877a06401j10261q9316N0462M2507N5675J51j02303L6732J636l8925j5854Q4436
$$ -106401 -216662 -305978 -255516 -213009 -157334 -157183 -259486 -222754 -221118 -260043 -275897 -191461
2865a91461j1506M5908j32491M351R763k5906l4929J0669J54640j3695j7553r3215
$$ -191461 -202967 -157059 -289550 -285199 -275436 -301342 -336271 -325602 -170962 -184657 -202210 -295425
2853b95425P0739p6030m2658K5152k181M5957j0913l171o8274l151N2570N5751
$$ -295425 -224686 -300716 -343374 -318222 -320403 -274446 -285359 -288530 -356804 -359955 -307385 -251634
2841b51634J1941k4753k2189p6297J52827J4897j10447P5988m0345j12706K9418
$$ -251634 -239693 -264446 -286635 -362932 -210105 -195208 -305655 -229667 -270012 -382718 -353300
2830c53300N8688M7233N235M8638m8346N5072J8073j07635P2874Q6935j27668
$$ -353300 -294612 -247379 -242144 -193506 -241852 -186780 -168707 -276342 -203468 -116533 -244201
2819b44201q1430M6172j1634J6216J16413M3k1836j5720q0009l5979o6951N0977
$$ -244201 -325631 -279459 -291093 -274877 -158464 -158421 -180257 -195977 -275986 -311965 -378916 -327939
2807c27939j1189K3200R368K4341R3473J872P748m1900j4049J8146k7017k521
$$ -327939 -339128 -315928 -306560 -282219 -188746 -186874 -179126 -221026 -235075 -216929 -243946 -246467
2795b46467R8005O121N0412o4888j03377k24P9935l2778L5966L9943o5237j24262
$$ -246467 -148462 -142341 -91929 -156817 -260194 -260418 -180483 -213261 -177295 -137352 -202589 -326851
2783c26851M7998k0950K8606J24119K1925n9521O8936M3950j00228Q3956M5279
$$ -326851 -278853 -299803 -271197 -147078 -125153 -184674 -115738 -71788 -172016 -88060 -42781
2772d2781q4710j21577M8303N309j9302L215k6714J7219l4697K4205p3808j26510
$$ -42781 -127491 -249068 -200765 -195456 -214758 -211543 -238257 -221038 -255735 -231530 -305338 -431848
2760d31848L6666J94869M5769k994o6465o1748M957O4787j08438l3227N6707J0540
$$ -431848 -395182 -200313 -154544 -157538 -224003 -285751 -280794 -216007 -324445 -357672 -300965 -290425
2748b90425J0368P2645R627J552O3100l1865L010n7217q5488m455M2665N7712
$$ -290425 -280057 -207412 -197785 -196233 -133133 -164998 -161988 -219205 -304693 -309148 -266483 -208771
2736b08771K9846J783k6620K0901P9949l4569k8206N492L7325K8336K4039p1029
$$ -208771 -178925 -177142 -203762 -182861 -102912 -137481 -165687 -160195 -122870 -94534 -70495 -141524
2724a41524m7961o8149k4683R7298N4859j1134J1792N8922N1417N6748J93472
$$ -141524 -189485 -257634 -282317 -185019 -130160 -141294 -129502 -70580 -19163 37585 231057
2713B31057J13061l3049R7148r0927l2182j07261k0936K7771n8719p9136q9436
$$ 231057 344118 311069 408217 317290 285108 177847 156911 184682 125963 46827 -42609
2702d2609K662n629J52061j18932l3192L6137L936j61407m7578J14102l3040J7389
$$ -42609 -39947 -45576 106485 -12447 -45639 -9502 -5566 -166973 -214551 -100449 -133489 -116100
2690a16100N1628n4605K8735p735m3946K1822k2151j2419k9338m0383l6449N3350
$$ -116100 -64472 -119077 -90342 -98077 -142023 -120201 -142352 -154771 -184109 -224492 -260941 -207591
2678b07591P4447p9186m0613P6008Q8477l1484j53017O0890O5081K6699J18045
$$ -207591 -133144 -212330 -252943 -176935 -88458 -119942 -272959 -212069 -146988 -120289 -2244
2667b244r8104p5647M4254r003k3332K1857P6808l5702p2595k3279M7795N4245
$$ -2244 -100348 -175995 -131741 -140744 -164076 -142219 -65411 -101113 -173708 -196987 -149192 -94947
2655i4947L8959J26732q3693O2297k7437r1669q644J4747L7965p847j0456L2816
$$ -94947 -55988 70744 -12949 49348 21911 -69758 -78402 -63655 -25690 -33537 -43993 -11177
2643a1177M4108l6364j20432q1596m3293J21570O4643q4267l1860K7158o9460
$$ -11177 32931 -3433 -123865 -205461 -248754 -127184 -62541 -146808 -178668 -151510 -220970
2632b20970J15460j61n9020R845j00278m1957j6285P5562M3191r0188J07590Q2409
$$ -220970 -105510 -105671 -164691 -154846 -255124 -297081 -313366 -237804 -194613 -284801 -177211 -94802
2620i4802l0135j1395k7733m846L1329Q7654n504M071j1220m2226j0075R8269
$$ -94802 -124937 -136332 -164065 -168911 -137582 -49928 -55432 -51361 -62581 -104807 -114882 -16613
2608a6613M0144J7996m4435j03386l1050M923O4178K8414N4045Q7715J5355k9335
$$ -16613 23531 41527 -2908 -106294 -137344 -132421 -68243 -39829 14216 101931 117286 87951
2596H7951L2590N0103j24368q15j1103p8241j1139M391m40P9366L8804j37614
$$ 87951 120541 170644 46276 45461 34358 -43883 -55022 -50631 -51071 28295 67099 -70515
2584g0515j5043P0203J23964k0960r7815j5387J1764Q7247J11274K0047j28333
$$ -70515 -85558 -15355 108609 87649 -10166 -25553 -13789 73458 184732 204779 76446
2573G6446L0252P8109K6502p5996q34M1736Q6381j3711j5538n359j5791L617n3239
$$ 76446 106698 184807 211309 135313 134479 176215 262596 248885 233347 227988 212197 215814 162575
2560A62575L6426j1467m6273J29090K4934j13804p2597m551q0054M940m0433n9791
$$ 162575 199001 187534 141261 270351 295285 181481 108884 104333 24279 29219 -11214 -71005
2548g1005Q3536K9688p5027M0605J43588p0238j18386l5954M9802l0731N2102
$$ -71005 12531 42219 -32808 7797 151385 81147 -37239 -73193 -23391 -54122 -2020
2537b020J49572K5560Q4262m7467L4015J03752J2636P480n1323p4479o5749P6109
$$ -2020 147552 173112 257374 209907 243922 347674 360310 367790 316467 241988 176239 252348
2525B52348J6825K9956k0950l2591J77449J33107L2452J38051J49439J31660K8074
$$ 252348 269173 299129 278179 245588 423037 556144 588596 726647 876086 1007746 1035820
2514A035820L311j0586l0408J16742J53779n2549N890k7003m6941K07417o824
$$ 1035820 1039131 1028545 998137 1114879 1268658 1216109 1221999 1194996 1148055 1355472 1348648
2503A348648M7719O1120J97760j9573o0045l6801r2941m7252P1729l6139L2172
$$ 1348648 1396367 1457487 1655247 1635674 1575629 1538828 1445887 1398635 1470364 1434225 1466397
2492A466397P9152K4095q9077j15494O4817K8584p6853J42236J45801J36796J22486
$$ 1466397 1545549 1569644 1480567 1365073 1429890 1458474 1381621 1523857 1669658 1806454 1928940
2481A928940J32540k0875P8699K672M1021p3798P110J64023J23114J13512J64843
$$ 1928940 2061480 2040605 2119304 2121976 2162997 2089199 2096309 2260332 2383446 2496958 2661801
2470B661801K31527L35010K03645K59498L93285M61714N78008R03724J117281
$$ 2661801 2893328 3228338 3431983 3691481 4084766 4546480 5124488 6028212 7145493
2461G145493J012532M62136N99191N53314O78255R20461J339077J821340K774585
$$ 7145493 8158025 8620161 9219352 9772666 10450921 11371382 12710459 14531799 17306384
2452A7306384L748530M979104P287935J2345544K2363528L0539231K2053540L231818
$$ 17306384 21054914 26034018 33321953 45667497 68031025 98570256 120623796 123855614
2444A23855614m825222j1739623j7560585j8412883j4636338j1270999q951323
$$ 123855614 119030392 107290769 89730184 71317301 56680963 45409964 36458641
2437C6458641o522227m638406l486280k601281j601819j043123q81897j140371
$$ 36458641 29936414 25298008 21811728 19210447 17608628 16565505 15683608 14543237
2429A4543237j142397j053824j275141j136800r42062q03858p81193o54492m78375
$$ 14543237 13400840 12347016 11071875 9935075 8993013 8189155 7407962 6753470 6275095
2420F275095l47884l90207m13473k16498k60212k04493l70216j92188k30865k44515
$$ 6275095 5927211 5537004 5123531 4907033 4646821 4442328 4072112 3879924 3649059 3404544
2410C404544l15900k95352j56092j1067l5001q457K5129Q930j13082j01969j59989
$$ 3404544 3088644 2793292 2637200 2626133 2591132 2582675 2607804 2616734 2503652 2401683 2241694
2399B241694j37660k05555j07239j96296n0153j39312k16892j03942j65974r6850
$$ 2241694 2104034 1898479 1791240 1594944 1544791 1405479 1188587 1084645 918671 821821
2389H21821q3480k9875P009j496k2827k1134L6546l2794o8821q4726M2939j1075
$$ 821821 738341 708466 715475 713979 691152 670018 706564 673770 604949 520223 563162 552087
2377E52087J9805j25576m7075M2123K667N6163m2620M9125L4224r874J0029l3873
$$ 552087 571892 446316 399241 441364 444031 500194 457574 506699 540923 531049 541078 507205
2365E07205J896J07442k9358K8215L7648k4327O676j12050O5778j1902J12713
$$ 507205 509101 616543 587185 615400 653048 628721 635397 523347 589125 577223 689936
2354F89936r8719n676M4645L5420O0054p4324q0415L2351o6557q1246j04255Q7094
$$ 689936 591217 585541 630186 665606 725660 651336 570921 603272 536715 455469 351214 438308
2342D38308o2710O9147M1499N2181j50457o3705p334q5801L8006q4046m7799O730
$$ 438308 375598 444745 486244 538425 387968 324263 316929 231128 269134 185088 137289 144019
2330A44019j204m7547p219l9036J277K2293J4778O3596k121n9450k5069M5289
$$ 144019 142815 95268 88049 49013 50290 72583 87361 150957 148836 89386 64317 109606
2318A09606L9398K0447K9434R107o7303q4254N8684P454o6415q1187l965l8145
$$ 109606 149004 169451 198885 207992 140689 56435 115119 122573 56158 -25029 -28994 -67139
2306f7139m836R0086p6724j8625Q3064p9380O623r8960J3029R5145L6894k7147
$$ -67139 -71975 18111 -58613 -77238 5826 -73554 -66931 -165891 -152862 -57717 -20823 -47970
2294d7970p7500L6686q1899N5676k1594N5216J46107j08530l4322j8132q0629
$$ -47970 -125470 -88784 -170683 -115007 -136601 -81385 64722 -43808 -78130 -96262 -176891
2283a76891M1032n7671N0778r1695Q767K7047Q192M7717Q1314Q2210r1881q4621
$$ -176891 -135859 -193530 -142752 -234447 -225680 -198633 -190441 -142724 -61410 20800 -71081 -155702
2271a55702R5461J22765j07748o9267j2486L8824R149P9931j00948J3453J9115
$$ -155702 -60241 62524 -45224 -114491 -126977 -88153 -79004 927 -100021 -86568 -67453
2260f7453m5217r6034K0978P7521K5761l2442M5065J5773L0363p6674o9966K078
$$ -67453 -112670 -208704 -187726 -110205 -84444 -116886 -71821 -56048 -25685 -102359 -172325 -170247
2248a70247P3394m1767j18813m3866J17784r7865O3971j5314M9639J04435J9607
$$ -170247 -96853 -138620 -257433 -301299 -183515 -281380 -217409 -232723 -183084 -78649 -59042
2237e9042p1941n8677N4345n8695M5083p4775l8880n4310O9112O8445j14805P1682
$$ -59042 -130983 -189660 -135315 -194010 -148927 -223702 -262582 -316892 -247780 -179335 -294140 -222458
2225b22458J8626j1000P1268J7085n7424L8286k5915J091k4299J58745l620j09090
$$ -222458 -203832 -214832 -143564 -126479 -183903 -145617 -171532 -170441 -194740 -35995 -39615 -148705
2213a48705K1068k8201O5218k52K2432j2370j19898m2449L7191O2821M2026k6072
$$ -148705 -127637 -155838 -90620 -90872 -68440 -80810 -200708 -243157 -205966 -143145 -101119 -127191
2201a27191j46162J5467J60527N0833j72190r866J04553R4393J37004j4980j05126
$$ -127191 -273353 -257886 -97359 -46526 -218716 -228582 -124029 -29636 107368 92388 -12738
2190a2738k07890O0274J08455K6833p226Q0430o6921N3171R396J9813J14408J54023
$$ -12738 -220628 -160354 -51899 -25066 -32292 48138 -18783 34388 43784 63597 178005 332028
2178C32028Q1562J3532Q3281M3485j04784j30745p4944m7859j14524m3638J3706
$$ 332028 413590 427122 510403 553888 449104 318359 243415 195556 81032 37394 51100
2167E1100j12097J3050o696M6276j902M755P632n2930l2899N9687m8595O474n0442
$$ 51100 -60997 -47947 -54643 -8367 -10269 -5514 2118 -50812 -83711 -24024 -72619 -66145 -116587
2154a16587l5553o1123l1254N8180l5r1812J5937M1294M2659R3220p8444K3286
$$ -116587 -152140 -213263 -244517 -186337 -186372 -278184 -262247 -220953 -178294 -85074 -163518 -140232
2142a40232K2133L8070l5958N7684L0207n6616J5615j29342m757J60922m8366
$$ -140232 -118099 -80029 -115987 -58303 -28096 -84712 -69097 -198439 -203196 -42274 -90640
2131i0640k222l9090J06650K0579n9425N2067M1921n8667n5480Q810K2357j16394
$$ -90640 -92862 -131952 -25302 -4723 -64148 -12081 29840 -28827 -84307 -75497 -53140 -169534
2119a69534l6329L3402P6129l1317J3755P2300r5125p0959P6255l7549n60J7221
$$ -169534 -205863 -172461 -96332 -127649 -113894 -41594 -136719 -207678 -131423 -168972 -169532 -152311
2107a52311k5133j2595j6344J2640m7549J02191l7661k9626j03068M525Q2548
$$ -152311 -177444 -190039 -206383 -193743 -241292 -139101 -176762 -206388 -309456 -304931 -222383
2096b22383O5218J97320m7640o2201m4991J8937j09849L562j2637O3740K9038
$$ -222383 -157165 40155 -7485 -69686 -114677 -95740 -205589 -202027 -214664 -150924 -121886
2085a21886J3598L7677L1490k6998r2035j5254R4992j60237K4309O2861Q8120
$$ -121886 -108288 -70611 -39121 -66119 -158154 -173408 -78416 -238653 -214344 -151483 -63363
2074f3363J07421m2950o2450j25075r7763R2401N0098M5315L8293o169n390o7396
$$ -63363 44058 1108 -61342 -186417 -284180 -191779 -141681 -96366 -58073 -64242 -69632 -137028
2062a37028P5607k5116n4756O6887j3012k7086q0860j0708R9090l8353O5870j2330
$$ -137028 -61421 -86537 -141293 -74406 -87418 -114504 -195364 -206072 -106982 -145335 -79465 -91795
2050i1795l6677j17412J9027O740J31902L5265L8178n9206K9791n9569p9583L1852
$$ -91795 -128472 -245884 -226857 -220117 -88215 -52950 -14772 -73978 -44187 -103756 -183339 -151487
2038a51487K6882L0513L8067M274j0034K5789L1789n9161o1621L7366j422l0229
$$ -151487 -124605 -94092 -56025 -51751 -61785 -35996 -4207 -63368 -124989 -87623 -89045 -119274
2026a19274P1350p847l4163m5561n5063N0468L8839L5007l1209o995L8291K5358
$$ -119274 -47924 -55771 -89934 -135495 -190558 -140090 -101251 -66244 -97453 -104448 -66157 -40799
2014d0799o3487p1793R0240n853j2470j8247M07n6097l3826J12298M3271q4290
$$ -40799 -104286 -176079 -85839 -91692 -104162 -122409 -122002 -178099 -211925 -99627 -56356 -140646
2002a40646j2016O9134j0261P307R9177q1199J0513j3666j04993r781R237K0735
$$ -140646 -152662 -83528 -93789 -86482 12695 -68504 -57991 -71657 -176650 -186431 -177194 -156459
1990a56459Q578M0438q2821j34944P4637P1269P3829m8936n7825L3227R3615m6857
$$ -156459 -147881 -107443 -190264 -325208 -250571 -179302 -105473 -154409 -212234 -179007 -85392 -132249
1978a32249k1879l9067O3734r8554j9019P9729o1794J3444R2543k5512J1940O7366
$$ -132249 -154128 -193195 -129461 -228015 -247034 -167305 -229099 -215655 -123112 -148624 -136684 -69318
1966f9318q5160n2621R5599p7160m6098R1977j7068n3760K9137m2463l8879O4136
$$ -69318 -154478 -207099 -111500 -188660 -234758 -142781 -159849 -213609 -184472 -226935 -265814 -201678
1954b01678J11139N0814L6850j371p4402r4183Q9361N3097o5157N1503M8532m9429
$$ -201678 -90539 -39725 -2875 -4246 -78648 -172831 -83470 -30373 -95530 -44027 4505 -44924
1942d4924n3680L2772r8202J79689r3696N8388m8056l7025n7608N7422k4632O8612
$$ -44924 -98604 -65832 -164034 15655 -78041 -19653 -67709 -104734 -162342 -104920 -129552 -60940
1930f0940Q322M3492k242p5341L6283j42436m8987L7451R7288L4766K4654K3111
$$ -60940 -52618 -9126 -11368 -86709 -50426 -192862 -241849 -204398 -107110 -72344 -47690 -24579
1918b4579r1217Q258M7357M1202L590l0556j00173M3435M7127j4547j69684K4361
$$ -24579 -115796 -107538 -60181 -18979 -15389 -45945 -146118 -102683 -55556 -70103 -239787 -215426
1906b15426J05623j8511O1167k2799m6523M1334j04434J12244K1465l994K5266
$$ -215426 -109803 -128314 -67147 -89946 -136469 -95135 -199569 -87325 -65860 -69854 -44588
1895d4588l7690o8700o0818J52486M3655m4597K8120p6796j04441o720P7800N2225
$$ -44588 -82278 -150978 -211796 -59310 -15655 -60252 -32132 -108928 -213369 -220089 -142289 -90064
1883i0064R398J6402R231q7959k6495N0151N9519n0382L9502K9433j53176o4929
$$ -90064 -80666 -64264 -55033 -142992 -169487 -119336 -59817 -110199 -70697 -41264 -194440 -259369
1871b59369O0948J25456p8511M5434p3796J3254M9375O0404k5818Q0240J6146
$$ -259369 -198421 -72965 -151476 -106042 -179838 -166584 -117209 -56805 -82623 -2383 13763
1860A3763j17182j3416M7990K7957k3465J9131q3023P4664Q5706o5503M5860L0884
$$ 13763 -103419 -116835 -68845 -40888 -64353 -45222 -128245 -53581 32125 -33378 12482 43366
1848D3366n3495q1275m6279k6610N6055j05349j1280P2532k7680l7082Q0469n3249
$$ 43366 -10129 -91404 -137683 -164293 -108238 -213587 -224867 -152335 -180015 -217097 -136628 -189877
1836a89877P3638J20449p7892l4599K9809q3299P8422O451q4701L6922m3676r906
$$ -189877 -116239 4210 -73682 -108281 -78472 -161771 -83349 -76898 -161599 -124677 -168353 -178259
1824a78259P2948L9739M9857o0060j1901K4085l1353L3879l1340n5288k2654j3819
$$ -178259 -105311 -65572 -15715 -75775 -87676 -63591 -94944 -61065 -92405 -147693 -170347 -184166
$$ [...]
##END NTUPLES=NMR SPECTRUM
##END=
