##TITLE=1H_CA-9433-13
 200.13MHz,CDCl3.
 8 sc
 
4.3.2026
##JCAMPDX= 6.0         $$ Bruker NMR JCAMP-DX V2.0
##DATA TYPE= NMR SPECTRUM
##DATA CLASS= NTUPLES
##ORIGIN= UXNMR, Bruker Analytische Messtechnik GmbH
##OWNER= pz
$$ XWIN-NMR		Version 3.5
$$ Wed Mar  4 14:22:36 2026 Russian Standard Time (UT+4h)  she@DPX200
##.OBSERVE FREQUENCY= 200.1313
##.OBSERVE NUCLEUS= ^1H
##.ACQUISITION MODE= SIMULTANEOUS
##.ACQUISITION SCHEME= undefined
##.AVERAGES= 8
##.DIGITISER RES= 18
##SPECTROMETER/DATA SYSTEM= spect
##.PULSE SEQUENCE= zg30
##.SOLVENT NAME= DMSO
##.SHIFT REFERENCE= (INTERNAL, DMSO, 0, 15.38)
##AUDIT TRAIL= $$ (NUMBER, WHEN, WHO, WHERE, WHAT)
$$ ##TITLE= Audit trail, XWIN-NMR		Version 3.5
$$ ##JCAMPDX= 5.01
$$ ##ORIGIN= Bruker BioSpin GmbH
$$ ##OWNER= she
$$ F:/spectra/data/she/nmr/H-C/1/pdata/1/auditp.txt
$$ ##AUDIT TRAIL=  $$ (NUMBER, WHEN, WHO, WHERE, WHAT)
(   1,<2026-03-04 14:21:05.04 +0400>,<she>,<DPX200>,
      <created by zg, POWCHK disabled, PULCHK disabled
       configuration hash MD5:
       00 E9 B6 7A A2 85 ED C7 34 08 36 98 17 FE 4E 26
       data hash MD5: 16K
       43 B5 18 E9 08 2E A1 86 6F E3 7F 77 83 35 7D 00>)
(   2,<2026-03-04 14:21:09.39 +0400>,<she>,<DPX200>,
      <Start of raw data processing
       efp BC_mod = 2 LB = 0.25 FT_mod = 6 PKNL = 1 PHC0 = -3701.282 PHC1 = 7.992321 SI = 16K 
       data hash MD5: 16K
       23 2B 54 92 A8 A8 47 8C 34 E0 4F B5 F7 E1 F8 8B>)
(   3,<2026-03-04 14:21:32.43 +0400>,<she>,<DPX200>,
      <pk PHC0 = -158.8125 PHC1 = 0 
       data hash MD5: 16K
       CD 5C CF 00 5A 36 79 D0 E9 D1 83 42 93 2C 19 9D>)
(   4,<2026-03-04 14:21:37.00 +0400>,<she>,<DPX200>,
      <abs ABSG = 5 
       data hash MD5: 16K
       93 30 4C 14 1A 37 78 04 BE 9B D5 3F 14 94 CC BD>)
$$ ##END=
$$ 
$$ hash MD5
$$ 39 33 CE 61 45 C5 97 51 3E 1A A4 4A 2B 16 23 16
##$RELAX= 
##$RELAX= 
##$RELAX= 
##$RELAX= 
##$RELAX= 
##$RELAX= 
$$ Bruker specific parameters
$$ --------------------------
##$DU= <F:/spectra>
##$EXPNO= 1
##$NAME= <H-C>
##$PROCNO= 1
##$TYPE= <nmr>
##$USER= <she>
##$AMP= (0..31)
100 100 100 100 100 100 100 100 100 100 100 100 100 100 100 100 100 100 
100 100 100 100 100 100 100 100 100 100 100 100 100 100 
##$AQSEQ= 0
##$AQ_mod= 1
##$AUNM= <au_zg>
##$AUTOPOS= <>
##$BF1= 200.13
##$BF2= 200.13
##$BF3= 200.13
##$BF4= 200.13
##$BF5= 200.13
##$BF6= 200.13
##$BF7= 200.13
##$BF8= 200.13
##$BYTORDA= 1
##$CFDGTYP= 0
##$CFRGTYP= 5
##$CHEMSTR= <none>
##$CNST= (0..31)
1 1 145 1 1 1 1 1 1 1 1 1 1 1 1 1 1 1 1 1 1 1 1 1 1 1 1 1 1 1 1 1 
##$CPDPRG= <>
##$CPDPRG1= <>
##$CPDPRG2= <>
##$CPDPRG3= <>
##$CPDPRG4= <mlev>
##$CPDPRG5= <mlev>
##$CPDPRG6= <mlev>
##$CPDPRG7= <mlev>
##$CPDPRG8= <mlev>
##$CPDPRGB= <>
##$CPDPRGT= <>
##$D= (0..31)
0 0.7 0 0 0 0 0 0 0 0 0 0.03 0 0 0 0 0 0 0 0 0 0 0 0 0 0 0 0 0 0 0 0 
##$DATE= 1772619664
##$DBL= (0..7)
120 120 120 120 120 120 120 120 
##$DBP= (0..7)
150 150 150 150 150 150 150 150 
##$DBP07= 0
##$DBPNAM0= <>
##$DBPNAM1= <>
##$DBPNAM2= <>
##$DBPNAM3= <>
##$DBPNAM4= <>
##$DBPNAM5= <>
$$ [...]
##$SUBNAM3= <"">
##$SUBNAM4= <"">
##$SUBNAM5= <"">
##$SUBNAM6= <"">
##$SUBNAM7= <"">
##$SUBNAM8= <"">
##$SUBNAM9= <"">
##$SW= 18.0517328524113
##$SWIBOX= (0..15)
0 0 2 0 0 0 0 0 0 0 0 0 0 0 0 0 
##$SW_h= 3612.71676300578
##$TD= 16384
##$TD0= 1
##$TE= 0
##$TE2= 300
##$TE3= 300
##$TEG= 300
##$TL= (0..7)
0 120 120 120 120 120 120 120 
##$TP= (0..7)
150 150 150 150 150 150 150 150 
##$TP07= 0
##$TPNAME0= <>
##$TPNAME1= <>
##$TPNAME2= <>
##$TPNAME3= <>
##$TPNAME4= <>
##$TPNAME5= <>
##$TPNAME6= <>
##$TPNAME7= <>
##$TPOAL= (0..7)
0.5 0.5 0.5 0.5 0.5 0.5 0.5 0.5 
##$TPOFFS= (0..7)
0 0 0 0 0 0 0 0 
##$TUNHIN= 0
##$TUNHOUT= 0
##$TUNXOUT= 0
##$USERA1= <user>
##$USERA2= <user>
##$USERA3= <user>
##$USERA4= <user>
##$USERA5= <user>
##$V9= 5
##$VALIST= <valist>
##$VCLIST= <CCCCCCCCCCCCCCC>
##$VD= 0
##$VDLIST= <DDDDDDDDDDDDDDD>
##$VPLIST= <PPPPPPPPPPPPPPP>
##$VTLIST= <TTTTTTTTTTTTTTT>
##$WBST= 1024
##$WBSW= 4
##$XGAIN= (0..3)
0 0 0 0 
##$XL= 0
##$YL= 0
##$YMAX_a= 315569
##$YMIN_a= -264625
##$ZGOPTNS= <>
##$ZL1= 120
##$ZL2= 120
##$ZL3= 120
##$ZL4= 120
##$ABSF1= 15.41966
##$ABSF2= -2.632188
##$ABSG= 5
##$ABSL= 3
##$ALPHA= 0
##$AQORDER= 0
##$ASSFAC= 0
##$ASSFACI= 0
##$ASSFACX= 0
##$ASSWID= 0
##$AUNMP= <proc_1d>
##$AZFE= 0.1
##$AZFW= 0.1
##$BCFW= 0
##$BC_mod= 2
##$BYTORDP= 0
##$COROFFS= 0
##$CY= -3
##$DATMOD= 1
##$DC= 0
##$DFILT= <>
##$DTYPP= 0
##$F1P= 0
##$F2P= 0
##$FCOR= 1
##$FTSIZE= 16384
##$FT_mod= 6
##$GAMMA= 0
##$GB= 0
##$INTBC= 1
##$INTSCL= 3.241238e-09
##$ISEN= 128
##$LB= 0.25
##$LEV0= 0
##$LPBIN= 0
##$MAXI= 10000
##$MC2= 0
##$MEAN= 0
##$ME_mod= 0
##$MI= 1.114404
##$NCOEF= 0
##$NC_proc= -7
##$NLEV= 6
##$NOISF1= 3.799351
##$NOISF2= 2.8
##$NSP= 0
##$NTH_PI= 0
##$NZP= 0
##$OFFSET= 15.37999
##$PC= 1
##$PHC0= -3860.094
##$PHC1= 7.992321
##$PH_mod= 1
##$PKNL= yes
##$PPARMOD= 0
##$PSCAL= 0
##$PSIGN= 0
##$REVERSE= no
##$SF= 200.130028361448
##$SI= 16384
##$SIGF1= 3
##$SIGF2= 2
##$SINO= 0.751879
##$SIOLD= 32768
##$SREGLST= <19F.Aceton>
##$SSB= 0
##$STSI= 16384
##$STSR= 0
##$SW_p= 3612.71676300578
##$SYMM= 0
##$S_DEV= 0
##$TDeff= 16384
##$TDoff= 0
##$TI= <>
##$TILT= no
##$TM1= 0
##$TM2= 0
##$TOPLEV= 0
##$USERP1= <user>
##$USERP2= <user>
##$USERP3= <user>
##$USERP4= <user>
##$USERP5= <user>
##$WDW= 1
##$XDIM= 16384
##$YMAX_p= 443578057
##$YMIN_p= -733741
$$ End of Bruker specific parameters
$$ ---------------------------------
##NTUPLES= NMR SPECTRUM
##VAR_NAME=  FREQUENCY,     SPECTRUM/REAL,   SPECTRUM/IMAG
##SYMBOL=    X,             R,               I
##VAR_TYPE=  INDEPENDENT,   DEPENDENT,       DEPENDENT
##VAR_FORM=  AFFN,          ASDF,            ASDF
##VAR_DIM=   16384,         16384,           16384
##UNITS=     HZ,            ARBITRARY UNITS, ARBITRARY UNITS
##FACTOR=    0.220516191357247, 1,           1
##FIRST=     3077.99775965459, 0,            0
##LAST=      -534.719003351193, 0,           0
##MIN=       -534.719003351193, -733741,     0
##MAX=       3077.99775965459, 443578057,    0
$$ Real data points
##PAGE= N=1
##DATA TABLE= (X++(R..R)), XYDATA
$$ [...]
10316 96763 54994 30600 -47348 -140971 -70074 -97973 -53793 62741 31329 5893 20320
10305 20320 -46259 -104922 -81262 -94408 -60018 -43148 -42667 -51254 -14290 10139 -572 11347
10293 11347 30587 -1324 -105261 -92085 -92394 -3527 -5318 -42862 7224 13773 -33303 -66247
10281 -66247 -111086 -64505 -59847 -84289 -100875 -100929 -126688 -43867 -34132 -9242 31056 4956 -33868
10268 -33868 -50357 -15359 -26492 -32752 -42182 -41250 -72301 -34562 -48434 -54402 -35657 -11747 37951
10255 37951 -22351 -30896 -19235 12361 48982 87548 115139 57188 -2288 16770 -19913 -34796
10243 -34796 -93719 -114401 -60081 -19455 14193 35793 60051 50306 12619 -28953 -4764 35343
10231 35343 581 -62539 29309 38322 15975 -12013 3481 51188 -22598 -70816 -24861 3809
10219 3809 -17127 -48169 -129061 -109960 -84312 -95143 -111606 -95763 -59882 111220 100523 35525
10207 35525 -20254 -27954 -8686 -39970 54453 -1400 -23808 -18303 -49638 -30004 -36607 -101583
10195 -101583 -79615 -54019 -13521 -8283 36253 30168 -18892 11343 52031 15436 34462 30765
10183 30765 -45117 -44939 -25605 31892 88322 78267 -38569 -55486 -1526 55615 5948 58337
10171 58337 56500 -4307 -42812 -50676 17411 5861 20548 -33416 -28432 -5475 7704 -71724
10159 -71724 -112446 -84941 -27992 47895 -16533 -35628 -32806 2863 14722 -43448 -51564 -88161
10147 -88161 -35946 -25425 -18377 -21074 35252 52204 -16573 21924 -47645 -62945 -123358 -52314
10135 -52314 -31395 -18383 20886 -32029 -41750 10913 56315 -27720 -27279 -64388 -74677 -46076
10123 -46076 -37220 -49144 -22991 -51322 -68968 -49205 -15655 -62891 -44341 -56901 -42847 -3679
10111 -3679 3961 -12377 15184 41340 52320 55538 66118 25420 8378 -38905 -68110 -46021
10099 -46021 -31299 -7308 -40604 -27921 7502 -45743 -53095 -9643 -28591 -8859 -55579 -3358
10087 -3358 -28402 -77648 1667 -11407 24915 32799 -10907 5016 -20221 416 51642 39958
10075 39958 51447 4576 -25012 36130 76618 -27003 -17149 -49433 -65179 10460 18896 8292
10063 8292 2397 14273 -15568 -45640 -72578 -78708 -103765 -106060 -69802 -45403 -58978 -44721
10051 -44721 -64935 -75600 -82800 -29728 -43798 -83682 -109127 -81454 -45965 -4291 -16421 -906
10039 -906 -33355 -60628 -74471 -5924 -724 -12341 -4881 -57976 -67717 -101590 -104643 -90 14741
10026 14741 -21258 15508 39044 25991 11424 -4958 -11376 14512 3702 30313 22642 -46065
10014 -46065 -19028 -45965 -113495 -141242 -67516 -90975 -58560 -37232 -59909 -64886 -1925 -12058
10002 -12058 -43928 -93047 -95825 -28194 -59138 -91881 -55798 13523 -20833 -58765 -94399 -152254
9990 -152254 -97293 -115157 -86816 -6641 5218 71863 51512 16258 -55647 -56200 -33267 -97788
9978 -97788 -101969 -4513 -16359 -17960 -81371 -76606 -58420 -71494 -55441 -19519 3609 -53081
9966 -53081 -68959 -66820 -5748 -52427 -58475 -36773 -39389 -27816 -22591 38131 9547 -24262 -37397
9953 -37397 -48043 -52481 -12996 -30142 9026 -38407 -79426 -36818 -2147 23455 62328 12155
9941 12155 36321 34939 -5569 -4091 14792 37938 20532 58483 72363 53927 65953 3729
9929 3729 -18785 -57255 -58387 -94059 -51109 19780 40329 20528 -14945 -32370 -19686 -48884
9917 -48884 -51729 62376 41399 13977 26612 6832 -56333 -10814 -15296 -43662 41573 2589
9905 2589 -1202 42270 -63002 -64718 -12050 -39422 -7283 -43950 -13186 24044 7609 48331
9893 48331 -14615 -75761 -13898 -19587 -50930 -8215 17041 9844 -45424 -29049 -30707 12703
9881 12703 1067 -53940 -7456 29137 59710 27221 24379 -19081 -21084 -46829 -73344 -91285
9869 -91285 -95705 -21655 -33278 -19858 -38053 -40661 -104447 -65483 21668 27034 -44751 -54698 -46359
9856 -46359 -33123 -61405 -99995 -65975 -56048 -60837 -39084 -71108 -89355 -76497 -32944 -46236
9844 -46236 -76485 -42233 -50153 -86040 -109502 -49669 -64246 -51878 12332 4891 -14060 65278
9832 65278 68773 -12162 -3669 -23293 -6386 -26601 -82770 -52539 -19874 -16883 -42884 -47706 -27722
9819 -27722 21611 16191 -94590 -123312 -74304 -45412 -4345 76783 56550 -10503 -3496 28641
9807 28641 30220 54343 19351 41558 58419 7110 16274 53096 45992 -9300 -32046 8539
9795 8539 -6391 14884 4703 12281 68270 31414 -25907 22957 65302 68698 78844 56239
9783 56239 43591 104672 79264 89003 86071 100656 81785 -1102 47535 64342 47004 -37693
9771 -37693 -44860 -56411 27269 86070 63534 106801 108558 73954 120230 126932 56504 -20131
9759 -20131 -20655 -16725 50199 54028 -14249 8462 21352 58340 112361 105591 106730 102717 43601
9746 43601 69441 12769 -25510 -46736 -28970 55726 117252 125138 52032 78603 76616 65846
9734 65846 22811 4526 -76807 -76028 -37135 -17460 16196 25163 16568 -31351 -35208 42796 79570
9721 79570 19160 41235 28420 44398 61072 44590 21448 117337 97259 49919 157122 141173
9709 141173 148703 114805 113554 140257 103035 92900 127712 126801 123576 133846 80468 68275 108095
9696 108095 74011 115042 193048 207859 219076 273577 238963 255296 232501 165083 202753 249607
9684 249607 325635 413448 522364 752371 918545 1074249 1291815 1461623 1642838 1820533
9674 1820533 1893134 1981430 1970541 1891594 1766352 1656676 1439522 1169892 964002 790394
9664 790394 667003 496932 511472 459757 437158 326642 293670 366792 379815 357326 339722
9653 339722 391758 415165 450093 475719 442936 463853 579409 708101 916690 1178849 1359947
9642 1359947 1607378 1874230 2004490 2112585 2213473 2202902 2121452 2024872 1856530 1593749
9632 1593749 1293658 1105105 960728 786233 689213 527954 421666 299800 259388 289079
9622 289079 340831 355579 334529 293501 236775 284754 253677 209289 153793 147032 180163 203634
9610 203634 155737 183753 176926 83923 130725 172328 196750 230017 247870 146603 83389 132043
9598 132043 117984 151675 125412 58604 31542 15464 33713 42003 -628 1442 -26078 -45624
9586 -45624 33845 53150 19847 19624 48817 37775 17640 -40905 -7735 -20828 -31979 -2530
9574 -2530 24260 73296 73645 65588 44652 24183 91714 154708 124759 129797 83129 -32686 -12022
9561 -12022 58569 50848 50355 -1154 60716 -16890 -293 39323 -3988 56676 34359 5295
9549 5295 -90778 -19733 28322 57057 66012 32636 -18024 16387 58832 38341 17041 84303
9537 84303 101563 50679 92651 92979 87945 42641 -9289 125594 68309 61918 40015 -8642
9525 -8642 7154 18335 31872 20192 61289 53524 39305 -41666 -33998 -53030 3403 57777
9513 57777 9398 58278 32442 -64113 -61682 -29044 -32520 -25774 55131 81612 47258 16981
9501 16981 78992 88174 11860 14994 42671 38184 63534 18851 14599 29079 46080 13134 82432
9488 82432 106817 83956 66222 66571 -13278 -55021 4665 -10261 21265 16445 -24406 21259
9476 21259 74872 41318 -5182 34652 61387 -3132 -20894 41247 17685 28194 61964 61734
9464 61734 30217 27911 36047 49326 31731 23689 40720 66979 50018 58825 124137 119338 48867
9451 48867 12231 32953 44637 78989 135456 117106 99740 66675 121120 128646 59113 74537
9439 74537 100531 133816 169663 174158 119497 165393 181235 189748 196306 171371 196762 245350
9427 245350 274188 218326 252911 360991 419751 564161 750372 927923 1124754 1301286
9417 1301286 1550150 1597594 1466532 1337958 1147447 946782 847445 984184 1090080 1265216
9407 1265216 1408711 1581660 1708822 1622360 1462249 1236321 1084984 977435 863623 786847
9397 786847 685100 684225 645836 603527 511097 506489 488850 449170 361595 460544 478224 429900
9385 429900 508655 600756 617685 612629 699435 962420 1260939 1418664 1581989 1656350 1575002
9374 1575002 1416244 1223745 1079445 1015349 999591 1050665 1178778 1383379 1643273 1724065
9364 1724065 1597469 1474486 1313429 1068750 845590 731043 633169 506395 459668 416557
9354 416557 328103 346239 345180 314875 310227 326006 344390 375673 293096 209674 208097 232621
9342 232621 287124 269721 175390 140135 182709 223623 190093 231166 256204 197534 182135 205314
9330 205314 204840 226945 241851 240239 267572 290683 290063 265306 267344 278101 271340 267142 226125
9317 226125 233072 239734 292220 245231 178614 175349 282663 346285 298666 315134 373952 354799
9305 354799 315045 258255 241231 230268 252229 235482 257580 262332 228982 335417 422051 448505
9293 448505 529137 636350 678546 790293 866747 785083 722754 677925 609056 548293 580019
9282 580019 563482 564684 506185 481803 497238 489723 574751 567896 653281 730339 780209 877126
9270 877126 939400 874113 889509 871081 849942 783430 636803 547171 543706 563600 595448 536871
9258 536871 551996 589864 636549 701624 757962 838254 959726 1055930 1084650 1096538 1116464
9247 1116464 1026944 948590 895668 852086 791442 737150 729180 714830 711761 765960 825187 835904
9235 835904 964341 1108992 1281708 1470043 1660461 1822075 1858741 1883163 1870944 1767709
9225 1767709 1788350 1724760 1648484 1630938 1658696 1702216 1831271 1797451 1667829 1491375 1341063
9214 1341063 1286127 1256340 1147183 990217 968029 1054579 1061475 989998 955796 1016497 1011223
9203 1011223 1005983 998911 926880 973471 1031959 1026265 1114635 1293400 1422840 1537227 1564387
9192 1564387 1605811 1774537 2087619 2347567 2631293 2869836 2884257 2853193 2756206 2743078
9182 2743078 2688378 2589711 2486025 2334323 2168244 2061574 2017029 2001310 1886743 1806974
9172 1806974 1706212 1626455 1533366 1424052 1372970 1338024 1349315 1314340 1392350 1480259 1488409
9161 1488409 1497344 1670424 1902788 2259782 2461445 2596210 2602976 2646975 2762342 2749191 2756675
9150 2756675 2695202 2562862 2324549 2046100 1878744 1838316 1842717 1870212 1978738 2129674
9140 2129674 2336110 2590396 2845349 3063301 3230994 3413697 3604827 3673220 3742701 3768393
9130 3768393 3734679 3629854 3452259 3178379 2788459 2394862 2198498 2031775 1819909 1643665
9120 1643665 1565304 1465786 1449279 1443241 1375455 1335506 1306349 1320195 1383711 1356242 1325743 1324106
9108 1324106 1378293 1394403 1392772 1480670 1505816 1595804 1780245 1966981 2153109 2243442 2301494
9097 2301494 2333398 2391956 2374731 2263254 2236266 2180907 2152466 2145032 2142143 2156923 2272515
9086 2272515 2351845 2411528 2435461 2351813 2329427 2229402 2080333 1986117 1949413 1929354 1871514
9075 1871514 1803180 1770291 1850050 1859840 1859757 1907592 2008068 2115277 2195736 2411857 2585446
9064 2585446 2617854 2591724 2482366 2402768 2315625 2273534 2241898 2258658 2163291 2192602 2284814
9053 2284814 2343162 2393732 2393073 2472072 2685844 2954824 3232721 3454250 3677802 3906143 4022649
9042 4022649 3969686 3843943 3624097 3454129 3308672 3219122 3103174 3028440 3024931 2976950 2994104
9031 2994104 2986391 3005173 3201938 3462024 3703146 3952784 4145455 4165057 4181483 4110028 3908790
9020 3908790 3686894 3518847 3399286 3355015 3332171 3351458 3374621 3432405 3516955 3637996 3760313
9009 3760313 3778597 3837456 3878953 3899974 3963655 4007633 3993115 4048569 4204077 4479042 4768905
8998 4768905 5027438 5374871 5576473 5555483 5495647 5525630 5629047 5707911 5737023 5698075 5557522
8987 5557522 5424512 5330601 5217475 5146111 5166698 5271639 5359636 5386987 5499864 5603018
8977 5603018 5737074 5929620 6047091 6192230 6344427 6568304 6739521 7027561 7386020 7687682
8967 7687682 7995692 8278582 8512314 8822688 9078714 9568232 10088045 10572460 11015390 11280447
8957 11280447 11529958 11739514 12018653 12300738 12461934 12661187 12806177 13092732 13563940
8948 13563940 14118654 14710443 15231741 15874808 16500675 17228129 18193889 19194006 20540072
8939 20540072 22259456 24292369 27038775 30857693 36543938 45287919 57939820 73823284
8931 73823284 90391122 105023956 114573394 118731427 120246802 118808336 112708738 103944964
8923 103944964 92364370 78742070 67020487 58611070 53078879 49905570 48783537 49714831
8915 49714831 53524867 61487457 73885638 88725347 103084522 113651048 116764192 112246763
8907 112246763 102374194 89697409 77373485 67053749 59139857 53371832 49357169 46838307
8899 46838307 45649067 45705049 47248776 50619450 56703541 66946601 82441585 101996027
8891 101996027 122485203 139937205 149116150 147705521 137811313 122397001 105730067
8884 105730067 91378329 80366501 72419636 67002916 63688675 62379723 62986611 65580487
8876 65580487 70775153 79858609 94445038 115129228 139980483 167002288 192514744
8869 192514744 211684310 222186801 223578806 215502253 199605417 179740661 158882284
8862 158882284 140120169 126085607 118556376 118423084 125320729 136434023 147598459 154754540
8854 154754540 154067495 145227610 130848802 113977428 97647617 83746639 72505494
8847 72505494 63561221 56321542 50542709 45955389 42348017 39772349 37895842 36543983
8839 36543983 35672996 35099515 34866911 34911709 35277861 35949590 36901446 38257603 40371481
8830 40371481 43323247 47951504 55148600 66093368 80993467 97936343 114132525 125863416
8822 125863416 129808407 126024549 117029234 106142042 96941996 92021761 92853167 99822693
8814 99822693 111499706 124443055 134754674 138310722 133294043 121370328 105445187
8807 105445187 88899264 74293928 62405215 52934632 45465794 39335250 34454081 30524553
8799 30524553 27382937 25001986 23037064 21570338 20308202 19182586 18185217 17343145
8791 17343145 16501415 15764983 15115337 14554531 14069502 13709364 13415605 13191649 13134312 13100357
8781 13100357 13285855 13534701 13721525 13707444 13587536 13250578 12720460 12224946 11606710 11059882
8771 11059882 10636094 10160170 9755049 9598658 9380638 9275555 9232317 9263707 9438378 9736277
8761 9736277 10005193 10325127 10600910 10820544 10811916 10613069 10353127 9942808 9587517 9369095
8751 9369095 9192411 9135663 9156867 9350302 9489266 9721768 9852969 9903151 10075410 10453112
8741 10453112 10874386 11441780 12020435 12393975 12478688 12296005 11940400 11441559 10917795 10424477
8731 10424477 10077759 9963455 9885170 9927212 10111951 10248629 10334391 10396553 10514914 10866360
8721 10866360 11315465 11877899 12459758 12699204 12720012 12502960 12124525 11634370 11204094 10877573
8711 10877573 10737684 10753145 10971265 11324355 11617372 11743145 11707859 11572530 11332799 11109997
8701 11109997 10972858 10825782 10732919 10842994 11058420 11233229 11484936 11923427 12444521 13118083
8691 13118083 14042287 15127888 16418112 17792720 19349428 20774039 22331461 24264077
8683 24264077 26978745 31232273 38135686 48288590 60642740 71969314 78933047 80022465
8675 80022465 75464966 67303308 59005963 52699005 49120401 48843493 52406016 59360059
8667 59360059 67537421 73808313 75818110 72665038 65202199 56023938 47612168 40798589
8659 40798589 35691965 32017534 29320163 27352149 26011457 25220005 24879327 24846006 25086672
8650 25086672 25571525 26276087 27190668 28458779 30113251 32257494 34947284 38576729 43895755
8641 43895755 51882231 63367193 78273173 95076654 111490212 123999477 129369158
8634 129369158 127139888 118846617 107180793 95871552 88217546 85885455 89150228 96767557
8626 96767557 106324713 114751016 118756169 116262156 107942265 95469173 81311171 68096435
8618 68096435 57255775 48782917 42416914 37643707 34023289 31388599 29380109 27934465
8610 27934465 26952830 26173420 25567777 25174618 25141223 25464877 26104261 26937601 28121305
8601 28121305 29789131 32518058 36850138 43484228 52221726 61211960 67615991 69789101
8593 69789101 67229126 61195422 53970161 47891426 43731266 42042242 43141045 47200936
8585 47200936 52955144 58080361 60312216 58642331 52983691 45844394 38815586 32053428
8577 32053428 27044651 23215182 20280544 17987529 16336965 14935297 13939343 13076396
8569 13076396 12339976 11711817 11117193 10665551 10366387 10118489 9992814 9989258 9897345 9833038
8559 9833038 9756002 9613260 9438251 9206735 8851937 8469185 8118054 7686573 7329969 7108965
8549 7108965 6830329 6524865 6259398 6096445 6047365 6025188 5992342 5848364 5641872 5423692
8539 5423692 5257813 4998218 4758416 4492506 4255318 3991608 3700987 3539509 3474292 3284423
8529 3284423 3180220 3056977 2943758 2916319 2956769 2888986 2863343 2876875 2833949 2821195 2850992
8518 2850992 2713782 2652439 2583533 2423526 2367829 2322821 2225168 2176851 2153643 2125514 2082098
8507 2082098 2040629 2071906 2137177 2250205 2288987 2362456 2454295 2563828 2512417 2448560 2407224
8496 2407224 2350657 2224458 2197406 2074828 1971746 1970847 1960933 1974338 1979208 2000538 1942560 1784603
8484 1784603 1689923 1597708 1608423 1550911 1541260 1466368 1366105 1256990 1242489 1198973 1198598 1194642
8472 1194642 1116821 1093016 1101320 1091008 1106378 1065998 1090859 1117923 1136827 1176018 1149348 1200050
8460 1200050 1252850 1255442 1352066 1430721 1509324 1513410 1444214 1454067 1336922 1250200 1347866 1372551
8448 1372551 1375273 1475775 1474418 1468121 1501761 1466957 1317330 1208892 1114769 1052042 983893
8437 983893 945749 885109 815057 753940 762846 697971 591100 624259 660352 653651 708355 687272
8425 687272 608148 564863 539427 520382 585902 518773 524337 535105 545026 495322 432697 411683
8413 411683 425387 474211 432385 401743 470696 433183 446905 475646 445865 422536 402208 429972
8401 429972 392427 351750 437398 437528 433123 390069 388093 436107 420066 374173 317863 366470
8389 366470 374382 354879 348721 363363 295246 228341 315212 344617 273776 289603 267135 250162
8377 250162 252392 273809 328692 380784 316225 277187 275272 350704 359251 349205 320403 303333
8365 303333 320498 284453 251318 245799 289712 253475 319511 346847 349483 343842 320983 323818
8353 323818 311534 347311 343256 312200 301268 302046 351564 282667 256125 325856 302065 212842
8341 212842 208759 242113 181030 188641 220718 312823 260471 196843 281732 295982 335294 342637
8329 342637 270758 209913 245333 268258 204204 221849 170289 193033 205970 208648 216206 230373
8317 230373 266777 295643 279876 276811 265361 298923 394946 473147 447819 514766 538954 420039
8305 420039 373219 390625 403916 363959 339569 432346 527446 540720 523367 456504 399103 389200
8293 389200 313951 314495 266508 311791 366398 234513 156177 166946 265210 299440 252640 236444
8281 236444 337258 316985 325070 303744 294412 273096 292878 318916 410079 532617 590146 661037
8269 661037 727249 753598 746316 754992 712646 633472 563754 573480 624124 655703 667040 702311
8257 702311 754848 774712 687893 659663 636948 610863 489452 433843 389816 313908 265404
8246 265404 244684 285802 227472 257604 232666 136332 180246 218426 254061 200409 200205 193159
8234 193159 239749 299598 337123 396198 399187 471955 485621 502941 503084 514801 441682 404663
8222 404663 387832 345458 226366 330788 382196 368827 388949 434388 405108 408325 299340
8211 299340 315345 273866 179057 200818 199143 132064 63795 111860 180326 174531 165537 111789
8199 111789 218172 98974 100598 251166 234217 348316 646718 508072 -193809 -206181
8189 -206181 -166765 -138476 -105227 21225 -45405 -99934 -45878 68664 4956 13416 80435
8178 80435 15388 -43881 16516 65573 24539 25123 33923 47987 71468 55085 50330 44735 -35561
8165 -35561 55148 26233 -43180 13500 -15663 -25023 -20730 -130 36649 26377 64883 91331
8153 91331 103144 -26656 -33233 -34786 -22134 56545 32792 -1053 -16003 -23571 -16133 -37944
8141 -37944 16227 35064 49811 5342 23037 58675 93572 88673 65555 109052 63337 13322
8129 13322 19919 55036 79048 46748 -15892 -18762 -47253 -50370 -11059 -103555 -85267 -4233
8117 -4233 26171 30430 15974 19639 -39197 -76443 -92369 -81920 20419 20753 18532 -16562 -79327
8104 -79327 -6277 -24395 4236 -15343 -27170 -55668 -45866 -12920 25187 39486 50090 -50989
8092 -50989 -67279 -33093 9250 10983 6397 -36085 -29067 -2377 -40398 -4068 25548 37197
8080 37197 28623 -31403 17205 67372 117316 90971 113865 105316 21874 -66241 -122420 -26553
8068 -26553 29230 -25412 -116435 -67268 -12396 -9152 -19495 -4612 70215 35884 -20149 20407
8056 20407 79609 51022 9173 14265 -30306 5091 -25258 -23210 6157 -11966 2438 -30843
8044 -30843 -42171 -52910 -37599 -6704 -30873 -9443 -35571 -10504 -59808 -58012 -38341 13312
8032 13312 -9993 -40128 -65257 -67277 -92935 -16031 14403 -6634 -20202 -20517 -25548 32409 56675
8019 56675 76186 79827 25391 17076 39144 14096 53331 -6863 -55840 -9021 -55459 -13456
8007 -13456 -8498 -44959 -103408 -38196 34266 17599 -17708 29744 -9217 -40609 56467 93828
7995 93828 78903 58590 -89725 -124410 -59156 -72757 -67561 -34853 -858 8850 -11319 -4289
7983 -4289 -38598 -92876 -97050 -102876 -74513 -74121 -54446 -16937 -12176 -32610 41532 15384 2622
7970 2622 32642 34667 -18230 -25870 -34959 -82643 -49694 -54348 4012 -44893 -34883 -58566 -47957
7957 -47957 -39013 -15351 46836 15475 -63322 -66869 14947 -6489 -28395 31782 -4152 25346
7945 25346 -46800 -71414 -76978 -103925 -15087 30514 -70495 -131463 -35584 812 -20823 -40469
7933 -40469 -27418 -75706 -82587 -83783 -103750 -104178 -103755 -93959 -23387 1124 10377 27028 -38127
7920 -38127 -49992 -31523 55428 48290 34692 61316 27425 -9935 -40434 18956 53081 30355
7908 30355 20592 24822 103283 108364 83999 23087 32194 5709 -71543 -60094 18879 26557 11870
7895 11870 -3129 -23956 51386 14329 -31816 -38590 -23615 -35210 -36415 -30215 5829 -45843
7883 -45843 -54595 -30064 -87547 -25168 -24314 6099 28417 10645 -73149 -23779 45871 70269
7871 70269 -2208 -36365 57022 -8235 -142902 -150044 -96809 -76171 5229 -44348 -77274 -31385
7859 -31385 1942 -5547 -39960 -143256 -119987 -68862 -20675 -8328 -17125 -67609 -40223 -37199
7847 -37199 -23279 -30713 -31188 -10440 -7935 -68781 -77110 -54478 -19216 -21757 9002 15342 40087
7834 40087 44493 76910 -6657 -45789 11539 -28176 -52548 -41751 -73768 -90055 -28363 -28523
7822 -28523 -65723 -67639 -65137 -61942 -19211 11316 64962 50768 49361 -7652 -103717 -147663 -92332
7809 -92332 -104878 -82223 -107146 -130866 -401476 -271669 24270 -27076 7363 -5554 32596
7798 32596 391 50985 53681 812 -17865 -102426 -82272 -103144 -86662 -21735 -31172 -68396
7786 -68396 -107765 -127185 -37360 -73054 -83894 -89888 -148934 -141490 -90848 -5351 19897 -29861
7774 -29861 -29736 -57377 -83908 -65907 -87277 -97398 -79771 -6072 -7130 -35138 -18230 -36440
7762 -36440 -62770 -31351 79015 37807 -19179 -44322 -58562 -50946 -69936 -39936 37881 26787
7750 26787 -14828 26881 -6780 56972 -36895 -26845 -66684 -64997 -11524 -6445 12481 -33502
7738 -33502 -17199 7604 -25160 -29552 2433 -39676 3546 4902 14327 16601 65190 12294 21476
7725 21476 25321 18088 20800 -10679 -39555 -14011 34863 9919 -10891 -16484 -15267 -11407 -82793
7712 -82793 -79889 -49543 -36497 36012 35427 -4669 -33272 -62242 -17140 -27721 -59942 -23001
7700 -23001 -23079 -75584 -178141 -159067 -125981 -59147 -45910 -17180 30655 -34442 -18645 47750
7688 47750 50128 -6110 -103644 -108645 -53724 -18434 -33618 -70374 -30581 -41638 -75239 8199
7676 8199 -55272 -70697 -70064 -63555 -42196 -3617 -78769 -119765 -62967 -45733 -41628 -72564 -73614
7663 -73614 -46552 -24983 -37862 -12338 28810 -38801 -31253 -22988 -45194 -86639 -84641 -17760
7651 -17760 -27251 -32457 -61297 -48675 -56189 -28102 -15255 24632 51575 70763 80804 19661
7639 19661 -14384 -71744 -50560 -93900 -52444 -39908 -45456 -64110 -130643 -46214 20093 -6055
7627 -6055 -35730 -72670 -77307 -28839 -51520 -53801 -53756 14060 5765 -52911 -15923 -15241 -24593 -42072
7613 -42072 -119605 -113743 -124121 -109745 -108396 -86436 -74780 -59329 -74687 -33019 -91347 -81116
7601 -81116 -15323 -50215 -95199 -53483 -59353 -47735 -10411 10331 21808 -7054 -26874 -32224
7589 -32224 -11322 -53715 -78984 -7927 82617 82741 52164 -57316 -89524 -51744 -49625 -4394
7577 -4394 -41030 -49221 -4995 -24455 11794 -50701 -57094 22725 -56247 -22506 18054 56151
7565 56151 70979 49215 34601 -36795 -86153 -74049 -53078 -94960 -81930 -95883 -83647 -50406
7553 -50406 12355 -29398 -96542 -57339 -34945 -2545 13896 -23213 53476 13388 -3553 -28317
7541 -28317 -8645 -22262 -15137 19172 36260 -43970 -43055 21283 72193 146636 78601 -963
7529 -963 -47170 -12198 -17811 -2410 -27837 -33103 47226 52423 89160 27122 -35680 -7259 -26127
7516 -26127 -45513 -95464 -105193 -116083 -103375 -41 15925 -11662 -21431 -20934 29828 -36310
7504 -36310 -75918 -42184 -81836 -16790 -8223 -28200 6528 -21864 5856 -15570 -56042 -83428
7492 -83428 -61181 -109059 2545 1426 909 40727 2704 -13832 -9693 62333 21988 15003 115478
7479 115478 70831 -16722 -7011 -27051 -117151 -107643 -75739 -8941 -6623 -60629 27987 43343
7467 43343 23457 28280 16596 22182 -58922 6487 16714 -14436 27447 -83346 -67408 -12500
7455 -12500 68894 47535 11214 29003 1374 4426 -11335 -108730 -59660 -32645 -85187 -79478
7443 -79478 -29134 -16618 -31698 13945 33366 -28633 -45889 -33434 -16597 -14585 2435 23205
7431 23205 18623 -23737 -70752 -84402 -80200 -82921 -46325 -46869 -74867 -72790 9304 -25998 -60983
7418 -60983 56739 125360 85389 14194 23405 1313 -23064 19570 2418 -1406 37417 -9583
7406 -9583 -16036 -49338 -21124 -50717 -88866 -53606 -13408 -67598 -3047 7852 -25218 -2943
7394 -2943 -18173 8157 13411 6011 12998 -41425 -28926 -2431 -38715 -77450 -113116 -135123 -83390
7381 -83390 -19448 -23281 -71721 -78221 -32991 -11093 -19286 14194 23667 9217 -311 -75730 -102588
7368 -102588 -166338 -126571 -125767 -144571 -98420 -35332 -94814 -112678 -51975 -17007 -33602 -48023
7356 -48023 -84905 -79895 -37783 -65449 -99019 -44137 -33145 -41551 -19507 -56181 -59486 2891
7344 2891 3075 -26503 68025 40728 4900 -54043 -119782 -93860 -68573 -70783 -42286 -28269 -54896
7331 -54896 -76122 -27456 1142 -5842 -25036 -14122 -9725 -26887 -45050 -22102 -55523 -33144
7319 -33144 7416 -34340 -11785 -3661 5852 -7308 -72341 -32567 -18140 -26569 -17546 -27570 -34925
7306 -34925 -98584 -82946 -53898 9749 7441 42147 63716 13412 -37888 -48827 -63935 -100604
7294 -100604 -54626 -19578 -23042 -70081 -71361 -58097 -88188 -82555 -83845 -4674 34897 -33928
7282 -33928 -76924 -32755 -87253 -59924 2880 -29608 -68320 -111161 47325 135999 94871 31397
7270 31397 -6113 -2386 16917 11739 41071 5738 -34132 -42863 -45075 -45529 -101985 -61496 -84854
7257 -84854 -55593 -17287 36165 1884 11314 49452 12114 -8163 -2797 24321 13464 -22021
7245 -22021 -18634 -6269 -18333 25566 12080 -28008 -55559 -96242 -30754 -87265 -171921 -117195
7233 -117195 -27113 -445 -8381 -34615 28522 73658 98762 104227 10910 37391 26983 -31442
7221 -31442 -96253 16512 22174 -46631 -97365 -50642 -12615 -75497 -62070 12019 15737 3035
7209 3035 38500 16844 -27333 68434 113982 -12384 -18807 -4573 -57265 -4640 41130 32168
7197 32168 23942 28497 -64725 22128 12770 36997 -37269 -20685 -5609 1724 -15203 -38172 14696
7184 14696 -9028 14200 -8994 49736 21802 35349 8582 -47285 -88930 -45419 -29698 -29165
7172 -29165 34176 34031 972 15092 3826 17276 -33890 -2978 -76724 -78599 -71340 -25895 -78339
7159 -78339 -70900 -54397 -73614 14191 8913 -20377 -73545 -58389 -83564 -19796 -6055 -29461
7147 -29461 -29199 13456 51442 57633 6054 -35275 -13780 -20096 20196 -41236 -109955 -58877 -25605
7134 -25605 -36259 27768 128 -11122 -72363 -67826 -19402 -48264 -11445 -39208 -56205 9794
7122 9794 -1680 -5120 -51939 -74352 -30869 40745 18568 -59610 -3289 -15283 -15838 -22434 -43949
7109 -43949 -46639 30011 40145 -6215 -20067 -64998 -3894 30411 4807 -4044 -19683 15728
7097 15728 -17678 34046 22973 41423 19771 23593 51263 -10863 -5363 68014 88501 126715
7085 126715 83696 32835 10047 11030 -10311 -20571 37628 28096 54123 20104 42796 -59756
7073 -59756 -42301 -43064 -11903 1847 22870 42607 -2400 -16382 -26339 7021 -58208 -53763 -50297
7060 -50297 -88951 -168542 -175988 -106958 -6252 -6635 -41280 5521 65194 37926 -39622 -97216
7048 -97216 -118253 -18675 -28738 -43343 39243 -18040 -106903 -109896 -74307 -74837 -49467 15376
7036 15376 39916 21550 40461 50614 66241 40366 -46085 -82217 -61901 -27494 -44652 -22510
7024 -22510 -72565 -72056 -68782 -102081 -35638 -51462 -26271 10277 12368 47813 -9220 -41063 -80204
7011 -80204 -102588 -57538 -39594 -45645 -12550 13750 -29661 -65655 2063 27856 40087 92373
6999 92373 -5978 -22014 -54242 -6961 40411 7928 -18829 -30483 -21645 -22368 -25964 -41891 -15227
6986 -15227 -91841 -87141 -59937 -4055 32047 20440 85939 47489 47805 51204 39686 81630 36042
6973 36042 -24054 -20627 -1074 -42632 -36571 -51740 -57576 -9395 10455 49472 -18034 -3821
6961 -3821 43967 5295 -9867 -15598 -17268 41492 123110 134411 90896 82964 13541 46566 25150
6948 25150 -17152 16583 21614 13952 52183 81196 66269 -42165 -63956 3485 14823 22360
6936 22360 -4237 -13103 -67714 -71964 -16097 16065 -98342 -76198 -27343 -25586 13665 34938
6924 34938 13103 -1691 -8798 95220 59565 -26454 -15138 2767 -9832 9448 -30449 -1403
6912 -1403 -16143 29415 13121 -49078 -19499 -49122 45152 63657 39981 40516 13874 8862 28618
6899 28618 56022 41907 -24280 -46369 -7432 32052 35951 13565 -33131 -12601 2505 -19811
6887 -19811 -15712 -12934 34018 43205 3112 -61456 -89702 -24813 -13181 64863 11288 -30821
6875 -30821 -58515 -22506 32704 11423 -11116 -24831 -3909 -24213 -52754 -8687 1885 76988
6863 76988 94586 64772 28439 -35376 13508 5871 41886 47843 -42070 -54257 -55633 -21977
6851 -21977 -3030 18666 -9795 30259 41681 86404 70030 6816 50605 53543 15382 50845
6839 50845 17933 -42797 13937 22242 2441 -11670 -3547 -13947 -18585 -98306 -50312 -45445 -78048
6826 -78048 -74236 -56312 -20647 -18718 -35052 -52843 -122229 -95596 -67236 -52057 -5871 -9620
6814 -9620 44748 52107 22110 51071 -19330 32722 -205 -62674 -76283 -73255 -84238 -45158
6802 -45158 25225 -43209 -49236 27477 63130 140909 125005 2159 -4518 20075 85598 115826
6790 115826 39573 21425 23064 60458 44102 -60303 -26786 67702 90077 80733 -21155 -22889
6778 -22889 56520 71584 50940 71266 64014 1461 39785 35365 21468 6794 70340 22808
6766 22808 -6321 31407 64316 -2149 -9749 -36472 -1606 -6517 21115 49423 -12521 2247
6754 2247 -11306 71634 102585 14450 -21017 -39488 30325 65734 48247 14874 65212 48919
6742 48919 17903 59358 101847 97478 91508 80840 21896 41919 108397 92675 -15570 12008
6730 12008 26466 58648 142867 101080 17465 29799 63569 68764 47387 79244 89876 -8750
6718 -8750 28767 47110 34404 28457 35496 71620 20422 13401 67228 23157 -9323 51654 29892
6705 29892 -3605 23323 29247 118271 116663 72640 73592 58241 96452 95365 86977 105714 108943
6692 108943 70006 58294 95351 101215 111242 145663 144171 176636 128913 102004 116989 153302
6680 153302 166053 154536 93443 106791 102087 115018 117598 134757 97559 136969 120963 128047
6668 128047 135104 105822 70084 85592 121619 165675 142080 103133 100352 71498 46934 62311
6656 62311 156827 175449 57895 43182 96710 74727 153982 183727 181643 168465 140011 162793
6644 162793 138705 166004 189729 225993 197837 137750 173724 253293 233401 253271 263611 293141
6632 293141 285779 295826 323943 340538 391638 351761 377373 427363 521308 572671 674161 575784
6620 575784 602063 570922 494026 454711 507329 483074 500524 480647 422018 485981 514020 616579
6608 616579 699318 740643 741811 735982 609641 521247 467378 347664 385126 467003 513945 474183
6596 474183 438915 418284 416583 394202 402652 399069 385439 363723 411912 459636 471974 464233
6584 464233 527796 569204 607345 673698 767558 935267 1151410 1309543 1435923 1421092 1313338
6573 1313338 1210459 1087147 978550 931435 918208 922455 1047509 1117298 1230069 1414077
6563 1414077 1539866 1555168 1465635 1327502 1213077 1131353 1099703 1049613 972383 917499 1013153
6552 1013153 1105786 1090706 1108020 1124800 1061849 996039 930955 940399 917599 881543 930014 917729
6540 917729 905489 1036058 1053387 1130498 1159182 1106635 1035911 940305 858993 823736 732261
6529 732261 687370 716552 679260 617167 610289 615654 680567 685716 612981 581020 660823 671201
6517 671201 631307 664435 640819 618487 716145 788504 866761 973542 1136065 1333584 1496164
6506 1496164 1776348 2021960 2166640 2227046 2162349 1969553 1770604 1659714 1528127 1465940
6496 1465940 1492893 1617879 1790034 1952065 2122299 2181216 2175984 2126069 1983536 1754198
6486 1754198 1522165 1310545 1180292 1168314 1060489 957887 972538 938688 938887 856709 830771
6475 830771 894122 892978 875424 796557 764333 872649 870490 875532 839488 823336 848802 853363
6463 853363 805861 789834 807337 841221 839081 863426 914104 796213 794842 823950 902119 943649
6451 943649 900354 876172 894412 942211 953181 920195 900677 913707 872498 906353 851038 875796
6439 875796 867687 847074 927029 954647 968655 973079 989340 1013837 1011566 1014582 1051982 1055035 1073861
6426 1073861 1017542 1016221 1135739 1106909 1040850 1071230 1032740 1029734 1121831 1216545 1231543 1291106
6414 1291106 1304403 1317685 1369610 1398592 1427954 1463029 1414159 1395086 1368987 1384022 1442410
6403 1442410 1433565 1502398 1493060 1478126 1544522 1640658 1673205 1768048 1771414 1767900 1730670 1818301
6391 1818301 1783242 1743120 1799990 1859295 2005563 2077522 2126847 2251003 2349303 2427742 2579423
6380 2579423 2655907 2632324 2717815 2820895 2807992 2739677 2723823 2732814 2680239 2631479 2695811
6369 2695811 2821915 2835004 2889561 2959910 3006793 3079500 3219948 3366844 3487203 3528404 3735660
6358 3735660 3968602 4083069 4163024 4245930 4252127 4200471 4177001 4246296 4298327 4408024 4531600
6347 4531600 4618304 4659095 4850166 4959375 5135434 5311975 5494221 5645025 5778678 6021707
6337 6021707 6311309 6554372 6893771 7232491 7582847 8058693 8615235 9265353 9924892 10775199
6327 10775199 11618249 12651228 13859555 15195727 16871872 18943773 21389703 24829695
6319 24829695 29714558 36795990 46655553 58589000 70607007 79759127 83874259 82286376
6311 82286376 76190741 67937713 59835735 53403625 49060510 46966509 47336001 50778423
6303 50778423 57670280 67360592 77652269 85517623 88307203 85079642 76874749 66269998
6295 66269998 55563963 46326285 39006365 33251803 28706485 25083905 22258276 20035063
6287 20035063 18176618 16690400 15600921 14727339 14069424 13453490 12994279 12666221 12402824
6278 12402824 12150675 11915195 11743551 11695467 11706157 11808974 11964465 12117535 12362370 12697144
6268 12697144 13098015 13626384 14270897 14787764 15296704 15780073 16186616 16552474 17158847
6259 17158847 17833638 18724641 19887989 21243255 22827093 24715479 26942294 29595448
6251 29595448 32865528 36966303 42446567 50211303 61614255 77752380 98184268 120034638
6243 120034638 138444336 149006923 149621262 141167774 127399399 112485210 99529947
6236 99529947 90086732 84589540 83369005 87094063 96564703 111165581 127986979 142434130
6228 142434130 149763710 147494277 136367571 119668516 101399251 84523894 70420825
6221 70420825 59201102 50186795 42946694 37000058 32149656 28262619 25124772 22670116
6213 22670116 20679574 19046395 17746316 16649846 15692890 14852964 14070207 13378527 12822247
6204 12822247 12313595 11880492 11376271 11032589 10704020 10334933 10053282 9840358 9742317 9652437
6194 9652437 9562854 9540019 9459587 9204375 8877459 8612714 8272614 7980393 7677867 7412266
6184 7412266 7161763 6976057 6861499 6718186 6514807 6386805 6336380 6304297 6273097 6257518
6174 6257518 6281572 6320933 6408388 6537266 6756753 6791869 6709086 6492542 6357283 6188211
6164 6188211 6020805 5770034 5532026 5383557 5244595 5115938 5056627 5126561 5026084 4978310
6154 4978310 5074514 5037279 5046541 5002816 4929490 4917462 4917546 4902385 4870710 4881073 4863909 4784207
6142 4784207 4777149 4861669 4961119 4965260 5075666 5138537 5199290 5182327 5323896 5543772 5733177
6131 5733177 5950288 6051865 6189521 6231707 6237084 6225811 6185391 6106634 6106212 6088482 6141872
6120 6141872 6192629 6247746 6336381 6410835 6547014 6630340 6681587 6757921 6812382 6846115 6967503
6109 6967503 7138928 7272362 7425199 7555408 7764300 8019406 8339953 8675075 9010893 9473929
6099 9473929 9887542 10295459 10763987 11175299 11675436 12213776 12748426 13363853 14000033 14758109
6089 14758109 15504508 16179463 16883428 17698618 18610724 19662212 20959548 22532051 24494903
6080 24494903 26874999 29782121 33335877 37932106 44155556 53269036 66588754 84604675
6072 84604675 105664643 125383697 138697225 141995951 135206643 121372066 104855924
6065 104855924 89414587 76811387 67054063 59766071 54384495 50497298 47949055 46662440
6057 46662440 46389998 47157390 49173197 52862755 59180623 69459825 84928014 105091113
6049 105091113 126261982 142886172 150205340 146347266 133189557 115058850 96553819
6042 96553819 80423608 67519308 57396851 49364589 42917377 37712511 33397938 29986948
6034 29986948 27395351 25303153 23576596 22208950 21054466 20070367 19245780 18597034 18090534
6025 18090534 17752036 17589605 17552369 17586357 17814881 18064905 18396904 18741117 19132930 19609103
6015 19609103 20057984 20637295 21193691 21729819 22362164 23070757 23975478 25191441 26642109
6006 26642109 28487739 31259043 35404388 41725086 51039622 62924457 75200850 84570968
5998 84570968 88457252 86120276 78830625 69139833 59726750 51992367 46127122 41780170
5990 41780170 38652922 36434410 34919455 34041246 33881287 34281780 35317331 37153414 40250999
5981 40250999 45317939 53141186 64040007 76470076 87226583 93170251 92509002 85796458
5973 85796458 75304807 63884952 53557151 45064623 38494459 33223459 29064557 25688061
5965 25688061 22927410 20768444 19083300 17791237 16865207 16109319 15529563 14883002 14244703
5956 14244703 13709102 13005955 12387645 11845769 11345704 10936976 10699794 10461770 10234206
5947 10234206 10064003 9977696 9933874 9935449 9920573 9904508 9864932 9782477 9704325 9570821 9440082
5936 9440082 9282701 9148553 9059535 9016278 9004117 8809786 8570312 8288011 7915770 7558994
5926 7558994 7147433 6755180 6402229 6117657 5969743 5822984 5766997 5697113 5663194 5630923
5916 5630923 5650970 5631347 5470146 5287454 5060897 4869163 4572177 4286877 4046922 3825607
5906 3825607 3578150 3408138 3295012 3159409 3033811 2899539 2886535 2807509 2732338 2729592
5896 2729592 2731049 2751482 2698379 2707601 2728454 2738270 2812924 2871254 2904401 3024666 3115945 3258271
5884 3258271 3343927 3370541 3290173 3269556 3261834 3190012 3126955 3079844 2993095 2956046 2907657 2829688
5872 2829688 2831486 2800222 2615527 2458268 2334437 2230672 2117920 1957692 1871657 1713894
5862 1713894 1651928 1585035 1437086 1398287 1296912 1274335 1302231 1268712 1188659 1148329 1177533
5851 1177533 1092985 1116286 1138098 1114326 1082124 1093789 1057563 1015200 954503 946731 901177 948817
5839 948817 922526 884658 854622 804116 803213 860199 828393 784824 768218 820608 866942 853440
5827 853440 784819 763307 781874 808237 803793 826196 870119 835914 781652 710194 720399 711942
5815 711942 716831 678529 677168 618710 588728 550928 602751 621941 577760 588348 632409 537261
5803 537261 539024 689251 663666 579400 604882 585830 558153 472607 521245 536295 556801 570842
5791 570842 582917 521767 521905 552737 592697 547461 526338 508397 527116 525239 488870 546236
5779 546236 538455 581331 567795 543027 502590 563725 539583 569223 594681 578625 580227 575193
5767 575193 601273 570250 568085 623658 673811 707011 764006 808012 917752 1021212 1012921 994920
5755 994920 919789 880445 762422 743025 774109 779304 744587 748691 598943 511276 549007 564895
5743 564895 614816 589004 617715 704760 759425 828761 876607 886195 967443 1005774 959554 940701
5731 940701 854378 743486 706860 656158 690021 654394 581782 607901 549111 498423 458286
5720 458286 480210 489414 487940 469278 455370 457148 460717 502180 473345 466200 440882 481052 561623
5707 561623 533122 544791 583536 542739 525657 498839 497999 544695 539972 492199 429102 427351
5695 427351 483788 506595 464534 497956 541233 608007 685950 789500 838474 868175 949922
5684 949922 884532 790664 812173 810993 787814 676335 635889 658972 621982 606005 678755 718368
5672 718368 743304 811692 821937 878330 922132 1046415 1116571 1171522 1225293 1203026 1163880
5661 1163880 1144081 1149215 1093282 942247 903936 957329 978969 983383 1064460 1095476 1094688 1044366
5649 1044366 1031377 978776 934838 850650 847065 879354 904840 975365 961665 901243 913242 858367
5637 858367 849630 852641 773421 775470 817533 774153 786830 788586 743697 746062 703753 624501 485882
5624 485882 500641 517474 468348 419256 443262 422836 485148 551804 534579 517693 503616 483922
5612 483922 460489 445614 405185 397385 430596 402035 355502 418257 392231 388923 396119 409242
5600 409242 496019 454689 421757 445179 410881 359811 387696 413086 411209 393805 430378 373444
5588 373444 381693 343050 303340 288611 331020 405892 362476 431700 425216 351639 426458 411183
5576 411183 322302 300127 343522 342551 290975 316514 320679 343212 375603 368793 371287 437584 405389
5563 405389 395874 424599 459117 477537 413472 384879 444041 504964 474724 472490 525298 513563
5551 513563 514929 474072 413227 393460 373619 414742 423580 421465 381057 395012 386533 362374
5539 362374 379062 394664 389183 442545 446567 436497 357166 401858 470420 472178 511384 457393
5527 457393 429317 383323 436588 422900 431911 420123 410336 408342 395592 401974 357687 385415
5515 385415 418255 433389 461209 427922 431447 466008 502334 486194 511800 494705 539316 495380
5503 495380 533854 443093 482805 504363 403941 453124 420994 412559 418309 454319 434625 461409
5491 461409 456561 537328 504637 514916 518461 491266 490626 512780 540733 511426 447355 535575
5479 535575 525175 564414 534482 499369 486686 507038 574184 661234 660527 599241 657019 613027
5467 613027 567858 598863 555921 595189 661354 634621 640078 596426 642282 742533 763495 735840
5455 735840 665896 683732 682564 650407 700526 684268 767659 679697 629365 706586 802286 726637
5443 726637 704951 786263 805722 836222 820935 836764 831420 826381 845744 856664 954218 825227
5431 825227 814254 899767 873956 893297 902285 902817 946328 992236 1070142 1068550 1088230 1104462
5419 1104462 1095493 1163207 1167896 1130701 1171360 1223114 1272467 1214504 1252694 1331957 1277618 1280769
5407 1280769 1284721 1266838 1278222 1381470 1426599 1477816 1534267 1591486 1637191 1697559 1731038
5396 1731038 1768684 1821962 1795672 1789315 1777413 1817360 1869980 1984584 2036285 2102472 2255586
5385 2255586 2379472 2487278 2561733 2580206 2552995 2603273 2616959 2758503 2790859 2833434 2847398
5374 2847398 2923463 3007057 3103239 3114390 3112568 3123629 3109235 3191367 3252829 3292698 3365077 3373080
5362 3373080 3382576 3406358 3377007 3391517 3447514 3488157 3513929 3615326 3651819 3602702 3620099
5351 3620099 3580099 3524760 3557847 3627206 3605336 3605281 3659699 3745329 3789456 3787522 3795232 3691071
5339 3691071 3620021 3526242 3503143 3528590 3592119 3639598 3650220 3749861 3861438 3950843 3955005
5328 3955005 3982838 3968296 4041310 4094112 4155074 4187014 4288310 4431342 4571150 4591606 4666591
5317 4666591 4843951 5006466 5170063 5270430 5353398 5608845 5791933 5849278 6109779 6324697
5307 6324697 6463790 6686346 6946961 7146305 7571533 7928596 8338514 8741007 9163700 9621803
5297 9621803 10199690 10875626 11638993 12502337 13538134 14887569 16661494 19140999 22663357
5288 22663357 27424088 32693650 36983678 39570923 40170476 39015405 37194332 35818894
5280 35818894 35436151 36170012 38511106 42922414 49494681 57675325 66293361 74022315
5272 74022315 79366395 82667865 84661660 85631612 85802743 85689894 85839128 86544678 87757812
5263 87757812 89723330 92341292 94627464 96313959 98051205 100311457 103205264 107025126
5255 107025126 111671414 115944380 118978014 120050428 118869208 115724238 111380631 107533449
5247 107533449 105088015 103360684 102043710 100946743 98914910 95739959 92308468 89251151
5239 89251151 86796222 85177342 84580869 85148183 86412792 87504215 87759557 85897461 80940836
5230 80940836 73614836 64973274 56476122 49208206 43654758 39771654 37580860 37041241
5222 37041241 38261391 40425962 42123868 42326037 40486749 36686641 32010745 27643216
5214 27643216 23932443 20989049 18607374 16562307 14970615 13718657 12606322 11821067
5206 11821067 11116439 10465099 9982639 9519899 9127265 8713608 8473357 8095986 7843206
5197 7843206 7536676 7241789 6981899 6745425 6507036 6348303 6176080 6054941 5874194 5646744
5187 5646744 5475210 5314210 5197467 5145341 5028095 4888903 4795012 4620777 4510602 4406059
5177 4406059 4321591 4282088 4130114 4012253 3968649 3848001 3818536 3723568 3643006 3555464 3575065
5166 3575065 3551930 3513057 3465000 3442415 3393283 3381660 3292863 3236986 3207231 3230938 3276463
5155 3276463 3291613 3239331 3142161 3167807 3222722 3239493 3283446 3266321 3320025 3372494 3438292
5144 3438292 3519753 3626428 3682752 3845913 4079159 4323282 4677249 4981073 5118758 5132540
5134 5132540 5101874 4868041 4622695 4416244 4335367 4293847 4219578 4269749 4379691 4594285
5124 4594285 4916067 5279700 5662556 6045048 6228563 6138123 5930829 5736779 5456721 5140788
5114 5140788 4888901 4781450 4639769 4505620 4332290 4244494 4103460 3938297 3855481 3834881
5104 3834881 3891601 3829752 3781583 3796824 3776275 3803905 3936594 4022647 4125287 4273523 4453368
5093 4453368 4660488 4816077 4937478 5218464 5543141 5958844 6436755 6965580 7565283 7912155
5083 7912155 8024757 7834810 7363402 6884821 6395219 6020545 5731130 5526328 5408776 5412722
5073 5412722 5535815 5910511 6401483 6902606 7324300 7531395 7485216 7063020 6452531 5965790
5063 5965790 5566933 5245851 4926897 4744628 4538602 4298168 4178767 4078923 3960739 3924979
5053 3924979 3891451 3812447 3681849 3588521 3566650 3555323 3522215 3527068 3535730 3511994 3530864 3467986
5041 3467986 3426369 3453763 3502784 3491258 3493348 3521597 3559385 3642180 3687873 3789859 3828400
5030 3828400 3792975 3788896 3748900 3717899 3728927 3816398 3841727 3892732 3905724 3977389 4028323 4096364
5018 4096364 4127179 4160527 4278137 4356344 4521685 4650524 4764791 4815309 4867298 4902008 4836329
5007 4836329 4797925 4760303 4888543 4951209 4968385 5044307 5075183 5086566 5063787 5187940 5276055
4996 5276055 5388148 5409797 5448715 5550330 5667214 5906376 6069883 6217431 6415945 6617811
4986 6617811 6838638 7076439 7215389 7365437 7593711 7751114 7908397 8044840 8239120 8549459
4976 8549459 8896986 9383707 9946325 10606115 11193730 11575814 11768476 11707263 11414143 11130899
4966 11130899 10935701 10670748 10492004 10300595 10077891 9985520 9949444 9977553 10006240 10149438
4956 10149438 10380779 10571292 10871243 11264963 11678417 12119656 12590144 13234673 13989593
4947 13989593 14636437 15194452 15585250 15615571 15472262 15182721 14852567 14616393 14501127 14382132
4937 14382132 14417370 14485797 14541687 14692222 14869610 15137657 15447854 15721912 15912498 16246327
4927 16246327 16578425 16916649 17289865 17749153 18285837 18951684 19712117 20435809 21293748
4918 21293748 22098784 22721264 23243033 23614488 23819162 23940046 24315991 24706753 25217045
4909 25217045 25817157 26452972 27269359 28142861 29119466 30131775 31431958 32818360 34388385
4900 34388385 36346903 38441884 40886130 43681724 46872293 50576196 55291076 61678851
4892 61678851 71076953 85446250 105694168 128219905 146071421 154459384 151883860 140052976
4884 140052976 124419681 110340229 99637273 92425687 88299333 86525273 86566096 88448321
4876 88448321 92522384 99591557 110801148 128239033 152637360 181031547 208971853
4869 208971853 234726010 256935830 272321575 278619307 275651134 263963904 246628668
4862 246628668 229645600 216793054 208678862 204265686 202149469 201394086 201423709 202578076
4854 202578076 205372805 210541907 219765003 234642328 254414652 273492882 285141157
4847 285141157 286165845 276328422 259626542 242694439 229859833 222535974 220428462 222710296
4839 222710296 228722715 238090506 250906620 267300466 287400019 310846057 336670374
4832 336670374 363094418 387389307 406742103 418937427 422963316 418716092 407124744
4825 407124744 389905589 368821971 345901927 323039455 301730582 283246905 268151541
4818 268151541 256508265 248048386 242352172 239162933 238287726 239763264 243982957 251406272
4810 251406272 262474022 277524276 296455797 318767195 343576824 369421725 394657103
4803 394657103 417075587 434103954 443454565 443578057 434247176 416798250 393558970 367241217
4795 367241217 340391778 314705639 291000383 269556880 250360809 233296047 218617913
4788 218617913 206402158 196749992 189575037 184707701 181946324 181087472 181706666 183117603
4780 183117603 184822534 186258876 187212263 187638329 187586796 186904566 185067306 181361406 175378373
4771 175378373 167113505 157020115 145905883 134825245 124180440 114221597 105139819
4764 105139819 96683801 88851434 81717627 75330391 69512217 64451337 60093708 56206568
4756 56206568 52781400 49919505 47332008 44966251 42867407 40964010 39237112 37764815
4748 37764815 36478636 35368366 34369448 33454583 32660763 31923446 31248576 30530332 29920243
4739 29920243 29280202 28701288 28150476 27664797 27170535 26716679 26210620 25668061 25077581
4730 25077581 24440561 23725148 23007819 22420297 21748531 21260958 20774073 20316173 20016559
4721 20016559 19789854 19618298 19461947 19254350 19032452 18876042 18654501 18405765 18110946
4712 18110946 17848194 17428442 17069615 16835270 16652171 16515362 16343885 16199164 16072979
4703 16072979 15855150 15623214 15397724 15155788 14897883 14651211 14353282 14113112 13867491
4694 13867491 13526985 13316996 13152018 12957296 12870676 12739251 12633179 12558977 12406405 12167610
4684 12167610 11818654 11470058 11129563 10943491 10810379 10810079 10918015 11063103 11147477 11269873
4674 11269873 11423022 11455008 11541523 11717389 11791475 11770802 11612581 11344839 10964810 10599825
4664 10599825 10283342 10003241 9858259 9904592 9957192 10027937 10144152 10120882 9949851 9789014
4654 9789014 9507638 9228125 9058004 8942902 9032034 9136835 9255720 9344716 9360453 9231123
4644 9231123 9095314 8972651 8832745 8782568 8857352 8982208 9212711 9482575 9595769 9672567
4634 9672567 9691996 9672587 9506259 9485786 9381641 9379559 9566716 9870162 10366376 11069558
4624 11069558 11776733 12354269 12727319 12753912 12504763 12182018 12039842 12022854 12007876 12164419
4614 12164419 12305625 12486020 12832349 13310788 13899469 14592934 15558272 16662581 17923191
4605 17923191 19412390 21083527 22773877 24457787 26100436 27656417 29268621 30976199
4597 30976199 33058387 35924877 40014003 46319865 56046578 71127885 91998753 115515093
4589 115515093 135439833 146495152 146367417 136626613 122257343 108782229 99403548 95209179
4581 95209179 97133387 105897629 121074249 138811708 152746347 158069254 153317763 140667320
4573 140667320 125521127 113564378 108046106 110778605 120944941 134139112 144156783
4566 144156783 146738830 140367093 126996034 111418051 97722079 88228443 83733551 84916289
4558 84916289 92464834 105264551 118994688 127965340 128435293 119866378 104779485 87900517
4550 87900517 72625240 60268598 50724205 43287368 37364896 32581211 28824249 25861757
4542 25861757 23590281 21814349 20350095 19244064 18296734 17401433 16557851 15819190 15168793
4533 15168793 14509332 13892929 13358255 12869205 12367066 11925096 11501216 11143845 10757939
4524 10757939 10430154 10209768 10046095 9800614 9546239 9384541 9215967 9131943 9071229 8895637
4514 8895637 8765508 8618029 8470678 8397580 8138652 7883141 7638140 7413802 7291790 7146670
4504 7146670 7004736 6910998 6713877 6510490 6315270 6132945 5930068 5758357 5658382 5532316
4494 5532316 5458208 5437426 5449098 5385380 5374688 5427497 5434427 5432069 5460560 5439216 5343977 5195437
4482 5195437 5017951 4850927 4712066 4632023 4544207 4462406 4343276 4181517 4126702 4135071 4069860
4471 4069860 4042976 4140946 4282427 4391619 4506954 4682928 4766011 4772529 4725486 4672433 4569912
4460 4569912 4489770 4593536 4610621 4679922 4788151 4844431 4937452 5293531 5939512 7014213
4450 7014213 8819767 11102574 13129977 14104060 13798689 12330859 10516790 8798195 7451658
4441 7451658 6506342 5766283 5187438 4742326 4481110 4239133 4034425 3839446 3767778 3684381
4431 3684381 3615115 3529339 3478051 3446284 3413540 3264960 3249777 3186605 3062691 3012865 3022324
4420 3022324 2925597 2902971 2985558 3030173 3033458 2983939 2995694 2950103 2898629 2815476 2890938 2889115
4408 2889115 2921838 3019244 3029114 3026875 3009366 3069575 3077304 3074398 2999543 2934141 2948649 2952248
4396 2952248 2911047 2962569 2954946 2973309 2934205 2887774 2896892 2992621 3049044 3164485 3313296
4385 3313296 3332563 3499092 3531052 3671628 3735504 3880258 3894148 3938190 4006462 4079160 4039135
4374 4039135 3997320 4022596 3925342 3908964 3877234 3880682 3845570 3815792 3843883 3833308 3926807 4046954
4362 4046954 4179750 4258903 4333871 4368743 4370457 4364006 4270065 4158018 4105019 4014986 3913754
4351 3913754 3830696 3748065 3630056 3613858 3661417 3694134 3728545 3750367 3753490 3881131 4017739
4340 4017739 4037978 4190472 4364929 4719627 5197547 5792107 6514604 7086597 7397828 7388677
4330 7388677 7098666 6692390 6268121 5934070 5761421 5766924 5953404 6308431 6788212 7216481
4320 7216481 7462333 7415313 7043092 6703444 6339902 6129390 6062883 6288578 6661175 7048018
4310 7048018 7255678 7208466 7068611 6747880 6404956 6084421 5845616 5808904 5846651 6013749
4300 6013749 6331332 6732261 7038501 7078323 6838525 6469073 6082788 5708158 5404525 5176853
4290 5176853 4991146 4819247 4739252 4691277 4657135 4626256 4554854 4548271 4623217 4669597 4724635
4279 4724635 4747787 4735924 4700047 4719695 4797819 4865074 4929204 5011406 5112564 5180953 5215073
4268 5215073 5317061 5402641 5433962 5513745 5553244 5605812 5706583 5816431 5924649 6009764 6074404
4257 6074404 6094414 6200727 6264666 6365956 6435799 6602854 6667014 6739117 6913586 6990820 7030874
4246 7030874 7160174 7257321 7342117 7434147 7617318 7789483 7884169 8032260 8235833 8426990
4236 8426990 8556885 8708924 8870593 9080815 9281517 9425704 9559744 9768745 10033817 10333851
4226 10333851 10589940 10851430 11111976 11450442 11736165 12056812 12433703 12886188 13338282
4217 13338282 13800494 14351669 14936419 15546580 16252275 17047040 17975474 19046899 20216696
4208 20216696 21575615 23077361 24674961 26538100 28409940 30213866 31956949 33610200
4200 33610200 35073477 36371124 37668528 38854270 39897812 40827126 41653648 42457210 43300594
4191 43300594 44336707 45852123 47819267 50381117 53486583 56959623 60344109 63354938
4183 63354938 65938529 67984343 69660724 71206256 72864316 74519346 76163921 77723058
4175 77723058 79199180 80491937 81770203 83339337 85115591 87149410 89462659 91627582
4167 91627582 93449877 94815134 95916864 97212382 99220338 102522024 107426299 113940981
4159 113940981 121209958 127908796 133088284 136012406 137075458 137119239 137135773 137723974 138994281
4150 138994281 140635038 142368087 144084332 145550149 146881707 148064075 149070323 149766776
4142 149766776 149914528 149447861 148538709 147257399 145922765 145007913 144914489 145949381 148777913
4133 148777913 153743040 160725492 169081859 177760303 185690946 192314708 197944024 203384814
4125 203384814 209178089 215139908 220714298 225359887 228824110 231378304 233348465 234627361
4117 234627361 234939672 234156590 232282039 229883692 227542113 225844008 225252769 225799452 227351318
4108 227351318 229537648 231758646 233579825 234699648 235143101 234859950 233959099 232650959
4100 232650959 231093453 229906973 229587579 230536230 232693949 235612644 238691512 241059000
4092 241059000 242104808 241658593 240286363 238522334 237170712 236091996 234617459 232219459
4084 232219459 228786356 224948465 221611221 218605566 215196312 210157733 202802829 193641236
4076 193641236 183823572 174509968 166699570 160967503 157235564 155249786 154752717 155140985
4068 155140985 155876411 156511737 156978514 157234321 157113976 156625987 155445119 153617146 151139980
4059 151139980 147995008 144511677 141388643 139094263 138048500 138235032 139271014 139929224
4051 139929224 139092929 135997487 130892223 124538251 118079664 112348345 107795746 104291777
4043 104291777 101540189 99174246 96829453 94339153 91706547 88925422 86154840 83637674
4035 83637674 81423111 79606093 77803298 76174701 74631690 73221038 71840869 70604859
4027 70604859 69541051 68281480 66835865 64917903 62393293 59335979 56017189 52808368
4019 52808368 49962012 47422007 45404463 43752218 42301162 40907532 39466849 38004805
4011 38004805 36589073 35288308 34170580 33108616 32088602 30996511 29745622 28418229
4003 28418229 26953872 25393892 23874935 22383187 21012624 19757205 18569403 17533685
3995 17533685 16567078 15727317 15024001 14342176 13737156 13139561 12636120 12183607 11673232
3986 11673232 11192580 10795164 10457723 10188948 9927403 9642907 9363259 9110713 8945790
3977 8945790 8762598 8486655 8177999 7945514 7852539 7654125 7438372 7333817 7214481 7052920
3967 7052920 6880810 6733416 6565151 6405552 6277404 6147925 6007888 5932874 5775069 5635951
3957 5635951 5565850 5485536 5369417 5285364 5221407 5167704 5098400 5033946 4905063 4769619 4725998
3946 4725998 4678951 4608946 4542464 4491045 4394776 4319271 4292857 4273291 4232901 4191400 4126240
3935 4126240 4077248 4125091 4000465 3923741 3876554 3895489 3844660 3791846 3740549 3677604 3668640
3924 3668640 3630754 3613822 3603985 3567866 3583067 3537685 3511090 3513301 3550539 3618407 3643071 3699697
3912 3699697 3708822 3752139 3776595 3838908 3926241 3988352 4040416 4103505 4230446 4392207 4520503
3901 4520503 4679661 4873258 5022780 5211621 5401286 5615688 5934708 6237069 6587714 6943964
3891 6943964 7244764 7460595 7677892 7936265 8054472 8085429 8096007 7947295 7656575 7353835
3881 7353835 6989993 6679862 6424996 6169008 5921269 5699048 5425604 5183166 4965013 4815923
3871 4815923 4613322 4422549 4266172 4156834 3985064 3839530 3709079 3561138 3537637 3457076
3861 3457076 3352574 3215607 3105998 3057303 2979671 2926637 2929422 2913634 2864206 2840580 2842421
3850 2842421 2862768 2874775 2798976 2815486 2822589 2840658 2791636 2641342 2657705 2598317 2485459
3839 2485459 2429809 2418858 2481074 2444136 2459844 2490386 2425938 2412149 2424240 2381354 2323748
3828 2323748 2270128 2263399 2208755 2270533 2421408 2363322 2277999 2286462 2248886 2251278 2235666 2225915
3816 2225915 2158518 2122361 2058340 2110321 2070489 1976141 2019510 2068029 2014683 1965500 2003652
3805 2003652 2025009 2116102 2117912 2128331 2201673 2121495 2138168 2092435 2042809 2051916 1988754 1919170
3793 1919170 1932815 1965025 1960702 1901774 1906362 1819758 1820808 1738846 1737534 1803125 1797144 1782614
3781 1782614 1782400 1858219 1864617 1893914 1906494 1903198 1856240 1885513 1873829 1829505 1786840 1726435
3769 1726435 1683906 1658759 1665275 1624524 1611506 1621625 1563877 1595762 1570607 1574057 1544038 1509975
3757 1509975 1464851 1436172 1455825 1535180 1554778 1583704 1563026 1543373 1545693 1565473 1560317 1585358
3745 1585358 1492956 1439643 1411774 1342652 1388076 1391368 1307896 1360681 1330154 1328255 1275984 1313313
3733 1313313 1374864 1281496 1298165 1262674 1234903 1219255 1229822 1238040 1313745 1283917 1242118 1320046
3721 1320046 1296408 1237451 1175738 1196279 1222657 1202901 1270811 1247518 1265333 1175773 1152562
3710 1152562 1182857 1201488 1265639 1232518 1272322 1231855 1256742 1264744 1242919 1263010 1258041 1239550
3698 1239550 1242609 1252026 1248124 1251925 1239033 1266329 1288924 1319588 1310017 1311102 1286871 1310105 1345948
3685 1345948 1378396 1430681 1474029 1512510 1455343 1426661 1432771 1520439 1565333 1577110 1624448 1591627
3673 1591627 1575596 1689882 1770645 1752805 1756322 1834565 1906533 1920525 1960423 1956665 1969968 2016671
3661 2016671 2103588 2107508 2145051 2196661 2181560 2217739 2319289 2399498 2389460 2413878 2587006
3650 2587006 2766487 2850415 2940274 3022475 3099896 3208077 3227471 3375862 3463277 3553630 3635866
3639 3635866 3698171 3759550 3776572 3827983 3841787 3931382 3950204 3968697 4099997 4101623 4112954
3628 4112954 4251149 4296989 4433018 4634854 4778427 4971051 5135515 5309557 5549414 5787268
3618 5787268 6054271 6250790 6510332 6752469 6962990 7171575 7358470 7583325 7826044 7971040
3608 7971040 8208864 8372277 8580683 8814534 8958598 9102608 9180528 9322081 9412365 9511628
3598 9511628 9714222 9973793 10271199 10546391 10945619 11375533 11850089 12376202 12970108 13539661
3588 13539661 14123055 14648311 15118612 15615903 16045630 16519719 17109374 17760112 18463798
3579 18463798 19381876 20469015 21771777 23353789 25214494 27388087 29771254 32250670
3571 32250670 34841920 37485277 40035538 42284220 44148940 45328847 45987164 45943719 45170185
3562 45170185 43804236 41866559 39585195 37258418 34850471 32738993 30819348 29072223
3554 29072223 27522510 25962725 24521122 23179101 21875865 20680345 19471141 18290766
3546 18290766 17136652 16033926 14988415 14052864 13216902 12426216 11707335 11024145 10328355
3537 10328355 9766028 9272188 8798272 8312593 7915806 7553078 7279246 7011543 6734707
3528 6734707 6484724 6209265 5954859 5692486 5467958 5244299 5073554 4852502 4684407 4510060
3518 4510060 4384201 4186317 4019092 3881177 3805652 3654015 3614546 3553077 3384211 3296797
3508 3296797 3191328 3074542 2991498 2985748 2956828 2843836 2796150 2658765 2560783 2437178 2295409
3497 2295409 2266180 2221949 2122962 2078847 2105480 2135813 1986535 1917594 1872381 1803374 1715424
3486 1715424 1648802 1603478 1594643 1528062 1533613 1558498 1539101 1447864 1396831 1348724 1318246 1343555
3474 1343555 1415959 1395198 1360212 1324614 1203887 1157317 1148767 1143821 1109064 1079527 1047313 1064859
3462 1064859 1043717 1014652 999514 1026649 971634 995834 1002419 1009572 981049 896133 843515 890043
3450 890043 877990 823806 825360 837047 764827 738032 748059 800827 781901 744592 732369 778994
3438 778994 768813 796710 751919 747595 771308 778348 779623 775501 800772 840925 780029 761908
3426 761908 731720 640668 714428 683836 725014 721549 659679 652137 629707 630784 648744 621267
3414 621267 707896 772136 724289 692369 647567 635947 679138 661936 663039 665760 622571 606997
3402 606997 620768 640384 717449 716545 585895 537507 567680 508459 503736 529506 522588 496481
3390 496481 540419 613708 617842 626536 613043 581657 558761 508982 566844 605335 565727 594259
3378 594259 581467 553804 599973 640839 605519 583111 622376 617259 571635 524084 540093 648356
3366 648356 628139 654502 655271 644321 651994 686336 631261 531563 581216 517349 527851 520213
3354 520213 500079 618051 651958 616553 610022 641299 580148 608004 633739 642488 626431 659952
3342 659952 686449 644517 690650 704775 660453 683331 764454 753774 775814 769360 761472 778757
3330 778757 782825 831679 796467 785797 793357 788277 857587 851302 873036 905060 905245 910165 889493
3317 889493 935278 963226 1012732 1063946 1029390 1038263 1180726 1212109 1253221 1283237 1247728 1314556
3305 1314556 1357185 1347967 1344222 1359170 1418065 1481280 1465304 1472713 1555313 1591610 1599587 1636465
3293 1636465 1644976 1635292 1701196 1759690 1747217 1799503 1848366 1925428 1965168 2072262 2139730 2220250
3281 2220250 2270130 2341282 2379678 2459643 2538024 2554245 2696638 2793896 2886352 3059403 3220583
3270 3220583 3386545 3562795 3790736 3971821 4249832 4523805 4804517 5207728 5492829 5949676
3260 5949676 6467316 7006164 7690870 8403275 9184899 10021328 10903954 11892265 12721507 13432459
3250 13432459 13926702 14125099 14074390 13898656 13788755 13714593 13618133 13564573 13591840 13553052
3240 13553052 13540320 13501272 13479692 13559418 13648234 13786776 14002002 14176784 14390830 14756180
3230 14756180 15126966 15713835 16703122 18248491 20442629 23805629 28036418 31739924 33958859
3221 33958859 34145742 32203578 29020892 25626774 22649987 20100829 17896236 16110466
3213 16110466 14784754 13772608 12861575 12172705 11583486 11126485 10726347 10439221 10224698
3204 10224698 10022002 9889991 9953090 10056921 10164682 10338935 10584982 10899552 11394144 11978190
3194 11978190 12606525 13145098 13505353 13601014 13416138 12744815 11803920 10887828 9953017 9036937
3184 9036937 8226520 7505275 6846569 6355273 5853195 5436041 5110431 4835528 4623197 4353510
3174 4353510 4062199 3836505 3636130 3434890 3199725 3046993 2844962 2642674 2547284 2444763
3164 2444763 2288650 2213150 2134630 2016708 1992158 1938562 1804592 1685723 1647410 1565237 1500816
3153 1500816 1534774 1417007 1338443 1314258 1248656 1197129 1147581 1168694 1087089 1012199 1016866
3142 1016866 990944 1042896 931613 885527 840606 839813 834408 793191 747187 704042 730215 697034
3130 697034 716807 694127 710546 717715 656328 561935 525472 575897 545939 527885 528397 552157
3118 552157 517482 503456 505320 526361 483322 425260 367690 357017 407627 469863 472187 439993
3106 439993 368544 323042 332116 312404 395275 340647 370450 370863 345014 250484 173594 272906
3094 272906 312484 265628 311046 293094 313205 297981 239159 149897 96434 121930 172464 180624
3082 180624 162264 272509 289823 245095 203577 161947 152412 194456 156471 143258 134277 100958
3070 100958 180563 185305 141607 127256 177765 223420 149251 153125 97589 130979 158863 102269
3058 102269 120331 166193 145632 68160 60616 123250 180917 153624 128116 69826 49346 21394
3046 21394 29778 74814 9664 38088 24688 85385 64989 -16382 58738 62004 -6812 39473
3034 39473 -6586 -4882 -7492 19983 68505 42689 83666 -2032 17660 23665 78031 116860
3022 116860 68594 25313 65068 27252 -9012 37409 12750 6930 26197 35603 -10184 -45241
3010 -45241 2723 13991 -23060 -79083 25661 -17402 -18880 20298 -26690 -51535 -1177 21167
2998 21167 42548 27643 30051 8525 28513 63575 63246 55526 -4996 27858 84373 -16039
2986 -16039 -14420 61612 -34772 -49350 13128 40415 7840 7738 11876 19078 -2489 40551 66801
2973 66801 13120 -14204 29717 111853 150481 127602 113108 49351 57766 30904 79075 71026
2961 71026 123274 119342 5544 -12707 -20518 -5429 32790 24382 47927 86526 109359 136782
2949 136782 75006 25079 26252 63092 78924 78096 104804 81185 146106 222577 225471 160736
2937 160736 114017 129648 70688 35186 62847 48704 15538 27672 5799 27123 1150 40392
2925 40392 51949 -12741 -98858 -50952 -22293 -35583 11347 21722 -3504 -22472 -51724 -94313
2913 -94313 -89326 -70956 -1403 34082 99233 102096 187573 158928 95733 82350 12367 -2765
2901 -2765 -26924 -56105 -76313 -66073 -31172 23432 59735 78085 55513 -281 -12721 -57292
2889 -57292 -6828 -48127 -76254 -50860 5871 -21679 -57658 -48366 -98634 -81297 -77035 -112787
2877 -112787 -65736 -87508 -36755 14984 -23532 -73350 -20107 -31576 -20361 11366 40760 -22280
2865 -22280 -78408 -40853 -58238 -21656 -46771 -66503 -40748 3475 22476 -26369 -105422 -52076
2853 -52076 -79691 13379 -43444 -76745 -144598 -113548 -13617 -35492 -94960 -97308 -78696 -72727
2841 -72727 -92039 -23575 1284 -15650 28359 41727 -87730 -74796 -59300 -67776 -129934 -87002
2829 -87002 -56501 -69966 -37659 -44971 -68944 -151697 -101513 -34217 -75464 -120958 -78903 -77076
2817 -77076 -50328 -72803 -67067 -83157 -107629 -90349 -116138 -115039 -123359 -129497 -60822 -42289 -32662
2804 -32662 -46166 -29059 -3968 -25736 -76373 -67896 -77966 -62881 -7249 20074 -72687 -76399
2792 -76399 -81993 -34353 -4373 -63480 -25491 -24084 -48656 -28882 -136316 -155344 -85063 -99793
2780 -99793 -120210 -76721 -39901 -47752 -52356 -6435 -27747 -78458 -95992 -103730 -97274 -78486 -74945
2767 -74945 -102189 -92117 -135938 -79650 -21153 6883 -52184 -100695 -62225 -77814 -75598 -39648
2755 -39648 -58705 -104217 -147818 -124719 -129890 -75940 -70383 -110838 -206805 -214775 -120311 -65141
2743 -65141 -48191 -56173 -70467 -66118 -91693 -153630 -77709 -63523 -72689 -66306 -81812 -102577 -89323
2730 -89323 -18025 -30626 -57093 -87622 -38929 -2828 -27936 85102 -4617 -31007 -75058 -65273
2718 -65273 -49797 -75020 -89564 -103315 -62545 -78662 -91589 -111523 -40562 -48567 -81615 -104151
2706 -104151 -113213 -89475 -11408 -18990 -73366 -57983 -84927 -113867 -119307 -1152 -49129 -26432
2694 -26432 90118 35117 146498 173326 112382 31441 72559 64116 6761 45135 4180 -63681
2682 -63681 -44591 33284 58875 54860 -7962 -45953 -99359 -76827 -32342 12703 18182 28734
2670 28734 -45391 -4410 -13468 -52946 -60188 -58062 -83583 -131578 -123535 -85339 -32849 -91783 -63142
2657 -63142 -64289 -105774 -56800 -28295 -17078 -32857 -75026 -41138 -36544 -56330 -92131 -93170
2645 -93170 -91341 -33662 -3723 -32370 -37664 -9557 9263 -14636 12585 -33903 -50766 -50390 -101323
2632 -101323 -61591 -83399 -99829 -49824 -94113 -174551 -109503 -24399 -41767 -75461 -52073 -61173
2620 -61173 -22096 -79166 -74857 -73818 -116014 -105880 -73189 -28873 -2971 -31225 -36564 -4374
2608 -4374 -44504 -60009 -64224 17612 -69189 -101653 -41821 -121317 -60262 -1944 32381 27658
2596 27658 -28569 -84706 -68220 -87503 -27917 -6214 -19339 -50861 -85076 -75660 -38732 -35742
2584 -35742 38266 51398 22733 45388 26661 68276 61485 52267 49991 -1491 -44500 -607
2572 -607 -24566 -26746 -28606 -52793 -22790 1548 10062 45999 46586 8900 -62567 -6960 12286
2559 12286 6616 -70904 -88123 -77892 5921 -25984 -1057 48718 78078 73882 19528 26233
2547 26233 54429 73222 29353 7694 24305 109611 33976 17588 11284 5307 67698 31595
2535 31595 29241 58427 14373 7344 96352 60232 42746 54394 8663 53454 39002 44045
2523 44045 93271 117709 123860 139870 91095 73988 149745 184517 180479 118852 184675 228619
2511 228619 164542 209870 218876 203709 229356 195178 165286 198700 174125 155010 131176 177058
2499 177058 213093 220136 145723 159333 225280 198005 213428 194575 126416 76457 119589 217352
2487 217352 179080 188804 216828 168400 196056 198651 227138 254183 283476 310807 309560 261476
2475 261476 295546 312322 306736 399361 336407 353108 420046 471002 427090 405755 457600 525135
2463 525135 543052 534277 527179 508183 535418 563005 575218 621609 672173 730724 812977 886553
2451 886553 983197 994402 1066713 1160234 1265269 1414271 1510120 1630740 1918966 2305157 2680268
2440 2680268 2959739 3110369 3128605 3223579 3409257 3807290 4224148 4788716 5587071 6844756
2430 6844756 8900820 12767700 19654528 27765819 33072435 34913945 32630392 26647111
2422 26647111 20535176 15776304 12302384 9772198 7843006 6333269 5208039 4299630
2414 4299630 3698601 3370512 3141101 3003840 2864572 2592591 2357022 1991158 1796525 1637863
2404 1637863 1448366 1344307 1251393 1187755 1059845 984442 911897 933516 890851 873713 891692
2393 891692 825244 885979 845193 772331 666312 596055 592418 610837 562817 513867 525437 512535
2381 512535 444348 454592 513289 439816 360480 341370 381297 426117 434859 426445 422079 337364
2369 337364 245205 234457 260693 240091 219550 239769 255498 270717 228475 195158 246182 227296
2357 227296 114455 132707 161173 197462 188744 108252 63476 146821 198814 161636 226997 187980
2345 187980 199996 152840 103299 79447 -986 68096 71781 36103 33081 30753 33654 97347
2333 97347 94626 128671 88241 118048 42752 60068 53533 8098 59177 -10560 -22919 -22927 56199
2320 56199 38690 7245 20521 68107 29262 45040 2965 -21525 -16123 -21658 -41712 -57647
2308 -57647 -2225 -54049 22186 75172 -14144 -1451 53151 29292 -46562 -22463 -37940 4175
2296 4175 56997 8254 -43906 -17216 -29946 -13022 -30398 -58783 -43664 -3316 13293 40589
2284 40589 -1896 33522 41790 -4850 -1713 -30627 24083 1909 1370 10165 65045 53297 56208
2271 56208 -41834 -96131 -37598 -116619 -134192 -98259 -39454 73244 42176 6871 1274 5287
2259 5287 5411 -52820 25252 18271 -78516 -76876 -15431 18077 38009 32818 -22465 19024 44896
2246 44896 5656 22416 -10660 18296 13700 790 -21639 24554 11254 4904 112004 49773
2234 49773 62638 71849 36934 1228 19323 39283 24772 -14485 -15105 -51857 -84148 -101666
2222 -101666 -101116 -41862 -46033 -61421 5642 29559 19092 -4466 -47217 -120691 -76831 -50054
2210 -50054 -69975 -34034 -39574 22398 20802 17362 -48987 -69570 -48759 1538 39066 42943 21522
2197 21522 -16717 -44355 -78528 -90354 -127164 -133490 -58191 -52353 -27622 -23861 -43303 -54880
2185 -54880 -49666 -68522 -45466 16355 -28191 -3914 46272 -21420 11898 35109 -23553 -52233
2173 -52233 10885 71443 4698 -25193 -77048 -56390 -19369 16797 -31413 -16880 6003 23658
2161 23658 33374 24505 -18870 51840 74542 59102 72696 4 -9524 -10936 3596 23248 21302
2148 21302 30764 27605 -29510 -30264 -24143 -40346 -63307 -115960 -101874 -41942 -44793 -55793 -52680
2135 -52680 -66661 -138086 -134449 -61181 -55670 -115185 -41731 -53837 -15573 -29430 -86708 -89045
2123 -89045 -103424 -74876 -67155 -63218 5576 17869 -102947 -88697 -70327 -91101 -101549 -119432
2111 -119432 -52139 -6765 -53204 25769 -17500 -13826 17347 -23068 -65318 -62916 -79239 -103180
2099 -103180 -153123 -122869 -79941 15782 -9234 -22207 -97238 -94823 -28382 -93676 -52072 -44640
2087 -44640 -83108 -137856 -140272 -121164 -55358 -104037 -100006 -47545 -4614 4117 -24592 -53341
2075 -53341 -9663 -14232 -3416 -47264 -39904 9303 7310 56210 30104 -42268 -35129 56141 -4083
2062 -4083 -55203 -30970 -19348 14102 -19826 -20689 -67078 -61308 25504 30405 8666 -23018 -60234
2049 -60234 -22193 -12553 -51245 -98544 -120070 -108768 -38914 -75461 -63974 -16467 3861 -88515
2037 -88515 -99775 -57335 -61934 -48387 -11621 21866 -6559 35008 52769 3489 22327 73090
2025 73090 -34065 -63124 -128708 -172285 -69968 -55849 -103281 -149588 -166286 -101861 -131457
2014 -131457 -93161 -25717 -26618 22125 22826 30562 47915 56001 36409 -17210 -28695 3314 -42875
2001 -42875 -117986 -87683 -80467 -57291 -16573 -21754 -81674 -42251 34156 30856 -14859 21941
1989 21941 10007 -16060 -13259 -7892 -25089 -50619 -42799 -37733 -80707 -110947 -70801 -58909 -6050
1976 -6050 -32489 -20261 -48345 10321 -73960 -40694 -25623 -18866 -6668 -32976 -39359 -79303
1964 -79303 -49240 -12648 -11958 43866 80432 26417 56136 11506 20967 -24698 -52365 -109845
1952 -109845 -58050 -53673 -20105 18282 -2809 -61093 -1487 22125 -17661 -6106 -31676 -29006
1940 -29006 -10898 -24930 -63327 -42492 -57623 -35321 44631 59681 39282 -13746 452 -16452
1928 -16452 -60533 -29580 14313 -8970 -23583 9974 42978 18676 -14672 -21023 -36659 -106730
1916 -106730 -61514 6282 15128 6055 34355 4554 -14563 26374 20100 -55437 -70354 -32355
1904 -32355 -22872 5268 -39695 -10411 -57724 -84541 -101530 -25550 -44376 -51507 40665 67946
1892 67946 6030 26900 30102 5314 -17905 -14324 -115614 -102544 25944 10841 -26038 8961
1880 8961 -39316 -58190 -919 -30727 -11565 32365 64257 32033 -15851 -1211 -2621 -15940
1868 -15940 -2738 39891 37670 -2128 -30821 -44842 17206 -1903 75662 -5580 14256 72344
1856 72344 18136 -30625 -25143 -53436 -96212 -49449 -9600 -36233 -61760 -10715 26305 41088
1844 41088 49752 12652 -27167 -10670 -23964 -15277 -71150 -90255 -83239 -24020 21786 -14293
1832 -14293 -11192 1899 -44694 -64856 -42842 -47612 -22042 -19880 -75679 -47371 24264 100487
1820 100487 14573 -68284 -56336 -48639 -9492 -2390 -69912 -90171 -64331 -80459 -85344 -7192
1808 -7192 68018 17353 -17005 2887 39298 36859 42908 56517 25285 -85637 -89651 -80772 -59290
1795 -59290 10712 23113 20602 -27573 -71844 -62181 30019 48977 56809 70753 71645 6724 90866
1782 90866 7456 -6915 -18172 -31279 -10523 -11063 -4762 -40 -8388 19097 31153 -1246 -29129
1769 -29129 -40833 -44768 -31305 -20880 -102043 -46561 2745 -8957 -64908 -89612 -25575 80117
1757 80117 55459 -57637 -132776 -62649 1930 60700 21031 20628 14894 15381 6942 26930 100472
1744 100472 95567 13642 -1344 27752 72027 29054 68122 -2942 -30876 -63660 -31242 -41699
1732 -41699 -34245 38315 70892 55242 64557 20808 -18253 -35985 -28857 -75881 -73714 -46959 -51059
1719 -51059 5418 -54449 -6679 -39935 -14798 -58039 -80174 -10166 32028 -9096 -80377 -49970
1707 -49970 -42146 -104890 -126038 -71949 -26947 11566 23264 54053 36677 61513 53194 31381
1695 31381 9611 -1698 -40589 -73339 -43583 20690 57877 8914 14656 3091 8359 -81970
1683 -81970 -37043 23485 66930 19813 -34862 -95775 -105720 -99819 -109636 -102510 -89387 -159582 -101364
1670 -101364 -50542 -30205 -42851 -46988 -73588 -57716 -109037 -116587 -31976 17405 89504 124643
1658 124643 69716 -15014 -7312 -62716 -50660 44739 -104833 -111478 -71670 -78939 -22121 -56901
1646 -56901 -74557 -14796 -5184 -93252 -77417 -31497 -37995 -29476 -3699 -7762 31440 -4229 -52257
1633 -52257 -22085 5428 -4014 -8026 33761 27985 -21888 -40425 -6228 -31992 -71238 -26205
1621 -26205 -58159 -72523 -86747 2800 -13243 -56660 -20078 5955 -57567 -23277 -12201 3520
1609 3520 15652 59103 51059 57869 40198 4022 -44743 -32319 -2603 53113 108342 60827
1597 60827 23978 -13291 -78445 -80007 -8891 -26738 -5762 -17348 -26794 -1188 43107 14126
1585 14126 -28495 1414 12140 44538 -30100 -44471 -88542 -64708 -15245 -65041 -45730 -68455
1573 -68455 -21936 -21251 12509 33228 17542 -25029 -29432 -4045 -22739 -2372 -42461 -61829
1561 -61829 9574 -16433 8348 21795 20625 7302 -9571 -27501 -37128 -23834 15941 30747
1549 30747 -17424 -64832 -123528 -63058 -28610 -41578 -13457 -13716 19839 -38451 1179 20302
1537 20302 38526 2629 -40497 -1954 -19365 -4590 -28495 -12597 -33521 162 22048 15560
1525 15560 44023 69489 46581 -6727 -22770 22292 -15471 -46005 -81253 -96489 -16720 52911
1513 52911 40240 76557 65162 -26899 -23560 -38042 -21952 -31567 -54535 -1945 9958 -21251
1501 -21251 -9723 5959 -7716 -44251 -9229 18716 8600 48886 25556 6643 20166 -12256
1489 -12256 -34051 -36146 -26640 -30175 -1836 -5622 -34576 -58874 -50266 -11945 -592 -13161 51358
1476 51358 20723 -48851 -2538 13800 39457 24747 95370 97163 23082 24756 -3980 -47453
1464 -47453 3025 15511 21189 14101 17667 30841 1411 31033 82814 53666 7893 -52540
1452 -52540 -117620 -84239 -77681 -947 -3309 -21630 39929 53978 25887 -5932 7143 54138
1440 54138 35801 38122 67504 5452 -73050 -115292 -90928 -66375 -36349 1393 -32435 22640
1428 22640 6430 17370 21022 -20512 -18609 -29521 -95053 1810 102890 -11271 -45017 7155
1416 7155 -62486 -55033 -50637 -87018 -75653 -54396 -133141 -46911 -8803 -116336 -82919 -85299
1404 -85299 -64337 -17109 -35388 -27960 557 -9891 17043 6353 6479 5815 -58961 -102327 -52917
1391 -52917 -69863 -51356 -17619 21327 24056 14917 31200 44757 3790 -26780 -50460 -9697
1379 -9697 30082 63853 24395 11691 36270 24521 2342 47839 36844 -51301 -14990 66247
1367 66247 32475 27212 -6331 -6212 79278 30506 -29114 1602 32287 -5550 -100658 -28576
1355 -28576 14620 28805 5924 -24013 -19111 -2468 -41747 -24015 -25716 23339 -9889 -71011
1343 -71011 -32 32755 -35576 -35665 -24619 -49553 16146 9998 -37414 -14097 21881 13129 29931
1330 29931 24718 16722 3564 -19032 -21563 15678 -55716 -59587 -70508 -60193 -90629 -59353 -24
1317 -24 37075 26670 9194 -11256 19509 24871 68249 -29790 -39542 -42987 -4985 -16951 22016
1304 22016 48845 -70499 -52202 11552 -3837 -31433 -661 37566 9562 13188 -11057 -60684
1292 -60684 -73404 -11110 39736 -50236 -96534 -90356 -5412 -49150 -35739 29897 34188 92886
1280 92886 5369 -16788 1724 -16133 3104 -45553 -47062 -39992 -38586 -81616 -73131 -27865 12241
1267 12241 46652 89455 9971 643 -11587 -26362 -57243 -83107 -77047 5520 12237 433
1255 433 -11624 -28184 36210 18520 -32 5083 8620 49931 60687 13776 -44476 -22774 -38743
1242 -38743 -22330 -4480 -4241 -10168 -65355 -16410 23332 1061 54742 38406 -13157 -9168 -58382
1229 -58382 -132606 -46796 -16519 -73884 -28796 -1611 27257 45109 15753 -37938 7687 13563
1217 13563 81734 79183 42032 11484 16072 48913 -20439 -61217 -45457 19668 30357 50980
1205 50980 26300 -52793 -5321 -81105 -130170 -127912 -116716 -98540 -21941 41126 33527 7747
1193 7747 1133 23238 60493 2650 -37904 -63694 -58811 -46790 -101145 -77443 -16536 50384
1181 50384 66060 39179 10691 49515 91196 -9065 -13072 -64161 -43289 -43358 -104987 -68169
1169 -68169 -102787 -25105 35894 -13327 3351 30048 38124 -15528 -37575 1075 24416 46829
1157 46829 -7001 34392 17874 13765 36703 75551 46827 28938 67629 41762 10594 32542
1145 32542 -2618 10215 -28485 -47742 -73823 -45686 -20330 -32026 -26868 22866 -3468 -17504
1133 -17504 42724 2242 -61142 -21316 -20727 -13577 7935 -1974 44822 29615 -14771 -53723 -84026
1120 -84026 -48459 -23266 5393 -48810 -58304 -39391 4258 16350 7059 6008 20843 2928
1108 2928 20187 43880 41412 24624 32009 10362 -19746 13330 26950 63694 -15531 -79638
1096 -79638 -57160 41270 59075 43463 256 -5739 17438 37623 -77335 34024 -21541 -14487
1084 -14487 -14812 -36694 -751 -14821 -8678 15527 3280 27695 112773 25374 7890 4080 -48278
1071 -48278 -86150 -50983 -16364 1313 -15687 -12007 -19308 -51351 -1626 29461 72761 19660
1059 19660 15056 49277 64766 86267 82324 48605 35891 -2674 -48977 7417 -26058 -30197
1047 -30197 -67226 -47087 32562 -28351 -48273 13235 40524 44117 -45151 20869 106045 139794
1035 139794 144956 65527 29185 -33025 -44357 24756 32681 -21605 3723 39082 -9253 -57638
1023 -57638 -65334 -48060 -17319 38706 78347 29172 -30375 24422 13975 -17073 -27613 -29957
1011 -29957 -4898 46713 32092 14339 48256 21236 -26086 14540 74853 63401 82653 132708
999 132708 112164 55724 4439 5239 23135 47109 17877 -16697 -9673 -19489 67607 69710 93564
986 93564 47329 33985 -9445 -31785 -21076 115 5071 36571 48399 29360 39555 -21730
974 -21730 -46896 -59812 -74605 17013 -17510 -84750 -22721 -690 11670 32148 47460 -14654
962 -14654 17624 -18982 -16706 -10844 -8837 8094 52917 11382 -35110 -44415 -26118 -45170 -39
949 -39 44039 6164 1958 -24504 56951 33631 -16830 31757 78528 22941 68252 45703 -30993
936 -30993 21177 17950 36807 29339 32527 35131 16670 3353 -31187 -51323 4467 3926 8331
923 8331 -66375 18046 17053 20782 17345 17178 42921 65306 77942 78999 52597 -8852 -6089 -51807
909 -51807 -10843 -24903 -26392 11548 45030 95878 53897 -10344 1687 -11752 -26784 15641
897 15641 47690 15616 44513 8647 8711 -27187 -23305 -15092 -30486 -32268 5078 49967 10287
884 10287 18745 22354 -23932 16275 33994 68535 70189 81782 -781 -7036 -30761 -21394 -3047
871 -3047 -37270 -61029 -91146 -16862 27619 47282 25153 6879 -11034 -11938 14908 45942 -18250
858 -18250 -42105 -5122 -84911 -117745 -34867 12811 95840 55934 46411 73627 -5204 2956
846 2956 12834 -9704 41405 31240 -59508 -47695 -44715 -99967 -99847 -57252 -34331 -78172 -37687
833 -37687 34245 54776 37416 -30003 -3440 59405 -44551 -51384 24862 30581 20268 -10473
821 -10473 31010 -47065 -1452 17594 13833 -35314 -48933 8196 -28256 -99826 -95774 -1833
809 -1833 -17036 18828 13564 12244 50105 43723 -18035 90003 65326 47770 40757 -4762 -64407
796 -64407 -33172 9422 19978 -13357 -67048 -10970 -24293 -24675 -24234 7743 -16600 57993 43043
783 43043 15764 -35955 -3375 -17614 -22125 -6016 26083 56034 70298 80942 22159 18189
771 18189 67270 27778 4198 -994 -15971 37481 -20413 29089 62090 54970 11507 3656 30914
758 30914 40005 -17855 -38170 21526 -11367 2512 -8940 -22660 -7425 -62606 -18478 -16315
746 -16315 21211 65946 62683 -31072 -56985 45570 37370 -26574 19604 13607 -29449 26596
734 26596 31911 16498 1840 -12539 -17231 -10205 -1442 -9583 -14127 -3133 -23804 14969 23627
721 23627 50418 40101 -6968 -5089 -13392 2038 10414 81324 58391 29238 16535 9847 35851
708 35851 37945 87449 115612 44869 28906 -5492 17251 65353 -10379 -23814 24175 51336
696 51336 39495 19943 7923 38217 -14248 -119628 -95118 -26053 -69143 -28767 15250 -6390
684 -6390 -10387 27769 98159 39966 43324 19044 50101 65154 31505 -1778 -6495 98254 77678
671 77678 50903 34777 -10592 -36314 -65318 -72131 -54390 23816 -66095 -69636 26550 32051 65231
658 65231 71874 41980 24271 59306 26423 50145 18984 -22417 -61341 28356 15630 -31613
646 -31613 20247 64807 74369 16601 -38742 -99742 -49493 34528 39055 -63301 -73183 -19874
634 -19874 -23645 2029 78409 112043 71170 40242 54461 19138 61781 42345 50699 12072
622 12072 18749 50056 -78316 -23052 -40290 21566 84066 153296 98511 8330 6018 40900
610 40900 160588 113120 35873 51341 51816 26330 28439 -19304 -25278 17548 -20913 -35793 495
597 495 37339 49519 68224 56871 47415 78153 70613 5157 -15468 -62919 -73454 33316 38277
584 38277 -17713 -40173 -44209 -50696 -13396 77336 105986 108117 44322 -20459 -8858 -40780 -21087
571 -21087 24781 -83672 -49041 -18564 -21589 -40200 -24867 40241 63218 85851 87991 74088
559 74088 12511 35699 23560 42528 54355 60226 40441 -2535 -21045 -34769 -29248 -19704 -37156
546 -37156 -7475 43522 32877 7320 -22022 -8278 7383 9983 1099 -62523 1148 -52834
534 -52834 -65141 -19679 5864 4877 -20439 16904 78255 52779 -7664 -2709 88092 66346 54123
521 54123 11744 2277 70557 9865 10907 10650 -30044 11590 -6730 20792 98658 71694 48884
508 48884 32479 26234 61328 83223 78132 155401 111653 109972 88666 -1116 41727 51546 45587
495 45587 -11160 -7029 35261 93091 107168 78109 53711 15902 74020 46741 28965 -4183
483 -4183 -6512 14578 32222 2236 -32626 -30912 -50060 -36407 -5185 -33967 -20231 6661 -15200
470 -15200 13700 -33561 -89394 -20219 -8732 60704 65766 -1883 -3465 -17062 6874 101501
458 101501 82973 15730 6860 27925 84349 29692 10156 -24325 -33753 13237 -12879 49159
446 49159 28145 38246 6769 -13492 17223 38150 37939 14826 14923 -11878 -3403 17426 34771
433 34771 -15323 -17308 -5794 -22325 -39968 18546 37098 40939 54614 71775 71782 84892 27318
420 27318 72452 24562 3983 4864 -27007 26528 8314 -23752 21635 48602 -22110 -44754
408 -44754 20933 -9749 32225 32641 18262 53815 44141 81944 72794 74546 50989 38155 3111
395 3111 -52206 33599 48287 58411 55699 23772 -30393 -90449 -11062 -231 -48688 -46718 44788
382 44788 4444 30110 -11770 2743 -8775 -6065 -347 -20527 -58057 -44260 -10395 -14357 17125
369 17125 -6724 345 50430 14758 39176 76245 32835 4646 47592 102296 90457 59148
357 59148 20135 -12265 -16210 -15445 38376 58193 90817 88584 66715 5411 32526 30611 12704
344 12704 1644 -47434 -15917 28457 83405 81065 86130 88113 97397 54988 1125 -25773 -29534
331 -29534 -7792 30639 53882 54821 56321 25019 5531 61505 63373 16288 -17399 4996 18439
318 18439 21332 -49695 -61830 -42673 -2858 47073 61466 23273 -31634 637 -1155 48939
306 48939 25530 -62895 -4150 -35256 -55722 -32965 58658 94376 59156 42884 76133 37586
294 37586 22944 70297 76157 47640 56257 64479 56084 41094 23123 -15324 -5241 21390 17100
281 17100 21212 -5005 -42762 17939 66189 76605 26103 -5279 6989 90679 76492 73279
269 73279 66807 47366 47602 -54151 -58854 1178 5002 32897 -12584 49334 64165 19147 -8190
256 -8190 -61359 -48903 -69210 32594 34207 22946 -14644 29688 36304 25707 -16822 -43786
244 -43786 -105219 -126824 -78986 -38182 1967 44307 45157 -14260 -5042 13944 37039 69053 -36264
231 -36264 -17639 -2829 19849 57737 54750 59766 20113 41053 -608 -966 31021 38860 107993
218 107993 114583 89395 78093 92469 75144 67875 45673 21881 48306 33314 -30862 3275
206 3275 72231 52597 -24018 -82338 -55472 40170 15372 -4804 32846 36689 8822 -25888
194 -25888 421 -12445 15288 7372 3168 -13411 -20480 -65223 12508 49226 34154 71816 12552
181 12552 15981 -7548 47071 28701 -39376 19945 16270 958 22307 -3700 22294 53358
169 53358 -23157 35545 54371 4279 24220 30811 51010 68166 36074 -2877 -16186 818
157 818 86354 46314 79335 77824 42371 105122 97245 55305 -1663 37830 -19483 -1007 62911
144 62911 27695 81491 49547 -7533 37412 -4833 63772 61922 41997 51830 95397 110084
132 110084 23332 30566 37444 -31633 -37234 5091 52019 77618 40078 2230 58656 70148
120 70148 41329 46440 68581 65992 6551 -13290 -52571 -29801 -3442 96044 42473 -6960
108 -6960 1988 -29945 -42561 6689 26050 55417 42794 40969 30254 -40350 -29267 -12242 -10518
95 -10518 3772 -29806 -993 66250 49945 62436 40945 5042 10599 10029 -30372 8968 45805
82 45805 41947 27219 28305 4031 29956 10978 30293 24823 14789 21920 -18722 -42058 -42641
69 -42641 4829 64314 66441 12855 62749 75812 52163 44801 70323 37242 41747 47786 8775
56 8775 -19188 37379 55236 11155 7623 57535 55295 42566 47084 39882 40435 54947 27189 -16704
42 -16704 -2130 35551 11778 -8632 982 -35420 29393 26253 8161 -28661 -79745 -30214 35676
29 35676 70181 45040 4580 23187 9930 15682 48010 30086 21620 86535 39674 19027 38127
16 38127 38088 50131 19545 -4801 35602 41246 32829 21311 38421 31195 31073 27658 34657 46894
2 46894 38049 8075
0 8075
$$ Imaginary data points
##PAGE= N=2
##DATA TABLE= (X++(I..I)), XYDATA
16383 -1779028 -1748421 -1709527 -1707006 -1670559 -1648163 -1587068 -1568276 -1491564 -1449821 -1434233 -1439967 -1422694
16371 -1422694 -1412084 -1369142 -1309919 -1265127 -1189777 -1199613 -1186162 -1151507 -1076115 -1045574 -1006452
16360 -1006452 -962989 -964372 -906920 -867973 -793176 -755187 -722518 -693084 -691607 -676290 -618660 -594967
16348 -594967 -564601 -558872 -477675 -437764 -440587 -459738 -389429 -337850 -319005 -281375 -260036 -206259
16336 -206259 -153872 -141296 -130862 -104873 -49352 -7859 13154 79132 112278 196998 155674
16325 155674 181000 249622 279573 315382 325094 341558 414054 444562 395806 478160 496614 557674
16313 557674 573560 587608 612151 664833 700698 660980 687409 685045 752855 773113 835840 892278
16301 892278 931935 901662 940644 1003196 1084809 1079505 1037735 1070935 1064963 1066894 1153648 1204290
16289 1204290 1207573 1277824 1282224 1329948 1323910 1350059 1383045 1385410 1444734 1438193 1476913 1516552
16277 1516552 1486341 1530457 1599696 1590996 1620609 1578686 1609471 1652058 1741717 1778316 1717938
16266 1717938 1789794 1852977 1870372 1856728 1910373 1941773 1884965 1947976 1995338 2076061 2102230
16255 2102230 2071235 2042061 1994548 2042405 2090764 2152785 2174081 2136950 2163732 2199245 2221838
16244 2221838 2220375 2205778 2265094 2280028 2305767 2370592 2361131 2376819 2366437 2419348 2451309 2475075
16232 2475075 2500380 2514808 2549962 2497845 2458477 2451623 2519839 2545121 2555653 2587869 2675288
16221 2675288 2713346 2662820 2682278 2720708 2762525 2786492 2860933 2841138 2754901 2701081 2786458
16210 2786458 2796126 2754100 2847291 2849578 2880325 2933031 2859509 2877033 2921170 2928018 2883562 2881532
16198 2881532 2975706 2970477 2975068 3050278 3079955 3077579 3070856 3060872 3058864 3043621 3039551 3071345 3138180
16185 3138180 3177667 3198582 3180726 3191300 3177556 3182909 3124584 3166041 3142426 3166795 3207987
16174 3207987 3207177 3266868 3257932 3223898 3215263 3258746 3207458 3161306 3218783 3280088 3334078 3370155
16162 3370155 3322428 3307166 3328782 3250927 3283011 3345176 3383813 3363474 3384136 3362645 3374699
16151 3374699 3324539 3380902 3486199 3465209 3402425 3331275 3407251 3458082 3468492 3527534 3487451
16140 3487451 3478309 3546506 3565365 3551866 3480347 3471900 3536862 3518763 3468208 3556097 3586616 3496634
16128 3496634 3480387 3518143 3525294 3501919 3478719 3546948 3623914 3596963 3540819 3567385 3578832
16117 3578832 3551416 3555137 3580451 3559581 3573271 3599909 3574113 3570407 3599404 3654435 3663755 3608210
16105 3608210 3606088 3591025 3562259 3604848 3665530 3610830 3605420 3631215 3641751 3635999 3671771 3676996
16093 3676996 3630211 3622141 3634492 3585363 3650673 3642000 3661291 3723138 3711893 3731321 3703552 3708789
16081 3708789 3714797 3688207 3687699 3694660 3662721 3627408 3645347 3711598 3778116 3712622 3657587 3661816
16069 3661816 3664371 3666868 3697017 3678385 3716620 3780824 3798804 3794923 3775260 3761337 3734335 3729945
16057 3729945 3681619 3780384 3735742 3721430 3795617 3784350 3788675 3783353 3792393 3816853 3795915 3783853
16045 3783853 3722947 3720392 3722467 3738242 3715331 3790441 3831782 3753004 3680791 3718626 3770547 3705461
16033 3705461 3739695 3817804 3847265 3868196 3830846 3805617 3823390 3793830 3798384 3843604 3846664 3817492
16021 3817492 3887077 3823230 3802434 3801238 3786956 3823568 3849026 3795093 3827484 3865129 3823403
16010 3823403 3782327 3808519 3799568 3784825 3708128 3745818 3849157 3806990 3806408 3815017 3827435 3815013
15998 3815013 3755641 3782720 3763346 3794310 3794982 3779466 3739368 3751476 3717239 3681078 3717315 3796603
15986 3796603 3874482 3850527 3907495 3853034 3846632 3842350 3815932 3762729 3803166 3789293 3859411 3861500
15974 3861500 3776393 3763162 3774572 3743247 3776744 3734833 3757223 3809031 3763990 3741978 3707963
15963 3707963 3731711 3766805 3794963 3762772 3767069 3825799 3834525 3786050 3772090 3756496 3777395 3761750
15951 3761750 3730756 3682997 3761271 3771792 3864060 3856258 3816215 3785698 3739568 3804026 3823021
15940 3823021 3785970 3761079 3703376 3749856 3738300 3717201 3797199 3788917 3771851 3747757 3785527
15929 3785527 3730633 3804265 3797581 3819277 3843894 3869429 3813854 3749043 3759843 3726564 3784097
15918 3784097 3709255 3692562 3728387 3769974 3796048 3754463 3847766 3844864 3843279 3870063 3845627 3866272
15906 3866272 3885764 3761425 3831319 3840082 3864707 3908063 3880287 3872500 3901694 3903121 3882118 3848583
15894 3848583 3850460 3794975 3795111 3862760 3855642 3759967 3810086 3865227 3843179 3824727 3814397 3827895
15882 3827895 3800488 3819618 3745066 3761831 3801277 3786193 3749091 3753530 3840568 3868788 3856876
15871 3856876 3820894 3771589 3743765 3787059 3764568 3804356 3884876 3807425 3766593 3784247 3823854
15860 3823854 3798429 3801745 3785029 3866618 3863410 3836856 3893601 3900585 3843430 3911758 3919345 3884745
15848 3884745 3832498 3830586 3803660 3854745 3844286 3810992 3805686 3879134 3950582 3945536 3891629 3877417
15836 3877417 3883388 3877115 3917430 3915375 3831434 3775943 3785840 3848006 3951774 3946701 3920251 3904198
15824 3904198 3925530 3957499 3901689 3841744 3790221 3789535 3811203 3877549 3846790 3808624 3764025 3821595
15812 3821595 3829212 3812954 3852159 3874439 3903779 3861579 3861511 3801051 3868724 3886689 3868649 3868840
15800 3868840 3850423 3828076 3847737 3851525 3845426 3821624 3808001 3922877 3887410 3903207 3873143
15789 3873143 3862080 3901615 3881181 3889111 3848977 3870094 3874007 3843656 3837510 3853260 3825868 3825381
15777 3825381 3807070 3818537 3872803 3918031 3909426 3861150 3774018 3817723 3845331 3883955 3878947 3847856
15765 3847856 3841759 3856667 3856512 3836472 3803216 3823350 3917403 3924287 3910102 3943276 3913608 3914654
15753 3914654 3931317 3964765 3994510 3879451 3819495 3864289 3852368 3821875 3858237 3818231 3851682
15742 3851682 3872026 3790219 3796083 3834808 3863607 3845715 3862829 3873326 3883366 3893829 3858982
15731 3858982 3868139 3909900 3871315 3896078 3913860 3908263 3904888 3903716 3908773 3921519 3925321 3882774
15719 3882774 3879583 3851897 3890711 3936721 3852680 3866569 3939669 3963257 3911344 3887706 3895907 3899965
15707 3899965 3929768 3880395 3895811 3917327 3888677 3972992 3988166 3943825 3942164 3928495 3882441
15696 3882441 3872666 3909060 3908117 3958676 3907226 3897685 3936642 3910149 3952619 3952458 3906035 3972290
15684 3972290 4000430 3985501 3962781 3904685 3892345 3890302 3887958 3829825 3803943 3893069 3922831 3887245
15672 3887245 3900853 3855989 3890432 3850004 3883437 3841470 3815676 3918149 3989545 3943846 3884523
15661 3884523 3857448 3841039 3940721 3923503 3933232 3949848 3938096 3937934 3935285 3932930 3909462 3907260
15649 3907260 3931795 3953986 3950827 3891360 3921912 3927770 3922803 3954196 3934825 3935965 3986826 3875852
15637 3875852 3863299 3919498 3972112 4010552 3993805 3922081 3905486 3933147 3910261 3835631 3819500
15626 3819500 3889324 3952107 3988101 3974846 3974144 3947081 3928367 3901905 3882216 3979800 3992991 3956396
15614 3956396 3954918 3937569 3948340 3928265 3965574 4007002 4016715 4000970 3975952 4012305 3967251 3939272
15602 3939272 3962895 3956329 3936204 3934401 3915279 3928414 3964132 3949066 3927038 4023768 3982773 3953142
15590 3953142 3951843 3964126 3937254 3900618 3878707 3937529 3900880 3919690 3937280 3877903 3946734
15579 3946734 3980124 3921763 3959531 3942936 3919534 3972134 3996883 3996346 3963229 4005733 3930090 3991610
$$ [...]
##END NTUPLES=NMR SPECTRUM
##END=
