##TITLE=1H_CA-9433-1
 200.13MHz,DMSO-d6.
 8 sc
 
 3.3.2026
##JCAMPDX= 6.0         $$ Bruker NMR JCAMP-DX V2.0
##DATA TYPE= NMR SPECTRUM
##DATA CLASS= NTUPLES
##ORIGIN= UXNMR, Bruker Analytische Messtechnik GmbH
##OWNER= pz
$$ XWIN-NMR		Version 3.5
$$ Tue Mar  3 13:37:21 2026 Russian Standard Time (UT+4h)  she@DPX200
##.OBSERVE FREQUENCY= 200.1313
##.OBSERVE NUCLEUS= ^1H
##.ACQUISITION MODE= SIMULTANEOUS
##.ACQUISITION SCHEME= undefined
##.AVERAGES= 8
##.DIGITISER RES= 18
##SPECTROMETER/DATA SYSTEM= spect
##.PULSE SEQUENCE= zg30
##.SOLVENT NAME= DMSO
##.SHIFT REFERENCE= (INTERNAL, DMSO, 0, 15.4197)
##AUDIT TRAIL= $$ (NUMBER, WHEN, WHO, WHERE, WHAT)
$$ ##TITLE= Audit trail, XWIN-NMR		Version 3.5
$$ ##JCAMPDX= 5.01
$$ ##ORIGIN= Bruker BioSpin GmbH
$$ ##OWNER= she
$$ F:/spectra/data/she/nmr/H-C/1/pdata/1/auditp.txt
$$ ##AUDIT TRAIL=  $$ (NUMBER, WHEN, WHO, WHERE, WHAT)
(   1,<2026-03-03 13:35:53.84 +0400>,<she>,<DPX200>,
      <created by zg, POWCHK disabled, PULCHK disabled
       configuration hash MD5:
       00 E9 B6 7A A2 85 ED C7 34 08 36 98 17 FE 4E 26
       data hash MD5: 16K
       DB F2 EA AD 57 B5 A0 68 D3 56 F5 A5 CB 32 1A 7C>)
(   2,<2026-03-03 13:35:58.43 +0400>,<she>,<DPX200>,
      <Start of raw data processing
       efp BC_mod = 2 LB = 0.25 FT_mod = 6 PKNL = 1 PHC0 = -3701.662 PHC1 = 8.992321 SI = 16K 
       data hash MD5: 16K
       EC BD 11 DA 24 DA 08 D7 53 15 D6 E1 EC 67 2F 7F>)
(   3,<2026-03-03 13:36:26.25 +0400>,<she>,<DPX200>,
      <pk PHC0 = -0.9652987 PHC1 = 0.6 
       data hash MD5: 16K
       1F 5E FA 93 28 51 A0 26 21 A2 72 09 BA 16 41 86>)
(   4,<2026-03-03 13:36:30.59 +0400>,<she>,<DPX200>,
      <abs ABSG = 5 
       data hash MD5: 16K
       7A 73 8F 5D 90 8D 11 15 B6 75 BB 5F 55 F3 25 2A>)
$$ ##END=
$$ 
$$ hash MD5
$$ 96 12 7E 9C 91 97 8E B5 7F 61 28 1D C2 A9 33 EF
##$RELAX= 
##$RELAX= 
##$RELAX= 
##$RELAX= 
##$RELAX= 
##$RELAX= 
$$ Bruker specific parameters
$$ --------------------------
##$DU= <F:/spectra>
##$EXPNO= 1
##$NAME= <H-C>
##$PROCNO= 1
##$TYPE= <nmr>
##$USER= <she>
##$AMP= (0..31)
100 100 100 100 100 100 100 100 100 100 100 100 100 100 100 100 100 100 
100 100 100 100 100 100 100 100 100 100 100 100 100 100 
##$AQSEQ= 0
##$AQ_mod= 1
##$AUNM= <au_zg>
##$AUTOPOS= <>
##$BF1= 200.13
##$BF2= 200.13
##$BF3= 200.13
##$BF4= 200.13
##$BF5= 200.13
##$BF6= 200.13
##$BF7= 200.13
##$BF8= 200.13
##$BYTORDA= 1
##$CFDGTYP= 0
##$CFRGTYP= 5
##$CHEMSTR= <none>
##$CNST= (0..31)
1 1 145 1 1 1 1 1 1 1 1 1 1 1 1 1 1 1 1 1 1 1 1 1 1 1 1 1 1 1 1 1 
##$CPDPRG= <>
##$CPDPRG1= <>
##$CPDPRG2= <>
##$CPDPRG3= <>
##$CPDPRG4= <mlev>
##$CPDPRG5= <mlev>
##$CPDPRG6= <mlev>
##$CPDPRG7= <mlev>
##$CPDPRG8= <mlev>
##$CPDPRGB= <>
##$CPDPRGT= <>
##$D= (0..31)
0 0.7 0 0 0 0 0 0 0 0 0 0.03 0 0 0 0 0 0 0 0 0 0 0 0 0 0 0 0 0 0 0 0 
##$DATE= 1772530553
##$DBL= (0..7)
120 120 120 120 120 120 120 120 
##$DBP= (0..7)
150 150 150 150 150 150 150 150 
##$DBP07= 0
##$DBPNAM0= <>
##$DBPNAM1= <>
##$DBPNAM2= <>
##$DBPNAM3= <>
##$DBPNAM4= <>
$$ [...]
##$SUBNAM3= <"">
##$SUBNAM4= <"">
##$SUBNAM5= <"">
##$SUBNAM6= <"">
##$SUBNAM7= <"">
##$SUBNAM8= <"">
##$SUBNAM9= <"">
##$SW= 18.0517328524113
##$SWIBOX= (0..15)
0 0 2 0 0 0 0 0 0 0 0 0 0 0 0 0 
##$SW_h= 3612.71676300578
##$TD= 16384
##$TD0= 1
##$TE= 0
##$TE2= 300
##$TE3= 300
##$TEG= 300
##$TL= (0..7)
0 120 120 120 120 120 120 120 
##$TP= (0..7)
150 150 150 150 150 150 150 150 
##$TP07= 0
##$TPNAME0= <>
##$TPNAME1= <>
##$TPNAME2= <>
##$TPNAME3= <>
##$TPNAME4= <>
##$TPNAME5= <>
##$TPNAME6= <>
##$TPNAME7= <>
##$TPOAL= (0..7)
0.5 0.5 0.5 0.5 0.5 0.5 0.5 0.5 
##$TPOFFS= (0..7)
0 0 0 0 0 0 0 0 
##$TUNHIN= 0
##$TUNHOUT= 0
##$TUNXOUT= 0
##$USERA1= <user>
##$USERA2= <user>
##$USERA3= <user>
##$USERA4= <user>
##$USERA5= <user>
##$V9= 5
##$VALIST= <valist>
##$VCLIST= <CCCCCCCCCCCCCCC>
##$VD= 0
##$VDLIST= <DDDDDDDDDDDDDDD>
##$VPLIST= <PPPPPPPPPPPPPPP>
##$VTLIST= <TTTTTTTTTTTTTTT>
##$WBST= 1024
##$WBSW= 4
##$XGAIN= (0..3)
0 0 0 0 
##$XL= 0
##$YL= 0
##$YMAX_a= 501290
##$YMIN_a= -681049
##$ZGOPTNS= <>
##$ZL1= 120
##$ZL2= 120
##$ZL3= 120
##$ZL4= 120
##$ABSF1= 15.35795
##$ABSF2= -2.693897
##$ABSG= 5
##$ABSL= 3
##$ALPHA= 0
##$AQORDER= 0
##$ASSFAC= 0
##$ASSFACI= 0
##$ASSFACX= 0
##$ASSWID= 0
##$AUNMP= <proc_1d>
##$AZFE= 0.1
##$AZFW= 0.1
##$BCFW= 0
##$BC_mod= 2
##$BYTORDP= 0
##$COROFFS= 0
##$CY= -3
##$DATMOD= 1
##$DC= 0
##$DFILT= <>
##$DTYPP= 0
##$F1P= 0
##$F2P= 0
##$FCOR= 1
##$FTSIZE= 16384
##$FT_mod= 6
##$GAMMA= 0
##$GB= 0
##$INTBC= 1
##$INTSCL= 3.241238e-09
##$ISEN= 128
##$LB= 0.25
##$LEV0= 0
##$LPBIN= 0
##$MAXI= 10000
##$MC2= 0
##$MEAN= 0
##$ME_mod= 0
##$MI= 1.114404
##$NCOEF= 0
##$NC_proc= -6
##$NLEV= 6
##$NOISF1= 3.799351
##$NOISF2= 2.8
##$NSP= 0
##$NTH_PI= 0
##$NZP= 0
##$OFFSET= 15.41965
##$PC= 1
##$PHC0= -3702.627
##$PHC1= 9.592321
##$PH_mod= 1
##$PKNL= yes
##$PPARMOD= 0
##$PSCAL= 0
##$PSIGN= 0
##$REVERSE= no
##$SF= 200.130020422292
##$SI= 16384
##$SIGF1= 3
##$SIGF2= 2
##$SINO= 0.751879
##$SIOLD= 32768
##$SREGLST= <19F.Aceton>
##$SSB= 0
##$STSI= 16384
##$STSR= 0
##$SW_p= 3612.71676300578
##$SYMM= 0
##$S_DEV= 0
##$TDeff= 16384
##$TDoff= 0
##$TI= <>
##$TILT= no
##$TM1= 0
##$TM2= 0
##$TOPLEV= 0
##$USERP1= <user>
##$USERP2= <user>
##$USERP3= <user>
##$USERP4= <user>
##$USERP5= <user>
##$WDW= 1
##$XDIM= 16384
##$YMAX_p= 309215320
##$YMIN_p= -401807
$$ End of Bruker specific parameters
$$ ---------------------------------
##NTUPLES= NMR SPECTRUM
##VAR_NAME=  FREQUENCY,     SPECTRUM/REAL,   SPECTRUM/IMAG
##SYMBOL=    X,             R,               I
##VAR_TYPE=  INDEPENDENT,   DEPENDENT,       DEPENDENT
##VAR_FORM=  AFFN,          ASDF,            ASDF
##VAR_DIM=   16384,         16384,           16384
##UNITS=     HZ,            ARBITRARY UNITS, ARBITRARY UNITS
##FACTOR=    0.220516191357247, 1,           1
##FIRST=     3085.93488497868, 0,            0
##LAST=      -526.781878027102, 0,           0
##MIN=       -526.781878027102, -401807,     0
##MAX=       3085.93488497868, 309215320,    0
$$ Real data points
##PAGE= N=1
##DATA TABLE= (X++(R..R)), XYDATA
$$ [...]
7810g6283J4542l696O3594J38572k31940l0671R9253M7290J2770R189P090L6261
7798H5971M0200K5613O7156j4195m9464j06986K1617P4113q2400j28578o5624
7787a32577J78406l1007j76963L0173L6888J11784K3863l091k3922K8846L016
7776D5416R887l0064K7765M0800P0099O3687K14187Q1933J42741J54825k2571
7765G98705J594k35102r9946j87219n0508qL37p4443K1187M8591J8282j06011
7753A35459L755M8441K1975k8014k7927R64k913q6051l8782Q4214J29238j5119
7741B25240j9764N6513N6020K47383J80322J91739p840j14077j54853p2284j22898
7730D65501j68998K8830n7035q0448k9226r447N3760L358j37644j1318Q2003o186
$$ y = [-76283, -61741, -65437, -1843, 136729, -95211, -125882, -26629, 20661, 33431, 42620, 49710, 85971, 126171, 151784, 218940, 204745, 155281, 48295, 69912, 144025, 61625, -66953, -132577, 45829, 14822, -162141, -131968, -95080, 16704, 40567, 37476, 13554, 42400, 45416, 55303, 25239, 53004, 93804, 163903, 227590, 441777, 523710, 666451, 821276, 798705, 800299, 565197, 465251, 278032, 227524, 227516, 227853, 153410, 174597, 223188, 241470, 135459, 139214, 187655, 209630, 181616, 153689, 154653, 151740, 65689, 26907, 111121, 240359, 225240, 205476, 261989, 318009, 565392, 745714, 937453, 929613, 815536, 660683, 588399, 465501, 296503, 325333, 268298, 187850, 158624, 149177, 202937, 206295, 68651, 57333, 139336, 133150]
7718A33150r1131J5226o690n5806p271R9794m1583p8091Q0202O5761K929M2665
7706A59155Q5122N3048o9833M7484n352o7510N5125q9650O354J8783j41656N2349
7694A03419K8624l6603r7604j7724J95J555J3707p0950M3070p5844K5000M9327
7682c3828K1360n6883N8375n6562M8320j7752j5204Q1792m9944j74394K4746l203
7670a73177R7422o7840n121Q3538m0476o2729J2690J78054r4016r171M0566p0473
7658a10733n0108l0006P8109N6808m8683K0358p2040o6158J26531J069l3157J08013
7646a9997L2826k1809K2992J7093r1521q4883l4943M810Q6461l7965n689R9476
7634c3149J597j07928K1015P1341J7363r2900p1022P032N4176Q5789q6794P351
$$ y = [133150, 42019, 57245, 50555, -5251, -12522, 87272, 45689, -32402, 47800, 113561, 116490, 159155, 244277, 297325, 227492, 274976, 269624, 202114, 257239, 167589, 173943, 192726, 51070, 103419, 132043, 95440, -2164, -19888, -19693, -18138, -4431, -75381, -32311, -108155, -83155, -33828, -12468, -69351, -10976, -67538, -19218, -36970, -52174, 29618, -20326, -194720, -169974, -173177, -75755, -143595, -148716, -65178, -105654, -168383, -155693, 22361, -71655, -80826, -40260, -110733, -160841, -190847, -112738, -55930, -104613, -84255, -156295, -222453, -95922, -94853, -128010, -19997, 12829, -8980, 14012, 31105, -60416, -145299, -180242, -175432, -88971, -126936, -132625, -33149, -31552, -139480, -118465, -47124, -29761, -122661, -193683, -186651, -132475, -46686, -133480, -126129]
7622a26129P6159o2564L0449j9110j9508R7079l4313l6664l1986K4732j31061
7611b32916k3686M0110L7160Q6934M1080n1531k0412K451n6426K3574N7756J2591
7599h3315K5881K30o9252J9881m9815O101N2124m5909n739m9901k0978M0880m4068
7586b23880R0720O8487K5913J3610O299L9787M926m5643j8157p8294l5935q459
7574a60626l676J37431l2486M899J20144K6008j19943o387o1063P8999Q506q877
7562a7071m4374k9678J3465l4329L4750N7266N329j40237l7498J45423K3064o3564
7550h7454J18104j18751r3758j3251M3582J1339M87M3221m7451m4147k3565l2266
7538b43910K6715J66549n3608o1881L3295j2024L970q7517J45415J14229n1239
$$ y = [-126129, -49970, -112534, -82085, -101195, -120703, -23624, -57937, -94601, -126587, -101855, -232916, -256602, -216492, -179332, -92398, -51318, -102849, -123261, -120810, -177236, -153662, -95906, -83315, -57434, -57204, -126456, -106575, -156390, -150289, -98165, -144074, -149813, -199714, -220692, -179812, -223880, -133160, -64673, -38760, -25150, -18851, 20936, 25862, -19781, -37938, -116232, -152167, -160626, -164302, -26871, -59357, -54458, 65686, 91694, -28249, -34636, -95699, -16700, -8194, -17071, -61445, -91123, -77658, -111987, -77237, -19971, -14642, -154879, -192377, -46954, -23890, -87454, 30650, -88101, -181859, -195110, -151528, -140189, -139702, -96481, -143932, -188079, -211644, -243910, -217195, -50646, -104254, -166135, -132840, -144864, -140894, -228411, -82996, 31233, -20006]
7527b0006r9849P1238P2503q7910K7270q2164k5775Q8377j4844q8729m498p8093
7515b42480k6954J3445N232P2085P1479j55549l3784J08696k7884P0440j2391
7504a57665j31181J28360k2996K0535j8756M1786M8200j24319r820O8281m2610
7493b00185N8609M8015J2752M9438p4416j0541p913K5563j6651k4822n0244K4933
7481a65462N3844M7568L4356j08443K1845k9457J7475L0402n4021K1674J5376
7470a14843p6261K08417L5230j36571J0459l9351O1182J0192j0862o0173O5795
7459d6786j3820m9191l2983K0524o8766j4186k3980M590J36896L4713l013K3057
7447c2945j9117m9595j31665Q2436j3517Q068Q2100k0811O1211R3542l9049L3986
$$ y = [-20006, -119855, -48617, 23886, -64024, -36754, -118918, -144693, -56316, -71160, -159889, -164387, -242480, -269434, -255989, -250757, -178672, -107193, -262742, -296526, -187830, -215714, -145274, -157665, -288846, -160486, -183482, -162947, -181703, -139917, -91717, -216036, -225856, -157575, -200185, -141576, -93561, -80809, -31371, -105787, -116328, -124241, -98678, -115329, -140151, -190395, -165462, -111618, -64050, -29694, -138137, -116292, -145749, -128274, -97872, -151893, -130219, -114843, -191104, 17313, 52543, -84028, -73569, -112920, -51738, -41546, -52408, -112581, -46786, -60606, -109797, -142780, -122256, -191022, -205208, -229188, -224598, -87702, -52989, -56002, -32945, -52062, -101657, -233322, -150886, -164403, -156335, -74235, -95046, -33835, 59707, 20658, 54644]
7435E4644k5302N4130q6160r005j3693K5467l1359J8275l8609j5822J21510m5966
7423H110r0152P7054N7886n9446L6151M0688j18417j8606M0040j8308j925k4478
7411g1403M9359j1512K0134l7279o342k3193L2606j2813M7370N2168q1046o8489
7399a10440J4902P7197J0894p1501o6374K4379p1706L8174K1861N7292R0148l8067
7387b3241J7193P523K7930l2849j4087o7808J3935p3584J10233l4261J5585N6783
7375C352L634r7611m7320p1021N0638p3973j0674J5765R8183J81159k4254m2711
7363a4833j5524j148j03380P5012l3295l0555P0276j24802L5788J06939n8170
7352i3692k9619k5277k4906O6279m8566l5834M0830q4392P060J69066k9470L0925
$$ y = [54644, 29342, 83472, -2688, -11693, -25386, 81, -31278, -13003, -51612, -67434, 54076, 8110, -82042, -4988, 52898, -6548, 29603, 70291, -48126, -66732, -26692, -45000, -46925, -71403, -22044, -33556, -13422, -50701, -57043, -80236, -47630, -60443, -13073, 39095, -41951, -110440, -95538, -18341, -7447, -78948, -145322, -120943, -192649, -154475, -132614, -75322, 14826, -23241, -6048, 1475, 29405, -3444, -17531, -85339, -71404, -144988, -34755, -69016, -53431, 3352, 6986, -90625, -137945, -208966, -158328, -232301, -242975, -227210, -129027, 52132, 27878, -14833, -30357, -31505, -134885, -59873, -93168, -123723, -53447, -178249, -142461, -35522, -93692, -123311, -148588, -173494, -107215, -155781, -191615, -150785, -235177, -228117, -59051, -88521, -57596]
7340e7596m2187k6496O0495p6940l0801P4209J6616k829J47132p6655K5308k7157
7328a6901N153p2854N0470N1883N3271M9613N281O349Q6272J04019J04506m6609
7316C80453l1650j15566q1707K7188q2172k2611l2837J7238J2533o3082M3613
7305E1400p6285k7238m0145Q596l509j2289p113P9391L0862r1463Q4038j11584
7293a15339Q9676R556o7077j1991j3166M2399k4418L8297Q0363m0767o8670o7917
7281a49054N0905Q6895k3644j6374J64P9055j05721n3960J15295L3868m834j08753
7269i6158M4806J6021L5527o1254K4736K8233j5326k6278J8430q8747J13569o161
7257a2602n2821n001n3924q250J8118j2817R8136M3300N9001N1488k1223L5495
$$ y = [-57596, -99783, -126279, -65784, -142724, -173525, -99316, -82700, -85529, 61603, -15052, 10256, -16901, -11748, -84602, -34132, 17751, 71022, 120635, 125916, 132265, 218537, 322556, 427062, 380453, 348803, 233237, 151530, 178718, 96546, 73935, 41098, 58336, 70869, 7787, 51400, -24885, -52123, -92268, -83672, -87181, -99470, -106583, -27192, 3670, -87793, -3755, -115339, -25663, -16107, -83184, -95175, -108341, -65942, -90360, -52063, 28300, -12467, -81137, -149054, -98149, -11254, -34898, -51272, -51108, 27947, -77774, -131734, -16439, 17429, 12595, -96158, -51352, -35331, 196, -61058, -36322, -8089, -23415, -49693, -31263, -120010, -6441, -12602, -65423, -70424, -124348, -132598, -114480, -127297, -29161, 14139, 73140, 124628, 103405, 138900]
7245A38900o2315j51124R51J5807P9188R770J5187n5989l4001L1258n7430J7470
7233e2328l9494M4941m0131Q6809O6430K3986j33451L8880k7432P661P5365J1321
7221F2557J06914k1366j29457m0922J7374j9379j1605N7126M6230K9346o2576
7210C4242M4003m2634Q717K6977l3082o3633J04401m9109o409K2702l5653N636
7198A6158J7246n5715o9243N0263R4392n0520N8692M7989J100J36848l7412l0135
7186A79663J02703j13554o1786R4970j6735l6039M6165p9610j6537K1524L0753
7175A51517j5786N3613O7818j2263m5672r4820K3576K2810L2709M8416K9667L7916
7163B99501j0369j22857R3011M8022l8941o4852N9073l8966Q2359N613K6984o1891
$$ y = [138900, 76585, -74539, -73588, -57781, 21407, 31177, 46364, -9625, -43626, -12368, -69798, -52328, -91822, -46881, -87012, -203, 66227, 90213, -43238, -4358, -31790, -24129, 51236, 62557, 169471, 148105, 18648, -22274, -4900, -24279, -35884, 21242, 67472, 96818, 34242, 78245, 35611, 44328, 71305, 38223, -25410, 78991, 29882, 23473, 46175, 10522, 16158, 33404, -22311, -91554, -41291, 53101, 2581, 61273, 109262, 110362, 247210, 209798, 179663, 282366, 168812, 107026, 201996, 185261, 149222, 195387, 115777, 99240, 120764, 151517, 135731, 189344, 257162, 244899, 199227, 104407, 127983, 150793, 183502, 231918, 261585, 299501, 289132, 166275, 259286, 307308, 268367, 203515, 262588, 223622, 305981, 311594, 338578, 276687]
7151B76687L9176Q9876q203O1761j37558J09606J04447j09156l3572J44027J1127
7140E48218O4053J9444o0204j7829m160N2285Q4011J0453q56J51471J00316K5780
7128I72982Q064Q8342k7066L4293J00343J12349J21763J06815P726J66944J62605
7117A855160K00816Q1611P4223K40471J84088J92343L06275L22238L80299N02671
7107D340195N68984O14267O48082P54101Q39647O64207N62225M19221K58786N9449
7097I729164j38499k44067m00489m10966m07603k84464k50810k27763q4724m6949
7087G232830N8825J96690J89812K92951M38266N22968M80466M81561M84654K04812
7077A0583835P1114k94045n96711o59128p29324p23917p91207p54247p44824o17457
$$ y = [276687, 315863, 405739, 397536, 459297, 321739, 431345, 535792, 426636, 393064, 537091, 548218, 612271, 631715, 571511, 553682, 549522, 601807, 685818, 696271, 695415, 846886, 947202, 972982, 981046, 1069388, 1042322, 1076615, 1176958, 1289307, 1411070, 1517885, 1525611, 1692555, 1855160, 2055976, 2137587, 2211810, 2452281, 2636369, 2828712, 3134987, 3457225, 3837524, 4340195, 4909179, 5523446, 6171528, 6925629, 7765276, 8429483, 8991708, 9410929, 9669715, 9729164, 9590665, 9346598, 8946109, 8535143, 8127540, 7843076, 7592266, 7364503, 7279779, 7232830, 7291655, 7488345, 7678157, 7971108, 8409374, 8932342, 9412808, 9894369, 10379023, 10583835, 10654949, 10360904, 9764193, 9105065, 8375741, 7651824, 6860617, 6106370, 5361546, 4744089]
7067D744089n23755m33121l76399l92633l02903k14715j80656j15103j93141r7262
7057A914401j36322k81417l7224o6617k5998j1791k23366m1811j2123j25253o2519
7046H89960Q7602j57212j48991M7334m7161M169j9350j9023K7817k7222q6618
7035E51305n10l2268J0625o3248K3616p4341k3768k4327n0055J7658j10286M2258
7023B66659j3130J30875m6534m840L4010n8984p8369p6677m3244J0819N6264k3198
7011A53651P5880P2723o7248j8638J1073q0796o1235j1891r32P986O3435N5591
6999A99599J05166q1272j26796L1620N8520N3044n9373M284l6504j4049J7699
6988A51938l4667o4403O0523m5347m347J02126O5842j0343o4897k8989k5137N338
$$ y = [4744089, 4220334, 3787213, 3410814, 3018181, 2715278, 2500563, 2319907, 2204804, 2011663, 1914401, 1778079, 1496662, 1459438, 1392821, 1366823, 1355032, 1131666, 1089855, 1077732, 952479, 889960, 977562, 820350, 671359, 718693, 671532, 675701, 656351, 637328, 665145, 637923, 551305, 550795, 518527, 529152, 465904, 489520, 415179, 391411, 367084, 317029, 334687, 224401, 266659, 253529, 384404, 337870, 333030, 367040, 308056, 229687, 153010, 109766, 120585, 176849, 153651, 229531, 302254, 235006, 216368, 227441, 146645, 85410, 73519, 72587, 80573, 144008, 199599, 304765, 223493, 96697, 128317, 186837, 239881, 180508, 184792, 148288, 134239, 151938, 117271, 52868, 113391, 68044, 63697, 165823, 231665, 221322, 156425, 127436, 102299, 107637]
6976A07637m3756J28606l6912l6394J4033l4321K4089L2370k5814o6277Q4909
6965A48170K41n3223k5081o8107k0462O7552o9350m8379O9156O7096k560L7185
6953A02238J3702J3757l7665n2273k6092P1080o8372j30177L0976J37762m6179
6942H757R554Q6504k0412J2178l2371j2096n900N4979L8576n5373j24043Q8216
6930D8569L3810N6977q847n923L3016m3643l0095j9746j3647m1346n3503K153
6918d2225J18094Q8359j04905P181j03095p1862Q4063n3336m204P4513J18434
6907A11017K0979j12056r6520O8095J525l4063N6181M3485O4084q1074m9677K9312
6895B1288K2683J5472j41594J4296L3866M4434q1018k3814J40910Q0646k5824
$$ y = [107637, 63881, 192487, 155575, 119181, 133214, 98893, 122982, 155352, 129538, 63261, 148170, 148411, 95188, 70107, 2000, -18462, 49090, -20260, -68639, 517, 67613, 65053, 102238, 115940, 129697, 92032, 39759, 13667, 84747, 16375, -113802, -82826, 54936, 8757, 18311, 104815, 84403, 96581, 64210, 52114, 46214, 101193, 139769, 84396, -39647, 48569, 82379, 139356, 130509, 124586, 157602, 113959, 83864, 64118, 50471, 9125, -44378, -42225, 75869, 164228, 59323, 66504, -36591, -108453, -24390, -77726, -81930, -7417, 111017, 131996, 19940, -76580, -8485, -6960, -41023, 15158, 58643, 122727, 41653, -8024, 21288, 43971, 59443, -82151, -67855, -33989, 10445, -70573, -94387, 46523, 127169, 101345]
6884A01345j19944j41045J54389j3155j46321R3668P54O7935q2229l4215K9713
6873h9105j568k2111o0204J16971o5220N4686n450k7726k2607p8552J36575k7698
6861i2009j1617j12570L4009j7599J85903Q8744p3843j9749R788m6078j5428p06
6849g1155J4516M128P7429K1958j91032m4248P2962n7476M7594n3070K6570K3301
6837a28523N114K6576l6942j3239P5577j38151J21176J18384j12693o1222J8818
6826a25125K9920J9518k1720m1919J219P7570J48884j09258K6314k0673m5211
6815f0481l2022N0689P407J0495M8571P6378o6303Q367r0857o5118k9883P2267
6803g0490R2527L8744p8078j21223P085R3944P376P438n5743o0264L5791J0798
$$ y = [101345, -18599, -159644, -5255, -18410, -164731, -71063, -70309, -2374, -84603, -118818, -89105, -90673, -112784, -172988, -56017, -121237, -66551, -72001, -99727, -122334, -200886, -64311, -92009, -103626, -216196, -182187, -199786, -13883, 74861, 1018, -18731, -8943, -55021, -70449, -71155, -56639, -52511, 24918, 46876, -144156, -188404, -115442, -172918, -125324, -178394, -151824, -128523, -123409, -96833, -133775, -147014, -71437, -209588, -88412, 29972, -82721, -143943, -125125, -95205, -75687, -97407, -139326, -138107, -60537, 88347, -20911, 5403, -15270, -60481, -92503, -41814, -34407, -23912, 24659, 101037, 34734, 43101, -47756, -112874, -142757, -70490, 22037, 60781, -17297, -138520, -131435, -37491, -30115, -22677, -78420, -138684, -102893, -92095]
6791i2095j04479L9274M6688m3472k1731O9843K1171p8889r708L9390J31116k8468
6779c1360p4197n1904P2651M2663l5734L3839O14q3838r9895J81561K1804N7154
6767C3358j06595K6826J3690m2149k764l2938M4072O4880P032K4832L1335q3202
6755b1623K1738j14790J799O7069O4185r2320n9134O6298j0612J05506Q7114J7393
6743A32623j22114j8399p5050p3312m3782k956N6310K3925R5244M3930j52l7572
6731b1305N3849l3946l2713l6777K7810N3667N3858j07690J9191k6572O6467n387
6719A0452j25705K4653Q3081q5629N2351L1367n7440O8888L5845L5181l6307k945
6707C3792j013O2921m2342j21768K4640R2671o5969m3199R546L7499o5167J7925
$$ y = [-92095, -196574, -157300, -110612, -154084, -175815, -105972, -84801, -163690, -173398, -134008, -2892, -31360, -105557, -157461, -84810, -42147, -77881, -44042, -43428, -127266, -227161, -45600, -23796, 33358, -73237, -46411, -32721, -74870, -77634, -110572, -66500, -1620, 5412, 30244, 61579, -21623, 115, -114675, -112876, -45807, 18378, -73942, -133076, -66778, -77390, 28116, 115230, 132623, 10509, -7890, -82940, -156252, -200034, -202990, -146680, -122755, -27511, 16419, 16267, -21305, 32544, -1402, -34115, -70892, -43082, 10585, 64443, -43247, -24056, -50628, 15839, 10452, -115253, -90600, -7519, -93148, -40797, -9430, -66870, 2018, 37863, 73044, 36737, 33792, 32779, 95700, 53358, -68410, -43770, 48901, -17068, -60267, -50721, -13222, -78389, -60464]
6695f0464K7411j2076n8095K8926J939k4637K0103J1204J0753N7630l3993m5420
6683g6719P0783l5736R1173Q6420R0069p1473L6007m2059K5854j9233o0521Q8681
6671A83246N8855l8684r797k6931k9870O5203Q3580J1017j84179p3171J7155n9909
6659c485Q1034O1454P4957j12214N3559L4822j59015J37753J01599j41456N3713
6648A82721J68685K6393P6209j2717o565O6256j1273n328L3885q3548q3685N9020
6636D10053K4947k9595N7598J920l4663l5496K3162k0585q4449O4813R9598j37561
6624C39742j18979M0061j8098j9679O6158P4097r7482q5663l3188J0027l0391
6613A26605L2310P9830j34613R2069K6398M3632l9365l0165l0768n3037n699m770
$$ y = [-60464, -33053, -45129, -103224, -74298, -72359, -96996, -76893, -65689, -54936, 2694, -31299, -76719, -5936, -41672, 49501, 135921, 225990, 154517, 190524, 148465, 174319, 155086, 94565, 183246, 242101, 203417, 193620, 166689, 136819, 202022, 285602, 296619, 112440, 39269, 56424, -3485, 77549, 139003, 213960, 101746, 155305, 190127, 31112, 168865, 270464, 129008, 182721, 351406, 377799, 454008, 441291, 434726, 500982, 489709, 484381, 518266, 434718, 351033, 410053, 435000, 405405, 463003, 464923, 430260, 394764, 417926, 397341, 312892, 377705, 477303, 339742, 220763, 260824, 242726, 223047, 289205, 363302, 265820, 180157, 146969, 156996, 126605, 158915, 238745, 104132, 196201, 222599, 266231, 226866, 196701, 165933, 112896, 107197, 102427]
6601A02427N5586P8476r866j06882N461k4108K4473O4925J06052o6275l2703P0267
6589B67833j676j8808J7747N1631p5316P0511K9849R7816k8802m8014L643J66102
6577E32516N181l078j8853l965J50498P3780K0859q1751K6258m3057j1387K7634
6565F74635Q0927j47566o3835J06372K464m5515L1363P8677p1156q4858K6576
6554E88084j3343p8904m5841o0106L1813O000r891J08928K7970J6724m3821k8381
6542D99232N3757r6806N9086M5540r1639L2148l430l0553k0748J38591k0424J8994
6530E83748Q3978M7793o220j34671M5520o4678j0044L8184N2321J4396n5561L8182
6518F32948l1416J2561j06591j24317Q4450J74879m7858m6813P2915n9669r5161
$$ y = [102427, 158013, 236489, 226623, 119741, 125202, 101094, 125567, 190492, 296544, 230269, 197566, 267833, 266157, 247349, 265096, 316727, 241411, 311922, 341771, 439587, 410785, 362771, 366414, 532516, 537697, 534619, 515766, 511801, 662299, 736079, 756938, 675187, 701445, 658388, 647001, 674635, 755562, 607996, 544161, 650533, 652997, 607482, 638845, 717522, 646366, 561508, 588084, 574741, 495837, 449996, 389890, 421703, 427703, 417812, 526740, 554710, 571434, 527613, 499232, 552989, 456183, 515269, 560809, 469170, 501318, 497888, 467335, 446587, 585178, 564754, 583748, 667726, 715519, 709299, 574628, 620148, 555470, 545426, 583610, 635931, 650327, 594766, 632948, 601532, 614093, 507502, 383185, 467635, 642514, 594656, 547843, 620758, 561089, 465928]
6507D65928M0984K4400l6415K785n0117J6826N5085j0841K952p7032N3639O0461
6495E48655N9986N4778r0245P3425O6667m4811l0442L5568q0958Q7242j01774
6484E78091r1921J15048r8540J0457m8691R893J71952M4491j15595j19936N3598
6473E08847L4886j7366N922N2885N2183m1330j24833J4175K4040P0222Q3341j49851
6461E13121R3057M3094k0746q5013N1720M5413N7774K1959J02502O5150m2218
6450H45813N2158j39667Q013K2781j00871k9980Q0831n7927J32141m2274N742
6439G76760Q1216q8497n8960Q2635J51217r7542l9987R5727J57348K9975J2869
6428A102761L7215M9929P8740k9850K767J6210r6703k9539K08113Q7141r8015
$$ y = [465928, 506912, 531312, 494897, 497682, 447565, 464391, 519476, 508635, 511587, 434555, 488194, 548655, 608641, 663419, 573174, 646599, 713266, 668455, 638013, 673581, 592623, 679865, 578091, 486170, 601218, 502678, 513135, 464444, 474337, 646289, 690780, 575185, 455249, 508847, 543733, 526367, 532289, 585174, 637357, 596027, 471194, 485369, 509409, 579631, 662972, 513121, 606178, 649272, 628526, 543513, 595233, 640646, 698420, 720379, 822881, 888031, 845813, 897971, 758304, 766317, 789098, 688227, 658247, 739078, 681151, 813292, 771018, 776760, 857976, 769479, 710519, 793154, 944371, 846829, 806842, 902569, 1059917, 1089892, 1102761, 1139976, 1189905, 1268645, 1238795, 1241562, 1257772, 1161069, 1131530, 1339643, 1426784, 1328769]
6417A328769n4117o0411N7889J44933m8036J02870K7985o4403k5393k8699M9551
6406A430938L3013j9545N4913P7830O1474L5094n2203r1248N0005j0447O0087
6395A629911J64752J11451O1843P652L7687o1255J77105N0594Q9892J33454J1866
6384B414952l6849L8294N9276N2213P5850J51393P9097P0533K7923J97042J51108
6373C280832M6268J44350J02931J5329R8589J45728J21606J62987J17274R7373
6363D333267K10054J86766J44951L23586L30883L55578L07600L29013L66122M62711
6353G350531M25508M50617N35559N21107P11620Q79979Q70014J030069J319936
6344A4094940J628265J847914K261194K873481L707653M972198O654723Q188004
$$ y = [1328769, 1274652, 1214241, 1272130, 1417063, 1369027, 1471897, 1499882, 1435479, 1410086, 1381387, 1430938, 1463951, 1444406, 1499319, 1577149, 1638623, 1673717, 1621514, 1530266, 1580271, 1569824, 1629911, 1794663, 1906114, 1967957, 1975609, 2013296, 1952041, 2129146, 2179740, 2269632, 2403086, 2414952, 2378103, 2416397, 2475673, 2527886, 2603736, 2755129, 2834226, 2904759, 2932682, 3129724, 3280832, 3327100, 3471450, 3574381, 3589710, 3688299, 3834027, 3955633, 4118620, 4235894, 4333267, 4543321, 4730087, 4875038, 5198624, 5529507, 5885085, 6192685, 6521698, 6887820, 7350531, 7776039, 8226656, 8762215, 9283322, 9994942, 10874921, 11744935, 12775004, 14094940, 15723205, 17571119, 19832313, 22705794, 26413447, 31385645, 38040368, 46228372]
6336D6228372Q668130P477938M462046N11700k996417m997360n306153m623131
6328D9425125l301484j512855P07346K987024N294033O797950O062272L410167
6320F9869578n79122m385013p085649q159086p842888o586813n522691m535031
6312B5173285l599475k816017k133658j603677j297319j100934r02630o75684
6304A1043891m94517n42023l34141l64164k47232o3232K1827q8302M0720J39597
6294I112424K3572O2598J14150J21464K49968J73490L65754M15220L47037M81175
6284A1466852M50777N81869O00980N37244P00859Q68064R35032J074733J489120
6275A8705530J625664K071100K449212K818949L204029M257226N572795P495174
$$ y = [46228372, 54896502, 62374440, 66836486, 67348186, 64351769, 59354409, 54048256, 49425125, 46123641, 44610786, 45318132, 48305156, 53599189, 60397139, 66459411, 69869578, 69290456, 64905443, 57819794, 49660708, 41817820, 35231007, 29708316, 25173285, 21573810, 18757793, 16624135, 15020458, 13723139, 12622205, 11719575, 11043891, 10549374, 10007351, 9673210, 9309046, 9061814, 8998582, 9020409, 8932107, 8972827, 9112424, 9135996, 9198594, 9312744, 9434208, 9684176, 9857666, 10223420, 10638640, 10985677, 11466852, 11917629, 12499498, 13100478, 13637722, 14338581, 15206645, 16141677, 17216410, 18705530, 20331194, 22402294, 24851506, 27670455, 30874484, 35131710, 40704505, 48199679]
6267D8199679R967754J2268805J3720018J2497243Q209462K428741l238557p026519
6259I7026626q369668p829043n945671l237497k42956L210787O811518R034119
6251I0458215Q850162N625215K48352n316034r583932j1646293j1708073j0589886
6243E6337726r077511p553026o174190m933450l951465l123830k386043k042074
6235A7096137j556125j443648j219146r30149q25647q42823p29991o16808l59388
6226H572412m42513l28163k63303k32790l30399k24643j87103k92312k31006k43340
6216E796840k22260k23022j93373q3790j71619m6616j66869j10264p241j2451
6206D559335m9235j7935k9364j55718j47610j05028n1906j58332p8105n5580r6735
$$ y = [48199679, 58167433, 70436238, 84156256, 96653499, 104862961, 107291702, 104053145, 97026626, 88656958, 80827915, 74882244, 71644747, 71401791, 74612578, 81424096, 90458215, 99308377, 104933592, 105181944, 99865910, 90281978, 78635685, 66927612, 56337726, 47260215, 39707189, 33532999, 28599549, 24648084, 21524254, 19138211, 17096137, 15540012, 14096364, 12877218, 11947069, 11121422, 10278599, 9548608, 8931800, 8572412, 8129899, 7801736, 7538433, 7305643, 6975244, 6750601, 6563498, 6271186, 6040180, 5796840, 5574580, 5351558, 5158185, 5074395, 4902776, 4856160, 4689291, 4579027, 4571786, 4559335, 4510100, 4492165, 4462801, 4307083, 4159473, 4054445, 4002539, 3844207, 3766102, 3710522, 3613787]
6195C613787m9236n0997q6562L9392Q8205r929r4260M7114M2022k9805p7749j22910
6183C309072n3454P1179J586r8705P901O6779m106k766J2513p353j77502N0392
6171C175536M2038k6569J22989P1318P0198j16507K4836q7495k2609n0353Q2299
6160C285681k5536p2920q4728l8642J8293O9890J17014o1969k8408j7143Q4195
6149C245727K4756J24759L7095n7423J257P5710N9997Q0306J67341J09303J8311
6138C887139J30061L1268J53534J25161J45530P4707j317P5701J9877L6158K28694
6127D906513J40773J73894K25152J30585J91895J09523K58885J77548O8932J47156
6117F530856J33552J84577N0754P0834J81973J3814L0185J38127J08941J72777
$$ y = [3613787, 3564551, 3513554, 3426992, 3466384, 3554589, 3544660, 3450400, 3497514, 3539536, 3509731, 3431982, 3309072, 3255618, 3326797, 3328383, 3229678, 3237579, 3304358, 3300252, 3297486, 3309999, 3302646, 3125144, 3175536, 3217574, 3191005, 3313994, 3385312, 3455510, 3339003, 3363839, 3276344, 3253735, 3203382, 3285681, 3260145, 3187225, 3102497, 3063855, 3082148, 3152038, 3269052, 3207083, 3178675, 3161532, 3245727, 3270483, 3395242, 3432337, 3374914, 3376171, 3451881, 3511878, 3592184, 3759525, 3868828, 3887139, 4017200, 4048468, 4202002, 4327163, 4472693, 4547400, 4546083, 4621784, 4641661, 4677819, 4906513, 5047286, 5221180, 5446332, 5576917, 5768812, 5878335, 6137220, 6314768, 6383700, 6530856, 6664408, 6848985, 6899739, 6970573, 7152546, 7166360, 7196545, 7334672, 7443613, 7616390]
6107G616390L12297K71502K88409K96916K11835J96420J42394K80012K38185J75359
6097A0029719O2089j1208Q3439J51018R8578K64129J04338K46142K22728J63120
6087A1414092J47631K22326R6806O777J29384J73503J79590J08855Q4560J96231
6077A2759755J95577K71452L66311K95816M42117M50953M97783N92347N40856
6068A6412967M50514M47985M19648M25696K27546K45952K76633J16992K56915
6059A9280848K49118L27361M72391M91260O48725Q48665J123399J356189J682508
6050B6480464K009802K403862K916546L596532M578563N807695Q017075J0671148
6042F6481687J2796512J3471554J1151632O062582l61256n809964r217508j0332947
$$ y = [7616390, 7928687, 8200189, 8488598, 8785514, 8997349, 9193769, 9336163, 9616175, 9854360, 10029719, 10091808, 10080600, 10164039, 10315057, 10413635, 10677764, 10782102, 11028244, 11250972, 11414092, 11561723, 11784049, 11880855, 11887632, 12017016, 12190519, 12370109, 12478964, 12563524, 12759755, 12955332, 13226784, 13593095, 13888911, 14331028, 14781981, 15279764, 15872111, 16412967, 16863481, 17311466, 17731114, 18156810, 18384356, 18630308, 18906941, 19023933, 19280848, 19529966, 19857327, 20329718, 20820978, 21469703, 22318368, 23441767, 24797956, 26480464, 28490266, 30894128, 33810674, 37407206, 41985769, 47793464, 55810539, 66481687, 79278199, 92749753, 103901385, 109963967, 109602711, 103792747, 94575239, 84242292]
6034H4242292r840041q380932o966763n666616m341565l150763k218260j251905
6026D2425447m82201M00354J092304K134129L410040N306352P727831J0477709
6018G2491965J2491062J2228928Q664787K541460m131972r138345j1659562j1709605
6010G1778718j0475880q909068p381869n964198m546100l542675k671084k147082
6002B6140762j580723j211080j062162p97679o22592n31034k38475k04569j74349
5993A9718099m6687K27383K26099K96182N18968O49156O89605Q55535J027246
5984B4161586J089922J362402J599451J953982K285213K503300K482497K669677
5976D0108030K780023K781357L216122L970280N495312P073556P940182P111083
$$ y = [84242292, 74402251, 66021319, 59054556, 53387940, 49046375, 45895612, 43677352, 42425447, 41943246, 42343600, 43435904, 45570033, 48980073, 54286425, 62014256, 72491965, 84983027, 97211955, 105876742, 108418202, 104286230, 95147885, 83488323, 71778718, 61302838, 52393770, 45011901, 39047703, 34501603, 30958928, 28287844, 26140762, 24560039, 23348959, 22286797, 21489118, 20866526, 20335492, 20097017, 19892448, 19718099, 19671412, 19898795, 20124894, 20421076, 20940044, 21589200, 22278805, 23134340, 24161586, 25251508, 26613910, 28213361, 30167343, 32452556, 34955856, 37438353, 40108030, 42888053, 45669410, 48885532, 52855812, 58351124, 65424680, 73364862, 80475945]
5968H0475945M019861j71693m085018o408204p123096o578867n521620m329872
5960E0277436l021683j953434j084438m62038L61207Q81016J351203J659637K060544
5951E0069450K681453L454464M807433O504209P901214Q051602O004523K212484
5943I1686832k551444o279446q350380q515115p858431o766445n685529m679049
5935D1000993l940275l204114k511265k077655j743762j623841j359940j268534
5927B3271607j175751j109922j014951j005356r66307q75986q57139r40043p16934
5918A4609218o40615o70170o63758p26293n92822n30089m76763l71589m21935
5909I515184l70491l38193k78497k37929k50105j91984j95743j16503q2025j58666
$$ y = [80475945, 84495806, 84324113, 80239095, 73830891, 66707795, 60128928, 54607308, 50277436, 47255753, 45302319, 44217881, 43755843, 44117050, 44998066, 46349269, 48008906, 50069450, 52750903, 56205367, 61012800, 67517009, 75418223, 83469825, 89474348, 91686832, 89135388, 82855942, 74505562, 65990447, 58132016, 51365571, 45680042, 41000993, 37060718, 33856604, 31345339, 29267684, 27523922, 25900081, 24540141, 23271607, 22095856, 20985934, 19970983, 18965627, 17999320, 17123334, 16266195, 15326152, 14609218, 13968603, 13298433, 12634675, 11908382, 11315560, 10785471, 10308708, 9937119, 9515184, 9144693, 8806500, 8528003, 8290074, 8039969, 7847985, 7652242, 7535739, 7453714, 7295048]
5899G295048m7558k6806J7803K7442n6623J28799J61310J15247J66511N7756L0244
5888G869173j66302j63433k65595l37683k95426k72670j85559k66968l07877j71851
5878E435809j80178j56376r5966j00417k51512L0285j4129j70667k3418N5350
5868D528781K3027k1600O7782o1428n255j48142j79734o0310j51390k16570k28084
5857C547077k15591j24341j16358j53470j14341n6642n5667o7254q2738j17805
5847B442870l6738j4724j18703j17070k0748m3663J5592o0795P220j00704p196
5836A945341k0599j61878P7673J12777j51621n2490J5103o1780q1930l4800O1773
5825A647569j819K4638N2051n8050M6829k1907j04660K5907n1630j8407j8592
$$ y = [7295048, 7247490, 7220684, 7238487, 7265929, 7209306, 7338105, 7499415, 7614662, 7781173, 7838929, 7869173, 7702871, 7539438, 7273843, 6936160, 6640734, 6368064, 6182505, 5915537, 5607660, 5435809, 5255631, 5099255, 5003289, 4902872, 4651360, 4681645, 4667516, 4496849, 4473431, 4528781, 4551808, 4530208, 4597990, 4536562, 4531307, 4383165, 4203431, 4143121, 3991731, 3775161, 3547077, 3331486, 3207145, 3090787, 2937317, 2822976, 2766334, 2710667, 2643413, 2560675, 2442870, 2406132, 2391408, 2272705, 2155635, 2134887, 2091224, 2106816, 2046021, 2053241, 1952537, 1945341, 1924742, 1762864, 1840537, 1953314, 1801693, 1749203, 1764306, 1702526, 1620596, 1585796, 1647569, 1645750, 1670388, 1722439, 1664389, 1711218, 1689311, 1584651, 1610558, 1558928, 1540521, 1521929]
5814A521929m2053Q9833m5275n0828m3938p8046L4793m8393l3965p0459P2585
5803A306183L6067K4023J9959M8273L4471K5433J5021J14328K6857j6791k1862
5792A611962j7274p3348J62460Q4105J92009J44336J09932p8879R5403P6549M1700
5781B348955N4299J98919J87832L7485J05152J57541K74199M34038M28573N95633
5771D822626O39330R30907J243216J912358L214135O106141Q227499P652442K865783
5762C7614437l284796n537870o369333n139106m154319k903675k185909j650254
5754F389175j233281q91725o19894l60598k61494k88012k78201j83357j54135
5745B118478j78556j31009l6650r9523r4067k19776N7383J6630n9470P4637o9324
$$ y = [1521929, 1479876, 1569709, 1524434, 1473606, 1429668, 1351622, 1386415, 1338022, 1304057, 1233598, 1306183, 1342250, 1366273, 1386232, 1434505, 1468976, 1494409, 1509430, 1623758, 1650615, 1633824, 1611962, 1594688, 1521340, 1683800, 1767905, 1959914, 2104250, 2214182, 2135303, 2230706, 2307255, 2348955, 2403254, 2602173, 2790005, 2827490, 2932642, 3090183, 3364382, 3798420, 4226993, 4822626, 5461956, 6392863, 7636079, 9548437, 12762572, 18868713, 27096212, 34748654, 37614437, 34329641, 28791771, 22422438, 17283332, 13129013, 10225338, 8039429, 6389175, 5155894, 4264169, 3644275, 3283677, 3022183, 2734171, 2455970, 2272613, 2118478, 1939922, 1808913, 1772263, 1672740, 1578673, 1358897, 1416280, 1432910, 1373440, 1448077, 1378753]
5734A378753j49747J911O4158k6480k2312P5404N1402J23094J0617k9932m8039
5723A428829m9897n6358m3962M0876j58371k1902k5388N5118k2764m0472q4128
5712A021581k0120o7129J2237K3665n2142o4467L863J30973J31316n2226o5070
5701A002481Q382l8244l9811M5599r5680j09755j8544P7276l7563n4127m1746
5690F98268p9489m5771M6105m2734n7825k3796P5472n7518q5982J6636O5389K0722
5678E29477m0712O9078N9862q0822q6081j25213J31868J71893j71062K5465l8259
5667D45494K017J33368j27329K5788k8659M0158J53620L8506J6804l1636k1306
5656F46825Q5817P1037n6730L0413J4959p5250r3494p4769N6926P0089j5153n4276
$$ y = [1378753, 1229006, 1230917, 1295075, 1268595, 1246283, 1321687, 1373089, 1496183, 1506800, 1476868, 1428829, 1378932, 1322574, 1278612, 1319488, 1161117, 1139215, 1113827, 1168945, 1146181, 1105709, 1021581, 1001461, 934332, 946569, 970234, 918092, 853625, 857488, 988461, 1119777, 1067551, 1002481, 1010863, 972619, 932808, 978407, 882727, 772972, 754428, 831704, 794141, 740014, 698268, 618779, 573008, 619113, 576379, 518554, 494758, 570230, 512712, 426730, 443366, 508755, 529477, 488765, 557843, 617705, 536883, 450802, 325589, 457457, 629350, 458288, 483753, 445494, 447511, 580879, 453550, 479338, 450679, 490837, 644457, 682963, 699767, 668131, 646825, 732642, 803679, 746949, 777362, 792321, 717071, 623577, 548808, 605734, 675823, 660670, 606394]
5644F06394q4799q658N5160n567j7560J4789J8749O468N0494J02990L8976N6512
5632H33948j8295o0355Q5749J0518p1330l7344m8054M057k1147K072n1879P2233
5620G00173J1896R8835k8097r5649Q5490j4661O4440m8018O652m4472N3007j4385
5608G75211o6410k3098K1552J23505Q330q3320o2579L5303n7650J588J69501L4350
5596H76283J02207l6529j23015K6710l1683P4034J4304L2100L3290p6346L5585
5585I26940J00402N4312L5257q7445N7367j07655R4214Q5575j20321r5954m6772
5574H95920R1585j3383n6910J13256j953j04576K9240Q0707r4681J68965J21604
5563A229774r2465n379l1956j37398j1947N731j00086J0911r2400M5270j7442
$$ y = [606394, 521595, 512937, 568097, 562530, 544970, 559759, 578508, 584976, 635470, 738460, 777436, 833948, 815653, 755298, 841047, 851565, 780235, 742891, 694837, 698894, 677747, 679819, 627940, 700173, 712069, 810904, 782807, 687158, 772648, 757987, 822427, 774409, 781061, 736589, 789596, 775211, 708801, 685703, 707255, 830760, 839090, 755770, 693191, 728494, 670844, 672432, 841933, 876283, 978490, 941961, 818946, 845656, 813973, 888007, 902311, 934411, 967701, 891355, 926940, 1027342, 1081654, 1116911, 1029466, 1086833, 979178, 1073392, 1158967, 1038646, 942692, 895920, 987505, 974122, 917212, 1030468, 1028515, 923939, 953179, 1033886, 939205, 1108170, 1229774, 1137309, 1131930, 1099974, 962576, 950629, 956360, 856274, 867185, 774785, 820055, 802613]
5552H02613m0908J8308m0313P814n6323q8557l010L8561j24760J02850O1163j23802
5540E53636j3082j03147M8092P9051n32l1928j6174J0992J9906l3020j36496o8240
5528C09058O6191p023m3707J71537L1095l556J8591l6175J16164k2595k5274n2769
5516E21537J3306j7473q1191M3640R5446P5195K1131p9864r4724O1342m7163L0804
5504E41986J8081p5046J6725j4839N1891P7509r4058j97352j1780J64726N948
5493D83791j10437J4165O463O81J6742O148k7700R2892k4334k0199l8398j6023
5481C83791N6548M6142j6765n762j20162k9551J19470Q1410M4210k3212k0010
5470E16109j5889R991P497l0359n161K2895q5296j0913Q6285k6906j1315O4377
$$ y = [802613, 761705, 780013, 739700, 747514, 691191, 602634, 599624, 638185, 513425, 616275, 677438, 553636, 540554, 437407, 485499, 564550, 564018, 532090, 515916, 526908, 546814, 513794, 377298, 309058, 375249, 368226, 324519, 496056, 527151, 523595, 542186, 506011, 622175, 599580, 574306, 521537, 534843, 517370, 436179, 479819, 575265, 650460, 671591, 591727, 497003, 558345, 511182, 541986, 560067, 485021, 501746, 486907, 538798, 616307, 522249, 324897, 313117, 477843, 483791, 373354, 387519, 393982, 394663, 411405, 417553, 389853, 482745, 458411, 438212, 399814, 383791, 440339, 486481, 469716, 463954, 343792, 314241, 433711, 515121, 559331, 536119, 516109, 500220, 510211, 517708, 487349, 482188, 505083, 419787, 408874, 495159, 468253, 456938, 521315]
5458E21315J7218j95878j5050J07964J8267K1270j5477n4127k1307M045R3163
5447D81403P2406m4613O425l4997k687m044N2224j8729J5962k4761M9969P405
5435E55963n2036j9033m7283n0827Q4681O6102r6955j0685J17416R2784p558m8575
5423E83994m0042J9695l2694k7869Q1492P8162m0907n8031J20341J2169q3484
5412F12826M2252K5802L0731p0830j4384q448l3845J06799N2008r0541n6034k7246
5400E69090q878K3550N9444N5349j4158p1174K8538P9817j3235j11373L2672J7446
5388F47088M3049L6056o5472J12260K5470o7600O6727l3300o6010J8737j1356
5377G05649L5263j1468j3107J05528k312j08866j1217O4183P4924l0558Q0781
$$ y = [521315, 538533, 342655, 327605, 435569, 453836, 475106, 459629, 405502, 384195, 388240, 481403, 553809, 509196, 515621, 480624, 477937, 473893, 526117, 507388, 523350, 498589, 548558, 555963, 503927, 484894, 437611, 386784, 471465, 537567, 440612, 429927, 547343, 640127, 632569, 583994, 543952, 563647, 530953, 503084, 584576, 662738, 621831, 563800, 684141, 696310, 612826, 655078, 680880, 711611, 640781, 626397, 617949, 584104, 690903, 742911, 652370, 596336, 569090, 560212, 583762, 643206, 698555, 684397, 613223, 641761, 721578, 708343, 596970, 629642, 647088, 690137, 726193, 660721, 772981, 798451, 730851, 797578, 764278, 698268, 717005, 705649, 740912, 729444, 716337, 821865, 819553, 710687, 699470, 763653, 838577, 808019, 888800]
5366H88800o2360p29L4951p4541l3089j1731J5700o7952j3352J00471k1564K390
5354G56994M9129N2757L7295m8093J3081P3786n8480M8831k732q014K6562k3076
5342I18040K3370L6197q0315N2722O9576j42682N0024m87k3491L0254o8539J83821
5330A048490R0580m246J05M9954k7678L930j3906L2278N7082P3030K7480k8184
5318A308915J31752N5239l9717P4456P696p2000N7785J3647j5801J9632O7191
5307A608795j6773j7852j9758K1176J8785J7658j03465O8757r375J15542J42003
5296A825493R1304J3122J2280l2265L3286N2852N855Q9059k76K5899R8165P0014
5284B284788J04793n2567K4800K8521K2117J1451P3931J01978R7166Q7612R7232
$$ y = [888800, 826440, 825711, 860662, 786121, 753032, 741301, 757001, 689049, 675697, 776168, 754604, 756994, 806123, 858880, 896175, 848082, 861163, 934949, 876469, 925300, 922568, 914554, 941116, 918040, 941410, 977607, 897292, 950014, 1019590, 876908, 926932, 926445, 902954, 933208, 864669, 1048490, 1139070, 1134824, 1134929, 1184883, 1157205, 1161135, 1147229, 1179507, 1236589, 1309619, 1337099, 1308915, 1440667, 1495906, 1456189, 1530645, 1538341, 1466341, 1524126, 1537773, 1521972, 1541604, 1608795, 1592022, 1574170, 1554412, 1575588, 1594373, 1612031, 1508566, 1577323, 1567948, 1683490, 1825493, 1916797, 1929919, 1942199, 1909934, 1943220, 1996072, 2001927, 2090986, 2090710, 2116609, 2214774, 2284788, 2389581, 2337014, 2361814, 2390335, 2412452, 2423903, 2497834, 2599812, 2696978, 2784590, 2881822]
5273B881822k5717N1533J08314l2717R8232j2236L7725R6895Q4315K7499M8247
5262C363912L679Q4320J37325J02046J03902J05410P1467p6186K63545L11176
5252D470596J10755M7731J71351J44336P3638J36159R5325J80965L07909K61727
5242F000492J45739J97189K80746K29496K62493L96039L65475L84155L83590L37552
5232H982966L97020P23509N89827P59095J030372J039686J322228J668348J967994
5223A8481045K698143L248595L500264L066958J963319P65997k91018n09811j58972
5214C2764520L89371J426601K574318L913251N344124O282108O022814M571401
5206F3288508K652844J044108N58713N91298N15907L06992L55163J417086K854719
$$ y = [2881822, 2856105, 2907638, 3015952, 2983235, 3081467, 3069231, 3106956, 3203851, 3288166, 3315665, 3363912, 3367591, 3451911, 3589236, 3691282, 3795184, 3900594, 3972061, 3895875, 4159420, 4470596, 4581351, 4629082, 4800433, 4944769, 5018407, 5154566, 5249891, 5430856, 5738765, 6000492, 6146231, 6343420, 6624166, 6853662, 7116155, 7512194, 7877669, 8261824, 8645414, 8982966, 9379986, 10103495, 10693322, 11452417, 12482789, 13522475, 14844703, 16513051, 18481045, 21179188, 24427783, 27928047, 30995005, 32958324, 33724321, 33433303, 32923492, 32764520, 33153891, 34580492, 37154810, 41068061, 46412185, 52694293, 58717107, 63288508, 65941352, 66985460, 67544173, 68135471, 68651378, 68958370, 69313533, 70730619, 73585338]
5197G3585338M230640M502952K984954J100404J83729N21394J611962K191185
5189I0912558J761656O48370j36040J8152K12350l95766j387577j727261j147424
5180H8759018N77007J750442J270130r91145l186825m276482l986985k614503
5172G7300657j305310n33546o601Q55141J823075K096441J066602r51800k950951
5163G7393708m074763m088123l003026j646877n8864J510389L176844M498089
5155G3707377N476327N266887L835508J657690q81459l119018m658724n606735
5147G5677853o329521o423586o259915n832517n059909m479134m044903l427945
5139C3820423k961105k582604k188807k020018j806784j474721j336682j160214
$$ y = [73585338, 77815978, 82318930, 85303884, 86404288, 86588017, 87109411, 88721373, 90912558, 92674214, 93322584, 93186544, 93204696, 93417046, 93021280, 91633703, 89906442, 88759018, 89336025, 91086467, 92356597, 91365452, 88178627, 83902145, 79915160, 77300657, 75995347, 75461801, 75455200, 76310341, 78133416, 80229857, 81296459, 80344659, 77393708, 73318945, 69230822, 66227796, 64580919, 64522055, 66032444, 69209288, 73707377, 79183704, 84450591, 88286099, 89943789, 89062330, 85943312, 81284588, 75677853, 69348332, 62924746, 56664831, 50832314, 45772405, 41293271, 37248368, 33820423, 30859318, 28276714, 26087907, 24067889, 22261105, 20786384, 19449702, 18289488]
5131A8289488j106953r48158p71198p30240o52276o07872m95950n33528m67729
5122A1975584m19143n35584l68737k82599l94673k37434k54637k84107j79773
5113I018897k39584k67443j89316j56829j17883j85785j48509k78228k5393j40632
5103G269295j99646k0371j08113j27474j85955q4713j37760j93792j70408j09669
5093E931394j46166r2773j63924P999q2915j38165j37485r7738o4046M619q8990
5082D931810r7217K2459j07564n5659J8042j1592R298k37420J2351K7179m158
5071D507529r5334o5718J10482n6993j0740m5748Q809P8675j09433M1427k6180
5060D336776l1446J27791L5978k5802n413m1458j3655K0147j02736O2421N2510
$$ y = [18289488, 17182535, 16234377, 15463179, 14732939, 14080663, 13472791, 12976841, 12443313, 11975584, 11556441, 11020857, 10652120, 10369521, 9974848, 9737414, 9482777, 9198670, 9018897, 8779313, 8511870, 8322554, 8165725, 8047842, 7862057, 7713548, 7435320, 7409927, 7269295, 7069649, 7049278, 6941165, 6813691, 6627736, 6543023, 6405263, 6211471, 6041063, 5931394, 5785228, 5692455, 5528531, 5536530, 5453615, 5315450, 5177965, 5080227, 5016181, 5020800, 4931810, 4834593, 4857052, 4749488, 4693829, 4711871, 4700279, 4709577, 4472157, 4484508, 4511687, 4507529, 4412195, 4346477, 4456959, 4399966, 4389226, 4343478, 4352287, 4430962, 4321529, 4362956, 4336776, 4305330, 4433121, 4469099, 4443297, 4437884, 4396426, 4382771, 4402918, 4300182, 4362603, 4415113]
5049D415113j22285j63796P5329N7537m7766k2319M9724M6414k4827P556j7915
5038D252765L5694Q055O5456M1411L1991L2225P0608N4811j04325J11706J04646
5027D705043L5652J1246l4352P047K2674j15410n8544k1200M959J03031o8203
5016D591943q5861K722j2412o1923k6603M3997J15313l5735O814M4638L8404L8660
5004D659957m6343L2488m0348J0593J704l6679j18801Q4570l8082j19805m7386
4993D341868J3895P9202R4274k1058m3920Q2919J61261N1390R9311J17522K50406
4982E227070K83699K07619J58242p8946o3163p763j05447j73472o2150L9512O7775
4971E492976O3986l8717J6389L8312R8429L0444O885O2946K05301K6324J0036
$$ y = [4415113, 4292828, 4129032, 4204361, 4261898, 4214132, 4191813, 4241537, 4287951, 4263124, 4270680, 4252765, 4288459, 4296514, 4361970, 4403381, 4435372, 4467597, 4538205, 4593016, 4488691, 4600397, 4705043, 4740695, 4751941, 4717589, 4724636, 4747310, 4631900, 4573356, 4552156, 4557115, 4660146, 4591943, 4506082, 4508804, 4496392, 4434469, 4407866, 4451863, 4567176, 4531441, 4538255, 4582893, 4621297, 4659957, 4613614, 4646102, 4605754, 4616347, 4618051, 4581372, 4462571, 4547141, 4509059, 4389254, 4341868, 4355763, 4434965, 4529239, 4508181, 4464261, 4547180, 4708441, 4759831, 4859142, 4976664, 5227070, 5510769, 5718388, 5876630, 5797684, 5734521, 5726758, 5621311, 5447839, 5385689, 5425201, 5492976, 5556962, 5518245, 5534634, 5572946, 5671375, 5701819, 5708704, 5771650, 5976951, 6003275, 6013311]
4960F013311P0926Q4554J29721O5812J54713P3031K18605K63201K00442K42383
4950G516699L68512K00226K53245J66681N7321J16978n1665K056k3183P7473J04256
4939H788599J09463J78416J47642K72070L16457K04613K74929R5372K06719J79513
4929A0773793k2553J9361K38833K16827Q7236K75397J66431J76577M5824K64693
4919A2242419K71691K86567J92391J53143K15333M21274L12368K67729L74556
4910A4737471M32955L90090L71351M00534L68835L33692N35436M45615N46390
4901A8562369L55084M00550N80862M83831N06186M11290K57246K54966J16077
4892B1928461J6406J39008J91404K05696K73473L30153N43801M76201N71703P46557
$$ y = [6013311, 6084237, 6168791, 6298512, 6364324, 6519037, 6592068, 6810673, 7073874, 7274316, 7516699, 7885211, 8085437, 8338682, 8505363, 8562684, 8679662, 8627997, 8630053, 8606870, 8684343, 8788599, 8898062, 9076478, 9224120, 9496190, 9812647, 10017260, 10292189, 10387561, 10594280, 10773793, 10751240, 10770601, 11009434, 11226261, 11313497, 11588894, 11755325, 11931902, 11977726, 12242419, 12514110, 12800677, 12993068, 13146211, 13361544, 13782818, 14095186, 14362915, 14737471, 15170426, 15560516, 15931867, 16332401, 16701236, 17034928, 17570364, 18015979, 18562369, 18917453, 19318003, 19898865, 20382696, 20888882, 21300172, 21557418, 21812384, 21928461, 21944867, 22083875, 22275279, 22480975, 22754448, 23084601, 23628402, 24104603, 24676306, 25422863]
4882B5422863O86353Q31460P50221O45687N01086N62801O09530O34455N55450
4873C1199906P46176R55595R82297J139016J247708J391472J427923J542797J676722
4864D2309612J680728J851508J966098K070521K157541K281760K329056K734500
4856E9381324L219936M228136N788914Q155110R296704Q340411M194796J519564
4848A04124895R45083J453193K948002M116199N106380N393094N439280N045501
4840A34571627M576447L759921K813062J919759J397339Q01368M88605J11631
4832A50439759l49404o88622p63185n87169J5504Q20098J647762K886848L983010
4823A57404601N030371N960054O795143P449672Q125898Q702111Q916119Q752131
$$ y = [25422863, 26109216, 26940676, 27690897, 28336584, 28837670, 29400471, 30010001, 30644456, 31199906, 31946082, 32901677, 33883974, 35022990, 36270698, 37662170, 39090093, 40632890, 42309612, 43990340, 45841848, 47807946, 49878467, 52036008, 54317768, 56646824, 59381324, 62601260, 66829396, 72618310, 80773420, 90070124, 98410535, 102605331, 104124895, 105069978, 106523171, 109471173, 113587372, 118693752, 124086846, 129526126, 134571627, 139148074, 142907995, 145721057, 147640816, 149038155, 149839523, 150328128, 150439759, 150090355, 149401733, 148638548, 148051379, 148066883, 148886981, 150534743, 153421591, 157404601, 162434972, 168395026, 175190169, 182639841, 190765739, 199467850, 208383969, 217136100]
4815B17136100P798205O322961M117483J654375o72683k627617m067288m998700
4807B24662836n542576n126971l986480j479485K979166P638641R554213N895537
4799B34594881k483378r722189j2861701j2514180r761850o385096l569358j112535
4791A76184594R69700L048345N222251P017645Q946974J1194768J4479148J7647226
4783B44710651J8307408J5258245R884594P363838P372982O003507L14095q534870
4775C00680450j5237039j7785625j6680759j3399857j0043409p256064n240021
4768B15037676l627856k282796j091268N67311K736663O509855J1419132J5263306
4760B44532023J4395450P154201k993386r909653j2255471j0817130p368863l842472
$$ y = [217136100, 224934305, 231257266, 235374749, 237029124, 236356441, 233728824, 229661536, 224662836, 219120260, 213993289, 210006809, 208527324, 211506490, 219145131, 228699344, 234594881, 232111503, 222389314, 209527613, 197013433, 187251583, 180866487, 177297129, 176184594, 177154294, 180202639, 185424890, 192442535, 201389509, 212584277, 227063425, 244710651, 263018059, 278276304, 288160898, 295524736, 302897718, 308901225, 309215320, 300680450, 285443411, 267657786, 250977027, 237577170, 227533761, 220277697, 215037676, 211409820, 209127024, 208035756, 208603067, 211339730, 217849585, 229268717, 244532023, 258927473, 266081674, 263088288, 253178635, 240923164, 230106034, 222737171, 218894699]
4752B18894699l60482K707172N174790P020968Q155571Q295189P987194P332897
4744B65207998O624161N606693L932333J555589j412262m540919p053211q841037
4736B61079345r872371j0190165j0095303r733019r322904q693115p890869o886465
4728A88395134n647681m559576l448443k284342j364273q91514n64812n02930
4720A69131563q64933j028633j317487j973872k698736l961379n194959o507514
4712A45584050p727373q430511q726002q491292q181461p801031p275070o899535
4704H2051775o335705n629527n142482m655287m048399l447810l168938k736649
4696D6886978k442719k120641j918189j828016j624118j341758j358393j151145
$$ y = [218894699, 218534217, 221241389, 226416179, 233437147, 241592718, 249887907, 257875101, 265207998, 271832159, 277438852, 281371185, 282926774, 281514512, 276973593, 269920382, 261079345, 251206974, 241016809, 230921506, 221188487, 211865583, 203172468, 195281599, 188395134, 182747453, 178187877, 174739434, 172455092, 171090819, 170199305, 169634493, 169131563, 168266630, 167237997, 165920510, 163946638, 161247902, 157286523, 152091564, 145584050, 137856677, 129426166, 120700164, 112208872, 104027411, 96226380, 88951310, 82051775, 75716070, 70086543, 64944061, 60288774, 56240375, 52792565, 49623627, 46886978, 44444259, 42323618, 40405429, 38577413, 36953295, 35611537, 34253144, 33101999]
4688C3101999j002323q79252q58356q17980p11217o62434p85998o62700o05950
4679B6115789l72984m25910n01925l42194l95145m54360l26968k48440l40588
4670B2707275m05549k72833k94525m34158m29919m31211m79329m19533n46556
4661A8993662m82441m74663n61934m34152n41015n10497l83190k68201l13636
4652A5023933l14270l34115k57587l26397p9482k25833j82821k40419k24450k06417
4642A2632142j53159k49901j74734l7433j29461k21560j42216j32278m5608j26551
4632A1219241o4958j7862J52466L44973P76257J054613J025818M07448n01170
4623A4396826q54643j152516r07035p29590m75407l47652k80745j43036n3204
$$ y = [33101999, 32099676, 31220424, 30362068, 29544088, 28832871, 28170437, 27384439, 26721739, 26115789, 25742805, 25316895, 24814970, 24472776, 24077631, 23623271, 23296303, 23047863, 22707275, 22301726, 22028893, 21734368, 21300210, 20870291, 20439080, 19959751, 19540218, 18993662, 18511221, 18036558, 17474624, 17040472, 16499457, 15988960, 15605770, 15337569, 15023933, 14709663, 14375548, 14117961, 13791564, 13712082, 13486249, 13303428, 13063009, 12838559, 12632142, 12478983, 12229082, 12054348, 12016915, 11887454, 11665894, 11523678, 11391400, 11345792, 11219241, 11154283, 11136421, 11288887, 11633860, 12410117, 13464730, 14490548, 14897996, 14396826, 13542183, 12389667, 11482632, 10753042, 10277635, 9929983, 9649238, 9506202, 9452998]
4614I452998J77724J39729K25869N43740N29575M58068M15013J52801J35276L06336
4604A2537129N44668Q03234J064026Q24565N49628J90903k09658k60372M9728
4595A6093851M65250J007360Q55490M47590l0130p76195q16175q74065n26839
4586A5846137j2526J34636J31631k17922o20396r21808q44401p93797n58985k80395
4576A1862174l23102j92502l61239m70006o72383n59604l76738j11440k26987
4567H568173j23263j03694J8956O0603N252J84749J39677N4066P0694R7605R1652
4556I064470J25440K76927L09760M00824L44052M36365N08902N29008N18039M52863
4546A2966650N76491M98591O41601Q33522R38077J254360J401479J681718J902958
$$ y = [9452998, 9630722, 9770451, 9996320, 10540060, 11069635, 11527703, 11942716, 12095517, 12230793, 12537129, 13081797, 13885031, 14949057, 15773622, 16323250, 16514153, 16304495, 16044123, 16093851, 16559101, 17566461, 18421951, 18869541, 18839411, 18063216, 17247041, 16372976, 15846137, 15833611, 15968247, 16099878, 15881956, 15261560, 14339752, 13495351, 12701554, 12142569, 11862174, 11539072, 11346570, 10985331, 10515325, 9842942, 9283338, 8906600, 8795160, 8568173, 8444910, 8341216, 8360172, 8420775, 8426027, 8610776, 8750453, 8804519, 8875213, 8972818, 9064470, 9189910, 9466837, 9776597, 10177421, 10521473, 10957838, 11466740, 11995748, 12513787, 12966650, 13543141, 14041732, 14683333, 15516855, 16454932, 17709292, 19110771, 20792489, 22695447]
4537B2695447K343689K634739L325767M428670O225093Q995901J2907692J6818924
4529H0375922J8093692J4147700N521581l394027r067280j0605939q855709n618637
4521H0597303j633669L215912Q399689J2601961J2783326P567146j083061q467842
4513A13980765j1753622j1409698q586506m636783N7186N134210R669423J0983475
4505A03438450P221796J02991o516646j0038294j0437877q249020n160051j418109
4497F8943240K675183P071673R921834Q894070L207876m392449j0165431j2572437
4489G3583559j2048015j0181017q305447o778159n599451m358390l359146k461515
4481B0492419j728210j303612q91057p57990q81500p34033p23849n68633o44327
$$ y = [22695447, 25039136, 27673875, 30999642, 35428312, 41653405, 50649306, 63556998, 80375922, 98469614, 112617314, 118138895, 114744868, 105677588, 95071649, 86215940, 80597303, 78963634, 82179546, 90579235, 103181196, 115964522, 123531668, 122448607, 113980765, 102227143, 90817445, 82230939, 77594156, 77651342, 82785552, 92454975, 103438450, 110660246, 110763237, 104246591, 94208297, 83770420, 75521400, 70361349, 68943240, 71618423, 78690096, 88611930, 97506000, 100713876, 96321427, 86155996, 73583559, 61535544, 51354527, 43049080, 36270921, 30671470, 26313080, 22953934, 20492419, 18764209, 17460597, 16569540, 15811550, 14930050, 14196017, 13472168, 12903535, 12259208]
4472A2259208p16209n12326k95258k15145j31261j0283L5941k4358j33167k75553
4462I981589j22177j8852L1698N197K38677J43114K5386p3683k36970l66793m98575
4451I108611l51772l17099l44360l80816k17983k51092k63978r0127Q051P497
4441F906932J11340J67264K15519J55129R0238K28512L10373J54227p0065l24388
4431G945081k79587m63461m94046l83775l28791k70151l05571j47921p7513j27167
4421E067098q1807l3602J36355K5652J13410J65885O7749m3675o0623k10692k02529
4410D943221j93068j76823j3986j04871j70594Q215K66883K00254K28365M68659
4400E456255N73724O55799M15432l0701m11582n69686n61782n16309l46682j95971
$$ y = [12259208, 11542999, 11030673, 10735415, 10520270, 10389009, 10378726, 10414667, 10390309, 10257142, 9981589, 9859412, 9840560, 9872258, 9877455, 10116132, 10259246, 10284632, 10210949, 9973979, 9607186, 9108611, 8756839, 8439740, 8095380, 7714564, 7496581, 7245489, 6981511, 6891384, 6899435, 6906932, 7018272, 7185536, 7401055, 7556184, 7646422, 7874934, 8185307, 8339534, 8269469, 7945081, 7665494, 7202033, 6707987, 6324212, 5995421, 5725270, 5419699, 5271778, 5194265, 5067098, 4985291, 4951689, 5088044, 5113696, 5227106, 5392991, 5460740, 5417065, 5356442, 5145750, 4943221, 4750153, 4573330, 4559344, 4454473, 4283879, 4292094, 4558977, 4759231, 4987596, 5456255, 6029979, 6685778, 7101210, 7070509, 6658927, 6089241, 5527459, 5011150, 4664468, 4468497]
4390D468497o3444j73800j11737j3483p6718K7872n6227n8681J24439K0124j3961
4379D072881K3668J66560j7364j36243J0528j66766j01929n0552m5144p4732q2559
4368C598348J2283O2343L941q1268l2939Q3927m6528k080M0236J47462o3729o0650
4356C661346q1190j06292l3881n5275m4939j1378o4767k8482P5556N360M9226
4345C365284J23938o7461j09049L6388n9834p6062k6777l2047p3725J47453m8596
4334C179512p2515N9844m7036J8875J10159l6298j01259J1301J22450k8833l8003
4323C178197q7600J27798J32890K421p0153K8521O9961N2032j0019o3847R1870
4312C452071N9503j09533j63771M4606k5349m6387J2858j4432q433K8706K4639
$$ y = [4468497, 4405053, 4231253, 4119516, 4106033, 4029315, 4057187, 4000960, 3942279, 4066718, 4086842, 4072881, 4096549, 4263109, 4245745, 4109502, 4120030, 3953264, 3851335, 3800783, 3755639, 3680907, 3598348, 3610631, 3672974, 3676915, 3595647, 3562708, 3646635, 3600107, 3598027, 3638263, 3785725, 3721996, 3661346, 3580156, 3473864, 3439983, 3384708, 3339769, 3328391, 3263624, 3235142, 3310698, 3316058, 3365284, 3489222, 3421761, 3312712, 3349100, 3289266, 3213204, 3186427, 3154380, 3080655, 3228108, 3179512, 3106997, 3166841, 3119805, 3138680, 3248839, 3212541, 3111282, 3122583, 3245033, 3216200, 3178197, 3090597, 3218395, 3351285, 3353706, 3283553, 3312074, 3382035, 3434067, 3424048, 3360201, 3452071, 3511574, 3402041, 3238270, 3282876, 3257527, 3211140, 3223998, 3209566, 3201133, 3229839, 3254478]
4301C254478m765O7659j8528J2577q053j00973O926O2359N2982l0856R0751Q1508
4289C466065k9503N976J1917o1839j30115Q95P5124L4231n1205j7865K8191j726
4277C330146o531r482K2645K8795k2853L9644N0636K8715K7631L7202n7535K1316
4265C490329J12292L9873Q13L2895O1857l1061J14894j5208J24262J84795K52086
4254D367827M93836O52821M10523n1395j57290m17384m54539k19964j53175j15376
4244D355884r9297p7147M1440j13871k1818J59565J00120o2526P3481q519J0137
4233D357449Q9616O2405n5566l478l165K0798K17312O4908J55023M0301M0421
4222D986024N2071J59063M8379J4287J06970Q9679O1717Q5587M8144J18142J37664
$$ y = [3254478, 3249713, 3317372, 3298844, 3311421, 3303368, 3202395, 3209321, 3271680, 3324662, 3293806, 3384557, 3466065, 3436562, 3442538, 3454455, 3392616, 3262501, 3263396, 3338520, 3372751, 3321546, 3303681, 3331872, 3330146, 3323615, 3314133, 3336778, 3365573, 3342720, 3382364, 3433000, 3461715, 3489346, 3526548, 3469013, 3490329, 3602621, 3642494, 3643307, 3676202, 3738059, 3706998, 3821892, 3806684, 3930946, 4115741, 4367827, 4861663, 5514484, 5925007, 5873612, 5716322, 5298938, 4844399, 4624435, 4471260, 4355884, 4256587, 4179440, 4220880, 4107009, 4085191, 4244756, 4344876, 4282350, 4355831, 4347312, 4357449, 4447065, 4509470, 4453904, 4450426, 4447261, 4468059, 4685371, 4750279, 4905302, 4945603, 4986024, 5038095, 5197158, 5245537, 5259824, 5366794, 5456473, 5518190, 5603777, 5651921, 5770063, 5907727]
4211E907727J857J77862m8693J38261J53426J2684J66633J67407O5257J06214
4201F848635K26529M4529J32621K08839J81646K66309J07290K06612K55785K07630
4191H686425K90495J77907K32231K25656K66823L23947K45168K26040L49710K56807
4181A1281209M15850M65137N20469N88342O53702O78145Q60682R37718Q31650
4172A7232904P25845M46389N24761P06662Q34476R65049J137457J462659J613449
4163B5649651J772217J926979J587602J177337J137268J035073R37095Q63655
4155C6086877Q17265J016931J089384J073338J181505J204698J192638J420824
4147D5083460J708447K048359K191913K152417K079658J923138J742369J787827
$$ y = [5907727, 5909584, 6087446, 6038753, 6177014, 6330440, 6343124, 6509757, 6677164, 6742421, 6848635, 7075164, 7119693, 7252314, 7461153, 7642799, 7909108, 8016398, 8223010, 8478795, 8686425, 8976920, 9154827, 9387058, 9612714, 9879537, 10203484, 10448652, 10674692, 11024402, 11281209, 11697059, 12162196, 12682665, 13271007, 13924709, 14602854, 15463536, 16401254, 17232904, 17958749, 18405138, 18929899, 19636561, 20471037, 21436086, 22573543, 24036202, 25649651, 27421868, 29348847, 30936449, 32113786, 33251054, 34286127, 35223222, 36086877, 36904142, 37921073, 39010457, 40083795, 41265300, 42469998, 43662636, 45083460, 46791907, 48840266, 51032179, 53184596, 55264254, 57187392, 58929761, 60717588]
4139F0717588J881819J717879J667764J674248J702351J724974J578769J565890
4131G4231282J761446J912765J945733J942548K003246J789661J709039J826900
4123H9122620K225472K768637L382434M333732M953884M991560M281467L438214
4115A19498020K152333J369072J028989J242047J441714J270974J155589R27009
4107A30085747R49309R85720Q14063R03661J055800J389526J394986J287449J268830
4098A40135091J191498J161370J463579K253249L217950M474449N869107P001123
4090A66767416P432313P334570O615224N686529N115934M890856M866956M859321
4082B13569119M624170M129850L437617K760798K179393J523667Q39719M21637
$$ y = [60717588, 62599407, 64317286, 65985050, 67659298, 69361649, 71086623, 72665392, 74231282, 75992728, 77905493, 79851226, 81793774, 83797020, 85586681, 87295720, 89122620, 91348092, 94116729, 97499163, 101832895, 106786779, 111778339, 116059806, 119498020, 121650353, 123019425, 124048414, 125290461, 126732175, 128003149, 129158738, 130085747, 131035056, 132020776, 132834839, 133738500, 134794300, 136183826, 137578812, 138866261, 140135091, 141326589, 142487959, 143951538, 146204787, 149422737, 153897186, 159766293, 166767416, 174199729, 181534299, 188149523, 193836052, 198951986, 203842842, 208709798, 213569119, 218193289, 222323139, 225760756, 228521554, 230700947, 232224614, 233064333, 233485970]
4074B33485970L04231P38221J431471K357235L103668L804553L729108L304746
4066B52259203K884911K240131J628531R38192M97182J05592R0907L38035N36820
4057B61519504J206407J639990J770811J453745Q53547r9425j026432j606610
4049B65711537j814328j997395k430418k894118l328861l104829k849001k973312
4041B44319275l547551m948690o656207q030559q547031q122075p350916o206659
4033A90909587n014652l842467k911956k281429k206914k140705k184219k306337
4025A68020908k589213k494521k529134k984457l053276l165452l223872l023719
4017A44957264k445613j896330j287297q88385j165361k109835l169701m237548
$$ y = [233485970, 233790201, 234528422, 235959893, 238317128, 241420796, 245225349, 248954457, 252259203, 255144114, 257384245, 259012776, 259950968, 260448150, 260553742, 260644649, 260982684, 261519504, 262725911, 264365901, 266136712, 267590457, 268444004, 268344579, 267318147, 265711537, 263897209, 261899814, 259469396, 256575278, 253246417, 250141588, 247292587, 244319275, 240771724, 235823034, 229166827, 221136268, 212589237, 204467162, 197116246, 190909587, 185894935, 182052468, 179140512, 176859083, 174652169, 172511464, 170327245, 168020908, 165431695, 162937174, 160408040, 157423583, 154370307, 151204855, 147980983, 144957264, 142511651, 140615321, 139328024, 138439639, 137274278, 135164443, 131994742, 127757194]
4009A27757194m764694n171734m794863m038562l495261k675969k379735k311147
4001I8125229k392263k505334k621894k669477k632656k535649k315578k273523
3993G8178855k143653k105566j932668j722252j507721j488723j591970j505520
3985F4180782j625122j698055j542821j455976j700654k061385k341223k497574
3977D9257972k183573k018652j856015j735553j804617j403935j415080j268791
3969C5571756j100305j026376j282524j362473j287438j428819j455672j340784
3961B5287365j293295j107124j046072j026657r50733p10530o60190m25076j07615
3952A7960073M9870L05057L43509l20867r15880j098876j145440q66900q11654
$$ y = [127757194, 122992500, 117820766, 113025903, 108987341, 105492080, 102816111, 100436376, 98125229, 95732966, 93227632, 90605738, 87936261, 85303605, 82767956, 80452378, 78178855, 76035202, 73929636, 71996968, 70274716, 68766995, 67278272, 65686302, 64180782, 62555660, 60857605, 59314784, 57858808, 56158154, 54096769, 51755546, 49257972, 47074399, 45055747, 43199732, 41464179, 39659562, 38255627, 36840547, 35571756, 34471451, 33445075, 32162551, 30800078, 29512640, 28083821, 26628149, 25287365, 23994070, 22886946, 21840874, 20814217, 19863484, 19152954, 18492764, 18067688, 17960073, 18009943, 18315000, 18658509, 18337642, 17421762, 16322886, 15177446, 14310546, 13498892]
3943A3498892n93694n41443n55679l49663k99160l31555k51885k81784k19633
3934A0074396k08344j90416k51931j89550j92352j85394j80420j35232l33725
3925H207032k51158j27559j49029j29407k03836k46746n4781q9148j40918o2536
3915F751914r9696j72634j70220q6428q6435j51669j77590l218j51602j63525
3905E488897J4459j29626q1905l9958j32012o0047j00055q0307n9639o2209m2808
3894D714790q6335j48673K6818p5830j16400l8849p8821j22635o8999k5651l8699
3883C940716j27991O5662n2734j45907K470q6201m4399o7821o5417j19607l4022
3872C264749l566L3063k4968j86114k1119O7017J28321r4769r0233L4199r2792
$$ y = [13498892, 12905198, 12363755, 11808076, 11458413, 11159253, 10827698, 10575813, 10294029, 10074396, 9866052, 9675636, 9423705, 9234155, 9041803, 8856409, 8675989, 8540757, 8207032, 7955874, 7828315, 7679286, 7549879, 7346043, 7099297, 7044516, 6955368, 6814450, 6751914, 6652218, 6479584, 6309364, 6222936, 6136501, 5984832, 5807242, 5804024, 5652422, 5488897, 5503356, 5373730, 5291825, 5251867, 5119855, 5059808, 4959753, 4879446, 4819807, 4757598, 4714790, 4628455, 4479782, 4506600, 4430770, 4314370, 4275521, 4196700, 4074065, 4005066, 3979415, 3940716, 3812725, 3878387, 3825653, 3679746, 3682216, 3596015, 3551616, 3483795, 3418378, 3298771, 3264749, 3261183, 3294246, 3269278, 3083164, 3062045, 3129062, 3257383, 3162614, 3072381, 3106580, 3013788]
3861C013788r1762J3890k3584j35705l7833J663M388n7554o7291M061j5100o0230
3849B548731n2531m5768n8898o4128O092R653k7906o7644L0497L8895n9848P8791
3837B335936L2344o2214J5814N1596L4995k9087J0005m1495k2857M9611L2341
3826B406989j50797n0967k9724L3813J6303M2556J7741j07462n3118K9241j1375
3815B143200j09943K1767R9351p4115l1716P7098o650p6976K4512Q2460J4982
3804B163970M0041K1070j51427j18958R0701J75240l6685q9954j8941K8175m039
3793B099193L6926L7773K1157O873k0596m5430l9724l9485k5030r565n8827O7792
3781B031057m0507J18220j8570M3583o2292p3812k5869K3586P764n7461N1055
$$ y = [3013788, 2922026, 2935916, 2912332, 2776627, 2738794, 2740457, 2744845, 2687291, 2620000, 2624061, 2608961, 2548731, 2496200, 2450432, 2391534, 2327406, 2333498, 2343151, 2315245, 2247601, 2278098, 2316993, 2257145, 2335936, 2368280, 2306066, 2321880, 2373476, 2408471, 2379384, 2389389, 2347894, 2325037, 2374648, 2406989, 2256192, 2205225, 2175501, 2209314, 2225617, 2268173, 2285914, 2178452, 2125334, 2154575, 2143200, 2033257, 2055024, 2154375, 2080260, 2048544, 2125642, 2118992, 2042016, 2066528, 2148988, 2163970, 2204011, 2225081, 2073654, 1954696, 2045397, 2220637, 2183952, 2093998, 2075057, 2103232, 2099193, 2136119, 2173892, 2195049, 2201922, 2181326, 2135896, 2096172, 2056687, 2031657, 2022092, 1963265, 2031057, 1990550, 2108770, 2090200, 2133783, 2071491, 1997679, 1971810, 1995396, 2003160, 1945699, 1996754]
3770A996754l1763K5063O0496n9999j3044j2439P5871J04454L4259j68168O24
3759B012108O2312o8702m7036o9003l7332O1663n9116o8371j010p877N4536j07242
3747A724930M004K0675Q13P135O7632L4715j3574k8778M546k9452l1981k8548
3735A732117P9132k2681j8246q306k6692k4964l7605l8327k1653j7148k5893K5280
3723A595014K8505j8634j6399q9109q6929l1810p6609N7734j5543j5398k2847
3712A307975m9952L2676M3853j0672j39788J3921R631j5333J70856k19302j24149
3701A019716K3233R2482k4449k6143q705J1880o099k2883q5024m8102J19065j2321
3689A032650K5356L0970l1443j05158j4690K786P0706J0996k1075P5386P438k9301
$$ y = [1996754, 1964991, 1990054, 2050550, 1990551, 1977507, 1965068, 2040939, 2145393, 2179652, 2011484, 2012108, 2074420, 2005718, 1958682, 1889679, 1852347, 1914010, 1854894, 1786523, 1785513, 1777636, 1832172, 1724930, 1728934, 1749609, 1750422, 1757557, 1825189, 1859904, 1846330, 1817552, 1822098, 1792646, 1760665, 1732117, 1811249, 1788568, 1770322, 1762016, 1735324, 1710360, 1672755, 1634428, 1612775, 1595627, 1569734, 1595014, 1623519, 1604885, 1588486, 1499377, 1412448, 1380638, 1304029, 1361763, 1346220, 1330822, 1307975, 1258023, 1290699, 1334552, 1323880, 1184092, 1198013, 1207644, 1192311, 1363167, 1143865, 1019716, 1042949, 1135431, 1110982, 1084839, 1076134, 1088014, 1081915, 1059032, 974008, 925906, 1044971, 1032650, 1058006, 1088976, 1057533, 952375, 937685, 940471, 1011177, 1022173, 1001098, 1076484, 1083922, 1054621]
3677A054621L5677p0113l3328N2817j549q5417j8922m6762K1177J21230M6779
3666A076210P5044L323o6569o9645M6120J07949K7026j7577j1755J01010J4901
3655A286037l8190N076o844K9670l8516P1482K1453M3936J07065J1748J199j0665
3643A483451O8040K9778R6551j100J01302J20983J6828J592J75676J01745R1266
3632B286112N5031m4053J446P7080M6745J9793L6821J25339R7329O5661J23313
3621B890617O2571J69667m484k9818K57595J34470J29476L19632J22277R7729
3611D149732J41383J91059J71179O8907J17898J64332J38430J25246P9331j2102
3601E335395L0165K2922Q1363N8536n9557P7988J37183N2650R4076J23265J42116
$$ y = [1054621, 1090298, 1020185, 986857, 1039674, 1038125, 952708, 933786, 887024, 908201, 1029431, 1076210, 1151254, 1154577, 1088008, 1018363, 1064483, 1172432, 1199458, 1181881, 1170126, 1271136, 1286037, 1247847, 1252923, 1246079, 1275749, 1237233, 1308715, 1330168, 1374104, 1481169, 1492917, 1494116, 1483451, 1551491, 1581269, 1677820, 1676720, 1778022, 1899005, 1915833, 1917425, 2093101, 2194846, 2286112, 2341143, 2297090, 2298536, 2375616, 2422361, 2442154, 2478975, 2604314, 2701643, 2767304, 2890617, 2953188, 3122855, 3118371, 3088553, 3346148, 3480618, 3610094, 3929726, 4052003, 4149732, 4291115, 4482174, 4653353, 4722260, 4840158, 5004490, 5142920, 5268166, 5347497, 5335395, 5365560, 5388482, 5469845, 5528381, 5468824, 5546812, 5683995, 5736645, 5830721, 5953986, 6096102]
3590F096102K18537L24762K02244K38973K74296K94347L73654L48019M94055L64093
3580I229082K37010L02889K90043K64491L84087K79549K37791K82980L43874L22139
3570A2173935K96123K82793J65034P8951K08525K65094K33959K77887L33868L68818
3560A4684987N54127N14978O92337P82261Q29444P97530P12620O58908N96314
3551B0823506O22720N97431O78349P56162Q83343R76456J036806J296265J701253
3542B9372291K110510K528814K844159L260248L448186L503574L363093L298960
3534E3729835L045073K422686J499429O10870m55523j288401k005464k599422
3526E4959083k716146k889225k540668k208774j798182j722086j607870j686655
$$ y = [6096102, 6314639, 6639401, 6841645, 7080618, 7354914, 7649261, 8022915, 8370934, 8864989, 9229082, 9466092, 9768981, 10059024, 10323515, 10707602, 10987151, 11224942, 11507922, 11851796, 12173935, 12470058, 12752851, 12917885, 12996836, 13205361, 13470455, 13704414, 13982301, 14316169, 14684987, 15239114, 15754092, 16446429, 17228690, 18058134, 18855664, 19568284, 20227192, 20823506, 21446226, 22043657, 22722006, 23478168, 24361511, 25337967, 26374773, 27671038, 29372291, 31482801, 34011615, 36855774, 40116022, 43564208, 47067782, 50430875, 53729835, 56774908, 59197594, 60697023, 61307893, 60852370, 59563969, 57558505, 54959083, 52242937, 49353712, 46813044, 44604270, 42806088, 41084002, 39476132, 37789477]
3518C7789477j674590j719940j787318j831179j775941j824752j974664j751544
3510B3449549j580000j577964j517356j270160j116814r77177j111504j002050
3502A3296524p97624p44952o99403m22980n84314n06824m71210l32326l05398
3493H431493k76610k10418l22088l01032k83011k32270l53623k41317l47309k31900
3483E631915j83377j66091j80797k26294k04431j21659j36649j3731j17728j87153
3473D094005j16041J1176o047k28517j09349j75609j11072j76113j95830j65580
3463B821023M7048j42373j47809k3229o5724m7220q8350m3540r6022J6521j19481
3452B110844j19182K3310M8009j08642q6263l5635m2133N9755M4762k5479r9963
$$ y = [37789477, 36114887, 34394947, 32607629, 30776450, 29000509, 27175757, 25201093, 23449549, 21869549, 20291585, 18774229, 17504069, 16387255, 15410078, 14298574, 13296524, 12498900, 11753948, 11054545, 10631565, 10047251, 9540427, 9069217, 8736891, 8431493, 8154883, 7944465, 7622377, 7321345, 7038334, 6806064, 6452441, 6211124, 5863815, 5631915, 5448538, 5282447, 5101650, 4875356, 4670925, 4549266, 4412617, 4398886, 4281158, 4094005, 3977964, 3989140, 3983093, 3754576, 3645227, 3469618, 3358546, 3182433, 2986603, 2821023, 2868071, 2725698, 2577889, 2554660, 2488936, 2441716, 2353366, 2309826, 2213804, 2230325, 2110844, 1991662, 2014972, 2062981, 1954339, 1868076, 1832441, 1790308, 1850063, 1894825, 1869346, 1769383]
3441A769383Q111p0729J3896J0666R627n520m1888n5644r7373k7598J5191r3217
3429A434905l8557q4610J6935P6695o6868m0207N5572j07621j35173L6680j6623
3418A131128K9785j0373J13639j2247n5695O6515r410k3834m8943K5657j6312
3407A189910m2033M8931R3614o9947l0761k7362o3776r1136O1178k9663L045k6747
3395A015253k5016K4284M8432k1824p3309q741j05925Q8523J9759j8567o726J49866
3383A086009j01183j02063k9483J24754l5681m0557j7382P7124O8517j0911Q9887
3372A109031J07454R8962q4021n6048j52755J0670j55333k0459j4644K5221l5741
3361H32337r2528R248J02813R9190n8921q1957p5158J5617l0166K4065Q200n0798
$$ y = [1769383, 1777494, 1706765, 1720661, 1731327, 1740954, 1735434, 1693546, 1637902, 1540529, 1512931, 1528122, 1434905, 1396348, 1311738, 1328673, 1405368, 1338500, 1298293, 1353865, 1246244, 1111071, 1147751, 1131128, 1160913, 1150540, 1264179, 1251932, 1196237, 1262752, 1253342, 1229508, 1180565, 1206222, 1189910, 1147877, 1196808, 1290422, 1220475, 1189714, 1162352, 1098576, 1007440, 1068618, 1038955, 1042000, 1015253, 990237, 1014521, 1062953, 1041129, 967820, 959079, 853154, 941677, 961436, 942869, 936143, 1086009, 984826, 882763, 853280, 978034, 942353, 901796, 884414, 961538, 1030055, 1019144, 1109031, 1216485, 1315447, 1231426, 1175378, 1022623, 1033293, 877960, 857501, 842857, 868078, 832337, 739809, 749057, 851870, 951060, 892139, 810182, 735024, 750641, 720475, 744540, 752740, 701942]
3349G01942N0948M6385k5673l5889R47L5850l1207J7451L9495K2656n6974M3036
3337H08967M9780o600j9130M3678p5193j07633n2012K6913J08514J44815k4664
3326H97435l7739k8793k7480J8771N9880q4660N3837m632K9901K3591R1622p1423
3314I20310K5920J23894O0416j10356J7005Q5543j20310N6849O1482k046j06542
3303A012165N7809J41952M8301Q5902K2229n4057K05930J01244J10224R9840K04619
3292B036158J98886J22173O122P1776R2496M0704K2348j6755P843J6273l4005
3281B564019j6032N0365J24955k6479K7932j996o845j72720o3729J43230P3091
3270B695791p6087J23934J13394J3748J61405K9761J01102J71747J98437J53736
$$ y = [701942, 752890, 799275, 773602, 737713, 738660, 774510, 743303, 760754, 800249, 822905, 765931, 808967, 858747, 852147, 833017, 876695, 801502, 693869, 641857, 668770, 777284, 922099, 897435, 859696, 830903, 803423, 822194, 882074, 797414, 851251, 846619, 876520, 900111, 991733, 920310, 946230, 1070124, 1130540, 1020184, 1037189, 1122732, 1002422, 1059271, 1120753, 1118707, 1012165, 1069974, 1211926, 1260227, 1346129, 1368358, 1314301, 1520231, 1621475, 1731699, 1831539, 2036158, 2235044, 2357217, 2363339, 2435115, 2527611, 2568315, 2590663, 2573908, 2581751, 2598024, 2564019, 2547987, 2598352, 2723307, 2696828, 2724760, 2722764, 2715919, 2543199, 2479470, 2622700, 2695791, 2619704, 2743638, 2857032, 2870780, 3032185, 3061946, 3163048, 3334795, 3533232, 3686968]
3260C686968J45798K00213L09893K63069K82492L71177K90829J85142J64273J15836
3250F015690k1943j06562q7684k02727l6590J3567J50485K25224J74017J95068
3240F318545R8005l1804O438P9216J11779K24730K59908L76160M61339N15589
3230H419905N07143O79624P80377R60199J035188J203887J261227J331285J451148
3221A7629983J479290J293803R83447O67991K69467M297j77945k75215k07546
3212B1667572k83271j94672m9322j58642l7876j27213R061q4609o5765O3161R8951
3201B0837375L04280K97507M58891O40796R20244J537567K263689L336915M995723
3192C5592987O341702N993307K985249q27860l714834m986672n061938m546147
$$ y = [3686968, 3832766, 4032979, 4342872, 4605941, 4888433, 5259610, 5550439, 5735581, 5899854, 6015690, 5993747, 5887185, 5799501, 5596774, 5560184, 5573751, 5724236, 5949460, 6123477, 6318545, 6416550, 6384746, 6391184, 6470400, 6582179, 6806909, 7066817, 7442977, 7904316, 8419905, 8927048, 9606672, 10387049, 11347248, 12382436, 13586323, 14847550, 16178835, 17629983, 19109273, 20403076, 21386523, 22054514, 22323981, 22328278, 22150333, 21875118, 21667572, 21384301, 21189629, 21140307, 20981665, 20943789, 20816576, 20825637, 20741028, 20675263, 20738424, 20837375, 21141655, 21439162, 21898053, 22538849, 23459093, 24996660, 27260349, 30597264, 35592987, 41934689, 47927996, 50913245, 50085385, 46370551, 41383879, 36321941, 31775794]
3184C1775794l841065l087310k543472k099879j498298j166044j010509p72343
3176A5756874n25047n53240n00576k07773j43482j24795j08162J18558K12314
3167A3924671J52775M41753O59667Q13353R64103R70883Q63358N43415k1895o57286
3157A8654797j149709j298181j428920j388382j276078j079476j012387j015175
3149I006489q39987o13353n56915m43384k97535m31580m18717l00325k95504k39967
3139D569222l07642j60364k66579j89090j67234k90059k24946k2127n2974r6235
3129B791972j30823j22718j74005j03402j14198l8867p1918j57791n8794o9935
3119A749521j69607p8098m6095q5224J2148r3445j09284O9146R462j33063m938
$$ y = [31775794, 27934729, 24847419, 22303947, 20204068, 18705770, 17539726, 16529217, 15756874, 15231827, 14678587, 14178011, 13970238, 13826756, 13701961, 13593799, 13712357, 13924671, 14077446, 14519199, 15178866, 15992219, 16956322, 17927205, 18790563, 19333978, 19312083, 18654797, 17505088, 16206907, 14777987, 13389605, 12113527, 11034051, 10021664, 9006489, 8166502, 7553149, 6996234, 6552850, 6255315, 5823735, 5405018, 5104693, 4809189, 4569222, 4261580, 4101216, 3834637, 3645547, 3478313, 3188254, 2963308, 2941181, 2888207, 2791972, 2661149, 2538431, 2364426, 2261024, 2146826, 2107959, 2036041, 1878250, 1819456, 1749521, 1579914, 1501816, 1455721, 1370497, 1382645, 1289200, 1179916, 1249062, 1258524, 1125461, 1120523]
3108A120523n5547K2563k4158j3885p1769k8955O2363q9158p3385n5275l759M4506
3096H34064O3647K4933l6620r4328l9628p440n9315k4842o0543M0547Q671M825
3084F53971j7953n7035J09837k1374j86289Q525j9686p6027r6801J13649N1209
3073D62026k4185j8622k4477M9646r3130N7394l2826n923K6037M1635j7465m4583
3061C75527p5110m3848J30444r219n9554M696L3127J6543l5806q8877J790R5373
3049C45086k5282l8896L1133l9635m3209K704L7231l1750q622J5453K9366j05402
3037A68177p0864N410r0055N3033L7602m5127J8752K157L9408k7249O8477P9075
3025B38796J7953n5695L678l2805j3578n7675M1837N6638m5022L5418m1092o2429
$$ y = [1120523, 1064976, 1087539, 1063381, 1049496, 977727, 948772, 1011135, 921977, 848592, 793317, 789558, 834064, 897711, 922644, 886024, 791696, 752068, 744628, 685313, 660471, 599928, 640475, 649146, 653971, 636018, 578983, 688820, 667446, 481157, 489682, 469996, 393969, 297168, 410817, 462026, 437841, 419219, 394742, 444388, 351258, 408652, 375826, 369903, 395940, 437575, 420110, 375527, 300417, 256569, 387013, 377794, 318240, 322936, 356063, 372606, 336800, 247923, 249713, 345086, 319804, 280908, 312041, 272406, 229197, 231901, 269132, 237382, 228760, 244213, 273579, 168177, 97313, 102723, 12668, 65701, 103303, 58176, 76928, 79085, 118493, 91244, 159721, 238796, 256749, 201054, 204732, 171927, 158349, 100674, 142511, 199149, 154127, 189545, 148453, 86024]
3013H6024p2074n5547L6754l7364Q49L4233n4238N551K2088l421Q5478J17413
3001A65746L1445j36390P0452j0372j0084R3941l8112j01394m7962L7600q3313
2990b8443o3092n184J57956k3939j23270O5325L4056j07813L9688K426N132m8244
2978i5402O4159N1315m8162N3553l8067j16418K1319Q2513K9603M6974l2651L3093
2966E1829k390j4692Q4924O9872q8490j57054P3638l5563R4451K5846n5884Q111
2954E4598M9038p0299q3615m8864J15610j7795K8752J41538l5903k591q0587L9135
2942H9017o0058J381R4909J35448k3481p5676Q3890J5307R4913M4536m5666j6973
2930C37547K6688O0758p5561R4844J4047Q8482N0304J3155q269q7361k5768P3328
$$ y = [86024, 13950, -41597, -4843, -42207, -41358, -7125, -61363, -55812, -33724, -37145, 48333, 165746, 197191, 60801, 131253, 120881, 110797, 204738, 166626, 65232, 17270, 54870, -28443, -91535, -96719, 61237, 37298, -85972, -20647, 13409, -94404, -54716, -52290, -47158, -95402, -31243, 20072, -28090, 25463, -12604, -129022, -107703, -25190, 4413, 51387, 18736, 51829, 49439, 34747, 119671, 189543, 101053, -56001, 17637, -17926, 76525, 102371, 46487, 54598, 103636, 33337, -50278, -99142, 16468, -1327, 27425, 168963, 133060, 130469, 49882, 89017, 28959, 30340, 125249, 260697, 237216, 161540, 245430, 260737, 355650, 400186, 354520, 337547, 364235, 424993, 349432, 444276, 458323, 546805, 597109, 610264, 601995, 514634, 488866, 562194]
2918E62194r8156j40470L8437P7712P9716o7755m9637J57671M6077j8084J91189
2907G78894q0281P3406P2816n9538J01845l6306p8137n2355O7477m6731n965M2604
2895G77729P4648N6975M2777p599n3791o7368J2148N8920m5447M3348Q985N5280
2883I56605J5779p5468p419O1243j6031l3949N5922N0927N2663L2412K8907J48456
2871A270047k1280j17857R0515J11181L1875m0j34646j02422m6154p957j58388
2860I14874j71320P2458J0223K6534R8951r7475m0191M52J7365J7946J14013p4301
2848H89529O9695n7768N564J5628m7074K1522n4526j04570m321n849m0593L0891
2836G18128N7061P1490l1006J29551O0408Q319o5662j03789r1168j7881k0283
$$ y = [562194, 464038, 323568, 362005, 439717, 519433, 451678, 402041, 559712, 605789, 587705, 778894, 698613, 772019, 844835, 785297, 887142, 850836, 772699, 720344, 787821, 741090, 735125, 777729, 852377, 909352, 952129, 944530, 890739, 823371, 835519, 894439, 848992, 892340, 901325, 956605, 972384, 896916, 889497, 950740, 934709, 900760, 956682, 1007609, 1060272, 1092684, 1121591, 1270047, 1248767, 1130910, 1221425, 1332606, 1364481, 1364441, 1229795, 1127373, 1081219, 1073262, 914874, 743554, 816012, 826235, 852769, 951720, 854245, 814054, 814506, 831871, 849817, 963830, 889529, 959224, 901456, 907020, 922648, 875574, 897096, 842570, 738000, 733679, 727830, 687237, 718128, 775189, 846679, 815673, 945224, 1005632, 1013951, 948289, 844500, 753332, 735451, 715168]
2825G15168k73706M3399m0868p8888j721p977k5900l4498O3985L7758k8658l5981
2813C32113J2886N7006k6018r8550P5142n7073P180k3798K6843r601K2067q9027
2801B29170O3129n6629n9967m3626Q3338J4350k7838k9303r0933P2602O8464l5226
2789A87531N6582J09206q6718j58499m6430J09958O3080m2125p7131J4146n8369
2778G1231n6818k040m9484J27725j0879K2420p9436l652L5314O5319n8749j06421
2766d5470K9387N5130R3429o7929p1868q524k4546n0187J19881m3561j4544M1082
2754A2280j06752p6354N4466J01873J7979k8153o5655q0719K7597J23142k4093
2743d4389M5155k5595l5494j7988k0459r693M646o5344Q804N8946K8726k2520
$$ y = [715168, 441462, 484861, 443993, 365105, 363384, 355407, 329507, 295009, 358994, 396752, 368094, 332113, 344999, 402005, 375987, 277437, 352579, 295506, 302686, 278888, 305731, 296130, 318197, 229170, 292299, 235670, 175703, 132077, 215415, 229765, 201927, 172624, 81691, 154293, 222757, 187531, 244113, 353319, 266601, 108102, 61672, 171630, 234710, 192585, 115454, 129600, 71231, 14413, 12373, -37111, 90614, 79735, 102155, 22719, 19067, 54381, 119700, 60951, -45470, -16083, 39047, 132476, 64547, -7321, -15845, -40391, -90578, 29303, -14258, -28802, 12280, -94472, -170826, -116360, -14487, 3492, -24661, -90316, -171035, -143438, -20296, -44389, 766, -24829, -60323, -78311, -98770, -108463, -103817, -169161, -160357, -101411, -72685, -95205]
2731i5205l99M8649L017M7505o7147j0865J4327j0167K2509N7403j8926O461m2565
2718d5403O3557m0351l7691m4624q087Q7087R1102J2216p8433n2274L5041n169
2706b3029N4325P837P24l4535o9059j6161q0168r183J28485n6297n9668k4227
2694a80956K174P9881l1271Q1161L1513J9575l5125P4664P8182j00535j5934r5636
2682i2307l2963J04318j06542o294j961j3240m2391O9416J14735L1920k9273M3056
2670C8474Q7366M8038j00481j29366P6099j2177P216Q2411P2832O0865Q1646N0001
2658C62924K31443R6999J08258O5139j32236j38301o7005j78874m4612j05617
2648A98118n4164m8906k12j19940K8639K4982M9729p926O3538o6158J1919l7067
$$ y = [-95205, -95604, -46955, -43938, 3567, -63580, -74445, -60118, -70285, -47776, 9627, -9299, -2838, -45403, 18154, -22197, -59888, -104512, -112599, -25512, 65590, 77806, -627, -52901, -17860, -23029, 31296, 39133, 39857, 5322, -63737, -79898, -160066, -169249, -40764, -97061, -156729, -180956, -178782, -98901, -130172, -49011, -17498, 2077, -33048, 41616, 119798, 19263, 3329, -92307, -125270, -20952, -127494, -133788, -135749, -148989, -191380, -121964, -7229, 24691, -4582, 38474, 125840, 173878, 73397, -55969, 20130, 7953, 15169, 97580, 170412, 231277, 312923, 362924, 594367, 691366, 799624, 864763, 732527, 594226, 527221, 348347, 303735, 198118, 143954, 95048, 94836, -25104, 3535, 28517, 78246, 70320, 133858, 67700, 79619, 42552]
2636D2552r7046j6061R6435P8861O0635j09402j3114j3015r3552P0628L4780J4005
2624E5706Q3361O654K2445p7008j63912R1654L716O6156m6872K6629j23321R6926
2612D2134L2604N1562p1147m2601K6389J6773j13104J7356O8218j1714l6363o9988
2600h9881P1689J75144j403l0892k4630J1283j9879N413n8193k986P2735O347
2588A14747j16526k5963r114j1602O7089n367l3349j5666q088N3010l2015M797
2576a8047m553J6451k9195N8670q9120Q347O1530o0144l2635K6205k9030j06925
2564a98446j0508N1867Q5048l0017R8864J31672L4948j8796J253J39731o931j2441
2552B66244l8646o7999n5414K9875N4138l9982O6438r4040l9853N7224J3430j58188
$$ y = [42552, -54494, -70555, 25880, 104741, 165376, 55974, 42860, 29845, -63707, 6921, 41701, 55706, 139067, 145721, 168166, 91158, -72754, 18900, 22616, 88772, 41900, 68529, -54792, 42134, 74738, 126300, 55153, 12552, 38941, 55714, -57390, -40034, 28184, 16470, -19893, -89881, -18192, 156952, 155549, 124657, 100027, 111310, 91431, 96844, 38651, 35665, 108400, 114747, -1779, -27742, -36856, -48458, 18631, 13264, -20085, -35751, -43839, 9171, -22844, -18047, -22600, -6149, -35344, 23326, -65794, -57447, 4083, -56061, -88696, -62491, -91521, -198446, -208954, -157087, -72039, -102056, -3192, 128480, 163428, 144632, 145885, 285616, 278685, 266244, 227598, 159599, 104185, 134060, 188198, 148216, 214654, 120614, 80761, 137985, 151415, -6773]
2540f773Q160m2640M4701q6389j4399J05131M3431p675N6273L1812O731Q5198
2528B23561p6602l9696j06647O0719L3957k3255k5596N9879k383J39017J9856
2517B62810l9793k7011j1743k55k1895j670Q8494N3794k5257q0422Q9386J7103
2505C03541p0336L2383L150P3658l6778n7866L9662O7946J49409p1643l3684P8863
2493D78305Q0946j7676j00898p0071q1393L1236m0391K3175M3464O1234r765n5370
2481C42796Q4637l220L6663q949J1762n197j3117J60121p8333O005J7647P7472
2469F28287K0799j8630P1317J83303J9447K9233P2334N6868q700Q0131o004L5734
2457A164119l930K8689j21205l7594K0164n498Q6927J67174N947k3840n1734J22023
$$ y = [-6773, 1387, -41253, 3448, -82941, -97340, 7791, 51222, 43547, 99820, 131632, 138363, 223561, 146959, 107263, 616, 61335, 95292, 72037, 46441, 106320, 103937, 242954, 262810, 223017, 196006, 184263, 184008, 162113, 160443, 248937, 302731, 277474, 197052, 286438, 303541, 233205, 265588, 268738, 342396, 305618, 247752, 287414, 355360, 504769, 433126, 399442, 478305, 559251, 541575, 440677, 370606, 289213, 320449, 280058, 303233, 346697, 407931, 398166, 342796, 427433, 424213, 460876, 451927, 463689, 458492, 445375, 605496, 527163, 533168, 550815, 628287, 649086, 630456, 701773, 885076, 904523, 933756, 1006090, 1062958, 1054258, 1134389, 1128385, 1164119, 1160189, 1188878, 1067673, 1030079, 1050243, 1044745, 1131672, 1298846, 1304793, 1280953, 1229219, 1351242]
2445A351242K51480P8436j11499J35699K0137M189Q784J50182L9780O1120o99
2434A988851M1704o9559J20156m4288J25241P3168Q0226J65656J34601J82922
2424B798678L92368J80843J37324J25353J66977N2973M8841J38424K76198M46922
2414D764901P21421O77726M15444M44644O12596M63236O67373R64368J490874
2405A1222583J744096J623911P69877M49500N10081J194870J907873K385077K581158
2396B4389026L550409N084789P890571J2774016K2766295L7572952M3119080K7283610
2388A84430748n896572k5678044l3104115k8166665k0661911j5393820j1823146
2381D3706475r879368p537471n107302l040756j654234p02169n70419n09411j063514
$$ y = [1351242, 1602722, 1681158, 1569659, 1705358, 1725495, 1729684, 1738468, 1888650, 1928430, 1989550, 1988851, 2030555, 1960996, 2081152, 2036864, 2162105, 2235273, 2315499, 2481155, 2615756, 2798678, 3191046, 3371889, 3509213, 3634566, 3801543, 3854516, 3903357, 4041781, 4317979, 4764901, 5486322, 6164048, 6579492, 7024136, 7636732, 8099968, 8767341, 9731709, 11222583, 12966679, 14590590, 15360467, 15809967, 16320048, 17514918, 19422791, 21807868, 24389026, 27939435, 33024224, 40914795, 53688811, 76455106, 114028058, 157147138, 184430748, 178534176, 152856132, 119752017, 91585352, 70923441, 55529621, 43706475, 33827107, 26289636, 21182334, 18141578, 16487344, 15785175, 15214756, 14705345, 13641831]
2372A3641831j406702j479000j380016j276539j039962p42732n82456n25051k38967
2363D970406l7941k716j87911j47069l45012k71607l80731l07562j50385j00672
2353C038800q7226R3420l9117r591j14286l3740r5369O1837k43144k30167j55960
2342B185457j12958j41988n8213q9314n8145q0160k9498r7049Q6513O525j00160
2331A511010m1855k6479j9057k9032j28297k5428k5949m579j49818k0301O8357
2320A108572n8084o9179j28819L5619m3822j52797O8871p3045M6504j0423J0961
2309G34358N9898L4740j6318J13947j26829p2061k3850n0416p1529j9265n3961
2298E08714R9704k4019q3L5472L1553K5699j05156j05555J49528p2198k0509l0438
$$ y = [13641831, 12235129, 10756129, 9376113, 8099574, 7059612, 6316880, 5734424, 5209373, 4970406, 4932465, 4929749, 4741838, 4594769, 4249757, 3978150, 3597419, 3289857, 3139472, 3038800, 2951574, 3044994, 3005877, 2996286, 2882000, 2848260, 2752891, 2814728, 2571584, 2341417, 2185457, 2072499, 1930511, 1872298, 1782984, 1724839, 1644679, 1615181, 1518132, 1604645, 1611170, 1511010, 1469155, 1442676, 1423619, 1394587, 1266290, 1240862, 1214913, 1210334, 1060516, 1040215, 1108572, 1050488, 981309, 852490, 888109, 844287, 691490, 760361, 687316, 733820, 723397, 734358, 794256, 828996, 812678, 926625, 799796, 727735, 703885, 653469, 581940, 562675, 508714, 608418, 584399, 584316, 619788, 651341, 677040, 571884, 466329, 615857, 543659, 523150, 492712]
2286D92712q534j62117k0143k86Q4323p0268j0027j7193l1745N5400N9268k7503
2274C43887k2719r0110Q4283N6363p4438m1797L7764P0139j18906J13472p2571
2263B85367l0932p6562J50728J237j842J2723L467j18020l349O1984K3095q2702
2251B25194j8901o7176J508L4438L6421P2954n7477l1264k164L6709J75597j9714
2239C86125j3317m3456J1047n8669j18747m8358L4772J9268j5096k6005j10350
2228A7214j2481M5432j24709m7006j4930N8216l5551L8724l5021J2425N465L934
2216h8288J45252K19991j21459q129J43242o1849k2913r4247j6229k4287n3384
2205A7700p832j236J05888K4919j40558l8455J8107k8087P4254J7412q8661j5327
$$ y = [492712, 484178, 322061, 301918, 301632, 385955, 315687, 305660, 288467, 256722, 312122, 371390, 343887, 321168, 231058, 315341, 371704, 297266, 255469, 293233, 363372, 244466, 357938, 285367, 254435, 177873, 328601, 329838, 327996, 340719, 344186, 226166, 222817, 284801, 307896, 225194, 206293, 139117, 140625, 175063, 211484, 284438, 226961, 195697, 193533, 230242, 405839, 386125, 372808, 329352, 340399, 281730, 162983, 114625, 149397, 168665, 153569, 127564, 17214, 4733, 50165, -74544, -121550, -136480, -78264, -113815, -75091, -110112, -97687, -92222, -88288, 56964, 276955, 155496, 147367, 290609, 228760, 205847, 111600, 95371, 71084, 17700, 9868, 8632, 114520, 139439, -1119, -39574, -21467, -49554, 24700, 42112, -46549, -61876]
2193f1876J0819N8608l8333l307O0691O402j1726j06107l7077j2305j6739M5311
2181a05639P2043j46265J3701J01334J1548R1165j10433K9274O3970J640K9415
2170E1753l7581p9061k4951m8851l3451J34455K8563n6712k7292K6106r2640N7921
2158a01741l910L0124P0916k4730j2499o0980O8078P7832o8892p5377K1884l9444
2146a18739L6274j3209J7719n0325R496K9723J7574N674L3195m014m1733J19009
2134D0644Q5139k0051Q826j8868M8589k4057j06961k5059R9764J22169K4814N8409
2122B93358R3947K18680J45110N4209r7332k17603n2974J4637r1812k22219j09808
2111B8193r5660m098M3167m4299k2603j166J18831K115k3945j01084N4783N2359
$$ y = [-61876, -51057, 7551, -30782, -34089, 26602, 33004, 21278, -84829, -121906, -134211, -150950, -105639, -33596, -179861, -166160, -64826, -53278, 37887, -72546, -43272, 20698, 22338, 51753, 14172, -64889, -89840, -138691, -172142, -37687, -9124, -65836, -93128, -67022, -159662, -101741, -105651, -75527, -4611, -29341, -41840, -102820, -34742, 43090, -25802, -101179, -79295, -118739, -82465, -95674, -77955, -128280, -118784, -89061, -71487, -65813, -32618, -36632, -78365, 40644, 125783, 105732, 114558, 95690, 144279, 120222, 13261, -11798, 87966, 210135, 234949, 293358, 387305, 605985, 751095, 805304, 707972, 490369, 437395, 452032, 360220, 138001, 28193, -67467, -71565, -28398, -72697, -95300, -96466, 22365, 24480, 535, -100549, -45766, 6593]
2099F593m4941Q4072K0032l6032j45586m8307n8945M0650J06954m4023J8576O5133
2087c5824q2058L0128R1416q3779n8355L1787L0675N5053k5120m0197O4130K9142
2075F998j14213j17990j7008L8187K6141P4675m2893Q9590M4024j15927k7799
2064a56215K9429R1116J6943j4851L249r6817R221o193n2231j1801L7677k7969
2052a78442L5504N3637j1394k0039L0416M700m8836L7245K8127l0851O0857j5679
2040e4755o9709l45J34805o1615q6430q984P2491P6364j11323l3661m226M4151
2028a03237J55066j6503j9858j9558p1190k2647n0715J08928N1595L1465r8988
2017e5642r6179k9017p356Q9382M2733o4644j1160L6821j23343J680j5681k8848
$$ y = [6593, -38348, 45724, 65756, 29724, -115862, -164169, -223114, -182464, -75510, -119533, -100957, -35824, -117882, -87754, 3662, -80117, -138472, -106685, -76010, -20957, -46077, -86274, -22144, 6998, -107215, -225205, -242213, -204026, -177885, -103210, -146103, -56513, -12489, -128416, -156215, -126786, -35670, -18727, -33578, -30329, -127146, -117925, -124118, -176349, -188150, -150473, -178442, -142938, -89301, -100695, -120734, -90318, -85618, -134454, -97209, -69082, -99933, -39076, -54755, -124464, -124809, 9996, -51619, -138049, -147033, -74542, 1822, -109501, -143162, -147388, -103237, 51829, 35326, 15468, -4090, -75280, -97927, -148642, -39714, 11881, 43346, -55642, -151821, -180838, -188194, -98812, -56079, -120723, -131883, -95062, -218405, -216725, -232406, -261254]
2005b61254P4819J34781m71K5780P601q5758j3859O7567j2455q1270L41L3621
1993a10557l200l1319L5593M0545l315M6304l3721n5409L9004r3895J4666o8311
1981b23615P3915J0593P1122q8355o2971j5955J3671j3774R5649L9078n5899Q5721
1969g0820j0240j03414m256o642N1060N9136r4150m4433R6885J6470j13101J9476
1957b04029J38713m0432K342q561J17514Q0557q5991j7746j58911P0994M2762
1946f2788J1581L2192m700J04469N9690l9073k396m7878j09515L8253O3988m1229
1934B594j9414k5349O7873N6213J8453r1611m8845j0014j353N7201k1215q3424
1922i8891O6414m922p2095k656m7749L8277j8172K5134p1018N0633k5039N6434
$$ y = [-261254, -186435, -51654, -52125, -26345, -18744, -104502, -118361, -50794, -63249, -144519, -144178, -110557, -113757, -145076, -109483, -68938, -72253, -25949, -59670, -115079, -76075, -169970, -155304, -223615, -149700, -139107, -67985, -156340, -219311, -235266, -221595, -235369, -139720, -100642, -156541, -70820, -81060, -184474, -188730, -195372, -144312, -85176, -179326, -223759, -126874, -110404, -223505, -204029, -65316, -105748, -103406, -111967, 5547, 86104, 113, -17633, -176544, -105550, -62788, -51207, -19015, -23715, 80754, 140444, 101371, 98975, 51097, -58418, -20165, 43823, 2594, -16820, -42169, 25704, 81917, 100370, 8759, -40086, -50100, -51453, 5748, -15467, -98891, -32477, -37399, -109494, -112150, -159899, -121622, -139794, -114660, -185678, -135045, -160084, -103650]
1910a03650n342k3645r2455Q0029N1459o272N2361P1035m1842r5784P0950q3223
1898a26379k835N0883o6250K7755J11389m6781o6075J6232O845J8293n8611l1752
1886a67286L9703J4992n9640M687L100K9837L7866r4220m1282P6304K9937p9384
1874b05386K541O0412j6566J33484j0978j20225J26418J2026k6865N3076Q8995
1863I6932j88471p6836J4631Q2309q899p1554l8883n040n4905J34691q6212L0189
1851a72048n7471M8860M6373k9593P0855O4395q1135n5390k9155k238N0797L2563
1839a13187j7404J29722O727o0481r017K4853o9684n0568n212J1135m445o8442
1827b26003P2859L5025N6599m7719J3822L6585N7062p8381m1740o7261K3184R8540
$$ y = [-103650, -108992, -132637, -225092, -145063, -93604, -99876, -47515, 23520, -18322, -114106, -43156, -126379, -129214, -78331, -144581, -116826, -5437, -52218, -118293, -102061, -95216, -76923, -135534, -167286, -127583, -112591, -172231, -167544, -164444, -134607, -96741, -190961, -232243, -155939, -126002, -205386, -202845, -142433, -158999, -25515, -36493, -156718, -30300, -18274, -45139, 7937, 96932, -91539, -168375, -153744, -71435, -80334, -151888, -190771, -195811, -250716, -116025, -202237, -172048, -229519, -180659, -134286, -163879, -93024, -28629, -109764, -165154, -194309, -196547, -145750, -113187, -130591, -869, 5858, -54623, -63640, -38787, -108471, -159039, -164251, -153116, -157561, -226003, -153144, -118119, -61520, -109239, -95417, -58832, -1770, -80151, -121891, -189152, -165968, -67428]
1815f7428j06432K0446K0372L5901Q7482N957K0763n8290k9440r283q604K2725
1803f5831N3238q8878K0386n9321m4882J05014n4143L1482j086L4870J0057N0701
1791h393n5957L5286j54986q7759N8638L2671L0018K5756P1336q5717J5750j3588
1779a36945K5327M8395m0536n2821j1583j8832R3686m8646J9333k3701J01947
$$ y = [-67428, -173860, -153414, -133042, -97141, -9659, -3702, 17061, -41229, -70669, -79952, -88556, -65831, -12593, -101471, -81085, -140406, -185288, -80274, -134417, -102935, -104021, -69151, -59094, -8393, -64350, -29064, -184050, -271809, -213171, -180500, -150482, -124726, -53390, -139107, -123357, -136945, -111618, -63223, -103759, -156580, -168163, -186995, -93309, -141955, -122622, -146323, -44376]
$$ [...]
##END NTUPLES=NMR SPECTRUM
##END=
