##TITLE=1H_CA-9427-3
 200.13MHz,CDCl3.
 8 sc
 
 26.2.2026
##JCAMPDX= 6.0         $$ Bruker NMR JCAMP-DX V2.0
##DATA TYPE= NMR SPECTRUM
##DATA CLASS= NTUPLES
##ORIGIN= UXNMR, Bruker Analytische Messtechnik GmbH
##OWNER= pz
$$ XWIN-NMR		Version 3.5
$$ Thu Feb 26 16:01:18 2026 Russian Standard Time (UT+4h)  she@DPX200
##.OBSERVE FREQUENCY= 200.1313
##.OBSERVE NUCLEUS= ^1H
##.ACQUISITION MODE= SIMULTANEOUS
##.ACQUISITION SCHEME= undefined
##.AVERAGES= 8
##.DIGITISER RES= 18
##SPECTROMETER/DATA SYSTEM= spect
##.PULSE SEQUENCE= zg30
##.SOLVENT NAME= D2O
##.SHIFT REFERENCE= (INTERNAL, D2O, 0, 15.4582)
##AUDIT TRAIL= $$ (NUMBER, WHEN, WHO, WHERE, WHAT)
$$ ##TITLE= Audit trail, XWIN-NMR		Version 3.5
$$ ##JCAMPDX= 5.01
$$ ##ORIGIN= Bruker BioSpin GmbH
$$ ##OWNER= she
$$ F:/spectra/data/she/nmr/H-C/1/pdata/1/auditp.txt
$$ ##AUDIT TRAIL=  $$ (NUMBER, WHEN, WHO, WHERE, WHAT)
(   1,<2026-02-26 15:59:42.23 +0400>,<she>,<DPX200>,
      <created by zg, POWCHK disabled, PULCHK disabled
       configuration hash MD5:
       00 E9 B6 7A A2 85 ED C7 34 08 36 98 17 FE 4E 26
       data hash MD5: 16K
       61 B4 06 15 2D 14 B4 5F 7D FD 68 FA 29 D6 B6 50>)
(   2,<2026-02-26 15:59:44.57 +0400>,<she>,<DPX200>,
      <Start of raw data processing
       efp BC_mod = 2 LB = 0.25 FT_mod = 6 PKNL = 1 PHC0 = -3705.888 PHC1 = 7.992321 SI = 16K 
       data hash MD5: 16K
       F7 EB CA 38 C0 90 4B 99 32 83 D9 A5 A3 4B 50 C1>)
(   3,<2026-02-26 16:00:20.79 +0400>,<she>,<DPX200>,
      <pk PHC0 = -151.5652 PHC1 = -1.8 
       data hash MD5: 16K
       66 81 5F 25 46 A0 C8 55 6C BE 6F B0 C2 57 EE D9>)
(   4,<2026-02-26 16:00:24.85 +0400>,<she>,<DPX200>,
      <abs ABSG = 5 
       data hash MD5: 16K
       33 7C 45 FF A6 FE 58 23 B8 B8 ED 48 EF 08 25 90>)
$$ ##END=
$$ 
$$ hash MD5
$$ CE 13 41 88 D2 6A 2E AF 31 A0 16 98 F1 18 00 69
##$RELAX= 
##$RELAX= 
##$RELAX= 
##$RELAX= 
##$RELAX= 
##$RELAX= 
$$ Bruker specific parameters
$$ --------------------------
##$DU= <F:/spectra>
##$EXPNO= 1
##$NAME= <H-C>
##$PROCNO= 1
##$TYPE= <nmr>
##$USER= <she>
##$AMP= (0..31)
100 100 100 100 100 100 100 100 100 100 100 100 100 100 100 100 100 100 
100 100 100 100 100 100 100 100 100 100 100 100 100 100 
##$AQSEQ= 0
##$AQ_mod= 1
##$AUNM= <au_zg>
##$AUTOPOS= <>
##$BF1= 200.13
##$BF2= 200.13
##$BF3= 200.13
##$BF4= 200.13
##$BF5= 200.13
##$BF6= 200.13
##$BF7= 200.13
##$BF8= 200.13
##$BYTORDA= 1
##$CFDGTYP= 0
##$CFRGTYP= 5
##$CHEMSTR= <none>
##$CNST= (0..31)
1 1 145 1 1 1 1 1 1 1 1 1 1 1 1 1 1 1 1 1 1 1 1 1 1 1 1 1 1 1 1 1 
##$CPDPRG= <>
##$CPDPRG1= <>
##$CPDPRG2= <>
##$CPDPRG3= <>
##$CPDPRG4= <mlev>
##$CPDPRG5= <mlev>
##$CPDPRG6= <mlev>
##$CPDPRG7= <mlev>
##$CPDPRG8= <mlev>
##$CPDPRGB= <>
##$CPDPRGT= <>
##$D= (0..31)
0 0.7 0 0 0 0 0 0 0 0 0 0.03 0 0 0 0 0 0 0 0 0 0 0 0 0 0 0 0 0 0 0 0 
##$DATE= 1772107181
##$DBL= (0..7)
120 120 120 120 120 120 120 120 
##$DBP= (0..7)
150 150 150 150 150 150 150 150 
##$DBP07= 0
##$DBPNAM0= <>
##$DBPNAM1= <>
##$DBPNAM2= <>
##$DBPNAM3= <>
##$DBPNAM4= <>
##$DBPNAM5= <>
$$ [...]
##$SUBNAM3= <"">
##$SUBNAM4= <"">
##$SUBNAM5= <"">
##$SUBNAM6= <"">
##$SUBNAM7= <"">
##$SUBNAM8= <"">
##$SUBNAM9= <"">
##$SW= 18.0517328524113
##$SWIBOX= (0..15)
0 0 2 0 0 0 0 0 0 0 0 0 0 0 0 0 
##$SW_h= 3612.71676300578
##$TD= 16384
##$TD0= 1
##$TE= 0
##$TE2= 300
##$TE3= 300
##$TEG= 300
##$TL= (0..7)
0 120 120 120 120 120 120 120 
##$TP= (0..7)
150 150 150 150 150 150 150 150 
##$TP07= 0
##$TPNAME0= <>
##$TPNAME1= <>
##$TPNAME2= <>
##$TPNAME3= <>
##$TPNAME4= <>
##$TPNAME5= <>
##$TPNAME6= <>
##$TPNAME7= <>
##$TPOAL= (0..7)
0.5 0.5 0.5 0.5 0.5 0.5 0.5 0.5 
##$TPOFFS= (0..7)
0 0 0 0 0 0 0 0 
##$TUNHIN= 0
##$TUNHOUT= 0
##$TUNXOUT= 0
##$USERA1= <user>
##$USERA2= <user>
##$USERA3= <user>
##$USERA4= <user>
##$USERA5= <user>
##$V9= 5
##$VALIST= <valist>
##$VCLIST= <CCCCCCCCCCCCCCC>
##$VD= 0
##$VDLIST= <DDDDDDDDDDDDDDD>
##$VPLIST= <PPPPPPPPPPPPPPP>
##$VTLIST= <TTTTTTTTTTTTTTT>
##$WBST= 1024
##$WBSW= 4
##$XGAIN= (0..3)
0 0 0 0 
##$XL= 0
##$YL= 0
##$YMAX_a= 935032
##$YMIN_a= -885127
##$ZGOPTNS= <>
##$ZL1= 120
##$ZL2= 120
##$ZL3= 120
##$ZL4= 120
##$ABSF1= 15.51551
##$ABSF2= -2.53634
##$ABSG= 5
##$ABSL= 3
##$ALPHA= 0
##$AQORDER= 0
##$ASSFAC= 0
##$ASSFACI= 0
##$ASSFACX= 0
##$ASSWID= 0
##$AUNMP= <proc_1d>
##$AZFE= 0.1
##$AZFW= 0.1
##$BCFW= 0
##$BC_mod= 2
##$BYTORDP= 0
##$COROFFS= 0
##$CY= -3
##$DATMOD= 1
##$DC= 0
##$DFILT= <>
##$DTYPP= 0
##$F1P= 0
##$F2P= 0
##$FCOR= 1
##$FTSIZE= 16384
##$FT_mod= 6
##$GAMMA= 0
##$GB= 0
##$INTBC= 1
##$INTSCL= 3.241238e-09
##$ISEN= 128
##$LB= 0.25
##$LEV0= 0
##$LPBIN= 0
##$MAXI= 10000
##$MC2= 0
##$MEAN= 0
##$ME_mod= 0
##$MI= 1.114404
##$NCOEF= 0
##$NC_proc= -6
##$NLEV= 6
##$NOISF1= 3.799351
##$NOISF2= 2.8
##$NSP= 0
##$NTH_PI= 0
##$NZP= 0
##$OFFSET= 15.45822
##$PC= 1
##$PHC0= -3857.453
##$PHC1= 6.192321
##$PH_mod= 1
##$PKNL= yes
##$PPARMOD= 0
##$PSCAL= 0
##$PSIGN= 0
##$REVERSE= no
##$SF= 200.13001270513
##$SI= 16384
##$SIGF1= 3
##$SIGF2= 2
##$SINO= 0.751879
##$SIOLD= 32768
##$SREGLST= <19F.Aceton>
##$SSB= 0
##$STSI= 16384
##$STSR= 0
##$SW_p= 3612.71676300578
##$SYMM= 0
##$S_DEV= 0
##$TDeff= 16384
##$TDoff= 0
##$TI= <>
##$TILT= no
##$TM1= 0
##$TM2= 0
##$TOPLEV= 0
##$USERP1= <user>
##$USERP2= <user>
##$USERP3= <user>
##$USERP4= <user>
##$USERP5= <user>
##$WDW= 1
##$XDIM= 16384
##$YMAX_p= 474649677
##$YMIN_p= -704589
$$ End of Bruker specific parameters
$$ ---------------------------------
##NTUPLES= NMR SPECTRUM
##VAR_NAME=  FREQUENCY,     SPECTRUM/REAL,   SPECTRUM/IMAG
##SYMBOL=    X,             R,               I
##VAR_TYPE=  INDEPENDENT,   DEPENDENT,       DEPENDENT
##VAR_FORM=  AFFN,          ASDF,            ASDF
##VAR_DIM=   16384,         16384,           16384
##UNITS=     HZ,            ARBITRARY UNITS, ARBITRARY UNITS
##FACTOR=    0.220516191357247, 1,           1
##FIRST=     3093.653670577, 0,              0
##LAST=      -519.063092428777, 0,           0
##MIN=       -519.063092428777, -704589,     0
##MAX=       3093.653670577, 474649677,      0
$$ Real data points
##PAGE= N=1
##DATA TABLE= (X++(R..R)), XYDATA
$$ [...]
$$ plain form
6317 867854 876862 874710 890735 871607 846703 853210 865567 877551 857505 936726 968633 900233
6305 900233 931839 1017351 1025874 985057 949372 942911 976502 977243 982928 1005355 1008804 1058969 1024466
6292 1024466 1060187 1116046 1132473 1130982 1158043 1272491 1249443 1165408 1195110 1191420 1200470 1264970
6280 1264970 1295554 1332206 1307024 1285327 1300818 1328155 1373775 1402865 1411276 1405635 1476541 1430521
6268 1430521 1421889 1434363 1458669 1489459 1450873 1474845 1445217 1488737 1487196 1492119 1469799 1509277
6256 1509277 1537144 1503803 1561698 1555811 1652610 1705764 1744452 1734101 1720610 1786646 1824039 1846303
6244 1846303 1799790 1776078 1764403 1837760 1843933 1909236 1918473 1892591 1878027 1891416 1952413 2022161
6232 2022161 2055394 2078570 2095569 2070063 2116076 2156285 2184165 2209580 2192106 2137236 2224325
$$ packed form
6317H67854R008k152J6025j9128k4904O507J2357J1984k0046P9221L1907o8400
6305I00233L1606Q5512Q523m0817l5685o461L3591P41N685K2427L449N0165l4503
6292A024466L5721N5859J6427j491K7061J14448k3048q4035K9702l690R050O4500
6280A264970L0584L6652k5182k1697J5491K7337M5620K9090Q411n641P0906m6020
6268A430521q632J2474K4306L0790l8586K3972k9628M3520j541M923k2320L9478
6256A509277K7867l3341N7895n887R6799N3154L8688j0351j3491O6036L7393K2264
6244A846303m6513k3712j1675P3357O173O5303R237k5882j4564J3389O0997O9748
6232B022161L3233K3176J6999k5506M6013M0209K7880K5415j7474n4870Q7089
$$ plain form
6221 2224325 2296651 2346652 2317341 2360973 2363961 2425152 2454698 2439317 2395624 2385268 2421538 2490339
6209 2490339 2490641 2504343 2492450 2460700 2513380 2581293 2532557 2557530 2585763 2535300 2555485 2617978
6197 2617978 2604305 2678617 2856956 2925366 2954165 2924544 2982373 2991221 2973480 2938852 2899460
6186 2899460 2842080 2872467 2881117 2814572 2803578 2753140 2687731 2640972 2623801 2564854 2515568 2481437
6174 2481437 2437663 2506442 2453123 2454011 2565624 2524625 2515535 2525470 2617574 2600853 2633730 2660408
6162 2660408 2700256 2686530 2707310 2809668 2811248 2830071 2828795 2862572 2842300 2961762 3016568
6151 3016568 3004726 2979209 3027539 3050982 3090510 3111052 3073894 3053775 3067006 3004730 2998824 2976345
6139 2976345 2910858 2903809 2923816 2913472 2806552 2787467 2771583 2737974 2708228 2656800 2602100
$$ packed form
6221B224325P2326N0001k9311M3632K988O1191K9546j5381m3693j0356L6270O8801
6209B490339L02J3702j1893l1750N2680O7913m8736K4973K8233n0463K0185O2493
6197B617978j3673P4312J78339O8410K8799k9621N7829Q848j7741l4628l9392
6186B899460n7380L0387Q650o6545j0994n0438o5409m6759j7171n8947m9286l4131
6174B481437m3774O8779n3319Q88J11613m0999r090R935R2104j6721L2877K6678
6162B660408L9848j3726K0780J02358J580J8823j276L3777k0272J19462N4806
6151C016568j1842k5517M8330K3443L9528K0542l7158k0119J3231o2276n906k2479
6139B976345o5487p049K0007j0344j06920j9085j5884l3609k9746n1428n4700
$$ plain form
6128 2602100 2594347 2640084 2631619 2660029 2631860 2649534 2675727 2644141 2657068 2700175 2730044 2778666
6116 2778666 2789211 2793897 2806282 2873886 2926848 2834126 2804232 2928933 2955281 3019714 2985565
6105 2985565 3017673 3005527 3064475 3144657 3172589 3153664 3160161 3225339 3224958 3232365 3247886 3208481
6093 3208481 3239503 3269377 3322510 3363226 3324786 3369795 3382067 3426722 3447483 3459998 3514960
6082 3514960 3559884 3593926 3650282 3593177 3624258 3671936 3729634 3723589 3773983 3828207 3808607 3882431
6070 3882431 3984069 3931884 3992183 4044535 4061544 4083526 4181630 4242940 4237786 4346447 4467603
6059 4467603 4441143 4542357 4647705 4730079 4769768 4837011 4946198 5014269 5045181 5071929 5194304
6048 5194304 5331977 5330881 5417054 5522112 5666592 5710424 5843647 5970574 6105987 6239326
$$ packed form
6128B602100p753M5737q465K8410k8169J7674K6193l1586J2927M3107K9869M8622
6116B778666J0545M686J2385O7604N2962r2722k9894J24701K6348O4433l4149
6105B985565L2108j2146N8948Q0182K7932j8925O497O5178l81P407J5521l9405
6093C208481L1022K9874N3133M0716l8440M5009J2272M4655K0761J2515N4962
6082C514960M4924L4042N6356n7105L1081M7678N7698o045N0394N4224j9600P3824
6070C882431J01638n2185O0299N2352J7009K1982R8104O1310n154J08661J21156
6059D467603k6460J01214J05348Q2374L9689O7243J09187O8071L0912K6748J22375
6048E194304J37673j096Q6173J05058J44480M3832J33223J26927J35413J33339
$$ plain form
6038 6239326 6352010 6492182 6565624 6679319 6787547 6947203 7002150 7087077 7196898 7326161
6028 7326161 7377153 7461968 7560608 7723713 7863748 7946757 7971318 8035539 8177209 8260525 8375612
6017 8375612 8522802 8690882 8833179 8921870 9029860 9190791 9339896 9444625 9540520 9649131
6007 9649131 9841491 9924643 10029527 10181232 10389674 10574138 10724379 10917289 11105283 11250845
5997 11250845 11452167 11638971 11775552 11934710 12122102 12357326 12531186 12664702 12811767
5988 12811767 12910819 13069343 13237393 13343162 13533421 13736362 13957956 14150523 14269561 14504435
5978 14504435 14786371 15040185 15279496 15601167 15917345 16199247 16510944 16826125 17106302
5969 17106302 17541908 17958864 18395542 18811155 19273690 19858921 20412441 20970271 21561984
$$ packed form
6038F239326J12684J40172P3442J13695J08228J59656N4947Q4927J09821J29263
6028G326161N0992Q4815R8640J63105J40035Q3009K4561O4221J41670Q3316J15087
6017H375612J47190J68080J42297Q8691J07990J60931J49105J04729R5895J08611
6007I649131J92360Q3152J04884J51705K08442J84464J50241J92910J87994J45562
5997A1250845K01322J86804J36581J59158J87392K35224J73860J33516J47065
5988A2811767R9052J58524J68050J05769J90259K02941K21594J92567J19038K34874
5978A4504435K81936K53814K39311L21671L16178K81902L11697L15181K80177
5969A7106302M35606M16956M36678M15613M62535N85231N53520N57830N91713
$$ plain form
5960 21561984 22243050 22894423 23559366 24261611 25091694 25878892 26594435 27337964 28076903
5951 28076903 28598778 29146640 29620760 30135111 30598058 31083678 31739347 32425839 33194162
5942 33194162 34127086 35154977 36237978 37477440 38933533 40441327 42083903 43935185
5934 43935185 45920484 48076470 50386482 52831877 55363629 57899407 60459389 63104127
5926 63104127 65731542 68467553 71295497 74379677 77745689 81491285 85687233 90367542
5918 90367542 95532640 101409669 107906343 115066623 123037419 131709357 140955451 150939746
5910 150939746 161520471 172693954 184153066 195767094 207279003 218245755 228083070
5903 228083070 236612824 243598758 248975994 252915640 255657243 257308179 257981064 257826114
$$ packed form
5960B1561984O81066O51373O64943P02245Q30083P87198P15543P43529P38939
5951B8076903N21875N47862M74120N14351M62947M85620O55669O86492P68323
5942C3194162R32924J027891J083001J239462J456093J507794J642576J851282
5934D3935185J985299K155986K310012K445395K531752K535778K559982K644738
5926F3104127K627415K736011K827944L084180L366012L745596M195948M680309
5918I0367542N165098N877029O496674P160280P970796Q671938R246094R984295
5910A50939746J0580725J1173483J1459112J1614028J1511909J0966752R837315
5903B28083070Q529754O985934N377236L939646K741603J650936O72885j54950
$$ plain form
5895 257826114 256242301 253232808 248310875 241468134 232879159 222725120 211446507 199571870
5887 199571870 187394026 175105449 163147622 151719849 140958402 131045317 121868779
5880 121868779 113625727 106267495 99705457 93865949 88649982 84022345 79830713 75927409
5872 75927409 72337953 69042436 65778240 62652373 59749447 56966466 54342520 51890723
5864 51890723 49631271 47594522 45802279 44025765 42474414 41052010 39750983 38636781
5856 38636781 37572950 36573340 35689903 34939098 34198876 33551332 32976091 32473672 31993359
5847 31993359 31529939 31147555 30909751 30596077 30186578 29792488 29383124 28895091 28403154
5838 28403154 27855127 27269521 26692105 26117714 25594110 25045081 24475802 23937895 23471070
$$ packed form
5895B57826114j583813l009493m921933o842741q588975j0154039j1278613j1874637
5887A99571870j2177844j2288577j1957827j1427773j0761447r913085r176538
5880A21868779q243052p358232o562038n839508n215967m627637m191632l903304
5872G5927409l589456l295517l264196l125867k902926k782981k623946k451797
5864E1890723k259452k036749j792243j776514j551351j422404j301027j114202
5856C8636781j063831r99610q83437p50805p40222o47544n75241n02419m80313
5847C1993359m63420l82384k37804l13674m09499l94090m09364m88033m91937
5838B8403154n48027n85606n77416n74391n23604n49029n69279n37907m66825
$$ plain form
5829 23471070 23013604 22483845 21871329 21261997 20707679 20346600 19878474 19377511 18868115
5820 18868115 18438344 18126582 17744642 17387810 17058176 16773618 16493128 16183011 15960648
5811 15960648 15671141 15500174 15397515 15243627 15127102 14978610 14823252 14676479 14556492
5802 14556492 14405274 14320282 14161827 14061168 13978548 13898254 13718161 13561693 13433780 13364247
5792 13364247 13202038 13162329 13161838 13138442 13012278 12976040 12994165 12974579 12894971 12857997 12820769
5781 12820769 12738820 12588771 12521196 12466973 12279624 12199130 12078960 11950088 11849277 11860347
5771 11860347 11814363 11709210 11637260 11654381 11623713 11589959 11588278 11539495 11498626 11528739 11451058
5760 11451058 11394242 11477318 11543162 11551892 11545794 11528935 11562619 11486297 11461194 11480447 11497847 11458293
$$ packed form
5829B3471070m57466n29759o12516o09332n54318l61079m68126n00963n09396
5820A8868115m29771l11762l81940l56832l29634k84558k80490l10117k22363
5811A5960648k89507j70967j02659j53888j16525j48492j55358j46773j19987
5802A4556492j51218q4992j58455j00659q2620q0294j80093j56468j27913o9533
5792A3364247j62209l9709m91k3396j26164l6238J8125j9586p9608l6974l7228
5781A2820769q1949j50049o7575n4223j87349q0494j20170j28872j00811J1070
5771A1860347m5984j05153p1950J7121l0668l3754j681m8783m0869L0113p7681
5760A1451058n6816Q3076O5844Q730o098j6859L3684p6322k5103J9253J7400l9554
$$ plain form
5748 11458293 11447728 11491422 11532906 11525997 11536445 11601650 11634778 11603088 11678928 11777264 11774047 11758271
5736 11758271 11867485 11970964 11988404 11894449 11986314 12008263 12093524 12147862 12191399 12219615 12223336
5725 12223336 12252515 12297055 12379974 12399423 12517466 12568644 12623932 12719086 12754860 12720233 12774284
5714 12774284 12824824 12904041 12998814 13099804 13148557 13189925 13241903 13293923 13376463 13471494 13516611
5703 13516611 13584211 13699849 13874834 13919500 13990380 14081009 14182405 14316733 14429707 14559536
5693 14559536 14728661 14979800 15104369 15228251 15475785 15722097 15916980 16132897 16339042
5684 16339042 16582605 16944036 17229689 17649637 18067947 18591708 19038713 19464719 19897821
5675 19897821 20430867 21018794 21715973 22320915 22603221 22553390 22320863 21968767 21660247 21409436
$$ packed form
5748A1458293j0565M3694M1484o909J0448O5205L3128l1690P5840R8336l217j5776
5736A1758271J09214J03479J7440r3955R1865K1949Q5261N4338M3537K8216L721
5725A2223336K9179M4540Q2919J9449J18043N1178N5288R5154L5774l4627N4051
5714A2774284N0540P9217R4773J00990M8753M1368N1978N2020Q2540R5031M5117
5703A3516611O7600J15638J74985M4666P0880R0629J01396J34328J12974J29829
5693A4559536J69125K51139J24569J23882K47534K46312J94883K15917K06145
5684A6339042K43563L61431K85653M19948M18310N23761M47005M26006M33102
5675A9897821N33046N87927O97179O04942K82306m9831k32527l52096l08520k50811
$$ plain form
5665 21409436 21271552 21283247 21341000 21351398 21322316 21305609 21227221 21170735 21171901 21277341 21380103
5654 21380103 21530784 21740956 22007894 22313723 22657160 23125083 23725653 24387283 25320045
5645 25320045 26409378 27755623 29485701 31445916 33480838 35271688 36122263 35768088
5637 35768088 34620090 33208267 31675134 30376318 29315700 28489466 27951652 27579103 27445647
5628 27445647 27378250 27468429 27618266 27748514 27819236 27771014 27778405 27796071 27886501 28025624 28315949
5617 28315949 28673515 29162793 29815286 30691503 31828726 33300955 35009967 36986748 38898162
5608 38898162 40325067 40681572 39779443 38026406 36050440 34186794 32557353 31201970
5600 31201970 30024454 29090156 28353436 27793150 27365548 26950551 26706997 26544852 26330902
$$ packed form
5665B1409436j37884J1695N7753J0398k9082j6707p8388n6486J166J05440J02762
5654B1380103J50681K10172K66938L05829L43437M67923O00570O61630R32762
5645B5320045J089333J346245J730078J960215K034922J790850Q50575l54175
5637C5768088j147998j411823j533133j298816j060618q26234n37814l72549j33456
5628B7445647o7397R0179J49837J30248P0722m8222P391J7666R0430J39123K90325
5617B8315949L57566M89278O52493Q76217J137223J472229J709012J976781J911414
5608C8898162J426905L56505r02129j753037j975966j863646j629441j355383
5600C1201970j177516r34298p36720n60286m27602m14997k43554j62145k13950
$$ plain form
5591 26330902 26205051 26138870 26131339 26104507 26106163 26076118 26163465 26303348 26502954 26807411 27145568
5580 27145568 27582011 28194527 28864464 29437385 29779360 29853753 29548886 29035096 28387841 27732237
5570 27732237 27177617 26760458 26467266 26094967 25812942 25588141 25354993 25227361 25102785
5561 25102785 25069598 24960182 24887622 24835353 24740894 24736176 24720395 24711662 24684635 24714812 24762254
5550 24762254 24756013 24793198 24807143 24785870 24792630 24780829 24872711 24938733 24971486 25020097 25003928 25073728
5538 25073728 25054440 24969608 24975518 25019025 25165074 25256650 25292032 25369311 25431223 25611364 25713428
5527 25713428 25762499 25734395 25692863 25739052 25669137 25582526 25519016 25481738 25378364 25196422 25143183
5516 25143183 25119846 25052838 25044284 24990941 24985497 24993120 24945481 24981943 24971535 24983814 25135065 25070135
$$ packed form
5591B6330902j25851o6181p531k6832J656l0045Q7347J39883J99606L04457L38157
5580B7145568M36443O12516O69937N72921L41975P4393l04867n13790o47255o55604
5570B7732237n54620m17159k93192l72299k82025k24801k33148j27632j24576
5561B5102785l3187j09416p2560n2269r4459m718j5781q733k7027L0177M7442
5550B4762254o241L7185J3945k1273O760j1801R1882O6022L2753M8611j6169O9800
5538B5073728j9288q4832N910M3507J46049R1576L5382P7279O1912J80141J02064
5527B5713428M9071k8104m1532M6189o9915q6611o3510l7278j03374j81942n3239
5516B5143183k3337o7008q554n3343n444P623m7639L6462j0408J2279J51251o4930
$$ plain form
5504 25070135 25078569 25135245 25213137 25290369 25229722 25214870 25185981 25159349 25120799 24999333 24916733
5493 24916733 24805411 24709401 24612905 24569435 24476514 24389517 24404248 24351079 24311375 24239177 24168075
5482 24168075 24206102 24202977 24145041 24110212 24061712 24019003 23879184 23756433 23572695 23394885 23246301
5471 23246301 23103936 22902050 22723444 22615438 22438099 22236792 22052411 21811799 21624831
5462 21624831 21435228 21326722 21226688 21066061 21023306 21003718 20908426 20858993 20746059 20647971
5452 20647971 20619353 20513838 20396161 20306274 20212506 20146360 20083987 19927150 19819785 19763761
5442 19763761 19678881 19568411 19492409 19307159 19228344 19146745 19036330 18925185 18809428 18730595
5432 18730595 18600933 18501059 18325122 18167270 18125509 18009953 17894611 17813323 17671598 17593518
$$ packed form
5504B5070135Q434N6676P7892P7232o0647j4852k8889k6632l8550j21466q2600
5493B4916733j11322r6010r6496m3470r2921q6997J4731n3169l9704p2198p1102
5482B4168075L8027l125n7936l4829m8500m2709j39819j22751j83738j77810j48584
5471B3246301j42365k01886j78606j08006j77339k01307j84381k40612j86968
5462B1624831j89603j08506j00034j60627m2755j9588r5292m9433j12934r8088
5452B0647971k8618j05515j17677q9887r3768o6146o2373j56837j07365n6024
5442A9763761q4880j10470p6002j85250p8815q1599j10415j11145j15757p8833
5432A8730595j29662r9874j75937j57852m1761j15556j15342q1288j41725p8080
$$ plain form
5422 17593518 17519607 17484441 17370763 17293158 17245104 17150006 17049856 17003122 16941270 16930174 16911868
5411 16911868 16799384 16727287 16720149 16734058 16622252 16559455 16465606 16428259 16288407 16133966 16099381
5400 16099381 16029301 15965305 15956770 15931838 15851545 15885624 15917282 16014046 16079427 16303323 16629903
5389 16629903 16975219 17451141 17970150 18307969 18406378 18261918 17818462 17280135 16762608 16225146
5379 16225146 15741668 15454369 15094392 14769091 14538368 14355971 14156161 13964603 13834155
5370 13834155 13753913 13709115 13582714 13496088 13538460 13505894 13477556 13494868 13543111 13662141 13820832
5359 13820832 13859062 13923953 13941445 13871858 13777091 13557160 13314745 13055822 12846229 12667334
5349 12667334 12440540 12275819 12140837 12135247 12061619 11976521 11947472 11920119 11966371 12012568 11954390
$$ packed form
5422A7593518p3911l5166j13678p7605m8054r5098j00150m6734o1852j1096j8306
5411A6911868j12484p2097p138J3909j11806o2797r3849l7347j39852j54441l4585
5400A6099381p0080o3996q535k4932q0293L4079L1658R6764O5381K23896L26580
5389A6629903L45316M75922N19009L37819R8409j44460m43456n38327n17527n37462
5379A6225146m83478k87299l59977l25301k30723j82397j99810j91558j30448
5370A3834155q0242m4798j26401q6626M2372l2566k8338J7312M8243J19030J58691
5359A3820832L8230O4891J7492o9587r4767k19931k42415k58923k09593j78895
5349A2667334k26794j64721j34982n590p3628q5098k9049k7353M6252M6197n8178
$$ plain form
5338 11954390 11908241 11971940 12046259 12137774 12282458 12440908 12467643 12466643 12352284 12131671 11907131
5327 11907131 11716929 11422137 11189537 11057157 10924634 10739845 10626671 10556742 10468282 10387130
5317 10387130 10307617 10275919 10252615 10203807 10224750 10152799 10175027 10227094 10260074 10323595 10338443
5306 10338443 10411669 10456949 10440771 10343577 10176647 9995133 9793631 9627115 9479356 9325987
5296 9325987 9157248 9060561 8988564 8936861 8898973 8825257 8812458 8830400 8839348 8884296 8934664
5285 8934664 8972401 9024312 9098733 9223021 9288696 9341469 9398278 9333935 9199662 9016853 8760075
5274 8760075 8515637 8318393 8160807 7979550 7884352 7763470 7704011 7605941 7523712 7523275 7437802
5263 7437802 7312011 7270080 7129547 7098633 7102863 7068421 6959446 6893505 6864666 6829062 6870561
$$ packed form
5338A1954390m6149O3699P4319R1515J44684J58450K6735j000j14359k20613k24540
5327A1907131j90202k94792k32600j32380j32523j84789j13174o9929q8460q1152
5317A0387130p9513l1698k3304m8808K0943p1951K2228N2067L2980O3521J4848
5306A0338443P3226M5280j6178r7194j66930j81514k01502j66516j47759j53369
5296I325987j68739r6687p1997n1703l7888p3716j2799J7942Q948M4948N0368
5285H934664L7737N1911P4421J24288O5675N2773N6809o4343j34273j82809k56778
5274H760075k44438j97244j57586j81257r5198j20882n9459r8070q2229m37q5473
5263G437802j25791m1931j40533l0914M230l4442j08975o5941k8839l5604M1499
$$ plain form
5252 6870561 6759107 6695856 6700497 6665321 6651842 6580564 6510963 6514579 6481653 6461783 6456071 6405834
5240 6405834 6350952 6369085 6339604 6347038 6326591 6341782 6351047 6385664 6330840 6318601 6322244 6233286
5228 6233286 6237175 6220516 6177714 6134616 6111605 6089706 6124112 6006672 6059423 6097313 6035282
5217 6035282 6025648 6010597 5969755 5944637 5982217 5988090 5944140 5901312 5867029 5878513 5871125 5837735
5205 5837735 5799784 5779406 5791568 5774007 5738945 5675336 5688263 5604990 5571305 5558508 5539095
5194 5539095 5508912 5537415 5461027 5449464 5454585 5441400 5435177 5412016 5382415 5349343 5353447 5351351
5182 5351351 5349871 5378669 5346218 5311403 5360336 5354211 5309969 5269131 5238078 5254990 5248273 5283996
5170 5283996 5249841 5207767 5196446 5221834 5228498 5259495 5274753 5255714 5262316 5261465 5285772 5315100
$$ packed form
5252F870561j11454o3251M641l5176j3479p1278o9601L616l2926j9870n712n0237
5240F405834n4882J8133k9481P434k0447J5191R265L4617n4824j2239L643q8958
5228F233286L889j6659m2802m3098k3011k1899L4406j17440N2751L7890o2031
5217F035282r634j5051m0842k5118L7580N873m3950m2828l4283J1484p388l3390
5205E837735l7951k0378J2162j7561l5062o3609J2927q3273l3685j2797j9413
5194E539095l0183K8503p6388j1563N121j3185o223k3161k9601l3072M104k096
5182E351351j480K8798l2451l4815M8933o125m4242m0838l1053J6912o717L5723
5170E283996l4155m2074j1321K5388O664L0997J5258j9039O602q51K4307K9328
$$ plain form
5158 5315100 5326898 5334434 5360901 5347130 5388062 5427631 5456059 5544735 5551630 5564816 5633767 5556377
5146 5556377 5652528 5822725 5867190 5972845 6114951 6181931 6362335 6413402 6477090 6545236 6530807
5135 6530807 6537482 6450873 6509312 6537105 6659432 6835625 7036007 7337503 7481301 7681546
5125 7681546 7892127 8131050 8320798 8464817 8556046 8617474 8523178 8363661 8278540 8280865 8239836
5114 8239836 8391605 8624370 8991916 9405015 9748168 9994461 10074427 10032958 9943934 9884658
5104 9884658 9750338 9674045 9450521 9287558 9306495 9393562 9512950 9593682 9789376 10040177
5094 10040177 10302533 10581072 10720281 10675645 10482661 10145331 9703237 9411652 9217557 9046078
5084 9046078 8981439 9146401 9474027 9712183 9806810 9907265 9871561 9766067 9646458 9469977
$$ packed form
5158E315100J1798P536K6467j3771M0932L9569K8428Q8676O895J3186O8951p7390
5146E556377R6151J70197M4465J05655J42106O6980J80404N1067O3688O8146j4429
5135F530807O675q6609N8439K7793J22327J76193K00382L01496J43798K00245
5125G681546K10581K38923J89748J44019R1229O1428r4296j59517q5121K325m1029
5114H239836J51769K32765L67546M13099L43153K46293P9966m1469q9024n9276
5104I884658j34320p6293k23524j62963J8937Q7067J19388Q0732J95694K50801
5094A0040177K62356K78539J39209m4636j92984l37330m42094k91585j94095j71479
5084I046078o4639J64962L27626K38156R4627J00455l5704j05494j19609j76481
$$ plain form
5074 9469977 9166524 8859332 8516262 8203445 7968661 7805678 7694023 7676930 7748726 7803652
5064 7803652 7945957 8030969 7998597 7943936 7784560 7569930 7425978 7298491 7165481 7044144
5054 7044144 6939814 6852802 6850995 6765627 6720910 6685797 6690239 6728480 6686152 6692845 6754513 6695666
5042 6695666 6615705 6610414 6558850 6559195 6575753 6581835 6526558 6585652 6595701 6641100 6710049 6757097
5030 6757097 6781629 6804133 6823217 6855419 6882592 6946930 7013366 7000854 7037489 7124859 7250602
5019 7250602 7311733 7376249 7356981 7347746 7338107 7388119 7457674 7515546 7574533 7648363 7689933 7777007
5007 7777007 7873364 7902872 8000858 8167073 8220394 8288760 8392756 8503822 8612575 8763335
4997 8763335 8889434 9021535 9112463 9197920 9325120 9429511 9479743 9551385 9688475 9792839
$$ packed form
5074I469977l03453l07192l43070l12817k34784j62983j11655j7093P1796N4926
5064G803652J42305Q5012l2372n4661j59376k14630j43952j27487j33010j21337
5054G044144j04330q7012j807q5368m4717l5113M442L8241m2328O693O1668n8847
5042F695666p9961n291n1564L45J6558O082n5277N9094J0049M5399O8949M7048
5030F757097K4532K2504J9084L2202K7173O4338O6436j2512L6635Q7370J25743
5019G250602O1131O4516j9268r235r639N0012O9555N7872N8987P3830M1570Q7074
5007G777007R6357K9508R7986J66215N3321O8366J03996J11066J08753J50760
4997H763335J26099J32101R0928Q5457J27200J04391N0232P1642J37090J04364
$$ plain form
4987 9792839 9894807 10033404 10177604 10317090 10524951 10731950 10967620 11091066 11320663 11490397
4977 11490397 11740705 11938313 12193549 12484859 12744989 12930438 13154006 13533505 13861666
4968 13861666 14189995 14568626 14933682 15263725 15813764 16401644 17064219 18069145 19463888
4959 19463888 21284953 23740376 26544592 28871797 30114175 29750159 28057698 25895207
4951 25895207 23824914 22177540 20984909 20223067 19756787 19571760 19723819 20141134 20883284
4942 20883284 21576351 22141734 22543534 22720363 22661782 22477346 22379087 22322712 22325276 22358879
4932 22358879 22498760 22712843 23079841 23507712 24063092 24682321 25366406 26135625 26814909
4923 26814909 27223854 27413632 27483770 27616939 27845743 28008323 28338237 28738851 29256091 29743370
$$ packed form
4987I792839J01968J38597J44200J39486K07861K06999K35670J23446K29597J69734
4977A1490397K50308J97608K55236K91310K60130J85449K23568L79499L28161
4968A3861666L28329L78631L65056L30043N50039N87880O62575J004926J394743
4959A9463888J821065K455423K804216K327205J242378l64016j692461k162491
4951B5895207k070293j647374j192631p61842m66280j85027J52059M17315P42150
4942B0883284O93067N65383M01800J76829n8581j84436r8259n6375K564L3603
4932B2358879J39881K14083L66998M27871N55380O19229O84085P69219O79284
4923B6814909M08945J89778P0138J33169K28804J62580L29914M00614N17240M87279
$$ plain form
4913 29743370 30206415 30790177 31282822 31805352 32330745 32859866 33531318 34425311 35737422
4904 35737422 37645272 39874834 42061229 43455104 43874497 43242429 41574122 39242786
4896 39242786 36830330 34812451 33325798 32296230 31623977 31273351 31308142 31619052 32197666
4887 32197666 33001152 33914795 34716239 35107892 35059660 34749622 34309220 33881802 33639703 33618452
4877 33618452 33860701 34238530 34806163 35576240 36581661 37801567 39178729 40823224 42494683
4868 42494683 43900879 44979219 45699595 46202505 46706068 47188855 47723191 48429946 49365617
4859 49365617 50446622 51295658 51843596 52033194 51983541 51797911 51743194 51895662 52326555 52918093
4849 52918093 53761105 54779255 56064412 57526505 59179445 61054751 63083495 65369469
$$ packed form
4913B9743370M63045N83762M92645N22530N25393N29121O71452Q93993J312111
4904C5737422J907850K229562K186395J393875M19393o32068j668307k331336
4896C9242786k412456k017879j486653j029568o72253l50626L4791L10910N78614
4887C2197666Q03486R13643Q01444L91653m8232l10038m40402m27418k42099k1251
4877C3618452K42249L77829N67633P70077J005421J219906J377162J644495J671459
4868D2494683J406196J078340P20376N02910N03563M82787N34336P06755R35671
4859D9365617J081005Q49036N47938J89598m9653j85630n4717J52468M30893N91538
4849E2918093Q43012J018150J285157J462093J652940J875306K028744K285974
$$ plain form
4841 65369469 67681961 70016871 72063015 73772360 74981303 75816671 76217183 75828168 74696719
4832 74696719 73098646 71365910 69679422 68143342 66687518 65358287 64213286 63277412
4824 63277412 62605745 62234728 62105707 62296821 62824226 63699790 64771229 65815587 66543896
4815 66543896 66858476 66959688 67038047 67271334 67742465 68266787 68921034 69621007 70345721 71008533
4805 71008533 71543813 72075286 72542140 73034582 73315468 73534020 73633475 73776092 73904703 74022275
4795 74022275 74108754 74401380 74795772 75154606 75783911 76640218 77607148 78757485 80123869
4786 80123869 81631927 83390984 85224820 87219547 89286397 91461558 93595576 95630832
4778 95630832 97723362 99660386 101517273 103129385 104687772 106273661 107963163 109725612
$$ packed form
4841F5369469K312492K334910K046144J709345J208943Q35368M00512l89015j131449
4832G4696719j598073j732736j686488j536080j455824j329231j145001r35874
4824F3277412o71667l71017j29021J91114N27405Q75564J071439J044358P28309
4815F6543896L14580J01212P8359K33287M71131N24322O54247O99973P24714O62812
4805G1008533N35280N31473M66854M92442K80886K18552R9455J42617J28611J17572
4795G4022275Q6479K92626L94392L58834O29305Q56307R66930J150337J366384
4786H0123869J508058J759057J833836J994727K066850K175161K134018K035256
4778I5630832K092530J937024J856887J612112J558387J585889J689502J762449
$$ plain form
4770 109725612 111591047 113732300 116097440 118783830 121650257 124738467 127980147 131249332
4762 131249332 134440534 137515262 140322035 142833991 144936191 146743857 148268657 149509507
4754 149509507 150458948 151263081 151920382 152391151 152746264 152924569 152991116 152995423 152999384 153153448
4744 153153448 153505420 154188966 155145270 156552508 158388708 160674378 163136870 165717767
4736 165717767 168266883 170587016 172471736 173643550 174092096 173699886 172522711 170652922
4728 170652922 168311134 165568826 162512750 159436848 156510307 153768789 151417677 149440256
4720 149440256 147923766 146969695 146632476 146818418 147615823 148949361 150822257 153200161 155826705
4711 155826705 158464009 160992168 163140479 164845921 165863335 166042486 165357906 163987544
$$ packed form
4770A09725612J865435K141253K365140K686390K866427L088210L241680L269185
4762A31249332L191202L074728K806773K511956K102200J807666J524800J240850
4754A49509507R49441Q04133O57301M70769L55113J78305O6547M307L961J54064
4744A53153448L51972O83546R56304J407238J836200K285670K462492K580897
4736A65717767K549116K320133J884720J171814M48546l92210j177175j869789
4728A70652922k341788k742308l056076l075902k926541k741518k351112j977421
4720A49440256j516490r54071l37219J85942P97405J333538J872896K377904K626544
4711A55826705K637304K528159K148311J705442J017414J79151o84580j370362
$$ plain form
4703 163987544 162074073 159578599 156492048 152682146 148169302 143013510 137216168 131081352
4695 131081352 124739259 118406078 112214639 106371678 100966011 96021246 91520214 87156513
4687 87156513 82858863 78577861 74406254 70587103 67188303 64248974 61964319 60078687
4679 60078687 58604101 57747547 57159342 56541535 55849380 54807703 53529929 52361030 51302678
4670 51302678 50227011 49130294 48072329 47030556 46037734 44921821 43653463 42249133
4662 42249133 40891926 39773817 38877060 38220586 37740049 37564246 37653135 37949065 38288274
4653 38288274 38460649 38338237 37961659 37485983 37065832 36993377 37091947 37329802 37813206 38428793
4643 38428793 38928842 39228999 39467106 39728433 39934755 40294292 40866178 41610759 42635465
$$ packed form
4703A63987544j913471k495474l086551l809902m512844n155792n797342o134816
4695A31081352o342093o333181o191439n842961n405667m944765m501032m363701
4687H7156513m297650m281002m171607l819151l398800k939329k284655j885632
4679F0078687j474586q56554n88205o17807o92155j041677j277774j168899j058352
4670E1302678j075667j096717j057965j041773r92822j115913j268358j404330
4662D2249133j357207j118109q96757o56474m80537j75803Q8889K95930L39209
4653C8288274J72375j22412l76578m75676m20151p2455R8570K37855M83404O15587
4643C8428793N00049L00157K38107K61327K06322L59537N71886P44581J024706
$$ plain form
4634 42635465 43743153 44889130 46179811 47570727 48833726 49956671 50960762 51613462
4626 51613462 52121924 52389858 52458515 52501650 52394614 52417824 52543107 52747835 53037584 53456612
4616 53456612 53740574 53936785 53908226 53560774 53013740 52337244 51677096 51121669 50689812 50269171
4606 50269171 49835696 49506687 49163271 48854057 48595454 48369343 48084647 47797959 47595440
4597 47595440 47425596 47302712 47274702 47429638 47515888 47667209 47823786 47733693 47581613 47234472
4587 47234472 46678268 45963141 45020723 43887241 42779537 41776990 40800087 39941577 39200346
4578 39200346 38653016 38266028 37957235 37515536 37004199 36487263 35887225 35278403 34673339
4569 34673339 34076113 33596969 33111569 32727649 32522838 32340131 32165376 31906839 31697840
$$ packed form
4634D2635465J107688J145977J290681J390916J262999J122945J004091O52700
4626E1613462N08462K67934O8657M3135j07036K3210J25283K04728K89749M19028
4616E3456612K83962J96211k8559l47452n47034o76496o60148n55427m31857m20641
4606E0269171m33475l29009l43416l09214k58603k26111k84696k86688k02519
4597D7595440j69844j22884k8010J54936Q6250J51321J56577r0093j52080l47141
4587D7234472n56204p15127r42418j133482j107704j002547r76903q58510p41231
4578C9200346n47330l86988l08793m41699n11337n16936o00038o08822o05064
4569C4673339n97226m79144m85400l83920k04811j82707j74755k58537k08999
$$ plain form
4560 31697840 31506403 31285353 31034867 30740621 30443702 30041537 29614396 29239157 28904761
4551 28904761 28623701 28329455 27976008 27668943 27388213 27084153 26795348 26642060 26475840
4542 26475840 26358141 26283125 26165389 26097771 26047336 25940153 25765835 25414802 24965189 24313837
4532 24313837 23528433 22688787 21777895 20855509 19963937 19164838 18384525 17673897 17071137
4523 17071137 16480969 15952426 15446247 15065710 14824511 14522548 14254221 14082501 13947624
4514 13947624 13811268 13662609 13464403 13327213 13211985 13133758 13072023 13029672 12813977 12688778
4504 12688778 12614674 12553057 12420459 12302451 12120351 11925108 11745350 11573451 11338132 11165933
4494 11165933 10965040 10772404 10628350 10398125 10229186 10065137 9916230 9804109 9804050 9718205
$$ packed form
4560C1697840j91437k21050k50486k94246k96919m02165m27141l75239l34396
4551B8904761k81060k94246l53447l07065k80730l04060k88805j53288j66220
4542B6475840j17699p5016j17736o7618n0435j07183j74318l51033m49613o51352
4532B4313837p85404q39646r10892r22386q91572p99099p80313p10628o02760
4523A7071137n90168n28543n06179l80537k41199l01963k68327j71720j34877
4514A3947624j36356j48659j98206j37190j15228p8227o1735m2351k15695j25199
4504A2688778p4104o1617j32598j18008j82100j95243j79758j71899k35319j72199
4494A1165933k00893j92636j44054k30225j68939j64049j48907j12121n9q5845
$$ plain form
4484 9718205 9668794 9649738 9599714 9513277 9412330 9343489 9328997 9298678 9204128 9103969 9079912
4473 9079912 8982535 8919596 8904052 8823166 8730147 8668295 8550112 8519165 8447745 8328368 8325212
4462 8325212 8314969 8293581 8142353 8036792 8049528 8021971 8088456 8122844 8164057 8162623 8191493
4451 8191493 8261820 8314801 8371084 8423782 8496550 8491884 8539938 8538538 8492913 8386727 8357265 8320800
4439 8320800 8284709 8201989 8086547 7977477 7846112 7786114 7626329 7519748 7402885 7302081
4429 7302081 7187418 7151871 7109408 7058616 6991416 6957544 6955972 6959564 6899146 6835414 6829213 6860957
4417 6860957 6908469 7003547 6980481 7034133 7081101 7152297 7156271 7179668 7321140 7304844 7404421
4406 7404421 7379291 7366517 7421216 7457710 7431839 7479441 7456313 7420468 7406402 7388736 7365661
$$ packed form
4484I718205m9411j9056n0024q6437j00947o8841j4492l0319r4550j00159k4057
4473I079912r7377o2939j5544q0886r3019o1852j18183l0947p1420j19377l156
4462H325212j0243k1388j51228j05561J2736k7557O6485L4388M1213j434K8870
4451H191493P0327N2981N6283N2698P2768m666M8054j400m5625j06186k9462l6465
4439H320800l6091q2720j15442j09070j31365n9998j59785j06581j16863j00804
4429G302081j14663l5547m2463n0792o7200l3872j572L592o0418o3732o201L1744
4417F860957M7512R5078k3066N3652M6968P1196L974K3397J41472j6296R9577
4406G404421k5130j2774N4699L6494k5871M7602k3128l5845j4066j7666k3075
$$ plain form
4395 7365661 7331933 7334188 7342217 7332644 7378622 7445062 7442248 7425887 7370241 7295248 7248277 7162017
4383 7162017 7136981 7148687 7142840 7122103 7092197 7034581 6995380 6969209 7023133 7070663 7056935 7089649
4371 7089649 7147759 7139318 7158450 7137365 7088025 7110451 7107713 7111812 7173684 7131810 7062505 7064367
4359 7064367 7096275 7073621 7012894 7028367 7067561 7089177 7040844 7043925 7021126 7033735 7066441 7092802
4347 7092802 7097377 7162982 7268361 7325442 7342001 7417582 7515825 7603405 7731929 7796751 7821063
4336 7821063 7874922 8031016 8184656 8276539 8360376 8432897 8578650 8673740 8660676 8789435 8930647
4325 8930647 8979893 8973402 9054769 9220638 9237267 9297451 9340550 9401010 9413865 9481507 9616351
4314 9616351 9724298 9784192 9859955 9971642 10025154 10134279 10196051 10303989 10395041 10475728 10577980
$$ packed form
4395G365661l3728K255Q029r573M5978O6440k814j6361n5646p4993m6971q6260
4383G162017k5036J1706n847k0737k9906n7616l9201k6171N3924M7530j3728L2714
4371G089649N8110q441J9132k1085m9340K2426k738M099O1872m1874o9305J862
4359G064367L1908k2654o0727J5473L9194K1616m8333L081k2799J2609L2706K6361
4347G092802M575O5605J05379N7081J6559P5581R8243Q7580J28524O4822K4312
4336G821063N3859J56094J53640R1883Q3837P2521J45753R5090j3064J28759J41212
4325H930647M9246o491Q1367J65869J6629O0184M3099O0460J2855O7642J34844
4314I616351J07947N9894P5763J11687N3512J09125O1772J07938R1052Q0687J02252
$$ plain form
4303 10577980 10721251 10835852 10930234 11004781 11064545 11176110 11265443 11420398 11553144 11524952
4293 11524952 11551727 11607038 11615454 11573727 11480453 11401187 11433207 11413368 11351990 11244543 11219037
4282 11219037 11245413 11183655 11192846 11176128 11129085 11174012 11208612 11278729 11362717 11421843 11446054
4271 11446054 11483662 11582508 11627975 11721405 11805873 11820105 11915778 12000324 12110935 12188377 12349633
4260 12349633 12472733 12562307 12654775 12777857 12990250 13119364 13366194 13527863 13716718 13850502
4250 13850502 14095282 14328686 14538694 14738164 14984082 15287729 15530682 15837352 16218342
4241 16218342 16597269 16976140 17349696 17714820 18098701 18591751 19039139 19518278 19963574
4232 19963574 20383781 20824658 21311921 21912532 22448522 23015952 23569671 24098588 24690803
$$ packed form
4303A0577980J43271J14601R4382P4547N9764J11565Q9333J54955J32746k8192
4293A1524952K6775N5311Q416m1727r3274p9266L2020j9839o1378j07447k5506
4282A1219037K6376o1758R191j6718m7043M4927L4600P0117Q3988N9126K4211
4271A1446054L7608R8846M5467R3430Q4468J4232R5673Q4546J10611P7442J61256
4260A2349633J23100Q9574R2468J23082K12393J29114K46830J61669J88855J33784
4250A3850502K44780K33404K10008J99470K45918L03647K42953L06670L80990
4241A6218342L78927L78871L73556L65124L83881M93050M47388M79139M45296
4232A9963574M20207M40877M87263O00611N35990N67430N53719N28917N92215
$$ plain form
4223 24690803 25259448 25927921 26548704 27179815 27854518 28419717 29043916 29788989 30492951
4214 30492951 31200187 31985286 32739020 33497721 34228769 34972121 35651992 36340294 36992123
4205 36992123 37648449 38286512 38823304 39520916 40127212 40799431 41444880 42072955 42736705
4196 42736705 43381073 44048224 44640866 45312368 45964015 46550635 47139411 47725364 48325889
4187 48325889 48924227 49465166 50061132 50599270 51197811 51818328 52495328 53223620 53955939
4178 53955939 54577094 55200599 55810888 56392735 56997083 57719199 58352696 58937621 59627075
4169 59627075 60315756 60992135 61798560 62602714 63432267 64250786 65033656 65818559 66649999
4160 66649999 67401380 68062292 68727390 69508664 70289072 71035882 71808452 72705424 73650397
$$ packed form
4223B4690803N68645O68473O20783O31111O74703N65199O24199P45073P03962
4214C0492951P07236P85099P53734P58701P31048P43352O79871O88302O51829
4205C6992123O56326O38063N36792O97612O06296O72219O45449O28075O63750
4196D2736705O44368O67151N92642O71502O51647N86620N88776N85953O00525
4187D8325889N98338N40939N95966N38138N98541O20517O77000P28292P32319
4178E3955939O21155O23505O10289N81847O04348P22116O33497N84925O89454
4169E9627075O88681O76379Q06425Q04154Q29553Q18519P82870P84903Q31440
4160F6649999P51381O60912O65098P81274P80408P46810P72570Q96972R44973
$$ plain form
4151 73650397 74674850 75793650 76938773 78102209 79363512 80686861 82062707 83442988
4143 83442988 84915238 86612315 88391462 90278314 92257325 94466250 96913149 99557164
4135 99557164 102354604 105336299 108593064 112064370 115612550 119393401 123343101 127387451
4127 127387451 131666406 136113906 140745005 145537081 150426135 155468581 160749913 166176295
4119 166176295 171792631 177591683 183340459 189255248 195219932 201106097 206898134 212578099
4111 212578099 217989508 223203868 228294717 233142559 237747446 242176847 246288050 250214152
4103 250214152 253837763 257130183 260049772 262550711 264572745 266068532 267066703 267587118
4095 267587118 267680657 267405016 266784299 265998099 264981288 263769026 262208804 260430882 258263945
$$ packed form
4151G3650397J024453J118800J145123J163436J261303J323349J375846J380281
4143H3442988J472250J697077J779147J886852J979011K208925K446899K644015
4135I9557164K797440K981695L256765L471306L548180L780851L949700M044350
4127A27387451M278955M447500M631099M792076M889054N042446N281332N426382
4119A66176295N616336N799052N748776N914789N964684N886165N792037N679965
4111B12578099N411409N214360N090849M847842M604887M429401M111203L926102
4103B50214152L623611L292420K919589K500939K022034J495787R98171N20415
4095B67587118R3539k75641o20717p86200j016811j212262j560222j777922k166937
$$ plain form
4086 258263945 255694363 252745482 249444993 245641155 241500324 237146506 232686452 228171257
4078 228171257 223613246 219102479 214580769 210239406 206013564 201915915 197965560 194171929
4070 194171929 190588917 187140954 183982834 181107225 178406136 176089101 174102681 172482296
4062 172482296 171228135 170195461 169372928 168813630 168349492 167953152 167615644 167324001 166909752
4053 166909752 166482095 166064383 165492106 164892853 164357576 163719294 163168209 162645248 162147220
4044 162147220 161668468 161250822 160817223 160416047 160122495 160021434 159834639 159660033 159473122
4035 159473122 159304185 159011293 158544451 158010508 157363762 156616992 155832065 154924353 154151642
4026 154151642 153440796 152802045 152321200 151803650 151320040 150737408 150110600 149305025 148245390
$$ packed form
4086B58263945k569582k948881l300489l803838m140831m353818m460054m515195
4078B28171257m558011m510767m521710m341363m225842m097649l950355l793631
4070A94171929l583012l447963l158120k875609k701089k317035j986420j620385
4062A72482296j254161j032674q22533n59298m64138l96340l37508k91643m14249
4053A66909752m27657m17712n72277n99253n35277o38282n51085n22961m98028
4044A62147220m78752m17646m33599m01176k93552j01061j86795j74606j86911
4035A59473122j68937k92892m66842n33943o46746p46770p84927r07712p72711
4026A54151642p10846o38751m80845n17550m83610n82632o26808q05575j059635
$$ plain form
4017 148245390 147015755 145393322 143585009 141697898 139496915 137208579 134730718 132046266
4009 132046266 129284022 126395813 123481167 120666578 117774033 115117061 112643196 110275155
4001 110275155 108222540 106401204 104712042 103104722 101577886 100210492 98930998 97624060
3993 97624060 96510277 95355826 94223643 93125702 92077219 91040774 90191126 89338787
3985 89338787 88387561 87533315 86541306 85377660 84112486 82610753 80914352 79094447 77162745
3976 77162745 75234188 73271249 71362634 69520038 67701674 66010048 64465909 62949600
3968 62949600 61611959 60177654 58966978 57855625 56741600 55681786 54703636 53732316
3960 53732316 52738941 51772114 50838157 49797144 48714846 47609999 46523173 45439586 44270927
$$ packed form
4017A48245390j229635j622433j808313j887111k200983k288336k477861k684452
4009A32046266k762244k888209k914646k814589k892545k656972k473865k368041
4001A10275155k052615j821336j689162j607320j526836j367394j279494j306938
3993I7624060j113783j154451j132183j097941j048483j036445q49648q52339
3985H9338787r51226q54246r92009j163646j265174j501733j696401j819905j931702
3976G7162745j928557j962939j908615j842596j818364j691626j544139j516309
3968F2949600j337641j434305j210676j111353j114025j059814r78150r71320
3960E3732316r93375r66827r33957j041013j082298j104847j086826j083587j168659
$$ plain form
3951 44270927 43119000 41967455 40843321 39893138 38981526 38009706 37128038 36280336 35475458
3942 35475458 34722493 34029089 33410961 32833647 32320105 31764638 31219461 30694580 30154129
3933 30154129 29613013 29170668 28666788 28190518 27712103 27169576 26765550 26378156 25934355
3924 25934355 25571049 25231626 24878386 24647144 24476851 24298913 24093214 23985504 23885354
3915 23885354 23820198 23745132 23692763 23692445 23714276 23748788 23779760 23887308 24042279 24146773 24312827
3904 24312827 24489903 24733492 24992409 25252108 25465531 25772333 26073045 26386478 26791755
3895 26791755 27216133 27638605 28134273 28629126 29189517 29692781 30199552 30705621 31235233
3886 31235233 31822403 32375284 32969234 33436831 34007345 34624975 35243554 35819945 36373787
$$ packed form
3951D4270927j151927j151545j124134r50183r11612r71820q81668q47702q04878
3942C5475458p52965o93404o18128n77314n13542n55467n45177n24881n40451
3933C0154129n41116m42345n03880m76270m78415n42527m04026l87394m43801
3924B5934355l63306l39423l53240k31242j70293j77938k05699j07710j00150
3915B3885354o5156p5066n2369l18K1831L4512L0972J07548J54971J04494J66054
3904B4312827J77076K43589K58917K59699K13423L06802L00712L13433M05277
3895B6791755M24378M22472M95668M94853N60391N03264N06771N06069N29612
3886C1235233N87170N52881N93950M67597N70514O17630O18579N76391N53842
$$ plain form
3877 36373787 37054499 37609160 38154358 38739023 39280298 39889580 40432619 40907592 41517329
3868 41517329 42228223 42944757 43688366 44572441 45476636 46351417 47315317 48288367 49243235
3859 49243235 50325339 51403949 52512614 53716748 54936734 56232263 57623938 59175379
3851 59175379 60764539 62496934 64316139 66357509 68454046 70759778 73098956 75613935
3843 75613935 78315559 81054746 84053762 87205277 90370064 93648624 97101669 100586260
3835 100586260 104174568 107622550 111048308 114448853 117769613 121066881 124286201 127379370
3827 127379370 130577379 133712890 136756177 139753540 142563185 145206135 147472884 149234992
3819 149234992 150513529 151180142 151305455 151154782 150774796 150230876 149577492 148985050 148418180
$$ packed form
3877C6373787O80712N54661N45198N84665N41275O09282N43039M74973O09737
3868D1517329P10894P16534P43609Q84075R04195Q74781R63900R73050R54868
3859D9243235J082104J078610J108665J204134J219986J295529J391675J551441
3851E9175379J589160J732395J819205K041370K096537K305732K339178K514979
3843G5613935K701624K739187K999016L151515L164787L278560L453045L484591
3835A00586260L588308L447982L425758L400545L320760L297268L219320L093169
3827A27379370L198009L135511L043287K997363K809645K642950K266749J762108
3819A49234992J278537O66613J25313j50673l79986n43920o53384n92442n66870
$$ plain form
3810 148418180 147777600 147352160 147015320 146608017 146297013 146127345 145985352 145845880 145755047
3801 145755047 145750508 145915274 146115693 146621085 147471168 148523656 150083739 152053644 154287217
3792 154287217 156902904 159801756 162953750 166230998 169708760 173537368 177645838 182181322
3784 182181322 187059878 192200642 197695075 203593254 209836966 216323107 223138652 230099636
3776 230099636 237360276 244818554 252253044 259435554 266283585 272373363 277540897 281805748
3768 281805748 284932142 286993691 288062002 288246113 287785715 286746018 285180627 283186647
3760 283186647 280693257 277793613 274278277 270100555 265162949 259455331 252934428 245695802
3752 245695802 237912098 229714481 221373900 213039710 204793465 196873748 189327056 182268195
$$ packed form
3810A48418180o40580m25440l36840m07303l11004j69668j41993j39472r0833
3801A45755047m539J64766K00419N05392Q50083J052488J560083J969905K233573
3792A54287217K615687K898852L151994L277248L477762L828608M108470M535484
3784A82181322M878556N140764N494433N898179O243712O486141O815545O960984
3776B30099636P260640P458278P434490P182510O848031O089778N167534M264851
3768B81805748L126394K061549J068311J84111m60398j039697j565391j993980
3760B83186647k493390k899644l515336m177722m937606n707618o520903p238626
3752B45695802p783704q197617q340581q334190q246245p919717p546692p058861
$$ plain form
3744 182268195 175661079 169403632 163643684 158495383 153733344 149480930 145684814 142406340
3736 142406340 139570118 137184238 135203497 133588636 132302970 131358722 130691104 130293685
3728 130293685 130147768 130280557 130541290 130946682 131655038 132613506 133767180 135132271 136686475
3719 136686475 138455101 140524371 142726275 145112953 147674604 150533850 153590299 156822654
3711 156822654 160294224 163966888 167799445 171798695 175846074 180079173 184303261 188588432
3703 188588432 192783812 196802181 200784789 204634638 208324178 211968706 215416935 218738207
3695 218738207 221861112 224675931 227197325 229412405 231240983 232524342 233329504 233550392
3687 233550392 233211640 232338611 230846642 228789170 226228040 223347349 220096045 216540528
$$ packed form
3744A82268195o607116o257447n759948n148301m762039m252414l796116l278474
3736A42406340k836222k385880j980741j614861j285666r44248o67618l97419
3728A30293685j45917J32789K60733M05392P08356R58468J153674J365091J554204
3719A36686475J768626K069270K201904K386678K561651K859246L056449L232355
3711A56822654L471570L672664L832557L999250M047379M233099M224088M285171
3703A88588432M195380M018369L982608L849849L689540L644528L448229L321272
3695B18738207L122905K814819K521394K215080J828578J283359Q05162K20888
3687B33550392l38752q73029j491969k057472k561130k880691l251304l555517
$$ plain form
3679 216540528 212719883 208746869 204716711 200722564 196552483 192364790 188223269 183947621
3671 183947621 179645634 175393966 171228768 167197335 163167167 159314190 155841514 152598257
3663 152598257 149701847 147161018 145019889 143268489 141968731 141129618 140752335 140778837 141092136
3654 141092136 141740697 142818101 144079552 145596554 147313345 149108593 151029404 152968676
3646 152968676 154888196 156840741 158844717 160847565 162972900 165306561 167786641 170370756
3638 170370756 173106661 176017956 178928174 181995957 185069581 188243416 191584959 195089238
3630 195089238 198838161 202810561 207149830 211926151 217259738 223231393 229716101 236782708
3622 236782708 244519289 252818663 261715641 271080866 280982482 291464454 302483910 314166854
$$ packed form
3679B16540528l820645l973014m030158l994147m170081m187693m141521m275648
3671A83947621m301987m251668m165198m031433m030168l852977l472676l243257
3663A52598257k896410k540829k141129j751400j299758q39113l77283K6502L13299
3654A41092136O48561J077404J261451J517002J716791J795248J920811J939272
3646A52968676J919520J952545K003976K002848K125335K333661K480080K584115
3638A70370756K735905K911295K910218L067783L073624L173835L341543L504279
3630A95089238L748923L972400M339269M776321N333587N971655O484708P066607
3622B36782708P736581Q299374Q896978R365225R901616J0481972J1019456J1682944
$$ plain form
3614 314166854 326514307 339156455 352367614 366005353 379572022 393155051 406329788
3607 406329788 418932928 430722064 441445454 450830847 458794444 465273085 470083675 473184861
3599 473184861 474649677 474408484 472548368 469039167 463927167 457248651 449050330 439529955
3591 439529955 428646024 416637003 403670671 389698982 375089058 359823982 344140239
3584 344140239 328175126 312058964 295918828 279909855 264243810 248949204 234226890
3577 234226890 220022189 206565428 193875660 181892780 170654385 160243419 150578108
3570 150578108 141687585 133614413 126243423 119539609 113460304 107971918 103087542 98740554
3562 98740554 94845985 91276484 88250476 85544106 83240647 81126572 79285015 77780017
$$ packed form
3614C14166854J2347453J2642148J3211159J3637739J3566669J3583029J3174737
3607D06329788J2603140J1789136J0723390R385393P963597O478641M810590L101186
3599D73184861J464816k41193j860116l509201n112000o678516q198321r520375
3591D39529955j0883931j2009021j2966332j3971689j4609924j5265076j5683743
3584C44140239j5965113j6116162j6140136j6008973j5666045j5294606j4722314
3577B34226890j4204701j3456761j2689768j1982880j1238395j0410966r665311
3570A50578108q890523q073172p370990o703814o079305n488386m884376m346988
3562I8740554l894569l569501l026008k706370k303459k114075j841557j504998
$$ plain form
3554 77780017 76495010 75482364 74486902 73613286 72825525 72094441 71459503 70791147 70142994
3545 70142994 69535514 68885850 68182444 67468027 66730970 65861511 65044284 64213501 63302152
3536 63302152 62403794 61504145 60427605 59394329 58308480 57150195 55970195 54736658
3528 54736658 53403745 52026605 50632589 49209088 47715623 46245806 44821981 43367650
3520 43367650 41873196 40406106 39087745 37798536 36651231 35501418 34465334 33607261
3512 33607261 32732949 31934058 31345629 30782288 30305475 29956866 29813677 29765831 29792798 29977383
3502 29977383 30225611 30423865 30520089 30541542 30451268 30330480 30252333 30236490 30269362 30372533
3492 30372533 30496719 30470591 30384678 30347659 30239830 29917349 29547237 28927580 28170468 27323554
$$ packed form
3554G7780017j285007j012646r95462q73616p87761p31084o34938o68356o48153
3545G0142994o07480o49664p03406p14417p37057q69459q17227q30783r11349
3536F3302152q98358q99649j076540j033276j085849j158285j180000j233537
3528E4736658j332913j377140j394016j423501j493465j469817j423825j454331
3520D3367650j494454j467090j318361j289209j147305j149813j036084q58073
3512C3607261q74312p98891n88429n63341m76813l48609j43189m7846K6967J84585
3502B9977383K48228J98254R6224K1453r0274j20788p8147j5843L2872J03171
3492C0372533J24186k6128q5913l7019j07829l22481l70112o19657p57112q46914
$$ plain form
3482 27323554 26358797 25317581 24311073 23503135 22752488 22030607 21427457 21018894 20503709
3473 20503709 19910159 19464784 19120907 18650767 18231882 17951500 17677608 17383658 17063134
3464 17063134 16815921 16608911 16406649 16191761 15947462 15784829 15623884 15520806 15455869 15392106
3454 15392106 15435413 15544950 15724170 15989690 16363400 16996723 17851458 19048253 20760877
3445 20760877 22812016 25017913 26944189 27813072 27126968 25420226 23356705 21421111
3437 21421111 19770965 18288547 17151431 16253987 15563043 15040680 14689461 14334106 14141273
3428 14141273 14050232 14062485 14173841 14298135 14465724 14817151 15198996 15651057 16266943 16951462
3418 16951462 18027049 19365552 21305440 24003798 27548669 31984215 36818121 40403191
$$ packed form
3482B7323554r64757j041216j006508q07938p50647p21881o03150m08563n15185
3473B0503709n93550m45375l43877m70140m18885k80382k73892k93950l20524
3464A7063134k47213k07010k02262k14888k44299j62633j60945j03078o4937o3763
3454A5392106M3307J09537J79220K65520L73710O33323Q54735J196795J712624
3445B0760877K051139K205897J926276Q68883o86104j706742k063521j935594
3437B1421111j650146j482418j137116q97444o90944n22363l51219l55355j92833
3428A4141273r1041J2253J11356J24294J67589L51427L81845M52061O15886O84519
3418A6951462J075587J338503J939888K698358L544871M435546M833906L585070
$$ plain form
3410 40403191 41013528 38646208 34632440 30273953 26380922 23162082 20463984 18292710
3402 18292710 16668300 15343643 14271148 13512394 12872758 12312755 11874450 11614402 11388078
3393 11388078 11231525 11045177 11007816 10992971 11038943 11221726 11506752 11831061 12455672 13382572
3383 13382572 14669070 16354447 18241396 20230687 21543661 21467784 20117109 18109221
3375 18109221 15946992 14003257 12470301 11200527 10088686 9248026 8510984 8010097 7678303
3366 7678303 7380892 6988315 6723808 6499819 6310631 6159554 5945690 5779532 5606441 5461516
3356 5461516 5353449 5263591 5179346 5068070 5064604 5046413 5001790 5005078 4992666 4941232 4845030
3345 4845030 4799552 4708919 4654292 4640672 4633040 4558423 4607936 4679641 4533330 4491208 4536880
$$ packed form
3410D0403191O10337k367320m013768m358487l893031l218840k698098k171274
3402A8292710j624410j324657j072495p58754o39636n60003m38305k60048k26324
3393A1388078j56553j86348l7361j4845M5972J82783K85026L24309O24611R26900
3383A3382572J286498J685377J886949J989291J312974p5877j350675k007888
3375A8109221k162229j943735j532956j269774j111841q40660p37042n00887l31794
3366G678303k97411l92577k64507k23989j89188j51077k13864j66158j73091j44925
3356E461516j08067q9858q4245j11276l466j8191m4623L288j2412n1434r6202
3345D845030m5478r0633n4627j3620p632p4617M9513P1705j46311m2122M5672
$$ plain form
3334 4536880 4542201 4564121 4599929 4559451 4557039 4633083 4696603 4737042 4727832 4689310 4715656 4767503
3322 4767503 4783726 4776204 4847759 4909890 4848697 4833134 4905111 4856338 4766853 4730304 4701781 4680744
3310 4680744 4686750 4624641 4554210 4494410 4443035 4392605 4379184 4257572 4118423 4103578 3973193
3299 3973193 3864335 3831322 3805011 3704957 3525821 3388871 3324037 3219205 3152199 2986161
3289 2986161 2872801 2763727 2721230 2642771 2542901 2503779 2384368 2348192 2296582 2231723 2141199
3278 2141199 2106679 2081474 2068713 2045700 1930170 1875510 1822731 1781889 1789491 1872328 1799808
3267 1799808 1696519 1684194 1714043 1676886 1658820 1667718 1661711 1700370 1713030 1623811 1605999 1622435
3255 1622435 1616686 1737169 1673600 1609956 1602052 1598073 1608033 1606144 1583578 1523375 1520447 1468431
$$ packed form
3334D536880N321K1920L5808m0478k412P6044O3520M0439r210l8522K6346N1847
3322D767503J6223p522P1555O2131o1193j5563P1977m8773q9485l6549k8523k1037
3310D680744O006o2109p0431n9800n1375n0430j3421j21612j39149j4845j30385
3299C973193j08858l3013k6311j00054j79136j36950o4834j04832o7006j66038
3289B986161j13360j09074m2497p8459r9870l9122j19411l6176n1610o4859r0524
3278B141199l4520k5205j2761k3013j15530n4660n2779m0842P602Q2837p2520
3267A799808j03289j2325K9849l7157j8066Q898o007L8659J2660q9219j7812J6436
3255A622435n749J20483o3569o3644p904l979R960j889k2566o0203k928n2016
$$ plain form
3243 1468431 1389577 1421426 1447577 1417406 1450851 1458899 1479332 1425389 1382824 1416410 1330441 1316696
3231 1316696 1310265 1335784 1252862 1211429 1283363 1293799 1268754 1338232 1351799 1319853 1291200 1333454
3219 1333454 1259286 1247161 1272131 1223677 1216799 1238062 1275485 1271305 1273826 1245661 1258072 1259179
3207 1259179 1219786 1141803 1146337 1108611 1110403 1171577 1148780 1141954 1139838 1200694 1226625 1204347
3195 1204347 1173130 1205926 1270227 1290568 1280228 1301696 1359095 1397931 1432792 1468253 1475839 1436756
3183 1436756 1495462 1452208 1492953 1483845 1459079 1503446 1549071 1484540 1485301 1515843 1496584 1572559
3171 1572559 1599986 1597463 1583457 1535867 1503382 1535113 1495221 1492149 1573941 1597558 1566149 1616652
3159 1616652 1750947 1788040 1794986 1850177 1922302 2015328 2123958 2216988 2248670 2273891 2194878
$$ packed form
3243A468431p8854L1849K6151l0171L3445Q048K0433n3943m2565L3586q5969j3745
3231A316696o431K5519q2922m1433P1934J0436k5045O9478J3567l1946k8653M2254
3219A333454p4168j2125K4970m8454o878K1263L7423m180K521k8165J2411J107
3207A259179l9393p7983M534l7726J792O1174k2797o826k116O0856K5931k2278
3195A204347l1217L2796O4301K0341j0340K1468N7399L8836L4861L5461P586l9083
3183A436756N8706m3254M0745r108k4766M4367M5625o4531P61L0542j9259P5975
3171A572559K7427k523j4006m7590l2485L1731l9892l072Q1792K3617l1409N0503
3159A616652J34295L7093O946N5191P2125R3026J08630R3030L1682K5221p9013
$$ plain form
3148 2194878 2068867 2068530 1915296 1786855 1782144 1723609 1744936 1840497 1868819 1817047 1822287 1809711
3136 1809711 1864407 1907098 1900007 1900352 1937430 1986028 1974442 2019480 2073573 2113961 2153620 2202394
3124 2202394 2239077 2264629 2213906 2239830 2223695 2181085 2170020 2106973 2089853 2130901 2150556
3113 2150556 2115575 2122114 2102527 2078608 2051243 2067276 2156205 2171133 2130366 2127655 2079846 2013909
3101 2013909 1956329 1894353 1905703 1943951 1888955 1847603 1808626 1779614 1690507 1663970 1675855
3090 1675855 1549641 1485776 1399317 1352293 1367194 1362793 1411530 1386740 1386544 1307002 1255286 1260007
3078 1260007 1228759 1209391 1138776 1099155 1134913 1167934 1119568 1072295 1015715 1104843 1057954
3067 1057954 998163 914201 868436 863899 839149 763382 781314 770148 733710 721658 694248 716627
$$ packed form
3148B194878j26011l37j53234j28441m711n8535K1327R5561K8322n1772N240j2576
3136A809711N4696M2691p091L45L7078M8598j1586M5038N4093M0388L9659M8774
3124B202394L6683K5552n0723K5924j6135m2610j1065o3047j7120M1048J9655
3113B150556l4981O539j9587k3919k7365J6033Q8929J4928m0767k711m7809o5937
3101B013909n7580o1976J1350L8248n4996m1352l8977k9012q9107k6537J1885
3090A675855j26214o3865q6459m7024J4901m401M8737k4790j96p9542n1716M721
3078A260007l1248j9368p0615l9621L5758L3021m8366m7273n6580Q9128m6889
3067A057954n9791q3962m5765m537k4750p5767J7932j1166l6438j2052k7410K2379
$$ plain form
3055 716627 709940 734574 688481 733199 658294 613148 571387 547929 539287 533214 435917 461277
3043 461277 437279 400954 424595 391976 326606 330601 295889 287757 302866 276435 317105 367701
3031 367701 363756 324537 317311 345838 376513 308412 316306 276946 221489 219666 222324 276835 284190
3018 284190 233430 208726 221654 169330 148739 174494 203431 191740 135000 124012 89471 98385
3006 98385 129423 115098 96569 66803 91876 98962 76978 86863 107643 66044 48846 47110
2994 47110 21126 74619 90188 101220 142555 127743 78842 10327 -34151 -13788 58907 35524
2982 35524 38152 109919 147334 107406 48394 52030 101471 146323 121910 168611 80902 97429
2970 97429 109010 142056 206642 123818 66083 109251 113048 91645 11240 45065 109672 123346
$$ packed form
3055G16627o687K4634m6093M4718p4905m5146m1761k3458q642o073r7297K5360
3043D61277k3998l6325K3641l2619o5370L995l4712q132J5109k6431M0670N0596
3031C67701l945l9219p226K8527L0675o8101P894l9360n5457j823K658N4511P355
3018B84190n0760k4704J2928n2324k0591K5755K8937j1691n6740j0988l4541Q914
3006I8385L1038j4325j8529k9766K5073P086k1984R885K0780m1599j7198j736
2994D7110k5984N3493J5569J1032M1335j4812m8901o8515m4478K0363P2695k3383
2982C5524K628P1767L7415l9928n9012L636M9441M4852k4413M6701q7709J6527
2970I7429J1581L3046O4586q2824n7735M3168L797k1403q0405L3825O4607J3674
$$ plain form
2958 123346 95464 29073 -7793 69077 96927 61942 -8466 -53128 -100012 -65620 10825 -76705
2946 -76705 -62970 -19471 25045 16738 -12192 -12613 32172 20144 973 -43269 -90987 -84009 -122239
2933 -122239 -52863 -51919 -123517 -118987 -61622 -99216 -57850 -102027 -146563 -112558 -120602 -72028
2921 -72028 -26857 -92912 -111605 -80347 -61066 -61420 -81255 -73772 -95632 -116654 -97025 -84600
2909 -84600 -147958 -65834 -61541 -109219 -133247 -117897 -113662 -46969 -36519 -55558 -76851 -74785
2897 -74785 -39697 -153284 -156772 -109698 -18942 -71149 -151037 -139726 -120453 -44411 -103900 -105641
2885 -105641 -110843 -119096 -178759 -179137 -217101 -192694 -124832 -81224 -57023 -28394 -43668 -131729
2873 -131729 -152127 -92782 -80386 -85266 -72690 -4582 766 -35005 -108859 -129848 -151516 -109172
$$ packed form
2958A23346k7882o6391l6866P6870K7850l4985p0408m4662m6884L4392P6445q7530
2946g6705J3735M3499M4516q307k8930m21M4785j2028j9171m4242m7718O978l8230
2933a22239O9376R44p1598M530N7365l7594M1366m4177m4536L4005q044M8574
2921g2028M5171o6055j8693L1258J9281l54j9835P483k1860k1022J9629J2425
2909h4600o3358Q2124M293m7678k4028J5350M235O6693J0450j9039k1293K066
2897g4785L5088j13587l488M7074R0756n2207p9888J1311J9273P6042n9489j741
2885a05641n202q253n9663l78l7964K4407O7862M3608K4201K8629j5274q8061
2873a31729k0398N9345J2396m880J2576O8108N348l5771p3854k0989k1668M2344
$$ plain form
2861 -109172 -150984 -181754 -150225 -184599 -127066 -100650 -134464 -101280 -115225 -157748 -151266 -133808
2849 -133808 -99333 -143085 -126953 -146058 -170315 -192032 -184418 -174455 -116500 -78371 -104573 -131282
2837 -131282 -102930 -178931 -183463 -178446 -216649 -206312 -214889 -216696 -171356 -149724 -124901 -122054 -173579
2824 -173579 -174289 -137789 -191517 -230386 -214113 -187855 -204949 -232820 -188976 -131949 -142573 -145753
2812 -145753 -134043 -131522 -127583 -147248 -138699 -185803 -172401 -200450 -140080 -159702 -211960 -167778
2800 -167778 -223665 -204428 -190503 -141558 -134183 -131555 -170544 -207148 -153412 -149213 -169392 -120341
2788 -120341 -103498 -199575 -172853 -132580 -176449 -206297 -195852 -207178 -211485 -214020 -247039 -195588
2776 -195588 -161001 -141013 -142691 -217567 -290168 -257318 -214993 -221819 -203082 -166479 -164194 -179050
$$ packed form
2861a09172m1812l0770L1529l4374N7533K6416l3814L3184j3945m2523O482J7458
2849a33808L4475m3752J6132j9105k4257k1717P614R963N7955L8129k6202k6709
2837a31282K8352p6001m532N017l8203J0337q577j807M5340K1632K4823K847n1525
2824a73579p10L6500n3728l8869J6273K6258j7094k7871M3844N7027j0624l180
2812a45753J1710K521L939j9665Q549m7104J3402k8049O0370j9622n2258M4182
2800a67778n5887J9237J3925M8945P375K628l8989l6604N3736M199k0179M9051
2788a20341J6843r6077K6722M0273m3869k9848J0445j1326m307k535l3019N1451
2776a95588L4587J9988j678p4876p2601L2850M2325o826J8737L6603K285j4856
$$ plain form
2764 -179050 -197802 -153956 -191903 -258469 -209921 -154690 -172118 -220631 -198572 -232779 -211147 -171073
2752 -171073 -223444 -223093 -186731 -212721 -209247 -154665 -188125 -202024 -185382 -132273 -197784 -262666
2740 -262666 -204375 -244161 -290980 -193191 -223467 -185318 -151043 -173408 -209156 -178112 -124451 -211721
2728 -211721 -169380 -156875 -180989 -154408 -111633 -158072 -195543 -210441 -198971 -235831 -195853 -216331
2716 -216331 -202694 -192808 -236688 -264811 -241737 -233365 -278129 -286604 -258119 -187870 -198570 -170071
2704 -170071 -156262 -61205 -68118 -149495 -167022 -204022 -130349 -140121 -192479 -117526 -151629 -171099
2692 -171099 -127480 -161126 -182336 -185567 -215410 -233946 -225604 -174162 -165839 -231449 -241457 -240481 -197013
2679 -197013 -209660 -131014 -143987 -134896 -107871 -121806 -188734 -173249 -137607 -117747 -144146 -219175
$$ packed form
2764a79050j8752M3846l7947o6566M8548N5231j7428m8513K2059l4207K1632M0074
2752a71073n2371L51L6362k5990L474N4582l3460j3899J6642N3109o5511o4882
2740b62666N8291l9786m6819R7789l0276L8149L4275k2365l5748L1044N3661q7270
2728b11721M2341J2505k4114K6581M2775m6439l7471j4898J1470l6860L9978k0478
2716b16331J3637R886m3880k8123K3074Q372m4764q475K8485P0249j0700K8499
2704a70071J3809R5057o913q1377j7527l7000P3673r772n2358P4953l4103j9470
2692a71099M3619l3646k1210l231k9843j8536Q342N1442Q323o5610j0008R76M3468
2679a97013j2647P8646j2973R091K7025j3935o6928J5485L5642J9860k6399p5029
$$ plain form
2667 -219175 -220848 -211564 -271447 -276417 -243258 -270797 -210347 -191605 -201773 -225267 -176984 -173936
2655 -173936 -174431 -179080 -193767 -154788 -147389 -219743 -245262 -201688 -116353 -99224 -96102 -140279 -180751
2642 -180751 -250254 -228542 -245264 -294235 -225977 -161569 -142227 -172813 -206849 -178937 -84217 -168430
2630 -168430 -143693 -78604 -187581 -146136 -149960 -88127 -49111 -62442 -70394 -62289 -48546 -38775
2618 -38775 -121074 -146458 -138586 -190713 -205363 -227969 -252406 -260189 -223674 -216917 -190886 -234426
2606 -234426 -222004 -132721 -129017 -146016 -126989 -151728 -149257 -218716 -180049 -171831 -301549 -257035
2594 -257035 -218450 -233399 -212526 -229880 -206121 -210224 -138174 -126123 -170525 -147669 -114934 -134685
2582 -134685 -122647 -133982 -114728 -98675 -82443 -78457 -150730 -163059 -162221 -115726 -175264 -207064
$$ packed form
2667b19175j673R284n9883m970L3159k7539O0450J8742j0168k3494M8283L048
2655a73936m95m649j4687L8979P399p2354k5519M3574Q5335J7129L122m4177m0472
2642a80751o9503K1712j6722m8971O8258O4408J9342l0586l4036K7912R4720q4213
2630a68430K4737O5089j08977M1445l824O1833L9016j3331p952Q105J3743R771
2618c8775q2299k5384P872n2127j4650k2606k4437p783L6515O757K6031m3540
2606b34426J2422Q9283L704j6999J9027k4739K471o9459L8667Q218j29718M4514
2594b57035L8585j4949K0873j7354K3759m103P2050J2051m4402K2856L2735j9751
2582a34685J2038j1335J9254J6053J6232L986p2273j2329Q38M6495n9538l1800
$$ plain form
2570 -207064 -74604 -87316 -133859 -150677 -171608 -206912 -173935 -198231 -201691 -205648 -159276 -108653
2558 -108653 -159551 -186680 -195617 -218164 -220067 -142727 -195741 -199139 -225694 -219425 -169792 -112835
2546 -112835 -51318 -82861 -147457 -109216 -126644 -142273 -200619 -197197 -174893 -165556 -172680 -187155
2534 -187155 -142894 -107942 -73298 -66265 -97784 -108720 -111307 -161297 -190973 -219425 -224288 -164362
2522 -164362 -178063 -124036 -148388 -148934 -114021 -107948 -126863 -179721 -205363 -172577 -161968 -159606
2510 -159606 -115098 -135927 -116906 -167087 -182756 -117359 -95380 -125242 -108666 -76635 -57257 -71184
2498 -71184 -65382 -107438 -114719 -149889 -163007 -196144 -168197 -112624 -113107 -87576 -109059 -130740 -95552
2485 -95552 -53680 -40116 -63780 -55248 -38987 -58185 -114440 -71432 -52345 -72100 -70994 877
$$ packed form
2570b07064J32460j2712m6543j6818k0931l5304L2977k4296l460l957M6372N0623
2558a08653n0898k7129q937k2547j903P7340n3014l398k6555O269M9633N6957
2546a12835O1517l1543o4596L8241j7428j5629n8346L422K2304R337p124j4475
2534a87155M4261L4952L4644P033l1519j0936k587m9990k9676k8452m863N9926
2522a64362j3701N4027k4352n46L4913O073j8915n2858k5642L2786J0609K362
2510a59606M4508k0829J9021n0181j5669O5397K1979k9862J6576L2031J9378j3927
2498g1184N802m2056p281l5170j3118l3137K7947N5573m83K5531k1483k1681L5188
2485i5552M1872J3564k3664Q532J6261j9198n6255M3008J9087j9755J106P1871
$$ plain form
2473 877 -2296 -11825 -18385 -94514 -60904 -18103 -12133 -1227 16333 39754 -36604 -47470 -54291
2460 -54291 -52848 -57502 -48674 10257 35517 27468 43 1126 50277 75691 14926 14974 3155
2447 3155 22706 39830 28866 42211 44643 30123 14926 -35431 82867 87353 38604 38543 80942
2434 80942 97032 76112 105314 97302 64445 115731 119428 99789 125448 110442 126961 209853
2422 209853 187121 137033 162461 124924 124253 184077 219188 200210 210877 214741 178382 256174
2410 256174 280842 316541 330742 304368 287684 301070 292328 380704 353346 412203 421689 383270
2398 383270 435785 440699 457299 394769 424031 495094 591774 645025 698999 765620 851438 941966
2386 941966 1063083 1094209 1140563 1183181 1314624 1363856 1407120 1535317 1621999 1661199 1727888
$$ packed form
2473H77l173r529o560p6129L3610M2801N970J0906J7560K3421p6358j0866o821
2460e4291J443m654Q828N8931K5260q049k7425J083M9151K5414o0765M8j1819
2447C155J9551J7124j0964J3345K432j4520j5197n0357J18298M486m8749o1M2399
2434H0942J6090k0920K9202q012l2857N1286L697j9639K5659j5006J6519Q2892
2422B09853k2732n0088K5428l7537o71N9824L5111j8978J0667L864l6359P7792
2410B56174K4668L5699J4201k6374j6684J3386q742Q8376k7358N8857R486l8419
2398C83270N2515M914J6600o2530K9262P1063R6680N3251N3974O6621Q5818R0528
2386I41966J21117L1126M6354M2618J31443M9232M3264J28197Q6682L9200O6689
$$ plain form
2375 1727888 1960122 2150070 2419478 2744339 3124155 3513271 3783255 3966636 4173796 4493936
2365 4493936 4910900 5423242 6078579 6932597 8260072 10082109 12754185 16620152 21880231
2356 21880231 28521647 33660869 33901817 29314771 23315092 18060111 14201769 11301078
2348 11301078 8978362 7122470 5763537 4834490 4220752 3805521 3527173 3372868 3153707
2339 3153707 2955351 2674700 2309649 1956375 1684756 1465339 1336834 1183847 1036174 973661
2329 973661 956618 955466 880269 780916 697943 681762 670932 659046 649851 565174 526942 485001
2317 485001 496350 497587 524642 459129 388703 377285 429796 468030 445237 437173 364224 380464
2305 380464 367130 353253 285727 244275 206698 166944 212095 191287 195711 186702 164982 103087
$$ packed form
2375A727888K32234J89948K69408L24861L79816L89116K69984J83381K07160L20140
2365D493936M16964N12342O55337Q54018J327475J822037K672076L865967N260079
2356B1880231O641416N139222K40948m587046n999679n254981l858342k900691
2348A1301078k322716j855892j358933r29047o13738m15231k78348j54305k19161
2339C153707j98356k80651l65051l53274k71619k19417j28505j52987j47673o2513
2329I73661j7043j152p5197r9353q2973j6181j0830j1886r195q4677l8232m1941
2317D85001J1349J237K7055o5513p0426j1418N2511L8234k2793q064p2949J6240
2305C80464j3334j3877o7526m1452l7577l9754M5151k0808M424r009k1720o1895
$$ plain form
2293 103087 179260 113178 67115 72241 57698 62320 103070 72660 -2861 33406 33736 63150
2281 63150 85210 79591 115061 -22877 -55383 32538 57611 85725 58871 84691 128430 52219
2269 52219 -11634 -7655 -46493 -69853 -21052 -19565 9843 20385 -31013 5694 9456 -51060
2257 -51060 -59440 -39058 -42422 -50462 -41290 -1678 -9167 -34381 76130 49614 -49410 15413 -65559
2244 -65559 -36133 -71873 -109104 -151088 -162726 -75062 -76605 -114535 -86276 -75034 -53134 -35043
2232 -35043 -127687 -146079 -135930 -124837 -126169 -75524 -93823 -90686 -80376 -44978 -39752 -68316
2220 -68316 -65931 -93451 -86473 -53434 -65651 -71742 -27698 -77820 -92448 -61024 -62589 -117590 -64736
2207 -64736 -52772 -133122 -100916 -71500 -79917 -75949 -82330 -113274 -97709 -77028 -120307 -154267
$$ packed form
2293A03087P6173o6082m6063N126j4543M622M0750l0410p5521L6267L30K9414
2281F3150K2060n619L5470j37938l2506Q7921K5073K8114k6854K5820M3739p6211
2269E2219o3853L979l8838k3360M8801J487K9408J0542n1398L6707L762o0516
2257e1060q380K0382l364q040R172L9612p489k5214J10511k6516r9024O4823q0972
2244f5559K9426l5740l7231m1984j1638Q7664j543l7930K8259J1242K1900J8091
2232c5043r2644j8392J0149J1093j332N0645j8299L137J0310L5398N226k8564
2220f8316K385k7520O978L3039j2217o091M4044n0122j4628L1424j565n5001N2854
2207f4736J1964q0350L2206K9416q417L968o381l0944J5565K0681m3279l3960
$$ plain form
2195 -154267 -121907 -142246 -132427 -135566 -84393 -27938 -37514 19803 23678 -34819 -22646 -32277 -81289
2182 -81289 -87950 -124254 -69015 -53186 -41498 -39127 -99877 -71820 13973 -13632 -58029 -68027
2170 -68027 -88535 -104028 -17420 441 -44875 -49953 -70386 -155682 -122207 -2893 -34814 -63609
2158 -63609 -36835 -90401 -71413 -10272 6034 785 -57912 -99616 -83024 -59868 -55575 -57873
2146 -57873 -36546 -69317 -159829 -153313 -89182 -150394 -210853 -139942 -63898 -66984 -113889 -88886
2134 -88886 -122554 -102237 -56079 -21177 -92985 -35746 -10244 -76680 -67004 -81964 -54691 -64034
2122 -64034 -100079 -74390 -45399 -14109 10707 -23962 -94489 -133262 -174464 -173495 -124292 -125773
2110 -125773 -57663 2158 12427 -9811 -16091 -28850 -34822 -88172 -71414 -52554 -65763 -56745
$$ packed form
2195a54267L2360k0339R819l139N1173N6455r576N7317L875n8497J2173r631m9012
2182h1289o661l6304N5239J5829J1688K371o0750K8057Q5793k7605m4397r998
2170f8027k0508j5493Q6608J7861m5316n078k0433q5296L3475J19314l1921k8795
2158f3609K6774n3566J8988O1141J6306n249n8697m1704J6592K3156M293k298
2146e7873K1327l2771r0512O516O4131o1212o0459P0911P6044l086m6905K5003
2134h8886l3668K0317M6158L4902p1808N7239K5502o6436R676j4960K7273r343
2122f4034l6045K5689K8991L1290K4816l4669p0527l8773m1202R69M9203j481
2110a25773O8110N9821J0269k2238o280j2759n972n3350J6758J8860j3209R018
$$ plain form
2098 -56745 -80536 -102000 -65818 -56851 -134692 -82786 -48645 -37264 -54620 -34636 -17434 6583
2086 6583 124415 113906 120895 111965 60554 3007 20098 45274 -33740 -33680 -68731 -90786 -83154
2073 -83154 -93395 -130951 -98383 -91416 -77869 -60741 -20407 1516 -80476 -122798 -66144 -58286
2061 -58286 -90742 -102052 -92913 -100442 -52338 -63181 -134750 -135414 -157422 -119845 -55162 -25701 -93685
2048 -93685 -132752 -130411 -119599 -103554 -67043 -52311 -71589 -141207 -148772 -158174 -102720 -128734
2036 -128734 -198637 -128228 -141496 -149150 -78844 -74493 -64826 -41665 -61110 3523 -27247 -36240
2024 -36240 -52322 -102553 -83621 -42101 -88910 -138537 -125482 -127317 -71724 -78636 -83808 -67462
2012 -67462 -49272 -49734 -37380 -65053 -132627 -86212 -93251 -73368 -19834 -558 12904 -91424
$$ packed form
2098e6745k3791k1464L6182Q967p7841N1906L4141J1381j7356J9984J7202K4017
2086F583J17832j0509O989q930n1411n7547J7091K5176p9014O0l5051k2055P632
2073h3154j0241l7556L2568O967J3547J7128M0334K1923q1992m2322N6654P858
2061e8286l2456j1310R139p529M8104j0843p1569o64k2008L7577O4683K9461o7984
2048i3685l9067K341J0812J6045L6511J4732j9278o9618p565r402N5454k6014
2036a28734o9903P0409j3268p654P0306M351R667K3161j9445O4633l0770q993
2024c6240j6082n0231J8932M1520m6809m9627J3055j835N5593o912n172J6346
2012f7462J8190m62J2354k7673o7574M6415p039J9883N3534J9276J3462j04328
$$ plain form
2000 -91424 -75676 27676 -1731 -42366 -42444 -33553 -82934 -73532 -89798 -106411 -98320 -78730 -67246
1987 -67246 -74014 -89476 -154557 -120755 -102340 -164964 -183993 -99029 -80889 -13613 -111309 -165903
1975 -165903 -152480 -115486 -39217 -23920 -106042 -118299 -61212 -93331 -106553 -124277 -127673 -67730
1963 -67730 -51196 -77178 -91536 -72048 -12731 -7367 -73184 -35075 18486 16492 -11347 -98091
1951 -98091 -43666 -125765 -126460 -69451 -111222 -67141 -57727 -52295 -13908 -38322 -51960 -90416 -131930
1938 -131930 -160493 -54395 -10511 -32360 27803 24018 -55407 4737 44034 -12561 -71248 -43319
1926 -43319 -12542 -54110 -46655 -24386 -88383 -64454 -104433 -69226 -66021 -55196 -55935 -96773 -63231
1913 -63231 -74663 -36755 -28077 -44326 -80945 -74616 -41764 -16301 -11096 12357 -2188 -100554
$$ packed form
2000i1424J5748J03352k9407m0635p8Q891m9381R402j6266j6613Q091J9590J1484
1987f7246o768j5462o5081L3802J8415o2624j9029Q4964J8140O7276r7696n4594
1975a65903J3423L6994P6269J5297q2122j2257N7087l2119j3222j7724l396N9943
1963f7730J6534k5982j4358J9488N9317N364o5817L8109N3561j994k7839q6744
1951i8091N4425q2099o95N7009m1771M4081R414N432L8387k4414j3638l8456m1514
1938a31930k8563J06098M3884k1849O0163l785p9425O0144L9297n6595n8687K7929
1926d3319L0777m1568P455K2269o3997K3929l9979L5207L205J0825p39m0838L3542
1913f3231j1432L7908Q678j6249l6619O329L2852K5463N205K3453j4545r8366
$$ plain form
1901 -100554 -135916 -64835 -65024 -31475 -32201 -63369 -132521 -104842 -32762 13655 28551 14375
1889 14375 -32289 -9708 -61235 -97298 -60003 -32425 -113410 -108090 -81293 -104824 -50909 13674
1877 13674 -60753 -104117 -67211 -56914 -68386 -36633 -4319 -28940 -87108 -72944 17408 51168
1865 51168 50086 -46148 -57253 -21504 -1041 -57324 -104982 -113017 -95121 -40813 -30305 -2303
1853 -2303 13407 -29392 5913 17438 -38549 -10963 25902 -12261 -69252 -102649 -72728 -1054
1841 -1054 -33619 -82099 4652 37181 -15514 44058 -26175 -17863 -14057 -50051 -46748 -72952 -64623
1828 -64623 -31931 -202 -34677 -67562 -29617 1214 3983 -15472 -5174 19998 -7501 -32889
1816 -32889 -54302 -30364 -43626 -56810 -72208 -226 -58489 -19739 -45875 -10050 1687 53383
$$ packed form
1901a00554l5362P1081j89L3549p26l1168o9152K7679P2080M6417J4896j4176
1889A4375m6664K2581n1527l6063L7295K7578q0985N320K6797k3531N3915O4583
1877A3674p4427m3364L6906J0297j1472L1753L2314k4621n8168J4164R0352L3760
1865E1168j082r6234j1105L5749K0463n6283m7658q035J7896N4308J0508K8002
1853b303J5710m2799L5305J1525n5987K7586L6865l8163n6991l3397K9921P1674
1841a054l2565m8480Q6751L2529n2695N9572p0233Q312L806l5994L303k6204Q329
1828f4623L2692L1729l4475l2885L7945L0831K769j9455J0298K5172k7499k5388
1816c2889k1413K3938j3262j3184j5398P1982n8263L8750k6136L5825J1737N1696
$$ plain form
1804 53383 5090 -49588 -24095 -48953 -27122 -20345 -29036 -78246 -86961 8541 76984 23299
1792 23299 -14407 94890 56794 -38852 -29034 -56023 -39856 -15733 -25131 -27507 -36757 -58143
1780 -58143 -62357 -52884 -60992 -73158 -47512 -56435 -102780 -82978 -26044 21008 14097 14653 -4681
1767 -4681 20683 41352 -38850 -40842 -35232 -90105 -133401 -79484 -35733 28417 27761 12939 5311
1754 5311 59115 -31333 -42071 -48613 9268 71163 -36090 4057 61523 56738 11515 38854
1742 38854 -21731 -57127 -3248 -31490 34965 32240 1623 35504 -9592 -9853 36322 25545
1730 25545 -20885 -51157 -52530 -32743 20282 3725 9029 37092 15710 -1135 22232 14314
1718 14314 -28896 -79444 -5914 -916 -23625 -13954 39813 22337 69912 -21021 -46382 49220
$$ packed form
1804E3383m8293n4678K5493k4858K1831O777q691m9210q715R5502O8443n3685
1792B3299l7706J09297l8096r5646R818k6989J6167K4123r398k376r250k1386
1780e8143m214R473q108j2166K5646q923m6345J9802N6934M7052o911N56j9334
1767d681K5364K0669q0202j992N610n4873m3296N3917M3751O4150o56j4822p628
1754E311N3804r0448j0738o542N7881O1895j07253M0147N7466m785m5223K7339
1742C8854o0585l5396N3879k8242O6455k725l0617L3881m5096k61M6175j0777
1730B5545m6430l0272j373J9787N3025j6557N304K8063k1382j6845K3367p918
1718A4314m3210n0548P3530M998k2709R671N3767j7476M7575r0933k5361R5602
$$ plain form
1706 49220 -5668 -58857 -54108 -10806 -71713 -27031 23849 -22802 31294 32438 7554 -19048
1694 -19048 -7391 34196 54972 62658 36123 50438 28534 11277 36872 32384 18263 6795
1682 6795 -42949 -80934 -1866 26806 1745 8263 66603 22566 -61649 -40898 -40624 -30823 -21980
1669 -21980 36691 31615 39727 13139 50887 74651 38589 -15374 -31723 39520 56780 4108
1657 4108 -34665 -25520 -14683 -15564 -1632 -19234 73438 83704 60976 -3709 -96315 -68710 -34240
1644 -34240 15985 65490 -1111 16542 -24324 -44919 16987 76347 31451 -21885 35464 96807
1632 96807 84914 23604 27767 22422 24719 65899 56532 -4697 118 -23475 -18612 4295 -37311
1619 -37311 27600 40938 39113 -12011 11624 32573 72731 60021 28252 72261 63017 78564
$$ packed form
1706D9220n4888n3189M749M3302o0907M4682N0880m6651N4096J144k4884k6602
1694a9048J1657M1587K0776P686k6535J4315k1904j7257K5595m488j4121j1468
1682F795m9744l7985P9068K8672k5061O518N8340m4037q4215K0751K74R801Q843
1669b1980N8671n076Q112k6588L7748K3764l6062n3963j6349P1243J7260n2672
1657D108l8773R145J0837q81J3932j7602R2672J0266k2728o4685r2606K7605L4470
1644c4240N0225M9505o6601J7653m0866k0595O1906N9360m4896n3336N7349O1343
1632I6807j1893o1310M163n345K297M1180r367o1229M815k3593M863K2907m1606
1619c7311O4911J3338j825n1124K3635K0949M0158j2710l1769M4009r244J5547
$$ plain form
1607 78564 54150 18339 -24070 -18392 -44948 -60875 -43359 16615 39111 68895 25626 25788
1595 25788 29907 50260 10209 29306 43361 -10274 -56662 -86999 -35815 -89478 -39218 -3972
1583 -3972 -50506 3106 38083 13102 65486 62374 24595 -18501 -74041 -96871 -51986 -4042
1571 -4042 5028 38260 57632 69162 17969 -6575 -19162 10784 16318 70070 65294 2792 26001
1558 26001 46287 48852 32739 42055 3872 67855 40290 24826 9353 -583 28943 41405
1546 41405 79259 82610 64336 89358 78112 22325 56772 105253 97848 22117 -15371 -44386
1534 -44386 14036 54191 27890 -53792 -45967 -16906 59053 55850 8220 28073 -5183 -17466
1522 -17466 -8575 -10260 2405 50622 85284 -2966 -11409 78109 63782 -53177 -57524 16242
$$ packed form
1607G8564k4414l5811m2409N678k6556j5927J7516N9974K2496K9784m3269J62
1595B5788M119K0353m0051J9097J4055n3635m6388l0337N1184n3663N0260L5246
1583c972m6534N3612L4977k4981N2384l112l7779m3096n5540k2830M4885M7944
1571d042R070L3232J9372J1530n1193k4544j2587K9946N534N3752m776o2502K3209
1558B6001K0286K565j6113R316l8183O3983k7565j5464j5473r936K9526J2462
1546D1405L7854L351j8274K5022j1246n5787L4447M8481p405p5731l7488k9015
1534d4386N8422M0155k6301q1682P825K9061P5959l203m7630J9853l3256j2283
1522a7466Q891j685J2665M8217L4662q8250q443Q9518j4327j16959m347P3766
$$ plain form
1510 16242 52750 21751 44969 37477 46494 35512 -77590 -78277 -36853 -7020 -22749 -66966
1498 -66966 -14327 -18953 -18551 -48743 -54746 -38955 24476 39759 -7233 -26861 -14299 60717 70165
1485 70165 81197 89885 86480 22451 -8645 24756 96230 95307 52029 75683 26166 18069 19444
1472 19444 29635 -5815 33473 85733 18939 33525 12327 46119 59398 133350 103777 44802
1460 44802 84407 49702 44695 105167 119115 69077 27304 31685 28159 72957 46502 -17071
1448 -17071 -5631 -22575 -12604 10418 -4262 15812 26548 15987 24249 67413 40582 -38485
1436 -38485 -70395 -59735 -25893 59009 57380 56259 94138 35446 47946 23595 27141 40326
1424 40326 21342 36909 -23456 7695 -23565 40640 15097 27068 67584 84856 22004 15430
$$ packed form
1510A6242L6508l0999K3218p492R017j0982j13102o87M1424K9833j5729m4217
1498f6966N2639m626M02l0192o003J5791O3431J5283m6992j9628J2562P5016R448
1485G0165J1032Q688l405o4029l1096L3401P1474r23m3278K3654m9517q097J375
1472A9444J0191l5450L9288N2260o6794J4586k1198L3792J3279P3952k9573n8975
1460D4802L9605l4705n007O0472J3948n0038m1773M381l526M4798k6455o3573
1448a7071J1440j6944R971K3022j4680K0074J0736j0561Q262M3164k6831p9067
1436c8485l1910J0660L3842Q4902j629j121L7879n8692J2500k4351L546J3185
1424D0326j8984J5567o0365L1151l1260O4205k5543J1971M0516J7272o2852o574
$$ plain form
1412 15430 64015 114235 73692 -5906 60775 88461 5496 -46410 8243 -5416 -29814 -12946
1400 -12946 -23836 -14442 8183 31854 53569 36197 4774 63012 62017 52129 68440 45752 82598
1387 82598 55567 42968 23443 82943 93386 85828 71570 113916 87492 14731 32706 71847
1375 71847 50483 83985 67731 96640 75339 63717 59692 35828 36786 38704 63153 82905 13790
1362 13790 2027 72763 115675 77721 30653 31506 42695 90726 88959 61661 46364 85889
1350 85889 76231 84539 114240 115281 70162 72397 91172 70563 36902 -4385 -58658 -42538 44489
1337 44489 48127 10466 98106 145870 89086 44860 -10223 14281 16035 24393 7778 -31436
1325 -31436 -14456 4833 52446 -19753 -18742 2302 67698 57041 40611 21745 17451 31431
$$ packed form
1412A5430M8585N0220m0543p9598O6681K7686q2965n1906N4653j3659k4398J6868
1400a2946j0890R394K2625K3671K1715j7372l1423N8238r95r888J6311k2688L6846
1387H2598k7031j2599j9525N9500J0443p558j4258M2346k6424p2761J7975L9141
1375G1847k1364L3502j6254K8909k1301j1622m025k3864R58J918K4449J9752o9115
1362A3790j1763P0736M2912l7954m7068Q53J1189M8031j767k7298j5297L9525
1350H5889r658Q308K9701J041m5119K235J8775k0609l3661m1287n4273J6120Q7027
1337D4489L638l7661Q7640M7764n6784m4226n5083K4504J754Q358j6615l9214
1325c1436J6980J9289M7613p2199J011K1044O5396j0657j6430j8866m294J3980
$$ plain form
1313 31431 47206 86839 118372 153274 88823 77169 55587 79832 22250 27642 53751 88646
1301 88646 89583 98397 203666 168173 148743 88697 53332 66653 69802 18564 21112 40683 78737
1288 78737 68255 22335 54322 13297 114228 74329 55003 16638 -20087 -28816 14831 98748
1276 98748 45784 -3126 46119 92472 15100 16716 73981 50551 78344 21786 -33486 -40791
1264 -40791 22524 116111 144832 59592 50900 20102 60759 87973 55983 48333 56266 66532
1252 66532 27937 42549 55521 88213 80199 -82 -26974 45523 93324 62305 30193 41533
1240 41533 72029 42907 115558 103209 100585 112326 -6346 -60234 -51445 85383 103618 107100
1228 107100 96330 62620 60664 72288 38722 101176 109138 72999 95754 95091 96862 39657 9903
$$ packed form
1313C1431J5775L9633L1533L4902o4451j1654k1582K4245n7582N392K6109L4895
1301H8646R37Q814J05269l5493j9430o0046l5365J3321L149n1238K548J9571L8054
1288G8737j0482m5920L1987m1025J00931l9899j9326l8365l6725q729M3647Q3917
1276I8748n2964m8910M9245M6353p7372J616N7265k3430K7793n6558n5272p305
1264d0791O3315R3587K8721q5240q692l0798M0657K7214l1990p650P933J0266
1252F6532l8595J4612J2972L2692q014q0281k6892P2497M7801l1019l2112J1340
1240D1533L0496k9122P2651j2349k624J1741j18672n3888Q789J36828J8235L482
1228A07100j0770l3710j956J1624l3566O2454P962l6139K2755o63J771n7205k9754
$$ plain form
1215 9903 66432 67236 48452 10403 57820 -11977 -60808 -86496 15274 48088 105661 172640
1203 172640 170215 126272 59436 29296 54156 41789 58749 63762 70168 63864 95433 148750
1191 148750 138654 58471 71242 88424 147955 94275 68623 85113 71057 25781 3897 40918
1179 40918 37019 45127 92131 91458 90340 79470 32233 93725 39063 94065 52280 -145 43344
1166 43344 27184 56816 62998 34929 105043 111658 134580 139061 51744 69080 84048 13616
1154 13616 11728 104386 124941 81140 73395 -2816 -41367 -9448 56435 383 10182 2764 1918
1141 1918 51758 45628 53009 -6081 -25981 4599 -37911 41726 73351 50340 -26416 39625
1129 39625 100963 60976 34211 65523 36168 13215 63088 83215 53517 88896 74091 27036
$$ packed form
1215I903N6529Q04j8784l8049M7417o9797m8831k5688J01770L2814N7573O6979
1203A72640k425m3943o6836l0140K4860j2367J6960N013O406o304L1569N3317
1191A48750j0096q0183J2771J7182N9531n3680k5652J6490j4056m5276k1884L7021
1179D0918l899Q108M7004o73j118j0870m7237O1492n4662N5002m1785n2425M3489
1166D3344j6160K9632O182k8069P0114O615K2922M481q7317J7336J4968p0432
1154A3616j888R2658K0555m3801p745p6211l8551L1919O5883n6052R799p418q46
1141A918M9840o130P381n9090j9900L0580m2510P9637L1625k3011p6756O6041
1129C9625O1338l9987k6765L1312k9355k2953M9873K0127k9698L5379j4805m7055
$$ plain form
1117 27036 57470 96487 96464 58564 7582 47922 81791 71156 53987 84988 28875 24365 -39017
1104 -39017 -5920 -6710 -2785 11056 2368 13563 52598 97821 96673 125764 85154 91989 109455
1091 109455 100500 107483 64396 58456 31521 -3518 106979 114990 100648 108538 100974 14157 39460
1078 39460 120265 38574 -38378 26407 87219 134843 44603 80877 146417 114781 51141 26892
1066 26892 5780 41736 85424 51218 1192 -10481 73232 30044 -12454 21117 11712 27015
1054 27015 49661 24056 15903 78265 64529 80838 62445 65637 67157 120032 100141 59996
1042 59996 35523 -5996 19302 81784 85064 149132 86425 43007 55031 62430 69208 53848
1030 53848 104095 108529 35527 20666 17485 54659 27700 -28028 -26302 21165 68342 14947
$$ packed form
1117B7036L0434L9017k3l7900n0982M0340L3869j0635j7169L1001n6113m510o3382
1104c9017L3097p90L925J3841q688J1195L9035M5223j148K9091m0610O835J7466
1091A09455q955O983m3087n940k6935l5039J10497Q011j4342P890p564q6817K5303
1078C9460Q0805q1691p6952O4785O0812M7624r0240L6274O5540l1636o3640k4249
1066B6892k1112L5956M3688l4206n0026j1673Q3713m3188m2498L3571r405J5303
1054B7015K2646k5605q153O2362j3736J6309j8393L192J520N2875j9891m0145
1042E9996k4473m1519K5298O2482L280O4068o2707m3418J2024P399O778j5360
1030E3848N0247M434p3002j4861l181L7174k6959n5728J726M7467M7177n3395
$$ plain form
1018 14947 16098 28315 120259 138881 55374 70286 66463 60594 89600 110965 108329 138746 114689
1005 114689 130238 132270 130845 129354 98250 93893 34056 38906 8126 51673 44888 72626 123869
992 123869 65038 24881 5804 48498 132611 172941 119975 65515 77764 -20884 -60621 44514
980 44514 39377 29181 68572 14259 57928 70789 85257 109506 65497 83869 18343 -83
968 -83 34012 94792 84403 -4014 45246 149543 139466 95017 75464 69239 51185 38443 52357
955 52357 50799 96167 145750 97126 60117 102163 98503 44260 27910 42362 -9405 8085
943 8085 -64740 -20278 -67022 -50852 -3409 35340 44929 70997 77379 34505 23781 45380 76701
930 76701 77812 104986 25757 10587 40191 60962 88455 53049 70453 139740 124324 117463
$$ packed form
1018A4947J151J2217R1944J8622q3507J4912l823n869K9006K1365k636L0417k4057
1005A14689J5549K032j425j491l1104m357n9837M850l0780M3547o785K7738N1243
992A23869n8831m0157j9077M2694Q4113M0330n2966n4460J2249r8648l9737J05135
980D4514n137j0196L9391n4313M3669J2861J4468K4249m4009J8372o5526j8426
968h3L4095O0780j0389q8417M9260J04297j0077m4449j9553o225j8054j2742J3914
955E2357j558M5368M9583m8624l7009M2046l660n4243j6350J4452n1767J7490
943H085p2825M4462m6744J6170M7443L8749R589K6068O382m2874j0724K1599L1321
930G6701J111K7174p9229j5170K9604K0771K7493l5406J7404O9287j5416o861
$$ plain form
918 117463 134944 83934 44235 21289 3048 17254 73086 29924 30127 83188 114893 46193
906 46193 -3655 -3972 -42760 -1552 88081 81422 -11474 -10436 52595 107597 56122 48722 37343
893 37343 -19617 32433 94474 72819 25007 47340 81871 101320 107229 68910 65424 87611
881 87611 52639 -17687 94928 84547 70405 65424 116516 123714 98710 104989 93537 12743
869 12743 32382 43374 46919 47753 57902 93875 60353 93070 36115 31144 3360 -24191 5690
856 5690 42370 95519 78354 105341 82391 79660 66898 46210 59746 32562 24658 29970 6472
843 6472 -4251 22338 7354 36117 54170 69876 23568 -11447 -49362 -52954 -3805 49692
831 49692 52086 55679 42875 6608 51222 56637 115913 60738 16427 16616 32335 -47584 9216
$$ packed form
918A17463J7481n1010l9699k2946j8241J4206N5832m3162K03N3061L1705o8700
906D6193m9848l17l8788M1208Q9633o659r2896J038O3031N5002n1475p400j1379
893C7343n6960N2050O2041k1655m7812K2333L4531J9449N909l8319l486K2187
881H7611l4972p0326J12615j0381j4142m981N1092P198k5004O279j1452q0794
869A2743J9639J0992L545Q34J0149L5973l3522L2717n6955m971k7784k7551K9881
856E690L6680N3149j7165K6987k2950k731j2762k0688J3536k7184p904N312k3498
843F472j0723K6589j4984K8763J8053J5706m6308l5015l7915l592M9149N3497
831D9692K394L593j2804l6267M4614N415N9276n5175m4311J89J5719p9919N6800
$$ plain form
818 9216 25350 34499 39931 46934 112705 92258 40930 16944 81041 150686 155877 65590 59615
805 59615 32476 42340 45655 9910 27419 24352 77227 64345 3091 -36633 -49716 -20472 -61177
792 -61177 1860 39000 -11347 8825 33132 -12233 -33127 -3836 38081 -7140 -2462 62620
780 62620 90587 74269 74924 1900 14580 13536 22562 -210 45542 22299 6417 97045 69938
767 69938 51248 50408 -217 -13610 -50032 7945 43528 67811 64485 60994 -140 -142 -1381 -7802
753 -7802 8352 1160 13801 -8919 -38926 -48998 -93296 -40089 -12936 -31755 44472 65068
741 65068 38562 35388 81857 39396 5149 -23597 19857 19202 34812 425 27058 1053 -45076
728 -45076 7159 -2050 -7095 32964 19085 19309 24821 76010 91825 36364 26325 -36 861
$$ packed form
818I216J6134R149N432P003O5771k0447n1328k3986O4097O9645N191r0287n975
805E9615k7139R864L315l5745J7509l067N2875j2882o1254l9724j3083K9244m0705
792f1177O3037L7140n0347K0172K4307m5365k0894K9291M1917m5221M678O5082
780F2620K7967j6318O55p3024J2680j044R026k2772M5752k3243j5882R0628k7107
767F9938j8690q40n0625j3393l6422N7977L5583K4283l326l491o1134kj239o421
753g802J6154p192J2641k2720l0007j0072m4298N3207K7153j8819P6227K0596
741F5068k6506l174M6469m2461l4247k8746M3454o55J5610l4387K6633k6005m6129
728d5076N2235r209n045M0059j3879K24N512N1189J5815n5461j0039k6361Q97
$$ plain form
715 861 -24760 13542 94051 -18087 -20156 2208 -30074 -34210 -26329 8811 -16283 -65026 -42056
702 -42056 -83941 -15232 -22161 -16732 66728 -45545 -60412 -8205 -53445 17859 11365 69065
690 69065 107700 10434 -28444 20185 71872 34746 3538 -54279 -95650 -52010 -35421 -8519
678 -8519 24165 11815 62038 61639 -25289 -1368 18077 15738 -42434 -81341 -77654 -26248 67629
665 67629 61988 -12569 64688 57218 -9210 70218 86621 41299 -23498 -5222 -3522 24080 -6917
652 -6917 -19373 10254 3032 6974 78556 84490 93471 71224 83004 72792 59288 22919 -32647
639 -32647 -41255 -54709 -88243 -72432 -33610 -49289 -71834 -81148 -55000 -43253 -59541 -11517
627 -11517 -92604 -95640 -17200 15607 -1294 -32844 -17458 -1899 -3152 -56966 -323 22910
$$ packed form
715H61k5621L8302Q0509j12138k069K2364l2282m136P881L5140k5094m8743K2970
702d2056m1885O8709o929N429Q3460j12273j4867N2207m5240P1304o494N7700
690F9065L8635r7266l8878M8629N1687l7126l1208n7817m1371M3640J6589K6902
678h519L2684j2350N0223l99q6928K3921J9445k339n8172l8907L687N1406R3877
665F7629n641p4557P7257p470o6428P9428J6403m5322o4797J8276J700K7602l0997
652f917j2456K9627p222L942P1582N934Q981k2247J1780j0212j3504l6369n5566
639c2647q608j3454l3534J5811L8822j5679k2545r314K6148J1747j6288M8024
627a1517q1087l036P8440L2807j6901l1550J5386J5559j253n3814N6643K3233
$$ plain form
615 22910 11797 15992 -39899 -11136 -6583 29862 75776 22740 -8445 -56156 -39898 -82187
603 -82187 -163497 -125931 -40331 35268 -22217 -19354 6010 23359 70994 11699 -73188 -17371
591 -17371 34736 32068 -25772 -13941 -11317 -33008 -39714 -37642 -33432 -28070 -47239 -30671 -4617
578 -4617 10155 -3458 -60046 -44801 -38513 -83097 -94493 -53267 -9808 -21189 -60452 -62015 -89558
565 -89558 -16134 -65709 -23851 40831 6383 -50320 -42549 -54831 -88081 -90036 -52475 22559
553 22559 755 -59854 -54312 -45112 -74930 -70230 6934 -6768 11886 -38492 -77250 3846 2711
540 2711 -36287 -58632 18319 66681 36767 -19631 -49337 -35688 -58671 -98453 -59749 -34255
528 -34255 -61838 -33563 -68986 -97310 -33581 -64491 -131002 -141794 -118475 -122803 -127538 -43239
$$ packed form
615B2910j1113M195n5891K8763M553L6445M5914n3036l1185m7711J6258m2289
603h2187q1310L7566Q5600P5599n7485K863K5364J7349M7635n9295q4887N5817
591a7371N2107k668n7840J1831K624k1691o706K072M210N362j9169J6568K6054
578d617J4772j3613n6588J5245O288m4584j1396M1226M3459j1381l9263j563k7543
565h9558P3424m9575M1858O4682l4448n6703P771j2282l3250j955L7561P5034
553B2559k1804o0609N542R200k9818M700P7164j3702J8654n0378l8758Q1096j135
540B711l8998k2345P6951M8362k9914n6398k9706J3649k2983l9782L8704K5494
528c4255k7583K8275l5423k8324O3729l0910o6511j0792K3319m328m735Q4299
$$ plain form
516 -43239 21848 -49721 -46173 -85348 -57160 -51576 -48025 -97184 -96958 -87052 -99205 -64347 -77389
503 -77389 -11078 -45437 7683 26692 13369 -84834 -16433 -3923 -14770 -33436 -41856 3619
491 3619 13514 2337 -9813 -19310 23849 18611 1523 68254 5843 -76180 -52714 -67946 -121963
478 -121963 -138893 -141034 -115626 -96132 -109431 -142442 -127276 -93260 -101005 -43629 -51548 -64038
466 -64038 -96143 -134331 -106935 -109285 -80137 -91898 -5307 -49515 -45818 -101122 -101302 -87647 -118870
453 -118870 -113307 -81300 -78270 -62431 -95849 -74299 -18594 -44343 -110394 -94188 -99665 -128965
441 -128965 -46142 -75711 -107544 -94139 -54391 -56476 -118726 -92544 -67528 -106130 -63518 -11860
429 -11860 22308 -42887 -43684 -37159 -97516 -90894 -70601 -87314 -151746 -131848 -37915 -31597 -74261
$$ packed form
516d3239O5087p1569L548l9175K8188N584L551m9159K26R906j2153L4858j3042
503g7389O6311l4359N3120J9009j3323r8203O8401J2510j0847j8666q420M5475
491C619R895j1177j2150r497M3159n238j7088O6731o2411q2023K3466j5232n4017
478a21963j6930k141K5408J9494j3299l3011J5166L4016p745N7376p919j2490
466f4038l2105l8188K7396k350K9148j1761Q6591m4208L697n5304j80J3655l1223
453a18870N563L2007L030J5839l3418K1550N5705k5749o6051J6206n477k9300
441a28965Q2823k9569l1833J3405L9748k085o2250K6182K5016l8602M2612N1658
429a1860L4168o5195p97O525o0357O622K0293j6713o4432J9898R3933O318m2664
$$ plain form
416 -74261 -69841 -109309 -106005 -147947 -151426 -100018 -76225 -56061 -119703 -126685 -94476 -69056 -70581
403 -70581 -35758 -88852 -106957 -60803 -112978 -154897 -116489 -120514 -67915 -58083 -78446 2945
391 2945 -11843 -34697 -90078 -95677 -77422 -39395 -34767 -77741 -144008 -82137 -79185 -49581 -69270
378 -69270 -133759 -123925 -105807 -138873 -157458 -124123 -159537 -63323 -79898 -42585 -91916 -178445
366 -178445 -162383 -121809 -106149 -96574 -42510 -100057 -185365 -129910 -48568 -94559 -91614 -71946
354 -71946 -51150 -98397 -134957 -143644 -103106 -125899 -146636 -168797 -71474 -49995 -75777 -73806
342 -73806 -40055 -8992 -55140 -47345 -63628 -75255 -139938 -105202 -107164 -162815 -134125 -129870 -155998
329 -155998 -113502 -88437 -67833 -90066 -168808 -159942 -180847 -114732 -78705 -114587 -85542 -166924
$$ packed form
416g4261M420l9468L304m1942l479N1408K3793K0164o3642o982L2209K5420j525
403g0581L4823n3094j8105M6154n2175m1919L8408m025N2599R832k0363Q1391
391B945j4788k2854n5381n599J8255L8027M628m2974o6267O1871K952K9604j9689
378f9270o4489R834J8118l3066j8585L3335l5414R6214j6575L7313m9331q6529
366a78445J6062M0574J5660R575N4064n7547q5308N5455Q1342m5991K945J9668
354g1946K0796m7247l6560q687M0538k2793k0737k2161R7323K1479k5782J971
342g3806L3751L1063m6148P795j6283j1627o4683L4736j962n5651K8690M255k6128
329a55998M2496K5065K0604k2233p8742Q866k0905O6115L6027l5882K9045q1382
$$ plain form
317 -166924 -166667 -132447 -164510 -180244 -99004 -79397 -121442 -93636 8197 -36674 -72576 -112429
305 -112429 -126967 -183762 -177561 -131648 -62216 -24779 -67785 -77655 -120204 -133550 -146403 -96860
293 -96860 -76604 -58419 -42413 -88676 -139117 -150199 -75384 -160300 -177070 -147271 -84076 -102292
281 -102292 -105152 -116933 -177722 -181081 -129237 -92372 -121549 -143361 -123324 -78388 -80597 -129904
269 -129904 -122021 -79216 -95957 -123499 -116034 -144590 -151562 -89051 -49217 -70126 -82636 -111060
$$ packed form
317a66924K57L4220l2063j5734Q1240J9607m2045K7806J01833m4871l5902l9853
305a12429j4538n6795O201M5913O9432L7437m3006r870m2549j3346j2853M9543
293i6860K0256J8185J6006m6263n0441j1082P4815q4916j6770K9799O3195j8216
281a02292k860j1781o0789l359N1844L6865k9177k1812K0037M4936k209m9307
269a29904P883M2805j6741k7542P465k8556o972O2511L9834k0909j2510k8424
$$ [...]
##END NTUPLES=NMR SPECTRUM
##END=
