##TITLE=1H_CA-9427-1
 200.13MHz,CDCl3.
 8 sc
 
 26.2.2026
##JCAMPDX= 6.0         $$ Bruker NMR JCAMP-DX V2.0
##DATA TYPE= NMR SPECTRUM
##DATA CLASS= NTUPLES
##ORIGIN= UXNMR, Bruker Analytische Messtechnik GmbH
##OWNER= pz
$$ XWIN-NMR		Version 3.5
$$ Thu Feb 26 16:06:47 2026 Russian Standard Time (UT+4h)  she@DPX200
##.OBSERVE FREQUENCY= 200.1313
##.OBSERVE NUCLEUS= ^1H
##.ACQUISITION MODE= SIMULTANEOUS
##.ACQUISITION SCHEME= undefined
##.AVERAGES= 8
##.DIGITISER RES= 18
##SPECTROMETER/DATA SYSTEM= spect
##.PULSE SEQUENCE= zg30
##.SOLVENT NAME= D2O
##.SHIFT REFERENCE= (INTERNAL, D2O, 0, 15.3998)
##AUDIT TRAIL= $$ (NUMBER, WHEN, WHO, WHERE, WHAT)
$$ ##TITLE= Audit trail, XWIN-NMR		Version 3.5
$$ ##JCAMPDX= 5.01
$$ ##ORIGIN= Bruker BioSpin GmbH
$$ ##OWNER= she
$$ F:/spectra/data/she/nmr/H-C/1/pdata/1/auditp.txt
$$ ##AUDIT TRAIL=  $$ (NUMBER, WHEN, WHO, WHERE, WHAT)
(   1,<2026-02-26 16:05:25.57 +0400>,<she>,<DPX200>,
      <created by zg, POWCHK disabled, PULCHK disabled
       configuration hash MD5:
       00 E9 B6 7A A2 85 ED C7 34 08 36 98 17 FE 4E 26
       data hash MD5: 16K
       C8 93 F6 45 98 4D 62 25 FB A3 E5 E4 82 38 9D 1A>)
(   2,<2026-02-26 16:05:30.42 +0400>,<she>,<DPX200>,
      <Start of raw data processing
       efp BC_mod = 2 LB = 0.25 FT_mod = 6 PKNL = 1 PHC0 = -3857.453 PHC1 = 6.192321 SI = 16K 
       data hash MD5: 16K
       16 09 ED F1 93 BF 0B CF 4C 75 F0 18 0D 90 65 6F>)
(   3,<2026-02-26 16:05:52.92 +0400>,<she>,<DPX200>,
      <pk PHC0 = -0.9266298 PHC1 = 1.6 
       data hash MD5: 16K
       51 89 23 96 71 54 8A 93 A7 E1 AC 03 42 21 F1 A2>)
(   4,<2026-02-26 16:05:57.04 +0400>,<she>,<DPX200>,
      <abs ABSG = 5 
       data hash MD5: 16K
       8B CC 0E 91 1A BC E2 FB EB 4E 13 5D AE C6 AE 08>)
$$ ##END=
$$ 
$$ hash MD5
$$ 0B 7F 5A 1B E1 A4 52 D4 9A 25 9C C8 D8 58 06 70
##$RELAX= 
##$RELAX= 
##$RELAX= 
##$RELAX= 
##$RELAX= 
##$RELAX= 
$$ Bruker specific parameters
$$ --------------------------
##$DU= <F:/spectra>
##$EXPNO= 1
##$NAME= <H-C>
##$PROCNO= 1
##$TYPE= <nmr>
##$USER= <she>
##$AMP= (0..31)
100 100 100 100 100 100 100 100 100 100 100 100 100 100 100 100 100 100 
100 100 100 100 100 100 100 100 100 100 100 100 100 100 
##$AQSEQ= 0
##$AQ_mod= 1
##$AUNM= <au_zg>
##$AUTOPOS= <>
##$BF1= 200.13
##$BF2= 200.13
##$BF3= 200.13
##$BF4= 200.13
##$BF5= 200.13
##$BF6= 200.13
##$BF7= 200.13
##$BF8= 200.13
##$BYTORDA= 1
##$CFDGTYP= 0
##$CFRGTYP= 5
##$CHEMSTR= <none>
##$CNST= (0..31)
1 1 145 1 1 1 1 1 1 1 1 1 1 1 1 1 1 1 1 1 1 1 1 1 1 1 1 1 1 1 1 1 
##$CPDPRG= <>
##$CPDPRG1= <>
##$CPDPRG2= <>
##$CPDPRG3= <>
##$CPDPRG4= <mlev>
##$CPDPRG5= <mlev>
##$CPDPRG6= <mlev>
##$CPDPRG7= <mlev>
##$CPDPRG8= <mlev>
##$CPDPRGB= <>
##$CPDPRGT= <>
##$D= (0..31)
0 0.7 0 0 0 0 0 0 0 0 0 0.03 0 0 0 0 0 0 0 0 0 0 0 0 0 0 0 0 0 0 0 0 
##$DATE= 1772107525
##$DBL= (0..7)
120 120 120 120 120 120 120 120 
##$DBP= (0..7)
150 150 150 150 150 150 150 150 
##$DBP07= 0
##$DBPNAM0= <>
##$DBPNAM1= <>
##$DBPNAM2= <>
##$DBPNAM3= <>
##$DBPNAM4= <>
##$DBPNAM5= <>
$$ [...]
##$SUBNAM3= <"">
##$SUBNAM4= <"">
##$SUBNAM5= <"">
##$SUBNAM6= <"">
##$SUBNAM7= <"">
##$SUBNAM8= <"">
##$SUBNAM9= <"">
##$SW= 18.0517328524113
##$SWIBOX= (0..15)
0 0 2 0 0 0 0 0 0 0 0 0 0 0 0 0 
##$SW_h= 3612.71676300578
##$TD= 16384
##$TD0= 1
##$TE= 0
##$TE2= 300
##$TE3= 300
##$TEG= 300
##$TL= (0..7)
0 120 120 120 120 120 120 120 
##$TP= (0..7)
150 150 150 150 150 150 150 150 
##$TP07= 0
##$TPNAME0= <>
##$TPNAME1= <>
##$TPNAME2= <>
##$TPNAME3= <>
##$TPNAME4= <>
##$TPNAME5= <>
##$TPNAME6= <>
##$TPNAME7= <>
##$TPOAL= (0..7)
0.5 0.5 0.5 0.5 0.5 0.5 0.5 0.5 
##$TPOFFS= (0..7)
0 0 0 0 0 0 0 0 
##$TUNHIN= 0
##$TUNHOUT= 0
##$TUNXOUT= 0
##$USERA1= <user>
##$USERA2= <user>
##$USERA3= <user>
##$USERA4= <user>
##$USERA5= <user>
##$V9= 5
##$VALIST= <valist>
##$VCLIST= <CCCCCCCCCCCCCCC>
##$VD= 0
##$VDLIST= <DDDDDDDDDDDDDDD>
##$VPLIST= <PPPPPPPPPPPPPPP>
##$VTLIST= <TTTTTTTTTTTTTTT>
##$WBST= 1024
##$WBSW= 4
##$XGAIN= (0..3)
0 0 0 0 
##$XL= 0
##$YL= 0
##$YMAX_a= 449809
##$YMIN_a= -464626
##$ZGOPTNS= <>
##$ZL1= 120
##$ZL2= 120
##$ZL3= 120
##$ZL4= 120
##$ABSF1= 15.45822
##$ABSF2= -2.59363
##$ABSG= 5
##$ABSL= 3
##$ALPHA= 0
##$AQORDER= 0
##$ASSFAC= 0
##$ASSFACI= 0
##$ASSFACX= 0
##$ASSWID= 0
##$AUNMP= <proc_1d>
##$AZFE= 0.1
##$AZFW= 0.1
##$BCFW= 0
##$BC_mod= 2
##$BYTORDP= 0
##$COROFFS= 0
##$CY= -3
##$DATMOD= 1
##$DC= 0
##$DFILT= <>
##$DTYPP= 0
##$F1P= 0
##$F2P= 0
##$FCOR= 1
##$FTSIZE= 16384
##$FT_mod= 6
##$GAMMA= 0
##$GB= 0
##$INTBC= 1
##$INTSCL= 3.241238e-09
##$ISEN= 128
##$LB= 0.25
##$LEV0= 0
##$LPBIN= 0
##$MAXI= 10000
##$MC2= 0
##$MEAN= 0
##$ME_mod= 0
##$MI= 1.114404
##$NCOEF= 0
##$NC_proc= -6
##$NLEV= 6
##$NOISF1= 3.799351
##$NOISF2= 2.8
##$NSP= 0
##$NTH_PI= 0
##$NZP= 0
##$OFFSET= 15.39982
##$PC= 1
##$PHC0= -3858.379
##$PHC1= 7.792321
##$PH_mod= 1
##$PKNL= yes
##$PPARMOD= 0
##$PSCAL= 0
##$PSIGN= 0
##$REVERSE= no
##$SF= 200.130024392114
##$SI= 16384
##$SIGF1= 3
##$SIGF2= 2
##$SINO= 0.751879
##$SIOLD= 32768
##$SREGLST= <19F.Aceton>
##$SSB= 0
##$STSI= 16384
##$STSR= 0
##$SW_p= 3612.71676300578
##$SYMM= 0
##$S_DEV= 0
##$TDeff= 16384
##$TDoff= 0
##$TI= <>
##$TILT= no
##$TM1= 0
##$TM2= 0
##$TOPLEV= 0
##$USERP1= <user>
##$USERP2= <user>
##$USERP3= <user>
##$USERP4= <user>
##$USERP5= <user>
##$WDW= 1
##$XDIM= 16384
##$YMAX_p= 291832878
##$YMIN_p= -193530
$$ End of Bruker specific parameters
$$ ---------------------------------
##NTUPLES= NMR SPECTRUM
##VAR_NAME=  FREQUENCY,     SPECTRUM/REAL,   SPECTRUM/IMAG
##SYMBOL=    X,             R,               I
##VAR_TYPE=  INDEPENDENT,   DEPENDENT,       DEPENDENT
##VAR_FORM=  AFFN,          ASDF,            ASDF
##VAR_DIM=   16384,         16384,           16384
##UNITS=     HZ,            ARBITRARY UNITS, ARBITRARY UNITS
##FACTOR=    0.220516191357247, 1,           1
##FIRST=     3081.96641782854, 0,            0
##LAST=      -530.750345177241, 0,           0
##MIN=       -530.750345177241, -193530,     0
##MAX=       3081.96641782854, 291832878,    0
$$ Real data points
##PAGE= N=1
##DATA TABLE= (X++(R..R)), XYDATA
$$ [...]
7173a5504J07903k842o4036K739J1684n3441M0473j1321J396n6881p0618j4991
$$ -15504 92399 89557 25521 28260 39944 -13497 26976 15655 17051 -39830 -110448 -125439
7161a25439M6464j8004Q6804N5293l0203n8886N2592O1623L6669m9060n5221O0648
$$ -125439 -78975 -96979 -10175 45118 14915 -43971 8621 70244 106913 57853 2632 63280
7149F3280n188j20029K1837J09147j9250K5371l7684n21K1889J7153K0177k7421
$$ 63280 58092 -61937 -40100 69047 49797 75168 37484 36963 58852 76005 96182 68761
7137F8761k0753K8272O0556n6716o659q201K0998J7428N887K1489l9354L815K4190
$$ 68761 48008 76280 136836 80120 73461 65260 86258 103686 109573 131062 91708 95523 119713
7124A19713R8115K8653k0679K0357J0405O1395J03848J18440J36159J87092J58537
$$ 119713 217828 246481 225802 246159 256564 317959 421807 540247 676406 863498 1022035
7113A022035L135j26298j75651j16033j52681p0535k8921j24579k7004l1502k3936
$$ 1022035 1025170 898872 723221 607188 454507 383972 355051 230472 203468 171966 148030
7102A48030o8603j5999k8026M9815l5089l6563J4104L1157K6706p1963O3459k2190
$$ 148030 79427 63428 35402 85217 50128 13565 27669 58826 85532 13569 77028 54838
7090E4838J8773N0581J5310J7202j0333J8861K6261j0005o214R0218J02334Q557
$$ 54838 73611 124192 139502 156704 146371 165232 191493 181488 175274 265492 367826 376383
7078C76383J29500J55989J09056k2051M7225j08813j48188r9903p2291q6887n5986
$$ 376383 505883 661872 770928 748877 796102 687289 539101 439198 366907 280020 224034
7067B24034o0492m8167o5142l22r216K0366J6386l0691j01552J0634M0849K8413
$$ 224034 163542 115375 50233 49911 40695 61061 77447 46756 -54796 -44162 -3313 25100
7055B5100N7277J5223k2201r0297J3579l5431M7416j8491m4567K6308K0094M6259
$$ 25100 82377 97600 75399 -14898 -1319 -36750 10666 -7825 -52392 -26084 -5990 40269
7043D0269o746l8946L4953n1099k3444M9794o799n5152K0960K0261O3305K5193
$$ 40269 33523 -5423 29530 -21569 -45013 4781 -2018 -57170 -36210 -15949 47356 72549
7031G2549N982J0565m8256p4850j1150Q520l0842N3437k7814j1616O6751o990
$$ 72549 78531 89096 40840 -34010 -45160 -36640 -67482 -14045 -41859 -53475 13276 6286
7019F286K4857M553m2354l8708Q131K8043Q4683j5435l2186J7895q8482L1636
$$ 6286 31143 35696 -6658 -45366 -37235 -9192 75491 60056 27870 45765 -42717 -11081
7007a1081J441j4440J3871L7862K6497l4301k6080j7015O2027k9204r1723k9718
$$ -11081 -9640 -24080 -10209 27653 54150 19849 -6231 -23246 38781 9577 -82146 -111864
6995a11864P112L7605K7410P5050j6026m5772N0621L6940M780L6593J8546n0586
$$ -111864 -104752 -67147 -39737 35313 19287 -26485 24136 61076 65856 102449 120995 70409
6983G0409k4285J1882m2184m4871j409M6182r653m8545j8509j5969J6991P651
$$ 70409 46124 58006 15822 -29049 -30458 15724 6071 -42474 -60983 -76952 -59961 -52310
6971e2310K102L4415J1186J9096o1038l171n9505K7243P8279J7086j8653j5343
$$ -52310 -50208 -15793 -4607 14489 -46549 -49720 -109225 -81982 -3703 13383 -5270 -20613
6959b0613P713m3367P1544K9068l5290J5614m3246l3190N5449j3195o96j0497
$$ -20613 -12900 -56267 15277 44345 9055 24669 -18577 -51767 3682 -9513 -10209 -20706
6947b0706M1016q0155O9031L162p445L3386j6559L936p454L2719M2615l2098q341
$$ -20706 20310 -59845 9186 12348 4903 38289 21730 25666 18212 50931 93546 61448 53107
6934E3107K1973k9036MK4529l797J4583J6714Q0859K9290N5377L1066K5722J09425
$$ 53107 75080 46044 46048 70577 66780 81363 98077 178936 208226 263603 294669 320391 429816
6921D29816O2779N458L1176L3478q2331Q088q7819r3030o5816k5134r8882m7686
$$ 429816 492595 498053 529229 562707 480376 488464 400645 307615 241799 216665 117783 70097
6909G0097J9604O128j7539q3063j2843M0994M8746k2402K6517l6578m3627K3041
$$ 70097 89701 95829 78290 -4773 -17616 23378 72124 49722 76239 39661 -3966 19075
6897A9075M4337j5079n6377o867L2422N4186k1347m2890M9601K8083J1164l0205
$$ 19075 63412 48333 -8044 -14911 17511 71697 50350 7460 57061 85144 96308 66103
6885F6103J7881K9019K7017k0543l8385j6171l8327O4624k0297o7133o854q722
$$ 66103 83984 113003 140020 119477 81092 64921 26594 91218 70921 3788 -3066 -11788
6873a1788J2683L7685K0977J1999n3322N1175L2185o1494k2393l2532l2302O7667
$$ -11788 895 38580 59557 71556 18234 69409 101594 40100 17707 -14825 -47127 20540
6861B0540K9868K896l4950J2412k8013L796J3908M499K7438M0582K2367j187M4285
$$ 20540 50408 53304 18354 30766 2753 6549 20457 24956 52394 92976 115343 114156 158441
6848A58441k9202L7405O596k6158J7725k5706P305N673L638K1105o2519n608M6350
$$ 158441 129239 166644 173240 147082 164807 139101 146406 152079 155717 176822 114303 108695 155045
6835A55045j7308K8981k184l1701n9828m9002M1601L6874L4649j8455j2667k7727
$$ 155045 137737 166718 164534 132833 73005 24003 65604 102478 137127 118672 106005 78278
6823G8278l4865J3108L4737M9962M1982p08j01506J9600Q7366j9775p961L4860
$$ 78278 43413 56521 91258 141220 183202 182494 80988 100588 187954 168179 160218 195078
6811A95078m2522J788j6847k6575J4149R6305n8860j09743L3159L6951k4908j8351
$$ 195078 152556 154344 137497 110922 125071 221376 162516 52773 85932 122883 97975 79624
6799G9624M4015K7531R784m855N933j6644K7664k57K5284m2725m2383J7012L71
$$ 79624 123639 151170 160954 156099 162032 145388 173052 172795 198079 155354 112971 129983 130354
6786A30354N3806j681n935m6309J5781J0171l841q143j6848l5912J5651R6782
$$ 130354 184160 182479 176544 130235 146016 156187 152346 144203 127355 91443 107094 203876
6774B03876q6222n8487n0257O3844P745m633K054j7815L8525N1189l4763j9524
$$ 203876 117654 59167 8910 72754 80499 75866 77920 60105 98630 149819 115056 95532
6762I5532m1173K877O8685P2561q837M752L789K4851M5282o5607m7429m1425p667
$$ 95532 54359 57236 125921 198482 189645 194397 198186 223037 268319 202712 155283 113858 106191
6749A06191n5311L5498k217N0611J2809n1159J0044J5179L7633o2289n6085O4479
$$ 106191 50880 86378 84161 134772 147581 96422 106466 121645 159278 96989 40904 105383
6737A05383l7189l8599R2657o7234P864K9276K0942m0986k2923K764K7499L9887
$$ 105383 68194 29595 122252 55018 62882 92158 113100 72114 49191 51955 79454 119341
6725A19341o9383j2997J3227l4685j5919N6043J3577R114K8363k9251K6107J5531
$$ 119341 49958 36961 50188 15503 -416 55627 69204 78318 106681 77430 103537 119068
6713A19068k0822J5894n9859N2617j2121m2341m3652K5369O7060k4280n6003L1614
$$ 119068 98246 114140 54281 106898 94777 52436 8784 34153 101213 76933 20930 52544
6701E2544M2945l9800M9044p556k3808K7803k8373M3211l9487o724K9937j8165
$$ 52544 95489 55689 104733 97177 73369 101172 72799 116010 76523 69799 99736 81571
6689H1571m8414R5394R2113n424N332M211q0398p6707O7589K0051J5662m022Q3747
$$ 81571 33157 128551 220664 215240 220572 224783 144385 67678 135267 155318 170980 166958 250705
6676B50705m4601K4007M4583l0086n3999J9565Q872p209Q10J9790L6909J0139
$$ 250705 206104 230111 274694 244608 190609 210174 219046 211837 212647 232437 269346 279485
6664B79485p669l4766n5157k4251L3822k8366L2858M7790K2772l4792l4098m7437
$$ 279485 271816 237050 181893 157642 191464 163098 195956 243746 266518 231726 197628 150191
6652A50191l1347R2552N0095P390J0223k5775L437M5723K9348o1717l7523P9105
$$ 150191 118844 211396 261491 268881 279104 253329 256766 302489 331837 270120 232597 311702
6640C11702J30033l453k8823l6073O7445j9303M8680J1930J6550N5800j3388J38531
$$ 311702 441735 438282 409459 373386 440831 421528 470208 482138 498688 554488 541100 679631
6628F79631n6732J4348N2437M5798N7308J159l0623J6985Q113l6672K8966j8220
$$ 679631 622899 637247 689684 735482 792790 793949 763326 780311 788424 751752 780718 762498
6616G62498M1744N9252K7713l5006k9913N6p6310l078K0939l8627k5738K4668
$$ 762498 804242 863494 891207 856201 826288 826344 750034 746956 767895 729268 703530 728198
6604G28198k9406l9951J0334l506l0441j4476k5795j3530O95k7699m0377M573
$$ 728198 698792 658841 669175 665669 635228 620752 594957 581427 582122 554423 514046 518619
6592E18619R8379j7293m4868M642N4101m9290j9007J7311l306J2808r463L4830
$$ 518619 616998 599705 554837 559479 613580 564290 545283 562594 559288 572096 562633 597463
6580E97463M8773M0312R844P66K52M2549m3442j8146L4309K2187j0061l1558N99
$$ 597463 646236 686548 696392 697158 697410 739959 696517 678371 712680 734867 724806 693248 693847
6567F93847J1556Q7572o817m1127k6209J4925n212L6786J10330J9036Q92r41k011
$$ 693847 705403 792975 786158 745031 718822 733747 728535 765321 875651 894687 895579 894638 892627
6554H92627M1988j9592N650K4324O7229P2816O791J8348J0772K5236P1519j1372
$$ 892627 934615 915023 920673 944997 1012226 1085042 1091833 1110181 1120953 1146189 1217708 1206336
6542A206336R1955K32569K45586J52959M8854P0465J9186m6929m0386j05351k13397
$$ 1206336 1298291 1530860 1776446 1929405 1978259 2048724 2067910 2020981 1980595 1875244 1661847
6531A661847k02308j87167m9312p6391m0719q7573N96n9237j05260m7329L7897
$$ 1661847 1459539 1272372 1223060 1146669 1105950 1018377 1018973 959736 854476 807147 845044
6520H45044K2699r8192q9875R90J7089K8126k507j1381l9696K6667k3697J2537
$$ 845044 867743 769551 679676 680666 697755 725881 723374 711993 672297 698964 675267 687804
6508F87804J4018M7713n186n5350O028K8319L0270k9229M5981J2129k0675l2634
$$ 687804 701822 749535 744349 688999 695027 723346 753616 724387 770368 782497 761822 729188
6496G29188n7688r660L7170J0474N4794L1840j6746L4514J8984k4574Q1084J7704
$$ 729188 671500 661840 699010 709484 764278 796118 779372 813886 832870 808296 889380 907084
6484I07084L5037P3718Q5286M258j3243L9534R3773P1595J49674R4464J25210
$$ 907084 942121 1015839 1101125 1105383 1092140 1131674 1225447 1297042 1446716 1541180 1666390
6473A666390K24896J83347J81929J85404J20157L9186j6292m6436j58370j11997
$$ 1666390 1891286 2074633 2256562 2441966 2562123 2601309 2585017 2538581 2380211 2268214
6463B268214j07196j85430p0681n6343j0699p3290q1631o755l0243J3096L6733
$$ 2268214 2161018 1975588 1904907 1848564 1837865 1764575 1682944 1676189 1645946 1659042 1695775
6452A695775J25517M1312Q8721J48678j206M6080J82586J84077J15960K20033
$$ 1695775 1821292 1862604 1951325 2100003 2098797 2144877 2327463 2511540 2627500 2847533
6442B847533K28281L75662M66944N13035N96403P59299J106391J384718J694025
$$ 2847533 3075814 3451476 3918420 4431455 5027858 5787157 6893548 8278266 9972291
6433I972291J941188K074802J601522N81387n54142j481810j977464j845152j623570
$$ 9972291 11913479 13988281 15589803 16171190 15617048 14135238 12157774 10312622 8689052
6424H689052j321142j023086p97406o75671n75289l98954l43015k93974l35411
$$ 8689052 7367910 6344824 5547418 4871747 4296458 3897504 3554489 3260515 2925104
6415B925104k10347j80035j78859j12559j01227j75165j15505j14392m2377q6714
$$ 2925104 2714757 2534722 2355863 2243304 2142077 1966912 1851407 1737015 1694638 1607924
6405A607924j0053N661r0137n2533m0097k8820o2265m9166L8520L5444r0476r5303
$$ 1607924 1597871 1603532 1513395 1460862 1420765 1391945 1329680 1280514 1319034 1354478 1264002 1168699
6393A168699O040n7890L731k3886m6847k5250j0335k9045r1430J7508l2810L6612
$$ 1168699 1174739 1116849 1120580 1096694 1049847 1024597 1014262 985217 893787 911295 878485 915097
6381I15097k627l9303l8835n3158L6016K7760K3735L4689r3169k7520O9395J0676
$$ 915097 912470 873167 834332 781174 817190 844950 868685 903374 810205 782685 852080 862756
6369H62756l3913k2701N5746L3677K8439K7107n0128m1670k2675J5975j156M5457
$$ 862756 828843 806142 861888 895565 924004 951111 900983 859313 836638 852613 851457 896914
6357H96914m2762q5400l1396r4935o272K8932N2302K5680p8122L4319M3929j6257
$$ 896914 854152 768752 737356 642421 636149 665081 717383 743063 664941 699260 743189 726932
6345G26932k244m608l1721J4078m6726J7846J8007n4795J7445K7177r23N0729
$$ 726932 724688 720080 688359 702437 655711 673557 691564 636769 654214 681391 680468 731197
6333G31197r621J7166N505p2862j0346J5987K3897m1595q886K9935R461L1263
$$ 731197 721576 738742 744247 671385 661039 677026 700923 659328 650442 680377 689838 721101
6321G21101J12808j3861k1454o252J873L4712P6280M647N3304m186m7279j3699
$$ 721101 833909 820048 798594 792342 794215 828927 905207 909854 963158 958972 911693 897994
6309H97994j928j063p4502J4518L0320L2399m1348Q269J13453K8339L5956N19
$$ 897994 896066 895003 820501 835019 865339 897738 856390 864659 978112 1006451 1042407 1042926
6297A042926l2469j7509J6600l1848K5426o5638M0213J5271M014P2201P397j9739
$$ 1042926 1010457 992948 1009548 977700 1003126 937488 977701 992972 996986 1069187 1076584 1056845
6285A056845K4696Q345n3762J8683K5707l0197L2999j3730m620N2389q6868k4626
$$ 1056845 1081541 1089886 1036124 1054807 1080514 1050317 1083316 1069586 1064966 1117355 1030487 1005861
6273A005861M1528K778l2198R201N3141P3095K3974N7425O661P7248n4365K5160
$$ 1005861 1047389 1050167 1017969 1027170 1080311 1153406 1177380 1234805 1241466 1318714 1264349 1289509
6261A289509R7099R2093J7390Q5281N5063o215J74596J21641L7427k2190J2894
$$ 1289509 1386608 1478701 1496091 1581372 1636435 1630220 1804816 1926457 1963884 1941694 1954588
6250A954588J9112p8960J4812n3848q1188l5993j5009O2881j0435p0749k4892
$$ 1954588 1973700 1894740 1909552 1855704 1774516 1738523 1723514 1786395 1775960 1705211 1680319
6239A680319j2895k0282Q1533O9383J32817J69049J06519J10979J00230J71700
$$ 1680319 1667424 1647142 1728675 1798058 1930875 2099924 2206443 2317422 2417652 2589352
6229B589352J20341O0441J28802K1438K8647o5255k5390O9271o4443j14801j21459
$$ 2589352 2709693 2770134 2898936 2920374 2949021 2883766 2858376 2927647 2863204 2748403 2626944
6218B626944j72666j38744m5951q7392q1586l7643p1323L2708J3243M2572M3303
$$ 2626944 2454278 2315534 2269583 2182191 2100605 2062962 1991639 2024347 2037590 2080162 2123465
6207B123465N6920N2578L4724R1236K0123J03778J23657Q0934K5496L9765j02761
$$ 2123465 2180385 2232963 2267687 2358923 2379046 2482824 2606481 2687415 2712911 2752676 2649915
6196B649915j10435K238q970j26162j0171p8012l8510O350m3237R85M8656K2396
$$ 2649915 2539480 2541718 2532748 2406586 2396415 2318403 2279893 2286243 2243006 2243991 2292647 2315043
6184B315043m9643M417l5577m89L2106N9295L6312n8487K799J08261R2868P4574
$$ 2315043 2265400 2269817 2234240 2233751 2265857 2325152 2361464 2302977 2305776 2414037 2506905 2581479
6172B581479L9034Q603Q0067J31641L5820P6005J33488P3033n1554r0995k02850
$$ 2581479 2620513 2629116 2709183 2840824 2876644 2952649 3086137 3159170 3107616 3016621 2813771
6161B813771j47485j73804k51679j56928j50876o5466M6621n6937m4258m0477
$$ 2813771 2666286 2492482 2240803 2083875 1932999 1867533 1914154 1857217 1812959 1772482
6151A772482J5020n8652m4942p1651n3613o5621l8617k8191O1114J21272r65J6246
$$ 1772482 1787502 1728850 1683908 1612257 1558644 1493023 1454406 1426215 1487329 1608601 1607636 1623882
6139A623882K3843J3986M2023M6909M8300L3405R9989J32503J31801J80988K18730
$$ 1623882 1647725 1661711 1703734 1750643 1798943 1832348 1932337 2064840 2196641 2377629 2596359
6128B596359J87973K22032L37025L25204K83012J72551J84590m7590k00488k10169
$$ 2596359 2784332 3006364 3343389 3668593 3951605 4124156 4308746 4261156 4060668 3850499
6118C850499k63955j81907r8661q6096K3980O2481L7884J29505J46960O4065Q6492
$$ 3850499 3586544 3404637 3305976 3219880 3243860 3306341 3344225 3473730 3620690 3684755 3771247
6107C771247J13284Q5820K7173K8836k1596r0043j84061k15502j18460o4109p0233
$$ 3771247 3884531 3970351 3997524 4026360 4004764 3914721 3730660 3515158 3396698 3332589 3262356
6096C262356j06139l879N0823P8224J62561J57087L21817L40773M62927M58897
$$ 3262356 3156217 3152338 3203161 3281385 3443946 3601033 3922850 4263623 4726550 5185447
6086E185447M05424K67461J98366L1936m5205j378j2686J37910J77213J42130
$$ 5185447 5590871 5858332 6056698 6088634 6043429 6042051 6029365 6167275 6344488 6486618
6076F486618L5262p9240l02464l19354k49506k59521k05282j31807j59569j26179
$$ 6486618 6521880 6442640 6140176 5820822 5571316 5311795 5106513 4974706 4815137 4688958
6066D688958K7033R4132J00633J14093l2640p9518k43473k34610l18084l10699
$$ 4688958 4715991 4810123 4910756 5024849 4992209 4912691 4669218 4434608 4116524 3805825
6056C805825r9104j24066l7892L6928J0732R9880J33802J67339K08260J69959
$$ 3805825 3706721 3582655 3544763 3581691 3592423 3692303 3826105 3993444 4201704 4371663
6046D371663J12378o6388k73338l48110k56241k25939k37088j97678j01921j64542
$$ 4371663 4484041 4417653 4144315 3796205 3539964 3314025 3076937 2879259 2777338 2612796
6036B612796o1347L0234l3720m4466k1204M3527O3918Q5150J26567K02283J44968
$$ 2612796 2551449 2581683 2547963 2503497 2482293 2525820 2589738 2674888 2801455 3003738 3148706
6025C148706K67814L02401K52490Q6518K7476m1554j99626k01502j71358k09303
$$ 3148706 3416520 3718921 3971411 4057929 4085405 4043851 3844225 3642723 3471365 3262062
6015C262062m8555j27516j57669J7860O8203M259M0513N8662o7514N0252K1786
$$ 3262062 3213507 3085991 2928322 2946182 3014385 3018644 3059157 3117819 3050305 3100557 3122343
6004C122343q946P2286K3764J5804k8121O5687R9779N2994P8837n2412R1315R1445
$$ 3122343 3113397 3185683 3209447 3225251 3197130 3262817 3362596 3415590 3494427 3442015 3533330 3624775
5992C624775M6298J1251P8260J504N1528J96128J67232J88624K46075L42214L98289
$$ 3624775 3671073 3682324 3760584 3762088 3813616 4009744 4176976 4365600 4611675 4953889 5352178
5981E352178M20048M31516J75825k0010l59554n24372m61706m67662m12217l77552
$$ 5352178 5772226 6203742 6379567 6359557 6000003 5475631 5013925 4546263 4134046 3756494
5971C756494l72507k13336k09706j19092j48186j13724j5069j7975j02642j23175
$$ 3756494 3383987 3170651 2960945 2841853 2693667 2579943 2564874 2546899 2444257 2321082
5961B321082m1238J0045L193m4944J2658l0377l898l7979p7282r8285O7182n4719
$$ 2321082 2279844 2289889 2293082 2248138 2260796 2230419 2226521 2188542 2111260 2012975 2080157 2025438
5949B025438m8037M7467m8150m631K2631J46663P5734j2757Q8996J58100J33595
$$ 2025438 1977401 2024868 1976718 1972087 1994718 2141381 2217115 2204358 2293354 2451454 2585049
5938B585049J69353P7605J06948K01826K03989K92515L49683L33680M40558M06823
$$ 2585049 2754402 2832007 2938955 3140781 3344770 3637285 3986968 4320648 4761206 5168029
5928E168029L32022L50613K92042J54127o3558l5090k26970j74411j50701q7108
$$ 5168029 5500051 5850664 6142706 6296833 6233275 6198185 5971215 5796804 5646103 5558995
5918E558995K2853p991r8979j47543k41843k32424j95279j70802j95572j83830
$$ 5558995 5581848 5573857 5474878 5327335 5085492 4853068 4657789 4486987 4291415 4107585
5908D107585o7187j43891r0387q615K2898K5318j15531j40131j59863j64854j11357
$$ 4107585 4040398 3896507 3806120 3797505 3820403 3845721 3730190 3590059 3430196 3265342 3153985
5897C153985j57585j66099j18385j99535l4053j9331L0498p210O7845K1496Q0228
$$ 3153985 2996400 2830301 2711916 2512381 2478328 2458997 2489495 2482285 2550130 2571626 2651854
5886B651854J03136o987o067j092J3357p315p160L6033n6273n9355j6323j49286
$$ 2651854 2754990 2748003 2741936 2740844 2754201 2746886 2739726 2775759 2719486 2660131 2643808 2494522
5874B494522q3495j14344p5937o7120r9176j24517M429J1460l7123j08132N0126
$$ 2494522 2411027 2296683 2220746 2153626 2054450 1929933 1934362 1945822 1908699 1800567 1850693
5863A850693l765o9281p424k5905K1561j3284n2440k9100j25606q5865L1010n880
$$ 1850693 1846928 1777647 1770223 1744318 1765879 1752595 1700155 1671055 1545449 1459584 1490594 1484714
5851A484714R361j6202r292p3437m6112K3057K0003L3160M1465N4090J1029M7201
$$ 1484714 1494075 1477873 1468581 1395144 1349032 1372089 1392092 1425252 1466717 1520807 1531836 1579037
5839A579037m712q5682k005l957j01622m9971j17232j9983J9726p3592q3321j856
$$ 1579037 1574325 1488643 1486638 1482681 1381059 1331088 1213856 1193873 1213599 1140007 1056686 1054830
5827A054830J165p0115m8337l1075n793L8664j2972K6436n8896o0824M1020J2164
$$ 1054830 1055995 985880 937543 906468 900675 939339 926367 952803 893907 833083 874103 886267
5815H86267Q720j2403k007M2683O269l6579j5539k5098J0930o1045j9216J01717
$$ 886267 894987 882584 880577 923260 929529 892950 877411 852313 863243 802198 782982 884699
5803H84699K9738m0550l8494o0617p34M3989j3114K1511k9384j0993K915l0935
$$ 884699 914437 873887 835393 774776 774042 818031 804917 826428 797044 786051 788966 758031
5791G58031L3877l0882k2229k4474j758K77N0494l5162r183L453m182k5711k8464
$$ 758031 791908 761026 738797 714323 712565 712842 763336 728174 718991 722444 718262 692551 664087
5778F64087M0526J9223M9054K1276O9357J299l3797J2781j0964K2666J1381m2966
$$ 664087 704613 723836 772890 794166 863523 864822 831025 843806 832842 855508 866889 823923
5766H23923N1588r265N0967q4311o5421L00k7799M3309p980N8901r887l2563M2750
$$ 823923 875511 866246 917213 832902 767481 767781 739982 783291 775311 834212 824325 791762 834512
5753H34512m9452L311Q0608l4910j24235N0319Q3154Q011M9785M6677j2006r3465
$$ 834512 785060 788371 868979 834069 709834 760153 843307 851318 901103 947780 935774 842309
5741H42309k4859N6411K6342J3588J3413r241o5937p2853p931M5l7267J9040k9203
$$ 842309 817450 873861 900203 913791 927204 917963 852026 779173 771242 771287 734020 753060 723857
5728G23857m1975m9121O0886O177J910O880J7564Q0375M6794n175n5625J5359
$$ 723857 681882 632761 693647 699824 701734 708614 726178 806553 853347 848172 792547 807906
5716H07906k3767O0742Q9415P7043j3973k3037l4249k9409N413j0880n448o069
$$ 807906 784139 844881 934296 1011339 997366 974329 940080 910671 916084 905204 899756 893687
5704H93687q3771k5502R0928n2474k60N1430l1833K5024p3119L7883J26Qk277
$$ 893687 809916 784414 875342 822868 822608 874038 842205 867229 794110 831993 832119 832127 829850
5691H29850k7361m5423K5266k4161R716N3389Q0273O9078m2347m4531l2241j5122
$$ 829850 802489 757066 782332 758171 767887 821276 901549 970627 928280 883749 851508 836386
5679H36386K4238j3866N360j9726N4197J1470o320k4589j3152j1785n2228L7655
$$ 836386 860624 846758 852118 832392 886589 898059 891739 867150 853998 842213 789985 827640
5667H27640J304K7426j1444m7714N4711q133l6847k4803O058R0234n4294n0088
$$ 827640 828944 856370 844926 797212 851923 843790 806943 782140 788198 878432 824138 774050
5655G74050k650j0315l0842m2753K8865m4569M8942m276o14O6923L502o065L288
$$ 774050 771400 761085 730243 687490 716355 671786 720728 716452 715838 782761 786263 780198 783486
5642G83486l8857L9445M492Q0857K7708l4541l2082m4992q5943K5782O0442m1022
$$ 783486 744629 784074 788566 869423 897131 862590 830508 785516 699573 725355 785797 744775
5630G44775K758k3621O7656L5643q736L9536K0329n2326K2179J6129M4279j8301
$$ 744775 747533 723912 791568 827211 818475 858011 878340 826014 848193 864322 908601 890300
5618H90300L0174l2639k2466N2360N2863m6626J4801J6939N528l6327L9459R2868
$$ 890300 920474 887835 865369 917729 970592 923966 938767 955706 961234 924907 964366 1057234
5606A057234P1162l5038M969o1182K6159p3494n3730K9921m195k8426q838Q669
$$ 1057234 1128396 1093358 1098327 1037145 1063304 989810 936080 966001 961806 933380 924542 933211
5594I33211o8894j6303N2246m3680p451J00224m0633p4122N1033M1009O462K3328
$$ 933211 864317 848014 900260 856580 849129 949353 908720 834598 885631 926640 933102 956430
5582I56430q0420N3890N3845l3499M0556K5648K1227Q464n03q5041P2790L3980
$$ 956430 876010 929900 983745 950246 990802 1016450 1037677 1046141 1045638 960597 1033387 1067367
5570A067367M7345m6523K0181l9776L4888j6691L378J24894J5361L5161m0609
$$ 1067367 1114712 1068189 1088370 1048594 1083482 1066791 1070169 1195063 1210424 1245585 1204976
5559A204976k2708J8931N6002M688P0755K2097R6688J11425L2469R7572O4897
$$ 1204976 1182268 1201199 1257201 1261889 1332644 1354741 1451429 1562854 1595323 1692895 1757792
5548A757792M9455R7245K51646K20840P5556J37417J10781Q3928j7984M183j4615
$$ 1757792 1807247 1904492 2156138 2376978 2452534 2589951 2700732 2784660 2766676 2770859 2756244
5537B756244M05K6666j4234L4032k7948o818L9577j7927n6375k2688L6819o2905
$$ 2756244 2756649 2783315 2769081 2803113 2775165 2768347 2807924 2789997 2733622 2710934 2747753 2684848
5525B684848n7624j23357j02242q0394k9554l4145p6073r2376M0317P780Q3838
$$ 2684848 2627224 2503867 2401625 2321231 2291677 2257532 2181459 2089083 2129400 2137180 2221018
5514B221018P385O1059R1947J12772j5162j19813k0044p312j14471j39542j47160
$$ 2221018 2228403 2289462 2381409 2494181 2479019 2359206 2339162 2331850 2217379 2077837 1930677
5503A930677n5144o1123j4533q0728j31498l8239J1549k6199k4151k5168K5308
$$ 1930677 1875533 1814410 1799877 1719149 1587651 1549412 1560961 1534762 1510611 1485443 1510751
5492A510751l059q1228j2244p164R0792J27367J2864L5286L6946R3216K41781
$$ 1510751 1507692 1426464 1414220 1407056 1497848 1625215 1638079 1673365 1710311 1803527 2045308
5481B045308P5803J77079K01942J85597J95726L9488P7161N6223J866m0767o6905
$$ 2045308 2121111 2298190 2500132 2685729 2881455 2920943 2998104 3054327 3056193 3015426 2948521
5470B948521k0285L213M8093k3412k8891J8256J4297k8589J8136l5483m8794k6599
$$ 2948521 2928236 2931449 2979542 2956130 2927239 2945495 2959792 2931203 2949339 2913856 2865062 2838463
5458B838463j14104p8305n3781o402o4749j7644m2117K0783N8711K4984L1247
$$ 2838463 2724359 2646054 2592273 2585871 2521122 2503478 2461361 2482144 2540855 2565839 2597086
5447B597086M0498M4309O5575J3492k2301K8158j12884j28175j08402j71569j17371
$$ 2597086 2637584 2681893 2747468 2760960 2738659 2766817 2653933 2525758 2417356 2245787 2128416
5436B128416j02732j78835k53271q2173p8421o1023n6255j38250J1282n5547K940
$$ 2128416 2025684 1846849 1593578 1511405 1432984 1371961 1315706 1177456 1188738 1133191 1136131
5425A136131k7510p8907k3919R587l6936j9559L4161L8346r3356n6466J2184L2344
$$ 1136131 1108621 1029714 1005795 1015382 978446 958887 993048 1031394 938038 881572 893756 926100
5413I26100m7219K0883j0903j8251j9687J1872r465k010p7171j5789P5836J7212
$$ 926100 878881 899764 888861 870610 850923 862795 853330 851320 774149 758360 834196 851408
5401H51408l2871l4442J8366k2598Q0746L6950r8823L7823K1291k3108M342M4064
$$ 851408 818537 784095 802461 779863 860609 897559 798736 836559 857850 834742 839084 883148
5389H83148K2611K0300k4360L030n7373J1651l4005K4862l6623j8333L0189J07
$$ 883148 905759 926059 901699 904729 847356 859007 825002 849864 813241 794908 825097 825204
5377H25204o575o2125j4830J7092j631O7718L3703k9401R480K4005l4734j7611
$$ 825204 818629 756504 741674 758766 757135 824853 858556 829155 838635 862640 827906 810295
5365H10295P2572l684r889n9936j8934Q9299P6148k5613l222j6934n0335j1797
$$ 810295 882867 879183 869294 809358 790424 879723 955871 930258 927036 910102 859767 847970
5353H47970k1825r2540N603l5611L7097J8777L5555k8655L5714J5678q998k6046
$$ 847970 826145 733605 739208 703597 740694 759471 795026 766371 802085 817763 808765 782719
5341G82719j0193O1700k0711n1466N7958O0854K4400K352l958q914k0992l0443
$$ 782719 772526 834226 813515 762049 820007 880861 905261 907613 903655 894741 873749 843306
5329H43306L2584N9429m7682M3111J2974K1291j6236O7480j438R7058J27195R57
$$ 843306 875890 935319 887637 930748 943722 965013 948777 1016257 1014819 1111877 1239072 1240029
5317A240029J03467N8877q100n4616N534m6994p7536j21025j03361j577Q487k9981
$$ 1240029 1343496 1402373 1394273 1339657 1345191 1298197 1220661 1099636 996275 994698 1003185 973204
5305I73204m1516m4515R3779r871K0999p9078q349O484K9271L7596k2283K7046
$$ 973204 931688 887173 980952 971081 992080 913002 904653 911137 940408 978004 955721 982767
5293I82767J6970k3186k3996M3702L3264j1063M2449P2758J11012Q6929m5538
$$ 982767 999737 976551 952555 996257 1029521 1018458 1060907 1133665 1244677 1331606 1286068
5282A286068O9349m5328n5504m0230O392K15o6733N9219n3942o3693k2265R969
$$ 1286068 1355417 1310089 1254585 1214355 1220747 1220962 1154229 1213448 1159506 1095813 1073548 1083517
5270A083517K5794o6256r643O4127J7432m5633q663n6335K4081j5781p066o352
$$ 1083517 1109311 1043055 1033412 1097539 1114971 1069338 1060675 1004340 1028421 1012640 1005574 999222
5258I99222m3621P9409k9706j2312n6250L9805M5422k7459n631M3125m102M6780
$$ 999222 955601 1035010 1005304 992992 936742 976547 1021969 994510 988879 1032004 1027902 1074682
5246A074682M3609M8155L5018K3856P228n6120j8629j0226O209l4409M5415m962
$$ 1074682 1118291 1166446 1201464 1225320 1232548 1176428 1157799 1147573 1153782 1119373 1164788 1159826
5234A159826m1169N4083P3544k6727K2676L0566l1225P087K0240k4220R094M5655
$$ 1159826 1118657 1172740 1246284 1219557 1242233 1272799 1241574 1248661 1268901 1244681 1253775 1299430
5222A299430L8161k0009l6138L3050k7848m2794R638N1545O3094N915J2065m0358
$$ 1299430 1337591 1317582 1281444 1314494 1286646 1243852 1253490 1305035 1368129 1374044 1386109 1345751
5210A345751L7523J1465K6933O102L4720j6228m0163M8248N1423P6613L6674P5357
$$ 1345751 1383274 1394739 1421672 1427774 1462494 1446266 1406103 1454351 1505774 1582387 1619061 1694418
5198A694418k169J7353M2586q574N0310Q3194p14O0028N4953l033P9646m5893
$$ 1694418 1692249 1709602 1752188 1743614 1793924 1877118 1876404 1936432 1991385 1988352 2067998 2022105
5186B022105J0337k6255k6063Q8972J06147R1114J15073k782J48068J60565J40187
$$ 2022105 2032442 2006187 1980124 2069096 2175243 2266357 2381430 2378648 2526716 2687281 2827468
5175B827468J83318J97445J38366Q8551J184j14930q0969l8416j18381o5654k6672
$$ 2827468 3010786 3208231 3346597 3435148 3436332 3321402 3240433 3202017 3083636 3017982 2991310
5164B991310j145K6959J8945O8755k9046Q801M6469k8900J10198J05466N1349
$$ 2991310 2990165 3017124 3036069 3104824 3075778 3084579 3131048 3102148 3212346 3317812 3369161
5153C369161R8756J29196K45061K40329K44644K66898L53224M90658M74586M57354
$$ 3369161 3467917 3597113 3842174 4082503 4327147 4594045 4947269 5437927 5912513 6369867
5143F369867M67350M18838L57559K48571N4884N5211q5484k15065l15018l57336
$$ 6369867 6837217 7256055 7613614 7862185 7917069 7972280 7886796 7671731 7356713 6999377
5133F999377k72535k99547j96742j38609o7611l879l6561j14083j65904k68824
$$ 6999377 6726842 6427295 6230553 6091944 6024333 6020454 5983893 5869810 5703906 5435082
5123E435082l14072k47393j86481j64028j29396j10723r6235q5139k9339o059
$$ 5435082 5121010 4873617 4687136 4523108 4393712 4282989 4186754 4101615 4072276 4066217
5113D066217M647j27383J7222J8626M4349J36645J43679M5872P2361P3858J50060
$$ 4066217 4070864 3943481 3960703 3979329 4023678 4160323 4304002 4349874 4422235 4496093 4646153
5102D646153K09318K83131K62257K28011K77478J79695Q7068l4936o0644J6338
$$ 4646153 4855471 5138602 5400859 5628870 5906348 6086043 6173111 6138175 6077531 6093869
5092F093869j4001j9495K7367N9993j3877Q4006P9079J52345J53570J29234R8433
$$ 6093869 6079868 6060373 6087740 6147733 6133856 6217862 6296941 6449286 6602856 6732090 6830523
5081F830523P1124J23096J59639K68722K43307K54550L67301K93417K42202K62205
$$ 6830523 6901647 7024743 7184382 7453104 7696411 7950961 8318262 8611679 8853881 9116086
5071I116086J05581j620k35082k42748k28561k41055j80099j48612k40129k14597
$$ 9116086 9221667 9220047 8984965 8742217 8513656 8272601 8092502 7943890 7703761 7489164
5061G489164j66392q4487r5332m9162j3159L0713o0032j765j541p4392K3554O4781
$$ 7489164 7322772 7238285 7142953 7093791 7080632 7111345 7051313 7049548 7048007 6973615 6997169 7061950
5049G061950R9449K6073M8807L3274Q8770J09448Q5229L1782J05188J48669J05522
$$ 7061950 7161399 7187472 7236279 7269553 7358323 7467771 7553000 7584782 7689970 7838639 7944161
5038G944161J31246K07213J23665Q8978J25150J50911P2737K04319K65430K84202
$$ 7944161 8075407 8282620 8406285 8495263 8620413 8771324 8844061 9048380 9313810 9598012
5028I598012L31224L33166K86761L90956N18830O21757O49069O93359P79012Q88076
$$ 9598012 9929236 10262402 10549163 10940119 11458949 12080706 12729775 13423134 14202146 15090222
5018A5090222J064563J322969J568344J867567K259149K643353L647544N063724
$$ 15090222 16154785 17477754 19046098 20913665 23172814 25816167 29463711 34527435
5010C4527435P110438J0192593J3838233J6520418J4300485P494265r63708r659861
$$ 34527435 41637873 51830466 65668699 82189117 96489602 103983867 103020159 93360298
5002I3360298j4720804j4814291j2073955r041545o683663m989678l682282k931624
$$ 93360298 78639494 63825203 51751248 42709703 36026040 31036362 27354080 24422456
4994B4422456k198926j530842j015905p53941m75600k44819j20494j3198K11531
$$ 24422456 22223530 20692688 19676783 18922842 18447242 18202423 18081929 18068731 18280262
4985A8280262L35871N16189P81823J038783J464863J991404K599178L555373M965780
$$ 18280262 18616133 19132322 19914145 20952928 22417791 24409195 27008373 30563746 35529526
4976C5529526P184577J0067195J3139510J3812011R485991M045913l36012o091182
$$ 35529526 42714103 52781298 65920808 79732819 89218810 93264723 92928711 86837529
4968H6837529j1688688j3325392j1433571q905906o805719n020097l644763k947301
$$ 86837529 75148841 61823449 50389878 41483972 34678253 29658156 26013393 23066092
4960B3066092k305087j712919j303308j034973q47777p44407n89983o29782m83902
$$ 23066092 20761005 19048086 17744778 16709805 15862028 15117621 14527638 13897856 13413954
4951A3413954l01633m23196l02817j85214j83298j52700j28819m0511q5295j17863
$$ 13413954 13112321 12689125 12386308 12201094 12017796 11865096 11736277 11695766 11610471 11492608
4941A1492608p2446j06100j14471p5213p0022j44706j35308j09725p3979l6559
$$ 11492608 11420162 11314062 11199591 11124378 11054356 10909650 10774342 10664617 10590638 10554079
4931A0554079K744n9492K3007L2973L3611M2994K2950k0289Q9301l939m664O6397
$$ 10554079 10556823 10497331 10520338 10553311 10586922 10629916 10652866 10632577 10721878 10717939 10713275 10779672
4919A0779672O1899J13786R7027L7622J03190R3791L3152N2591O0387P4123P5908
$$ 10779672 10841571 10955357 11052384 11090006 11193196 11286987 11320139 11372730 11433117 11507240 11583148
4908A1583148J7453J29192Q3165P130k7967J21293O7654K0205R0108J57046K23763
$$ 11583148 11600601 11729793 11812958 11820088 11792121 11913414 11981068 12001273 12091381 12248427 12472190
4897A2472190J86890J38745K55015K06236K42951K71894J66465K41323L25759
$$ 12472190 12659080 12797825 13052840 13259076 13502027 13773921 13940386 14181709 14507468
4888A4507468L12813L25221L28192L16299K88497L86642L32288K80844L00768
$$ 14507468 14820281 15145502 15473694 15789993 16078490 16465132 16797420 17078264 17379032
4879A7379032L16627L80061K55838L58362L40518L71955M94274N13163M77258
$$ 17379032 17695659 18075720 18331558 18689920 19030438 19402393 19896667 20409830 20887088
4870B0887088M08178N27045N94917N91160N82587O20874P01227N39869N05342
$$ 20887088 21295266 21822311 22417228 23008388 23590975 24211849 24913076 25452945 25958287
4861B5958287O07170P03139O04890O51910O95255O71180P11175O75758O94938
$$ 25958287 26565457 27268596 27873486 28525396 29220651 29891831 30603006 31278764 31973702
4852C1973702P38134P88902Q86039Q90394R60303R90696J076513J174422J201052
$$ 31973702 32711836 33500738 34386777 35277171 36237474 37228170 38304683 39479105 40680157
4843D0680157J239890J231707J195041J233434J431861J589921J858392K114393
$$ 40680157 41920047 43151754 44346795 45580229 47012090 48602011 50460403 52574796
4835E2574796K301863K592169L000367L447175L874554M502439N178905N754703
$$ 52574796 54876659 57468828 60469195 63916370 67790924 72293363 77472268 83226971
4827H3226971O278442O606827O713280O460036O159961O096598O074166O208285
$$ 83226971 89505413 96112240 102825520 109285556 115445517 121542115 127616281 133824566
4819A33824566O117759N884922N355223M492574L877409L578002L395654L517967
$$ 133824566 139942325 145827247 151182470 155675044 159552453 163130455 166526109 170044076
4811A70044076L793340M316978N249078O842199Q726178J0379117J1366494J1515494
$$ 170044076 173837416 178154394 183403472 190245671 198971849 209350966 220717460 232232954
4803B32232954J1025672R906528Q102548N986423L823077K273362J222312J68697
$$ 232232954 243258626 253165154 261267702 267254125 271077202 273350564 274572876 274741573
4795B74741573r99557j698553j528166m74521N01563Q35695N68781j06342o64832
$$ 274741573 273742016 272043463 270515297 270040776 270542339 271378034 271946815 271840473 271175641
4786B71175641n72868K71265J191660J806393J303644J76331k64545Q31579K664445
$$ 271175641 270602773 270874038 272065698 273872091 275175735 275352066 275087521 275919100 278583545
4777B78583545L462173K595157J061527l3813j139578k777509n294111q087814
$$ 278583545 282045718 284640875 285702402 285668589 284529011 281751502 276457391 268369577
4769B68369577j0299632j1623938j2034909j1555580j0171981q350887o318427
$$ 268369577 258069945 246446007 234411098 222855518 212683537 204332650 198014223
4762A98014223m822157l907702l579860l544102l716422m100009m750968n431584
$$ 198014223 193192066 189284364 185704504 182160402 178443980 174343971 169593003 164161419
4754A64161419o141996o713397p170871p481333p537042p833246q199676q387446
$$ 164161419 158019423 151306026 144135155 136653822 129116780 121283534 113083858 104696412
4746A04696412q154006p586849o898846o052813n326801m622893m080254l575460
$$ 104696412 96542406 88955557 82056711 76003898 70677097 66054204 61973950 58398490
4738E8398490l363192l009521k714168k322486j975952j659281j578580j537779
$$ 58398490 55035298 52025777 49311609 46989123 45013171 43353890 41775310 40237531
4730D0237531j464531j450976j368634j380634j267198j134659j047938j044726
$$ 40237531 38773000 37322024 35953390 34572756 33305558 32170899 31122961 30078235
4722C0078235r06540q40093q31652p68016o07034n08645n63007n38465n27182
$$ 30078235 29171695 28331602 27499950 26731934 26124900 25616255 25053248 24514783 23987601
4713B3987601m90687m55182m60083m03190l81274n02136n13117n01860m93716
$$ 23987601 23496914 23041732 22581649 22178459 21797185 21295049 20781932 20280072 19786356
4704A9786356m26693l50733l75166l57685l47581l61369l69987k85068l21343
$$ 19786356 19359663 19008930 18633764 18276079 17928498 17567129 17197142 16912074 16590731
4695A6590731k66126k00840j93300j92443k51889j92770l06692l14167k57128
$$ 16590731 16324605 16123765 15930465 15738022 15486133 15293363 14986671 14672504 14415376
4686A4415376r4127q8729k8110P6642K76926N73063Q71553J104551R00955j32035
$$ 14415376 14321249 14232520 14204410 14281052 14557978 15131041 16002594 17107145 18008100 17876065
4676A7876065q91024j224908j068843q62145o16796m72793m19234k95308j73728
$$ 17876065 16985041 15760133 14691290 13829145 13212349 12739556 12320322 12025014 11851286
4667A1851286k09221j32913j24970j33160j47229q8497q0944k7300l013P76p250
$$ 11851286 11642065 11509152 11384182 11251022 11103793 11015296 10934352 10907052 10904039 10904815 10897565
4656A0897565q2907n9516n6401j01160k24152j79813o1314j47156p9676k0485
$$ 10897565 10814658 10755142 10698741 10597581 10373429 10193616 10132302 9985146 9905470 9884985
4646I884985J569R52L6386M5143P33M3834M5113r3188j12124j23010j80642k25147
$$ 9884985 9886554 9887506 9923892 9969035 9969768 10013602 10058715 9965527 9853403 9730393 9549751 9324604
4634I324604j73765j83819k40986k07318l21838k07316j57411k01090k18201r6469
$$ 9324604 9150839 8967020 8726034 8518716 8196878 7989562 7832151 7631061 7412860 7316391
4624G316391j23741j33082P279n512q1591N7180K8188L5036n0844q855k9870o4116
$$ 7316391 7192650 7059568 7066847 7061335 6979744 7036924 7065112 7100148 7049304 7040449 7010579 6946463
4612F946463r3824m2796j36767j58596q8562j04123j32732o0952n1294j24514
$$ 6946463 6852639 6809843 6673076 6514480 6425918 6321795 6189063 6128111 6076817 5952303
4602E952303j45567j20299o3409j57673j03611l329j03940l6779K4154L0680n0500
$$ 5952303 5806736 5686437 5623028 5465355 5361744 5358415 5254475 5217696 5241850 5272530 5222030
4591E222030j11279o3183q8817j50048q8344q0879r1726l977J3834o8444k0382
$$ 5222030 5110751 5047568 4958751 4808703 4720359 4639480 4547754 4543777 4557611 4489167 4468785
4580D468785L7525o1131n9467n6963q8641j06534r2145k8629q068l9634r9822
$$ 4468785 4506310 4445179 4385712 4328749 4240108 4133574 4041429 4012800 4004732 3965098 3865276
4569C865276q8431p8611j26611p9126l4204l062j2147j8430L7548q8880l0533
$$ 3865276 3776845 3698234 3571623 3492497 3458293 3455231 3443084 3424654 3462202 3373322 3342789
4558C342789R5669J39986R873m8525M6848k7788M239k0800j17726n4476k0859
$$ 3342789 3438458 3578444 3588317 3539792 3586640 3558852 3563091 3542291 3424565 3370089 3349230
4547C349230k8030L4383Q1504j9786n4843P7579O7620M2988P7515J7931n7530
$$ 3349230 3321200 3355583 3437087 3417301 3362458 3440037 3507657 3550645 3628160 3646091 3588561
4536C588561m0974M9535P2596P0411O0437j14100K2205J4933j7985O6920L2182
$$ 3588561 3547587 3597122 3669718 3740129 3800566 3686466 3708671 3723604 3705619 3772539 3804721
4525C804721Q1088J6478L7454M6864N9020Q7550J347M4688n4243J548R1889P5773
$$ 3804721 3885809 3902287 3939741 3986605 4045625 4133175 4134522 4179210 4124967 4126515 4218404 4294177
4513D294177P379N9822J63000R8383J0695R4741J19430N6129Q6416J0736M1946
$$ 4294177 4301556 4361378 4524378 4622761 4633456 4728197 4847627 4903756 4990172 5000908 5042854
4502E042854J3417n112j3717n3565k6450o7583k6315L9188n5541J9124j2744j5119
$$ 5042854 5056271 5051159 5037442 4983877 4957427 4889844 4863529 4902717 4847176 4866300 4853556 4838437
4490D838437P6273Q1462M379Q862P871O845m4999m3061J7999l0113J03345M7459
$$ 4838437 4914710 4996172 5000551 5009413 5017284 5024129 4979130 4936069 4954068 4923955 5027300 5074759
4478E074759N1879K6047k8759m2099J6078L9910K8118J851j31676m0521j39320
$$ 5074759 5126638 5152685 5123926 5081827 5097905 5137815 5165933 5167784 5036108 4995587 4856267
4467D856267q6831n0561j6744M4451j12005k7581o0825m6080l2699k0177j7733
$$ 4856267 4769436 4718875 4702131 4746582 4634577 4606996 4546171 4500091 4467392 4447215 4429482
4456D429482O8957n2825K5821K3791J7234j3586k524L9379M5725R4193J01702
$$ 4429482 4498439 4445614 4471435 4495226 4512460 4498874 4496350 4535729 4581454 4675647 4777349
4445D777349N2453K06463K81693L50043K32728K2505p8437j23092j38519j69275
$$ 4777349 4829802 5036265 5317958 5668001 5900729 5923234 5844797 5721705 5583186 5413911
4435E413911r5539K0249R2526O6280J21161J54968K47785L04187L25876N12414
$$ 5413911 5318372 5338621 5431147 5497427 5618588 5773556 6021341 6325528 6651404 7163818
4425G163818P31301R16444J104157J143743R33548L15109m11323r50673j007593
$$ 7163818 7895119 8811563 9915720 11059463 11993011 12308120 11896797 10946124 9938531
4416I938531r16524p79450n73732m49637k86064k56408k29168j01596j68732r2441
$$ 9938531 9022007 8242557 7668825 7219188 6933124 6676716 6447548 6345952 6177220 6084779
4406F084779M384L0702L4766m2824L3156M8299R9892N2518k8530L3839K3292k2624
$$ 6084779 6089163 6119865 6154631 6111807 6144963 6193262 6293154 6345672 6317142 6350981 6374273 6351649
4394F351649K857j964J4177n8025r085J31913R7155L6554K3056M6744q5894M3138
$$ 6351649 6354506 6352542 6366719 6308694 6299609 6431522 6528677 6565231 6588287 6635031 6549137 6592275
4382F592275J7864J32445J9231N9298L3140O228P2874J21770N0902N0196Q8407
$$ 6592275 6610139 6742584 6761815 6821113 6854253 6860481 6933355 7055125 7106027 7156223 7244630
4371G244630M2322o2868l1939L6804O17M8585P5462K4504j1599N3442Q0924O8828
$$ 7244630 7286952 7224084 7192145 7228949 7229566 7278151 7353613 7378117 7366518 7419960 7500884 7569712
4359G569712J09701q1890J16203K7317J0758P788k5384K3852J16464Q8195J09873
$$ 7569712 7679413 7597523 7713726 7741043 7751801 7759589 7734205 7758057 7874521 7962716 8072589
4348H072589N4542J6446O9755J0257R838m5435p2955l7517J4039O392M4812O800
$$ 8072589 8127131 8143577 8213332 8223589 8233427 8187992 8115037 8077520 8091559 8097951 8142763 8149563
4336H149563M0557m7578J53538J48564J2876N1517J00233j0070L7140O5574O6700
$$ 8149563 8190120 8142542 8296080 8444644 8457520 8509037 8609270 8599200 8636340 8701914 8768614
4325H768614J6693J0323j3052L0729l6312N4199m063K277m7881K4175K5747J5748
$$ 8768614 8785307 8795630 8782578 8813307 8776995 8831194 8827131 8829408 8781527 8805702 8831449 8847197
4313H847197j3986J3495N7944k3786M7068K2707K4558J19R6414Q3943J4759K0953
$$ 8847197 8833211 8846706 8904650 8880864 8927932 8950639 8975197 8975316 9071730 9155673 9170432 9191385
4301I191385N6181J00215L2824M813J7037J18983P3333L3828l9750O5491Q5268
$$ 9191385 9247566 9347781 9380605 9385418 9402455 9521438 9594771 9628599 9588849 9654340 9739608
4290I739608J24000K1591J15337Q4784R2826J24178J03933J99964J37903N8349
$$ 9739608 9863608 9885199 10000536 10085320 10178146 10302324 10406257 10606221 10744124 10802473
4280A0802473J31704O0720N9365R5637R6785R6863J23633K04417R3941J46531
$$ 10802473 10934177 10994897 11054262 11149899 11246684 11343547 11467180 11671597 11765538 11912069
4270A1912069J02652J44537J50264K32520K53804K53737K52422J94299J75764
$$ 11912069 12014721 12159258 12309522 12542042 12795846 13049583 13302005 13496304 13672068
4261A3672068J72666K23061K14076K22386K52890K58792K37816J45794K36814
$$ 13672068 13844734 14067795 14281871 14504257 14757147 15015939 15253755 15399549 15636363
4252A5636363J88220K56803J89311J82899J65719K00253K13729J26594J40462
$$ 15636363 15824583 16081386 16270697 16453596 16619315 16819568 17033297 17159891 17300353
4243A7300353L9289J33716J12955M3675M8618J9277M5307j418j4000O131j2528
$$ 17300353 17339642 17473358 17586313 17629988 17678606 17697883 17743190 17741772 17727772 17733903 17721375
4232A7721375k1014o1687K2285j4589j9376j3308q7205k3746n5275l2987l005
$$ 17721375 17700361 17638674 17660959 17646370 17626994 17613686 17526481 17502735 17447460 17414473 17411468
4221A7411468r3904r8961j05079j29218j95890k67282j52150m5596r0620j13008
$$ 17411468 17317564 17218603 17113524 16984306 16788416 16521134 16368984 16323388 16232768 16119760
4211A6119760o9871q4750q6564p958O4770j414l0257j03199o5004j95421j41373
$$ 16119760 16049889 15965139 15878575 15870617 15935387 15933973 15903716 15800517 15735513 15540092 15398719
4200A5398719m7866k0711n6190j14605l4170j7440j1138L9729L4881J15513J20280
$$ 15398719 15350853 15330142 15273952 15159347 15125177 15107737 15096599 15136328 15171209 15286722 15407002
4189A5407002N4051Q1277J86696K02986J97460J56354P4333J08440J88391K20477
$$ 15407002 15461053 15542330 15729026 15932012 16129472 16285826 16360159 16468599 16656990 16877467
4179A6877467K73787K51436L43268L29901K93695L68816M25453M64396N23527
$$ 16877467 17151254 17402690 17745958 18075859 18369554 18738370 19163823 19628219 20151746
4170B0151746O00646M91495N92491P36517P92390R70828J065317J050139J079792
$$ 20151746 20752392 21243887 21836378 22572895 23365285 24336113 25401430 26451569 27531361
4161B7531361R98447J102298J038317R69111R49237Q87200R29804R48065J039734
$$ 27531361 28529808 29632106 30670423 31639534 32588771 33475971 34405775 35353840 36393574
4152C6393574J215917J410005J525927J360298J221416J206551J354274J471679
$$ 36393574 37609491 39019496 40545423 41905721 43127137 44333688 45687962 47159641
4144D7159641J632043J630332J516083J075259O19563L54421J77720M59458N34107
$$ 47159641 48791684 50422016 51938099 53013358 53632921 53987342 54165062 54624520 55158627
4135E5158627P69147R09259Q86000R97290J181237J408437J713770J983476K227541
$$ 55158627 55927774 56837033 57723033 58720323 59901560 61309997 63023767 65007243 67234784
4126F7234784K628147K694288K709565K629513K502817K220155K137759K351201
$$ 67234784 69862931 72557219 75266784 77896297 80399114 82619269 84757028 87108229
4118H7108229L070025M108153N210408O231095O674779O215190N217642M085343
$$ 87108229 90178254 94286407 99496815 105727910 112402689 118617879 123835521 127920864
4110A27920864L111797K948318L070305L137852L121958L412571M271950N364367
$$ 127920864 131032661 133980979 137051284 140189136 143311094 146723665 150995615 156359982
4102A56359982N891377N722707N147631N090518N606278O692633Q255075J0261478
$$ 156359982 162251359 167974066 173121697 178212215 183818493 190511126 198766201 209027679
4094B09027679J2593832J4283773J3709681R903559M264059m28709k173535j184759
$$ 209027679 221621511 235905284 249614965 259518524 263782583 263353874 261180339 259995580
4086B59995580J014446L125393M371275M830395M952300M771698L849540J710842
$$ 259995580 261010026 264135419 268506694 273337089 278289389 283061087 286910627 288621469
4078B88621469j82429j89903J152305J694596P36840j662307m014262n656183
$$ 288621469 288439040 288249137 289401442 291096038 291832878 290170571 286156309 280500126
4070B80500126o575877o794918o148793m281966j537646J424323K775099O72070
$$ 280500126 273924249 267129331 260980538 256698572 255160926 256585249 259360348 260032418
4062B60032418m557068j0013574j3171835j3556546j1967237r705534p440840
$$ 260032418 255475350 245461776 232289941 218733395 206766158 197060624 189619784
4055A89619784n570192m215169l483264l816192m594622n342076n356187m963394
$$ 189619784 184049592 179834423 176351159 172534967 167940345 162598269 157242082 152278688
4047A52278688m433222l756916l353191l256526l175427l388290l874302m586467
$$ 152278688 147845466 144088550 140735359 137478833 134303406 130915116 127040814 122454347
4039A22454347n109121n287940n186236m432914l641156k993439k677787k633588
$$ 122454347 117345226 112057286 106871050 102438136 98796980 95803541 93125754 90492166
4031I0492166k755014k925133k878080k751157k493579k229594k025887j855558
$$ 90492166 87737152 84812019 81933939 79182782 76689203 74459609 72433722 70578164
4023G0578164j821476j632924j485733j323211j067171p96470p58596r06714p92232
$$ 70578164 68756688 67123764 65638031 64314820 63247649 62451179 61692583 60785869 59993637
4014E9993637q78157j101493j325241j542922j759108j729471j633276j508589
$$ 59993637 59115480 58013987 56688746 55145824 53386716 51657245 50023969 48515380
4006D8515380j576354j757260j724116j944936j749053j493658j394805j168628
$$ 48515380 46939026 45181766 43457650 41512714 39763661 38270003 36875198 35706570
3998C5706570j082752r71717r52814r44514r12853r28038q51175p94927q48175
$$ 35706570 34623818 33652101 32699287 31754773 30841920 29913882 29062707 28267780 27419605
3989B7419605q64985r11249q53207p24482o85572o29981n41447o58892n90573
$$ 27419605 26554620 25643371 24790164 24065682 23380110 22750129 22208682 21549790 20959217
3980B0959217m31980m79856l62337l17143k94043l27822j98889k48394k08410
$$ 20959217 20527237 20047381 19685044 19367901 19073858 18746036 18547147 18298753 18090343
3971A8090343j83097k31033j53763j47515j39450k27330j49563r8383j83032j26894
$$ 18090343 17907246 17676213 17522450 17374935 17235485 17008155 16858592 16760209 16577177 16450283
3961A6450283n2997j46842p7918j41537p2379k5148j12078r000R541m3159J3718
$$ 16450283 16397286 16250444 16172526 16030989 15958610 15933462 15821384 15812384 15821925 15778766 15792484
3950A5792484M0713q2255J5332N8776k6076j3940n5665l1998J3050n1802r3656
$$ 15792484 15833197 15750942 15766274 15825050 15798974 15785034 15729369 15697371 15710421 15658619 15564963
3939A5564963p2117q5051P3218L4789j4150O5650R655K8312J48827Q6008N0064
$$ 15564963 15492846 15407795 15481013 15515802 15501652 15567302 15576957 15605269 15754096 15840104 15890168
3928A5890168J10332M2226J09812O3273O8633M6771P2611J59893R8995J00646
$$ 15890168 16000500 16042726 16152538 16215811 16284444 16331215 16403826 16563719 16662714 16763360
3918A6763360M8607J38956R2316n445P3352N2258J936M6794J9811l8128j7923
$$ 16763360 16811967 16950923 17043239 17037794 17111146 17163404 17165340 17212134 17231945 17193817 17175894
3907A7175894O4469k7173O803q2147n6734J9327p3933p0721q4547N762l5033m0645
$$ 17175894 17240363 17213190 17219993 17137846 17081112 17100439 17026506 16955785 16871238 16877000 16841967 16801322
3895A6801322N6191P1782J7933J00245J46160J34815J36081J42426K11172K25352
$$ 16801322 16857513 16929295 16947228 17047473 17193633 17328448 17464529 17606955 17818127 18043479
3885A8043479J67278K62167K49299K21578L14494K84842K40604L75353L39160
$$ 18043479 18210757 18472924 18722223 18943801 19258295 19543137 19783741 20159094 20498254
3876B0498254L09968K63582M17463M63481N15864N07111N03475N61980O48903
$$ 20498254 20808222 21071804 21489267 21952748 22468612 22975723 23479198 24041178 24690081
3867B4690081O51017P19478Q02900Q07637Q35953R03151J045362J050423J141419
$$ 24690081 25341098 26060576 26863476 27671113 28507066 29410217 30455579 31506002 32647421
3858C2647421J174974J065505J037008Q94911O36218M77585K96514Q3820k0194
$$ 32647421 33822395 34887900 35924908 36819819 37456037 37933622 38230136 38313956 38293762
3849C8293762k5670j04654j77802j73575K5449p2834q9138j41782j24993k67365
$$ 38293762 38268092 38163438 37985636 37812061 37837510 37764676 37675538 37533756 37408763 37141398
3839C7141398n06344o62750p67112q75734r78745j111076j051104j025264j009065
$$ 37141398 36635054 35972304 35205192 34329458 33350713 32239637 31188533 30163269 29154204
3830B9154204q80583p80672o28527o57097n95486n52522m36350m47322m27479
$$ 29154204 28273621 27492949 26864422 26207325 25611839 25059317 24622967 24175645 23748166
3821B3748166k83497l63395m17443k71441l10220l62685k66248l71252m50056
$$ 23748166 23464669 23101274 22683831 22412390 22102170 21739485 21473237 21101985 20651929
3812B0651929l33265l55687m12761k45098k20430j97436k30583k95923j38793
$$ 20651929 20318664 19962977 19550216 19305118 19084688 18887252 18656669 18360746 18221953
3803A8221953n4110p3094l1771n4497J3967Q9452M1973J68832J29669J68408K61211
$$ 18221953 18167843 18094749 18062978 18008481 18022448 18111900 18153873 18322705 18452374 18620782 18881993
3792A8881993J82637K13417J11858K80837J65210J19689J38809O3106P3528N3865
$$ 18881993 19064630 19278047 19389905 19670742 19835952 19955641 20094450 20157556 20231084 20284949
3782B0284949K7940n3080q661p0103n6765j08216j22702p4903j70001k60378j51202
$$ 20284949 20312889 20259809 20251148 20181045 20124280 20016064 19893362 19818459 19648458 19388080 19236878
3771A9236878j92210k98972k66767l17611k74698l35090m45805l87983l42985
$$ 19236878 19044668 18745696 18478929 18161318 17886620 17551530 17105725 16717742 16374757
3762A6374757m67974l91813k75405m42755k69812l60287l07827k58359k65840
$$ 16374757 15906783 15514970 15239565 14796810 14526998 14166711 13858884 13600525 13334685
3753A3334685k88057k81266k53543k46118k36021j29361j04897q2539j03943L4967
$$ 13334685 13046628 12765362 12511819 12265701 12029680 11900319 11795422 11712883 11608940 11643907
3743A1643907Q8622L2028K9688K6108J23092M560J30972J45893J13239J50867
$$ 11643907 11732529 11764557 11794245 11820353 11943445 11948005 12078977 12224870 12338109 12488976
3733A2488976J92119J36057J65126K02690K05526K29908K07647J20248K10403
$$ 12488976 12681095 12817152 12982278 13184968 13390494 13620402 13828049 13948297 14158700
3724A4158700J57077J17242J42292O6209p5775m3517m9206n1421j04446j43519
$$ 14158700 14315777 14433019 14575311 14641520 14565745 14522228 14473022 14421601 14317155 14173636
3714A4173636j41325j66540j27002k46867k28705k29066k00842k59113k92920
$$ 14173636 14032311 13865771 13738769 13491902 13263197 13034131 12833289 12574176 12281256
3705A2281256k57822k02855l21058k80077k99337l42081l07831k19964k54524
$$ 12281256 12023434 11820579 11499521 11219444 10920107 10578026 10270195 10050231 9795707
3696I795707k81729k19396k49439k77435k02819j15543k23011k92734k00785j83927
$$ 9795707 9513978 9294582 9045143 8767708 8564889 8449346 8226335 7933601 7732816 7548889
3686G548889j49578n5619j04577j5845n2487l5828o0144k2897K4799k5661m3282
$$ 7548889 7399311 7343692 7239115 7223270 7170783 7134955 7074811 7051914 7076713 7051052 7007770
3675G007770l9462k8454j08192r9777j8367p3291l852p3009j45820j9720O4247
$$ 7007770 6968308 6939854 6831662 6731885 6713518 6640227 6636375 6563366 6417546 6397826 6462073
3664F462073O8123M4905j3363k1460Q8359l7910o069J5m2553l6155K7902N1911
$$ 6462073 6530196 6575101 6561738 6540278 6628637 6590727 6584658 6584673 6542120 6505965 6533867 6585778
3652F585778k4412M9260J17782P194R6589R3244J30408J78157J60775J64601K01135
$$ 6585778 6561366 6610626 6728408 6735602 6832191 6925435 7055843 7234000 7394775 7559376 7760511
3641G760511K26612J71899J85561J58798P7677J22743J40035J65100J69260P7460
$$ 7760511 7987123 8159022 8344583 8503381 8581058 8703801 8843836 9008936 9178196 9255656
3631I255656J12899J12483J98006J47215J89889J40444P2617Q7678K4659r421
$$ 9255656 9368555 9481038 9679044 9826259 10016148 10156592 10229209 10316887 10341546 10332125
3621A0332125N9432N7227J10731J38787Q534r2554r5738j93275r8477j44113k45180
$$ 10332125 10391557 10448784 10559515 10698302 10706836 10614282 10518544 10325269 10226792 10082679 9837499
3610I837499k26277j93517j57891j49495j12664n6306p1279N5345p0588l5061
$$ 9837499 9611222 9417705 9259814 9110319 8997655 8941349 8870070 8925415 8854827 8819766
3600H819766Q980J6657N870M577J2159P166O4832N6604J62496J18444J70291J86676
$$ 8819766 8828746 8845403 8851273 8855850 8868009 8875175 8940007 8996611 9159107 9277551 9447842 9634518
3588I634518K12026K91309K27125K01584K16137J90938K31988K15602J84705K62527
$$ 9634518 9846544 10137853 10364978 10566562 10782699 10973637 11205625 11421227 11605932 11868459
3578A1868459K84343K23915K85396K26898L11853J69544Q2553J48390J34318K1735
$$ 11868459 12152802 12376717 12662113 12889011 13200864 13370408 13452961 13601351 13735669 13757404
3568A3757404k7704L9951O527M4203m6840p725j0831m6210l514K8641K5523M5867
$$ 13757404 13729700 13769651 13776178 13820381 13773541 13765816 13754985 13708775 13705261 13733902 13759425 13805292
3556A3805292J39716Q0267J27794K10273K23963K05198J15978J19936K25741O3040
$$ 13805292 13945008 14025275 14153069 14363342 14587305 14792503 14908481 15028417 15254158 15317198
3546A5317198P0073J08885J55023Q9892J51643K9046k5188k7577l4180n9220p5643
$$ 15317198 15387271 15496156 15651179 15741071 15892714 15921760 15896572 15868995 15834815 15775595 15699952
3535A5699952l1766q6013j27368j34051k34386l60767k80309l71721l73272m54406
$$ 15699952 15668186 15582173 15454805 15320754 15086368 14725601 14445292 14073571 13700299 13245893
3525A3245893m22821m36730m53875l14525l42733l28241k70230l06415k47887
$$ 13245893 12823072 12386342 11932467 11617942 11275209 10946968 10676738 10370323 10122436
3516A0122436k64029l04039k60898k28404k52695k96926k58627j25945j86542
$$ 10122436 9858407 9554368 9293470 9065066 8812371 8515445 8256818 8130873 7944331
3507G944331k09558k24591j69191j09410j43473k9030j15512k4411k586N4360
$$ 7944331 7734773 7510182 7340991 7231581 7088108 7059078 6943566 6919155 6916569 6970929
3497F970929J20991J17291Q3270R1983J39556J05621R3389J47804O4636J01398
$$ 6970929 7091920 7209211 7292481 7384464 7524020 7629641 7723030 7870834 7935470 8036868
3487H036868K01389R4118P2166J40335Q0447M0741L5996Q999k3181K4129L0871
$$ 8036868 8238257 8332375 8404541 8544876 8625323 8666064 8702060 8711059 8687878 8712007 8742878
3476H742878J6967P4694q292q924K1094j7137l9649j29582k06673j69129k77300
$$ 8742878 8759845 8834539 8826247 8817323 8838417 8821280 8781631 8652049 8445376 8276247 7998947
3465G998947l49963l80684l44135k88568j91904l14285j91290j34250j33934j68752
$$ 7998947 7648984 7268300 6924165 6635597 6443693 6129408 5938118 5803868 5669934 5501182
3455E501182j46981j30813o7018j0147l5577p8315k46197j29342k90345j74542
$$ 5501182 5354201 5223388 5156370 5146223 5110646 5032331 4786134 4656792 4366447 4191905
3445D191905j55616j87367j78220j39431j03838p0804O8134o1459q6014j5686
$$ 4191905 4036289 3848922 3670702 3531271 3427433 3356629 3424763 3363304 3277290 3261604
3435C261604j9393m4230m1260p0465j0559J1468m7404l6911p8242n557K8809p0018
$$ 3261604 3242211 3197981 3156721 3086256 3075697 3087165 3039761 3002850 2924608 2919051 2947860 2877842
3423B877842L2490p2369N9178O523K323N894J6316L1276K3780J11110Q8079J06352
$$ 2877842 2910332 2837963 2897141 2903664 2905987 2911881 2928197 2959473 2983253 3094363 3182442 3288794
3411C288794N7501J44950K00216J33853R2780J87323J63955J19911K18011K58812
$$ 3288794 3346295 3491245 3691461 3825314 3918094 4105417 4269372 4389283 4607294 4866106
3401D866106K80764K98294K31755K69957K92027K08481K46883K91373L54506L38211
$$ 4866106 5146870 5445164 5676919 5946876 6238903 6447384 6694267 6985640 7340146 7678357
3391G678357L12719K93468K75865K15706K56951J36327P6435R0737J3783L3896
$$ 7678357 7991076 8284544 8560409 8776115 9033066 9169393 9245828 9336565 9350348 9384244
3381I384244k3807r5321M742K2569o8482P982r0160j71523j52269k14070k57027
$$ 9384244 9360437 9265116 9269858 9292427 9223945 9231927 9141767 8970244 8817975 8603905 8346878
3370H346878k85578k58221k63812k82495l35505k27894k41958k73122j63152l26508
$$ 8346878 8061300 7803079 7539267 7256772 6921267 6693373 6451415 6178293 6015141 5688633
3360E688633k76365k18665k48361k02803k42119j69135j55541r8880m8265P86
$$ 5688633 5412268 5193603 4945242 4742439 4500320 4331185 4175644 4076764 4028499 4029285
3350D029285N5465M6304J59717J12550P6359Q8187N164L9168J66617J49002J19258
$$ 4029285 4084750 4131054 4290771 4403321 4479680 4567867 4573031 4612199 4778816 4927818 5047076
3339E047076Q6243J75170J38828K00986J98053J35161P4897J87417J78152J01343
$$ 5047076 5133319 5308489 5447317 5648303 5846356 5981517 6056414 6243831 6421983 6523326
3329F523326n645l3315k6073m1409l8977r2353n7283j11713r0079j32540k35746
$$ 6523326 6517681 6484366 6458293 6416884 6377907 6285554 6228271 6116558 6026479 5893939 5658193
3318E658193j72759j27087j74842j61965j90690k00279k39084j81618j23295r4742
$$ 5658193 5485434 5358347 5183505 5021540 4830850 4630571 4391487 4209869 4086574 3991832
3308C991832j30477j88946k21874j72701j74878k38453j10862k21149j32332q5615
$$ 3991832 3861355 3672409 3450535 3277834 3102956 2864503 2753641 2532492 2400160 2314545
3298B314545n4957q2649m8256q968J6003L8807lk6620O977P515m0321l986l776
$$ 2314545 2259588 2176939 2128683 2119715 2135718 2174525 2174522 2147902 2154879 2162394 2122073 2118087 2114311
3285B114311k382m5849J7303P7058J7812j5214k9115q7061j17323r2953l9900
$$ 2114311 2111929 2066080 2083383 2160441 2178253 2163039 2133924 2046863 1929540 1836587 1796687
3274A796687r7623o7138l9113N6152P6403R691p764J394L0638l2909k8321K7304
$$ 1796687 1699064 1631926 1592813 1648965 1725368 1735059 1727295 1728689 1759327 1726418 1698097 1725401
3262A725401m861N994R7950J38830R1593o4292q0745m9766k6601Q976j8623N263
$$ 1725401 1720540 1726534 1824484 1963314 2054907 1990615 1909870 1860104 1833503 1842479 1823856 1829119
3250A829119M096O5658L6112j5225M0126M6010L1371r314k0831r5067k4830R7620
$$ 1829119 1833215 1898873 1934985 1919760 1959886 2005896 2037267 2027953 2007122 1912055 1887225 1984845
3238A984845P8115O5748J21786J81591J88935J19746L6931j01903j25130j24556
$$ 1984845 2062960 2128708 2250494 2432085 2621020 2740766 2777697 2675794 2550664 2426108
3228B426108j45634p5690j9513J0747j16134o1888j03728p1269j13698M2720j0735
$$ 2426108 2280474 2204784 2185271 2196018 2079884 2017996 1914268 1842999 1729301 1772021 1761286
3217A761286J5051j8048K3311J10349N1784P1425Q0386K3102P7893N0139K1912
$$ 1761286 1776337 1758289 1781600 1891949 1943733 2015158 2095544 2118646 2196539 2246678 2268590
3206B268590J23245K09675J04758Q5597m8184k40959k20557k04520j13226o7980
$$ 2268590 2391835 2601510 2706268 2791865 2743681 2502722 2282165 2077645 1964419 1896439
3196A896439q6310m4831K3422q0617q7532k6540j0302j38322r1512O7272L9410
$$ 1896439 1810129 1765298 1788720 1708103 1620571 1594031 1583729 1445407 1353895 1421167 1460577
3185A460577k3112m036K2694J995j686l0836p69J9467r992L1512j7837o4512p6654
$$ 1460577 1437465 1433429 1456123 1458118 1456432 1425596 1424827 1444294 1434302 1465814 1447977 1383465 1306811
3172A306811L0934n5970K6281j9735N4880Q1126k3934p184Q8642O7895k2577O6305
$$ 1306811 1337745 1281775 1308056 1288321 1343201 1424327 1400393 1393209 1481851 1549746 1527169 1593474
3160A593474P6962J37160P0309M1298r5055m6684R144j19264j16758o1024j6060
$$ 1593474 1670436 1807596 1877905 1919203 1824148 1777464 1786608 1667344 1550586 1489562 1473502
3149A473502p8842o1327q3134j2076K1499l7022k2532j5989Q987l457j1314J8154
$$ 1473502 1394660 1333333 1250199 1238123 1259622 1222600 1200068 1184079 1193066 1189609 1178295 1196449
3137A196449m7859M8323K3479m3570M7948J41885Q492Q4306R3440O1653l723q6300
$$ 1196449 1148590 1196913 1220392 1176822 1224770 1366655 1375147 1459453 1552893 1614546 1610823 1524523
3125A524523r3475j63516r9106j07762r9200r1300k3095m6690p5385p4692J8759
$$ 1524523 1431048 1267532 1168426 1060664 961464 870164 847069 800379 724994 650302 669061
3114F69061l826k5421J6505p96q0667M13J2239K2579j3659m2052L6641o2060R284
$$ 669061 665235 639814 656319 655523 574856 575269 587508 610087 596428 554376 591017 528957 538241
3101E38241K4659j3035q1609n3803K2192j637k3165q4217N7678j5332k5521n802
$$ 538241 562900 549865 468256 414453 436645 435008 411843 327626 385304 369972 344451 338649
3089C38649K7355k8142l2218k590j9185J5513l8216j8957o7155J4474O524P273
$$ 338649 366004 337862 305644 303054 283869 299382 261166 242209 175054 189528 196052 203325
3077B03325Q3841p281q0891N3560o117N579n5365J1516N9467L0314Q356p9707
$$ 203325 287166 279885 198994 252554 246437 252016 196651 208167 267634 297948 306304 226597
3065B26597j0976J3246N7937m3736j7841K9123m017j9121o7783q899J4638k5781
$$ 226597 215621 228867 286804 243068 225227 254350 250333 231212 163429 154530 169168 143387
3053A43387n818k3839M8580O306p2892l008K4498J8933l0374J230j0768M3751
$$ 143387 137569 113730 162310 168616 95724 92716 117214 136147 105773 107003 96235 139986
3041A39986p888L2074L0240N6995k0328k6288L6082q0338l7681p229M2799m3295
$$ 139986 132098 164172 194412 251407 231079 204791 240873 160535 122854 115625 158424 115129
3029A15129L1816P7025o9390k8735O998r372p8419J4512N0205J650n0947O7400
$$ 115129 146945 223970 154580 125845 132843 123471 45052 59564 109769 111419 60472 127872
3017A27872O0885l0403m4156r3313L0586M1299J0249L4080j2751M521j9501J2031
$$ 127872 188757 158354 114198 20885 51471 92770 103019 137099 124348 128869 109368 121399
3005A21399J7149k875M8829m643p9857k1943J5663m2424j5176O9874L3298K3193
$$ 121399 138548 135673 184502 179859 100002 78059 93722 51298 36122 105996 139294 162487
2993A62487j6467P5221L8827l8146L1721l9008k574N3183l6358l8990q761m781
$$ 162487 146020 221241 260068 221922 253643 214635 212061 265244 228886 189896 181135 176354
2981A76354P0876J3562l6580m4666O163j1179K4139k1429L9203m9616k0756l5487
$$ 176354 247230 260792 224212 179546 185709 174530 198669 177240 216443 166827 146071 110584
2969A10584J6157P206O547m752R1070j8252n033j8897k9826K0245K1895n784M2385
$$ 110584 126741 133947 140494 135742 226812 208560 203527 184630 154804 175049 196944 191160 233545
2956B33545M8630K3699n1725N9866K9493l2018k1740m20K6941J1880L9958K6888
$$ 233545 282175 305874 254149 314015 343508 311490 289750 289330 316271 328151 368109 394997
2944C94997k8352n8001M2007P6643j08680J8763J02298o2509k7755n6560l6189
$$ 394997 366645 308644 350651 427294 318614 337377 439675 377166 349411 292851 256662
2933B56662K220N4229o9898m5575J2250Q5834R0245l5624K384P1251o7741J8473
$$ 256662 258882 313111 243213 197638 209888 295722 385967 350343 352727 423978 356237 374710
2921C74710J9280l0365L5208N9814n7786k1176J3124m1631n663L3467j3057j2550
$$ 374710 393990 363625 398833 458647 400861 379685 392809 351178 345515 378982 365925 353375
2909C53375J3913M4456k4716j370k5654l2760m1684m1373n8695n6069N991j2492
$$ 353375 367288 411744 387028 385658 360004 327244 285560 244187 185492 129423 135414 122922
2897A22922o744M5410J1581L3627L4230J8541r2706k3386M9850K9402P1297K5694
$$ 122922 116178 161588 173169 206796 241026 259567 166861 143475 193325 222727 294024 319718
2885C19718j0163k3284k4046p598j02176M1995N033p326N1815k4265j3849l16
$$ 319718 309555 286271 262225 254627 152451 194446 199479 192153 243968 219703 205854 205538
2873B05538l1902j8248K6185N4786m9796J1842q1920J4999l5105n0177M2952k1152
$$ 205538 173636 155388 181573 236359 186563 198405 116485 131484 96379 46202 89154 68002
2861F8002j3855N634j522M5476J2196r7403L7573N0214R933r5191l6426N599M0502
$$ 68002 54147 59781 58259 103735 115931 18528 56101 106315 116248 21057 -15369 -9770 30732
2848C0732n6761L6814M0026m9053J2568J6498L5016j7812J7937k5297q2148R835
$$ 30732 -26029 10785 50811 1758 14326 30824 65840 48028 65965 40668 -41480 -31645
2836c1645m4865r06P4518J3235k2640k0287l0324M6441K9462L994m838m1027o5195
$$ -31645 -76510 -77416 -2898 10337 -12303 -32590 -62914 -16473 12989 16983 12145 -28882 -94077
2823i4077K3173M9672k3525m4168k1142k993K6686r613O342L7875K5605J7486
$$ -94077 -70904 -21232 -44757 -88925 -110067 -113060 -86374 -95987 -89645 -51770 -26165 -8679
2811h679R839n2099o0163j8351N6234m5010Q9103O404l5220K1464p0054O968K8690
$$ -8679 1160 -50939 -111102 -129453 -73219 -118229 -29126 -22722 -57942 -36478 -106532 -99564 -70874
2798g0874J6617L0979k1184l8188j4931L2777q547L648M0687q467k6512l6822
$$ -70874 -54257 -23278 -44462 -82650 -97581 -64804 -73351 -69703 -29016 -37483 -63995 -100817
2786a00817L6507k2915j1969J7118K4029J9775M3750o8517m058M2781k662m5862
$$ -100817 -64310 -87225 -99194 -82076 -58047 -38272 5478 -63039 -67097 -24316 -26978 -72840
2774g2840P15K3144j1836P799k1326K8315j7253n1462N2749K5361K0702L6308
$$ -72840 -72125 -48981 -60817 -53018 -74344 -46029 -63282 -114744 -61995 -36634 -15932 20376
2762B0376m7151P4820m7341l6426L9463O0525k6377j17307K5191k241j7297O2141
$$ 20376 -26775 48045 704 -35722 3741 64266 37889 -79418 -54227 -56468 -73765 -11624
2750a1624k0122n2339O6396l3639n6637J7077n932O2999k861l0805l4927j579
$$ -11624 -31746 -84085 -17689 -51328 -107965 -90888 -96820 -33821 -36682 -67487 -102414 -103993
2738a03993J9347m0256N8532L9358l3494O7936l4141l442l6654N3432k0811o0924
$$ -103993 -84646 -124902 -66370 -27012 -60506 7430 -26711 -30153 -66807 -13375 -34186 -95110
2726i5110J3087l3342j5796P85O1942N3750J0006j0101n340J2696j238o2590k4454
$$ -95110 -82023 -115365 -131161 -130376 -68434 -14684 -4678 -14779 -20119 -7423 -8661 -71251 -95705
2713i5705Q0083m2435n5099N6654J432J32941p3469o15j881l6174L7298J5145
$$ -95705 -15622 -58057 -113156 -56502 -55070 77871 4402 3787 1906 -34268 3030 18175
2701A8175L8545n673n0472l5864K1900l0094J1013j9227p8732N7439O8303n8228
$$ 18175 56720 51047 575 -35289 -13389 -43483 -32470 -51697 -130429 -72990 -4687 -62915
2689f2915J3547L8505m7192L9318j5224k7393K9972K6317J8122R2774o9844j9482
$$ -62915 -49368 -10863 -58055 -18737 -33961 -61354 -31382 -5065 13057 105831 35987 16505
2677A6505N8930N2032l645j2363J8957L6215q485m1912k9980l5560l8282m1605
$$ 16505 75435 127467 123822 111459 130416 166631 158146 116234 86254 50694 12412 -29193
2665b9193L0615M0580l4187j9714J098R299q575o5344M7150j2277j0286j7055
$$ -29193 1422 42002 7815 -11899 -10801 -1502 -10077 -75421 -28271 -40548 -50834 -67889
2653f7889o2295K4134N03M9981k8443R35K2757K01L0114k9618R55L3929J9016
$$ -67889 -130184 -106050 -105547 -55566 -84009 -83074 -60317 -60116 -30002 -59620 -58665 -24736 -5720
2640e720j7829J9561J1872N0011k2476n8794j8261K7900p2199l5265O754k2036
$$ -5720 -23549 -3988 7884 57895 35419 -23375 -41636 -13736 -85935 -121200 -114446 -136482
2628a36482L3432m816O966M8100L2598J3864j8601l4188p614J0181K1983m3225
$$ -136482 -103050 -107866 -100900 -52800 -20202 -6338 -24939 -59127 -66741 -56560 -34577 -77802
2616g7802N1463K9698o4640L0932m5973j6531N7396n7317L6156l798J3510j6644
$$ -77802 -26339 3359 -61281 -30349 -76322 -92853 -35457 -92774 -56618 -60416 -46906 -63550
2604f3550k8153N8331n583K1318L0602N5311J6242j9004p4464J391L899L9967
$$ -63550 -91703 -33372 -38955 -17637 12965 68276 84518 65514 -8950 -7559 -3660 36307
2592C6307l274M1845Q03l8857L9686P029j28o7294R167R6832p5208j07868P8585
$$ 36307 33033 74878 75681 36824 76510 83539 83411 16117 25284 122116 46908 -60960 17625
2579A7625J1908k4617m5021J1328K7535m6203K7418O5026k3331m2813L9999M164
$$ 17625 29533 4916 -40105 -28777 -1242 -47445 -20027 44999 21668 -21145 18854 23018
2567B3018l612j7868R650l9915M1273l6393M8571M9363O022l444o7074J6567J4602
$$ 23018 19406 1538 11188 -28727 12546 -23847 24724 74087 80109 76665 9591 26158 40760
2554D0760n5007k1558Q6448k4328k4233K9651n5433R706P3006J3290n6682q9727
$$ 40760 -14247 -35805 50643 26315 2082 31733 -23700 -13994 59012 72302 15620 -74107
2542g4107L4277N3694O5391O2483j24406n5892K8683M0806L0124l7551L05p633
$$ -74107 -39830 13864 79255 141738 17332 -38560 -9877 30929 61053 23502 23807 16174
2530A6174K6393J1375J9636n8733K3754N4456J5468j7401j2801J1534j9344J9346
$$ 16174 42567 53942 73578 14845 38599 93055 108523 91122 78321 89855 70511 89857
2518H9857J7512m8829k9744p351J8501N5705J3791k3973K2796L4667q215N756
$$ 89857 107369 58540 28796 21445 39946 95651 109442 85469 108265 142932 134717 140473
2506A40473j2284n3331n0280l7507J7681L2818m0293J16331K0689l6578J4790
$$ 140473 128189 74858 24578 -12929 4752 37570 -2723 113608 134297 97719 112509
2495A12509N098J9O7506M9764n1571j6510L4590N8274j5799L2121j078j8467r6816
$$ 112509 117607 117626 185132 234896 183325 166815 201405 259679 243880 276001 274923 256456 159640
2482A59640r520P8932l4245N1348P7757l001J1998k004o3598o8515P4912N5887
$$ 159640 150120 229052 194807 246155 323912 320911 332909 330905 267307 198792 273704 329591
2470C29591j22803L7971O7553m7917P6445j4578l8100J6287P9097J08471J5291
$$ 329591 206788 244759 312312 264395 340840 326262 288162 304449 383546 492017 507308
2459E07308j9911N3248j5263n4600J0353l3884M6956P0118P8632j7697k0434N0902
$$ 507308 487397 540645 525382 470782 481135 447251 494207 564325 642957 625260 604826 655728
2447F55728N5387J04759N9207o547L416Q8971N4545K6213O6198Q4665J0550N6084
$$ 655728 711115 815874 875081 868534 871950 960921 1015466 1041679 1107877 1192542 1203092 1259176
2435A259176j6828K0611O8620R6151P5059O8014K01461K03423J30022K68408M16608
$$ 1259176 1242348 1262959 1331579 1427730 1502789 1570803 1772264 1975687 2105709 2374117 2790725
2424B790725M32051M19567K34999O8372K33930L18560M47096N36849O32426J119818
$$ 2790725 3222776 3642343 3877342 3945714 4179644 4498204 4945300 5482149 6114575 7234393
2414G234393J542875K076945L113658M532822O183251Q242452O709745J220301
$$ 7234393 8777268 10854213 13967871 18500693 24683944 32926396 39636141 40856442
2406D0856442n416819p841846o279276m835389l393444k593949j862347j592016
$$ 40856442 35439623 27597777 21318501 16483112 13089668 10495719 8633372 7041356
2398G041356j191403q24300n33295m03109j66725j60025k37838l10807l57746
$$ 7041356 5849953 5025653 4492358 4089249 3922524 3762499 3524661 3213854 2856108
2389B856108k57344k94848k55988j93085j33058j65013l8419j59181o8512k1509
$$ 2856108 2598764 2303916 2047928 1854843 1721785 1556772 1518353 1359172 1290660 1269151
2379A269151m7953p4527m8693k3465j20767m6552R168k4427m5451k9348l040Q023
$$ 1269151 1221198 1146671 1097978 1074513 953746 907194 916362 891935 846484 817136 814096 822119
2367H22119n3409n7528n2502m2572M351q016l483o2312l6492l0225m2449L0886
$$ 822119 768710 711182 658680 616108 620459 612443 608960 546648 510156 479931 437482 468368
2355D68368J5581l2503p08j0363n7559k1O093J8189j4109N6162l6989p0534J8571
$$ 468368 483949 451446 450738 440375 382816 382795 388888 407077 392968 449130 412141 341607 360178
2342C60178l0635n9749K7782l2401q3024k9159L475r85J015J7134K5779Q305k4398
$$ 360178 329543 269794 297576 265175 182151 152992 156467 155482 156497 173631 199410 207715 183317
2329A83317Q952M8185P0627o0868p3270m0803L8885k4390j0911j8334Q9603j2619
$$ 183317 192269 240454 311081 250213 176943 136140 175025 150635 139724 121390 210993 198374
2317A98374j8167K0431j2246o8085K0203L7357r9709Q9139J1242J9003k4628J5473
$$ 198374 180207 200638 188392 120307 140510 177867 78158 167297 178539 197542 172914 188387
2305A88387p6176k5868K8218N844m4719k1554M2105k1800n1494k9962K4483J7961
$$ 188387 112211 86343 114561 120405 75686 54132 96237 74437 22943 -7019 17464 35425
2293C5425j401k5260M5415L4034M590l6035J3223n232l2856K5792M4995J0936
$$ 35425 34024 8764 54179 88213 92803 56768 69991 64759 31903 57695 102690 113626
2281A13626j5232j7136j5485n9855J9379L377k1647N5311P087p493l6761O4102
$$ 113626 98394 81258 65773 5918 25297 28674 7027 62338 69425 61932 25171 89273
2269H9273l7488l1636J3693Q223n965n5369R236m8279j41R440P7265Q471M0356
$$ 89273 51785 20149 33842 42065 36100 -19269 -10033 -58312 -58453 -49013 28252 36723 77079
2256G7079p2749o04n753P9265Q992j08488O8989J5589k0667q2244N1430K4405
$$ 77079 4330 3726 -2027 77238 86230 -22258 46731 62320 41653 -40591 10839 35244
2244C5244M7618l5633N073n7716k5533J4119l8765j0311r979L9702k7670K9437
$$ 35244 82862 47229 52302 -5414 -30947 -16828 -55593 -65904 -75883 -36181 -63851 -34414
2232c4414k356J1215L351n1554m9397j2260J21881K5790n9036l4604J0224j4466
$$ -34414 -36770 -25555 -22204 -73758 -123155 -135415 -13534 12256 -46780 -81384 -71160 -85626
2220h5626r833j259n646O994k2793L6859M690L3258j6698J293M2664m7933m8438
$$ -85626 -95459 -96718 -102364 -95370 -118163 -81304 -76614 -43356 -60054 -58761 -16097 -64030 -112468
2207a12468J1222P6616K3173R633m2939k3726K5177j934J5289M2590k2473j01433
$$ -112468 -101246 -24630 -1457 8176 -34763 -58489 -33312 -35246 -19957 22633 160 -101273
2195a01273J6761M0471R3596k0485m5760M5263J713k538M6164J435q9168M617
$$ -101273 -84512 -44041 49555 29070 -16690 28573 30286 27748 73912 75347 -13821 -9204
2183i204k6704o407k8487L1739O333o762k5711L9106q127k8854J7411n0580l889
$$ -9204 -35908 -42315 -70802 -39063 -32730 -39492 -65203 -26097 -34224 -63078 -45667 -96247 -100136
2170a00136K9152j9623J0459L6012j9868j1856q218k658m6466M0434p298M9685
$$ -100136 -70984 -90607 -80148 -44136 -64004 -75860 -84078 -86736 -133202 -92768 -100066 -50381
2158e0381m3111l1303J4481k2751Q3448M1675K8770J6647o5616L5274J4678q703
$$ -50381 -93492 -124795 -110314 -133065 -49617 -7942 20828 37475 -28141 7133 21811 13108
2146A3108m9019K7175M0264j2592K9265P765o882K4422L1591m9039m1448m8934
$$ 13108 -35911 -8736 31528 18936 48201 55966 49084 73506 105097 56058 14610 -34324
2134c4324L7008p1083j1679K5556K4336K9197R366j9291l101K2029O124j03303
$$ -34324 2684 -68399 -80078 -54522 -30186 -989 8377 -10914 -14015 8014 14138 -89165
2122h9165j6299j3615k0561N609O6947K6323J6456k8853K7037k3976l3965L2817
$$ -89165 -105464 -119079 -139640 -134031 -67084 -40761 -24305 -53158 -26121 -50097 -84062 -51245
2110e1245L4959L3381m4281K8727l9636K6501j0634r91l1535M7913K4442m5584
$$ -51245 -16286 17095 -27186 1541 -38095 -11594 -22228 -23219 -54754 -6841 17601 -27983
2098b7983l6503K5092k3231J1770O9829O1136o1048j8527O1197k4742p6437L6146
$$ -27983 -64486 -39394 -62625 -50855 18974 80110 19062 535 61732 36990 -39447 -3301
2086c301N326m3212K8496N7579m3027l4564l0391n116L3337k0366Q853k2919O630
$$ -3301 2025 -41187 -12691 44888 1861 -32703 -63094 -68210 -34873 -55239 -46386 -69305 -62675
2073f2675L7333k3458n6861N012K8514P2605k6542r1870Q794Q6224j4954r521
$$ -62675 -25342 -48800 -105661 -100649 -72135 470 -26072 -117942 -109148 -22924 -37878 -47399
2061d7399O2172M8318k4947m4484q688q1243K1092N2504M162l099q3218j974M1631
$$ -47399 14773 63091 38144 -6340 -15028 -96271 -75179 -22675 -18513 -21612 -104830 -106804 -65173
2048f5173P8816m6721M2631K2934m6002m8767L3715P9368k8283k0716j6603p0050
$$ -65173 13643 -33078 9553 32487 -13515 -62282 -28567 50801 22518 1802 -14801 -84851
2036h4851k954N2158m5430N2765k6759m5722k8753Q5873M0330k0384j6982l3871
$$ -84851 -87805 -35647 -81077 -28312 -55071 -100793 -129546 -43673 -3343 -23727 -40709 -74580
2024g4580q539L3696k7418M6491k5083k5084M195j3120n542O6119J7440m8339
$$ -74580 -83119 -49423 -76841 -30350 -55433 -80517 -76322 -89442 -94984 -28865 -11425 -59764
2012e9764J4284J7094K6425n391J7965j7888o0306k4514J4008M3970N771n6463
$$ -59764 -45480 -28386 -1961 -7352 10613 -7275 -67581 -92095 -78087 -34117 -28346 -84809
2000h4809j4651L6799N1547k8393q1229L3604N3594n0550L5425k8736J3356L806
$$ -84809 -99460 -62661 -11114 -39507 -120736 -87132 -33538 -84088 -48663 -77399 -64043 -60237
1988f0237k1121j6119Q627M5963L6789l0278l2672q6302M4626N1697J0860N36
$$ -60237 -81358 -97477 -88850 -42887 -6098 -36376 -69048 -155350 -110724 -59027 -48167 -47631
1976d7631Q836m3406k3646J088M1555j019k5003L5466O8532n6721m2538M3781
$$ -47631 -38795 -82201 -105847 -104759 -63204 -64223 -89226 -53760 14772 -41949 -84487 -40706
1964d0706N192k1248j9916K9049j8272L874P736R974M6332O2009k5458n5961k6625
$$ -40706 -35514 -56762 -76678 -47629 -65901 -62027 -54291 -44317 2015 64024 38566 -17395 -44020
1951d4020L3303M2602r594p9870M932L7870k6796j3846K8773o4982k899M1890
$$ -44020 -10717 31885 22291 -57579 -52647 -14777 -41573 -55419 -26646 -91628 -94527 -52637
1939e2637m063L3370L287j7953k1781N1844K4883K3011j1206K3777K4204j18316
$$ -52637 -56700 -23330 -20043 -37996 -59777 -7933 16950 39961 28755 52532 76736 -41580
1927d1580o0011P104P4861p660K3011J9325l4334k5216l3869L7856L157o8911
$$ -41580 -101591 -94487 -19626 -27286 -4275 15050 -19284 -44500 -78369 -40513 -37356 -106267
1915a06267J319k5550J3741K8139m5828L5435J08057m2149j5228r26j4821p581
$$ -106267 -104948 -130498 -116757 -88618 -134446 -99011 9046 -33103 -48331 -49257 -64078 -71659
1903g1659K9319R408P15M133n7875M5301N7003J062r705K8190J6581k469M1238
$$ -71659 -42340 -32932 -32217 -28084 -85959 -40658 16345 17407 7702 35892 52473 50004 91242
1890I1242J095q5839k3716K8758k2949K3897l3769j02198r605L9819O6576l7819
$$ 91242 92337 6498 -17218 11540 -11409 12488 -21281 -123479 -133084 -93265 -26689 -64508
1878f4508k9109N1913j342N5496O4468j3023l6251p7805o2675M8372O0965l1420
$$ -64508 -93617 -41704 -43046 12450 76918 63895 27644 -50161 -112836 -64464 -3499 -34919
1866c4919m0931L2137j4082R569K6281M5563J9065j0627K711m356O086k1404L2746
$$ -34919 -75850 -43713 -57795 -48226 -21945 23618 42683 32056 34767 30411 36497 15093 47839
1853D7839J650k5337n0143K1187k2920K1775k0707m443N0108m4912Q348K5075
$$ 47839 49489 24152 -25991 -4804 -27724 -5949 -26656 -31099 19009 -25903 -17555 7520
1841G520n1802m1304L6831o940k0839J8805K3889k3744l5605r308K7584P8727
$$ 7520 -44282 -85586 -48755 -55695 -76534 -57729 -33840 -57584 -93189 -102497 -74913 3814
1829C814O45m5182m9654k5304k6799N1545Q1444j4203J6700L8814p6263m2310
$$ 3814 4459 -40723 -90377 -115681 -142480 -90935 -9491 -23694 -6994 31820 -44443 -86753
1817h6753M2302k2040O0203K5982k9949K6832r4817N3634L0495m673J4132k0602
$$ -86753 -44451 -66491 -6288 19694 -10255 16577 -78240 -24606 5889 1216 15348 -5254
1805e254l0181J9230J4839p4746j0230O1373P1431p116l8872l4661M7752K2676
$$ -5254 -35435 -16205 -1366 -76112 -86342 -24969 46462 39346 474 -34187 13565 36241
1793C6241l1089l725K6117m7044j7707k3153J1910M5086K8622r182l2221O0935
$$ 36241 5152 1427 27544 -19500 -37207 -60360 -48450 -3364 25258 16076 -16145 44790
1781D4790M770n8674n1470M9391O114k1757J7840p831Q663k5520K0532j8233O0066
$$ 44790 49560 -9114 -60584 -11193 -5079 -26836 -8996 -16827 -8164 -33684 -13152 -31385 28681
1768B8681j0383j997j9885j3429k3860J6247n0601l1113j5300J9809L3816m592
$$ 28681 18298 16301 -3584 -17013 -40873 -24626 -75227 -106340 -121640 -101831 -68015 -72607
1756g2607J6609r7292Q706J18248k2524M3598j7310j7176N1701O328K6136o7049
$$ -72607 -55998 -153290 -144584 -26336 -48860 -5262 -22572 -39748 11953 18281 44417 -22632
1744b2632q959m2084k3719J1524m196M1018L9490k4688O756j9098O8520j1620
$$ -22632 -31591 -73675 -97394 -85870 -90066 -49048 -9558 -34246 -27490 -46588 21932 10312
1732A0312l1790o0437M9019K1540q625M5575K2071m7528o3797Q9311l9599k2974
$$ 10312 -21478 -81915 -32896 -11356 -19981 25594 47665 137 -63660 25651 -13948 -36922
1720c6922R070J3215M8268L728k9262j8418L1521J5520k2433N620n9541P5391
$$ -36922 -27852 -14637 33631 37359 8097 -10321 21200 36720 14287 19907 -39634 35757
1708C5757k460q6239M5503K4080m3607n5818J31156k9756p1737L2906o619J4639
$$ 35757 33297 -52942 -7439 16641 -26966 -82784 48372 18616 -53121 -20215 -26834 -12195
1696a2195k1729n5773K5122O4412L9193J6155n8434l3075K1676J4008n363k6993
$$ -12195 -33924 -89697 -64575 -163 39030 55185 -3249 -36324 -14648 -640 -6003 -32996
1684c2996O3556j0308k4611K8807l7666m0777L546M2583M241m0447j0380O895
$$ -32996 30560 20252 -4359 24448 -13218 -53995 -50449 -7866 -3625 -44072 -54452 -47557
1672d7557L6864l7762J4975l7217K5855k8154J8764Q9904l9908j4908K3865j3233
$$ -47557 -10693 -48455 -33480 -70697 -44842 -72996 -54232 35672 -4236 -19144 4721 -8512
1660h512k8470m535j0032K470k5464K2383L1479J6667r453k2312M8145R0290r9030
$$ -8512 -36982 -41517 -51549 -49079 -74543 -52160 -20681 -4014 -13467 -35779 12366 102656 3626
1647C626j9606o0779k9088L2642J3500O4756n266n0223L4179K1788r5860K3833
$$ 3626 -15980 -76759 -105847 -73205 -59705 5051 -215 -50438 -16259 5529 -90331 -66498
1635f6498P3251l9394m762n4329J03506K3936o3996R2204m3694j3594r420K7577
$$ -66498 6753 -32641 -37403 -91732 11774 35710 -28286 63918 20224 6630 -2790 24787
1623B4787J3942n8472o3141K7579L2971n122J6655O276J0932m7299J7322R820
$$ 24787 38729 -19743 -82884 -55305 -22334 -27456 -10801 -4525 6407 -40892 -23570 -13750
1611a3750k9022m9073N8935k9309n527O5623J1569K5664r9607m8551j8548O4923
$$ -13750 -42772 -91845 -32910 -62219 -67746 -2123 9446 35110 -64497 -113048 -131596 -66673
1599f6673J4754l7625J1583J3438K9014j2273N627P3110M636q584j7220K7645
$$ -66673 -51919 -89544 -77961 -64523 -35509 -47782 -42155 30955 35591 27007 9787 37432
1587C7432p4128o5485M559j7587N0775Q2848l3583m326J7161k8235P620Q918O3428
$$ 37432 -36696 -102181 -97622 -115209 -64434 18414 -15169 -19495 -2334 -30569 -22949 -14031 49397
1574D9397J1929k3235R633J166j06876n888M1342M6975J6318j5837K8955l9392
$$ 49397 61326 38091 47724 48890 -57986 -63874 -22532 24443 40761 24924 53879 14487
1562A4487m4072k1568J0377k436n36J6538Q482j2490K3263K5691q9833J3925N8886
$$ 14487 -29585 -51153 -40776 -43212 -43748 -27210 -18728 -31218 -7955 17736 -72097 -58172 714
1549G14k9785P408L2378j9612p797q4300r424J7398M8258k4563j2112K2472N5583
$$ 714 -29071 -21663 10715 -8897 -16694 -100994 -110418 -93020 -44762 -69325 -81437 -58965 -3382
1536c382J5238M958l3752L5328j7463N391l2804j5665q272K4481L168j780P6503
$$ -3382 11856 16814 -16938 18390 927 6318 -26486 -42151 -50423 -25942 -22774 -24554 51949
1523E1949K7507j6771m9356P0841n1294m4239J0736j5003K9516M4164j1501p814
$$ 51949 79456 62685 13329 84170 32876 -11363 -627 -15630 13886 58050 46549 38735
1511C8735n0484n4906k490O4290k2369j4814M3060J9659n1210k1541K7883K2556
$$ 38735 -11749 -66655 -69145 -4855 -27224 -42038 1022 20681 -30529 -52070 -24187 -1631
1499a631o3334K3937k2541j0083P6407j5539r793j8810l1332P2720O6999l2918
$$ -1631 -64965 -41028 -63569 -73652 2755 -12784 -22577 -41387 -72719 1 67000 34082
1487C4082n4478K9962L8077j9706J3971o0467o3015L8439P370N532m5922P991
$$ 34082 -20396 9566 47643 27937 41908 -18559 -81574 -43135 -35765 -30233 -76155 -68164
1475f8164M220M6415K8089j2380m377N9143j5171k8471j7589N3183k4945l1940
$$ -68164 -63944 -17529 10560 -1820 -6197 52946 37775 9304 -8285 44898 19953 -11987
1463a1987P412l4144j6202M5935J1420L3070m885J9331J4333q7043K2698J2773
$$ -11987 -4575 -38719 -54921 -8986 2434 35504 30619 49950 64283 -22760 -62 12711
1451A2711p2489K4206L0405n470K3859K762j2890J207K9949j16765M4471Q4815
$$ 12711 -59778 -35572 -5167 -10637 13222 15984 3094 4301 34250 -82515 -38044 46771
1439D6771O276j09498j5924L9962j4625O895O3932K4339J0847r513k9698k1017
$$ 46771 53047 -56451 -72375 -32413 -47038 -40143 23789 48128 58975 49462 19764 -1253
1427a253l7774k3007k0144K5102P3628N8250n8261M434j4137k409k7247J7100
$$ -1253 -39027 -62034 -82178 -57076 16552 74802 16541 20975 6838 4429 -22818 -5718
1415e718M4559p5994L2995K6808m1074M295K608K168k1855L2662K6711n387k784
$$ -5718 38841 -37153 -4158 22650 -18424 -14129 -11521 -9353 -31208 1454 28165 22778 19994
1402A9994m4605j4728L9125L3213o0485k2980l7467O0656N7815o9698l0818M6156
$$ 19994 -24611 -39339 -214 32999 -27486 -50466 -87933 -27277 30538 -39160 -69978 -23822
1390b3822j0638J8835M9417J9037N183m8888P796l9813n2188Q0264k3122k6880
$$ -23822 -34460 -15625 33792 52829 58012 9124 16920 -22893 -75081 5183 -17939 -44819
1378d4819P8071j306j4672j6459n9487L7784K8715L9146m3288K4741k4861m5444
$$ -44819 33252 31946 17274 815 -58672 -20888 7827 46973 3685 28426 3565 -41879
1366d1879q374M8432k2950J0920k034L6618R5700o1986P558j8615n7554m3388
$$ -41879 -50253 -1821 -24771 -13851 -15885 20733 116433 54447 62005 43390 -14164 -57552
1354e7552O350J2653M3841P8041m3897o7201R11j4062q805M4639n477j5825l2960
$$ -57552 -51202 -38549 5292 83333 39436 -27765 -26854 -40916 -49721 -5082 -10559 -26384 -59344
1341e9344O0486K6898m8974K0155L9700l9962K1367m8913K0176J4528l5115j6659
$$ -59344 1142 28040 -20934 -779 38921 -1041 20326 -28587 -8411 6117 -28998 -45657
1329d5657n067J6650p5095O0480O5508J251Q33K5834m3283J3790k6053L6471k5374
$$ -45657 -50724 -34074 -109169 -48689 16819 18070 18903 44737 1454 15244 -10809 25662 288
1316B88L338n6652n197M1748L6623o085K6899j10445M6169M2881K8613J5512J5190
$$ 288 3626 -53026 -58223 -16475 20148 14063 40962 -69483 -23314 19567 48180 63692 78882
1303G8882J5926O3995o1826r8622M0305o8625j4522K9902l8408P9242M1437n153
$$ 78882 94808 158803 96977 -1645 38660 -29965 -44487 -14585 -52993 26249 67686 62533
1291F2533r340l9560M9711J8019K2710m6639J2113j3451N0058m709k3463r8480
$$ 62533 53193 13633 63344 81363 104073 57434 69547 56096 106154 101445 77982 -20498
1279b0498M995R952k5850k980L4106K7792K4292J1374J7831m9747o4693K9677
$$ -20498 -15503 -5551 -31401 -34381 -275 27517 51809 63183 81014 31267 -33426 -3749
1267c749K8586J8324N5803m8656o8130p455k1942Q876j9343M3672L0347k8612
$$ -3749 24837 43161 98964 50308 -17822 -25277 -47219 -38343 -57686 -14014 16333 -12279
1255a2279L9837k974j2563l0010J630K4664N1163L9815l8065p4673o1864M6026
$$ -12279 27558 24584 12021 -17989 -16359 8305 59468 99283 61218 -13455 -75319 -29293
1243b9293j2924K9741K6729q7k2872m216L3575K3068p6966m048K3859j7553l039
$$ -29293 -42217 -12476 14253 14166 -8706 -12922 20653 43721 -33245 -37293 -13434 -30987 -34026
1230c4026l495N2898o810K5619k1096m4944Q376L997j3398J2994N6376l2568q1036
$$ -34026 -37521 15377 8567 34186 13090 -31854 -23478 -19481 -32879 -19885 36491 3923 -77113
1217g7113M967O9189J4348j1523L524J2934O267L7018Q023L137K051p9123L1626
$$ -77113 -72146 -2957 11391 -132 3392 16326 22593 59611 67634 70771 72822 -6301 25325
1204B5325j8159K2731k7693k9675L1084J2159k3895m823m2680n0328K5417K3278
$$ 25325 7166 29897 2204 -27471 3613 15772 -8123 -12946 -55626 -105954 -80537 -57259
1192e7259O7365o7732j4364P3427l6284N1896O1180m9677k3987k1749L0442K455
$$ -57259 10106 -57626 -71990 1437 -34847 17049 78229 28552 4565 -17184 13258 15713
1180A5713n0587j7879L8512l0646j4171K5772L3136m9762k3059J00473K5763j0056
$$ 15713 -34874 -52753 -14241 -44887 -59058 -33286 -150 -49912 -72971 27502 53265 43209
1168D3209k1119l3400M7909n0221n8101Q549L8527M5765n226n3263M8186M5716
$$ 43209 22090 -11310 36599 -13622 -71723 -63174 -24647 21118 15892 -37371 10815 56531
1156E6531J8309k5878l8903N1965J7470l7868l1253K273l3513p0644N6356N2731
$$ 56531 74840 48962 10059 62024 79494 41626 10373 12646 -20867 -91511 -35155 17576
1144A7576k1320k4976L0778P5909J6078l0413j0901k5613n9512O146n641l9911
$$ 17576 -3744 -28720 2058 77967 94045 63632 52731 27118 -32394 -26248 -31889 -71800
1132g1800K244N1926K5832M4422N5655k2101q507p1164l291L8405J3277O46q759
$$ -71800 -69556 -17630 8202 52624 108279 86178 77671 6507 3216 41621 54898 55544 46785
1119D6785k0170J3164K2856n8285l5431q4491Q1224J6276n771p535R063n315O80
$$ 46785 26615 39779 62635 4350 -31081 -115572 -34348 -18072 -23843 -31378 -22315 -27630 -26950
1106b6950Q154k9450K5737R0802n480l2439L556M1441n3906j1299m8719K254N068
$$ -26950 -18796 -48246 -22509 68293 62813 30374 33930 75371 21465 10166 -38553 -36299 -31231
1093c1231p25P361j3358L0246J6210k6385O198P042J6164j8516n4857k3614N6338
$$ -31231 -31956 -24595 -37953 -7707 8503 -17882 -11684 -4642 11522 -6994 -61851 -85465 -29127
1080b9127L4577J8030P249n8673L5587l8189k5679K8807m4942j3980J47751O8375
$$ -29127 5450 23480 30729 -27944 7643 -30546 -56225 -27418 -72360 -86340 61411 129786
1068A29786m3389q8350m0259O044J4732L7611J5833m1058m6157j6975K5847R8621
$$ 129786 86397 -1953 -42212 -36168 -21436 16175 32008 -9050 -55207 -72182 -46335 52286
1056E2286K6114n605n9869o0963O1864k135m4741K3652J6934n2037l0907p0067
$$ 52286 78400 72795 12926 -48037 13827 11692 -33049 -9397 7537 -44500 -75407 -145474
1044a45474L9938N2023k4976o143J03867l1191L304O9692l132K8419o3678k8490
$$ -145474 -105536 -53513 -78489 -84632 19235 -11956 -8652 61040 57908 86327 22649 -5841
1032e841O5851m717p842j8180l8581j6101L8644J4873l2277k6217m0593M0646
$$ -5841 60010 55293 47451 29271 -9310 -25411 13233 28106 -4171 -30388 -70981 -30335
1020c0335L1702l9721j5596R953M1445m0775L1775N3784p8260p3108J4946R2650
$$ -30335 1367 -38354 -53950 -43997 -2552 -43327 -11552 42232 -36028 -109136 -94190 -1540
1008a540R7524k2289k5664k7440r490j3171L9349n9432j125L0517L0205J8128
$$ -1540 95984 73695 48031 20591 11101 -2070 37279 -22153 -23278 7239 37444 55572
996E5572K909Q25m8208o9293K3270J9495J0815Q9017j9230k1074j6300j3359j2896
$$ 55572 58481 59306 11098 -58195 -34925 -15430 -4615 84402 65172 44098 27798 14439 1543
983A543N702K724K3850l5795k0592n2615K88k0771r168O2380L5884k9167m2442
$$ 1543 7245 9969 33819 -1976 -22568 -75183 -74895 -95666 -104834 -42454 -6570 -35737 -78179
970g8179L2125P2349K4320k9112q424R945m434p082j8310j9440K3374L4714N3114
$$ -78179 -46054 26295 50615 21503 13079 23024 18590 11508 -6802 -26242 -2868 31846 84960
957H4960j7709l8851l1467M1255Q584K8380L7876m5723m4604l7015L9654L4788
$$ 84960 67251 28400 -3067 38188 46772 75152 113028 67305 22701 -14314 25340 60128
945F0128l6994k1364L0998j634k1957L3005j489j7969Q7208K6973m3168m6009
$$ 60128 23134 1770 32768 31134 9177 42182 40693 22724 109932 136905 93737 47728
933D7728N010O6296k3115m2698J7761k4499m4134J0377L4032k2553R605k7034
$$ 47728 52738 119034 95919 53221 70982 46483 2349 12726 46758 24205 33810 6776
921F776j3270N2049r622n3087K7918J4014L5668q6314L8676k7987O0210k0694
$$ 6776 -6494 45555 35933 -17154 10764 24778 60446 -25868 12808 -15179 45031 24337
909B4337o232m3952P305O9733q759k254j5165m6536k394M3166K740p544n1951
$$ 24337 18105 -25847 -18542 51191 42432 40178 25013 -21523 -23917 19249 21989 14445 -37506
896c7506N0684K1291j5423L6731m9590O8976N4798j4361R648l5644l3899j0274
$$ -37506 13178 34469 19046 55777 6187 75163 129961 115600 125248 89604 55705 45431
884D5431n8656l5682N4401k7437k5506j7039j1398L7122N3231k4034N2218n0887
$$ 45431 -13225 -48907 5494 -21943 -47449 -64488 -75886 -38764 14467 -9567 42651 -8236
872h236K3936N3184l9755m2593M2966J5091J5714n0109R013m5123N2644J679o2731
$$ -8236 15700 68884 29129 -13464 29502 44593 60307 10198 19211 -25912 26732 28411 -34320
859c4320J1785P4619K5404n3433j9659J6293J8383j6623k9584k7934M3694M9153
$$ -34320 -22535 52084 77488 24055 4396 20689 39072 22449 -7135 -35069 8625 57778
847E7778O482q311L0353m4227J2179m4501l8530l202l9559P2843K3600K0734n3922
$$ 57778 64260 55949 86302 42075 54254 9753 -28777 -31979 -71538 1305 24905 45639 -8283
834h283J7939l731P5808O0811p2749n467n5575J8132Q4733k6150j4718N1353k6022
$$ -8283 9656 5925 81733 142544 69795 64328 8753 26885 111618 85468 70750 122103 96081
821I6081r8478O0007K5381n0742r514n5717L7106L1895l6912L591m719J9507o0178
$$ 96081 -2397 57610 82991 32249 22735 -32982 4124 36019 -893 2698 -2021 17486 -42692
$$ [...]
##END NTUPLES=NMR SPECTRUM
##END=
