##TITLE=1H_CA-9426
 200.13MHz,DMSO-d6.
 8 sc
 
 19.2.2026
##JCAMPDX= 6.0         $$ Bruker NMR JCAMP-DX V2.0
##DATA TYPE= NMR SPECTRUM
##DATA CLASS= NTUPLES
##ORIGIN= UXNMR, Bruker Analytische Messtechnik GmbH
##OWNER= pz
$$ XWIN-NMR		Version 3.5
$$ Thu Feb 19 15:53:52 2026 Russian Standard Time (UT+4h)  she@DPX200
##.OBSERVE FREQUENCY= 200.1313
##.OBSERVE NUCLEUS= ^1H
##.ACQUISITION MODE= SIMULTANEOUS
##.ACQUISITION SCHEME= undefined
##.AVERAGES= 8
##.DIGITISER RES= 18
##SPECTROMETER/DATA SYSTEM= spect
##.PULSE SEQUENCE= zg30
##.SOLVENT NAME= DMSO
##.SHIFT REFERENCE= (INTERNAL, DMSO, 0, 15.3062)
##AUDIT TRAIL= $$ (NUMBER, WHEN, WHO, WHERE, WHAT)
$$ ##TITLE= Audit trail, XWIN-NMR		Version 3.5
$$ ##JCAMPDX= 5.01
$$ ##ORIGIN= Bruker BioSpin GmbH
$$ ##OWNER= she
$$ F:/spectra/data/she/nmr/H-C/1/pdata/1/auditp.txt
$$ ##AUDIT TRAIL=  $$ (NUMBER, WHEN, WHO, WHERE, WHAT)
(   1,<2026-02-19 15:52:34.87 +0400>,<she>,<DPX200>,
      <created by zg, POWCHK disabled, PULCHK disabled
       configuration hash MD5:
       00 E9 B6 7A A2 85 ED C7 34 08 36 98 17 FE 4E 26
       data hash MD5: 16K
       6F D5 21 27 F7 CF 7E 76 70 0D B0 9D A4 1B 3D EA>)
(   2,<2026-02-19 15:52:37.59 +0400>,<she>,<DPX200>,
      <Start of raw data processing
       efp BC_mod = 2 LB = 0.25 FT_mod = 6 PKNL = 1 PHC0 = -3700.31 PHC1 = 8.792321 SI = 16K 
       data hash MD5: 16K
       9E 0C F2 DC 5D 09 E5 5C 23 DD F9 E0 79 65 9C 13>)
(   3,<2026-02-19 15:52:57.57 +0400>,<she>,<DPX200>,
      <pk PHC0 = 1.254056 PHC1 = -2.6 
       data hash MD5: 16K
       F2 B2 80 8B C3 45 F6 95 8D 73 5A 55 27 E1 C0 F4>)
(   4,<2026-02-19 15:53:02.71 +0400>,<she>,<DPX200>,
      <abs ABSG = 5 
       data hash MD5: 16K
       64 5D 94 6C 93 B4 DC E0 50 1D FD 29 E0 16 F3 9E>)
$$ ##END=
$$ 
$$ hash MD5
$$ 78 04 D3 D8 3D D8 38 31 A3 44 CD A3 8E 9B 71 53
##$RELAX= 
##$RELAX= 
##$RELAX= 
##$RELAX= 
##$RELAX= 
##$RELAX= 
$$ Bruker specific parameters
$$ --------------------------
##$DU= <F:/spectra>
##$EXPNO= 1
##$NAME= <H-C>
##$PROCNO= 1
##$TYPE= <nmr>
##$USER= <she>
##$AMP= (0..31)
100 100 100 100 100 100 100 100 100 100 100 100 100 100 100 100 100 100 
100 100 100 100 100 100 100 100 100 100 100 100 100 100 
##$AQSEQ= 0
##$AQ_mod= 1
##$AUNM= <au_zg>
##$AUTOPOS= <>
##$BF1= 200.13
##$BF2= 200.13
##$BF3= 200.13
##$BF4= 200.13
##$BF5= 200.13
##$BF6= 200.13
##$BF7= 200.13
##$BF8= 200.13
##$BYTORDA= 1
##$CFDGTYP= 0
##$CFRGTYP= 5
##$CHEMSTR= <none>
##$CNST= (0..31)
1 1 145 1 1 1 1 1 1 1 1 1 1 1 1 1 1 1 1 1 1 1 1 1 1 1 1 1 1 1 1 1 
##$CPDPRG= <>
##$CPDPRG1= <>
##$CPDPRG2= <>
##$CPDPRG3= <>
##$CPDPRG4= <mlev>
##$CPDPRG5= <mlev>
##$CPDPRG6= <mlev>
##$CPDPRG7= <mlev>
##$CPDPRG8= <mlev>
##$CPDPRGB= <>
##$CPDPRGT= <>
##$D= (0..31)
0 0.7 0 0 0 0 0 0 0 0 0 0.03 0 0 0 0 0 0 0 0 0 0 0 0 0 0 0 0 0 0 0 0 
##$DATE= 1771501954
##$DBL= (0..7)
120 120 120 120 120 120 120 120 
##$DBP= (0..7)
150 150 150 150 150 150 150 150 
##$DBP07= 0
##$DBPNAM0= <>
##$DBPNAM1= <>
##$DBPNAM2= <>
##$DBPNAM3= <>
##$DBPNAM4= <>
##$DBPNAM5= <>
$$ [...]
##$SUBNAM3= <"">
##$SUBNAM4= <"">
##$SUBNAM5= <"">
##$SUBNAM6= <"">
##$SUBNAM7= <"">
##$SUBNAM8= <"">
##$SUBNAM9= <"">
##$SW= 18.0517328524113
##$SWIBOX= (0..15)
0 0 2 0 0 0 0 0 0 0 0 0 0 0 0 0 
##$SW_h= 3612.71676300578
##$TD= 16384
##$TD0= 1
##$TE= 0
##$TE2= 300
##$TE3= 300
##$TEG= 300
##$TL= (0..7)
0 120 120 120 120 120 120 120 
##$TP= (0..7)
150 150 150 150 150 150 150 150 
##$TP07= 0
##$TPNAME0= <>
##$TPNAME1= <>
##$TPNAME2= <>
##$TPNAME3= <>
##$TPNAME4= <>
##$TPNAME5= <>
##$TPNAME6= <>
##$TPNAME7= <>
##$TPOAL= (0..7)
0.5 0.5 0.5 0.5 0.5 0.5 0.5 0.5 
##$TPOFFS= (0..7)
0 0 0 0 0 0 0 0 
##$TUNHIN= 0
##$TUNHOUT= 0
##$TUNXOUT= 0
##$USERA1= <user>
##$USERA2= <user>
##$USERA3= <user>
##$USERA4= <user>
##$USERA5= <user>
##$V9= 5
##$VALIST= <valist>
##$VCLIST= <CCCCCCCCCCCCCCC>
##$VD= 0
##$VDLIST= <DDDDDDDDDDDDDDD>
##$VPLIST= <PPPPPPPPPPPPPPP>
##$VTLIST= <TTTTTTTTTTTTTTT>
##$WBST= 1024
##$WBSW= 4
##$XGAIN= (0..3)
0 0 0 0 
##$XL= 0
##$YL= 0
##$YMAX_a= 468683
##$YMIN_a= -763864
##$ZGOPTNS= <>
##$ZL1= 120
##$ZL2= 120
##$ZL3= 120
##$ZL4= 120
##$ABSF1= 15.40093
##$ABSF2= -2.650917
##$ABSG= 5
##$ABSL= 3
##$ALPHA= 0
##$AQORDER= 0
##$ASSFAC= 0
##$ASSFACI= 0
##$ASSFACX= 0
##$ASSWID= 0
##$AUNMP= <proc_1d>
##$AZFE= 0.1
##$AZFW= 0.1
##$BCFW= 0
##$BC_mod= 2
##$BYTORDP= 0
##$COROFFS= 0
##$CY= -3
##$DATMOD= 1
##$DC= 0
##$DFILT= <>
##$DTYPP= 0
##$F1P= 0
##$F2P= 0
##$FCOR= 1
##$FTSIZE= 16384
##$FT_mod= 6
##$GAMMA= 0
##$GB= 0
##$INTBC= 1
##$INTSCL= 3.241238e-09
##$ISEN= 128
##$LB= 0.25
##$LEV0= 0
##$LPBIN= 0
##$MAXI= 10000
##$MC2= 0
##$MEAN= 0
##$ME_mod= 0
##$MI= 1.114404
##$NCOEF= 0
##$NC_proc= -6
##$NLEV= 6
##$NOISF1= 3.799351
##$NOISF2= 2.8
##$NSP= 0
##$NTH_PI= 0
##$NZP= 0
##$OFFSET= 15.30617
##$PC= 1
##$PHC0= -3699.056
##$PHC1= 6.192321
##$PH_mod= 1
##$PKNL= yes
##$PPARMOD= 0
##$PSCAL= 0
##$PSIGN= 0
##$REVERSE= no
##$SF= 200.130043134883
##$SI= 16384
##$SIGF1= 3
##$SIGF2= 2
##$SINO= 0.751879
##$SIOLD= 32768
##$SREGLST= <19F.Aceton>
##$SSB= 0
##$STSI= 16384
##$STSR= 0
##$SW_p= 3612.71676300578
##$SYMM= 0
##$S_DEV= 0
##$TDeff= 16384
##$TDoff= 0
##$TI= <>
##$TILT= no
##$TM1= 0
##$TM2= 0
##$TOPLEV= 0
##$USERP1= <user>
##$USERP2= <user>
##$USERP3= <user>
##$USERP4= <user>
##$USERP5= <user>
##$WDW= 1
##$XDIM= 16384
##$YMAX_p= 390573329
##$YMIN_p= -541007
$$ End of Bruker specific parameters
$$ ---------------------------------
##NTUPLES= NMR SPECTRUM
##VAR_NAME=  FREQUENCY,     SPECTRUM/REAL,   SPECTRUM/IMAG
##SYMBOL=    X,             R,               I
##VAR_TYPE=  INDEPENDENT,   DEPENDENT,       DEPENDENT
##VAR_FORM=  AFFN,          ASDF,            ASDF
##VAR_DIM=   16384,         16384,           16384
##UNITS=     HZ,            ARBITRARY UNITS, ARBITRARY UNITS
##FACTOR=    0.220516191357247, 1,           1
##FIRST=     3063.22455510254, 0,            0
##LAST=      -549.492207903243, 0,           0
##MIN=       -549.492207903243, -541007,     0
##MAX=       3063.22455510254, 390573329,    0
$$ Real data points
##PAGE= N=1
##DATA TABLE= (X++(R..R)), XYDATA
$$ [...]
7618B64967k1630J3633o9513l5352Q4137L2987N0682L0978j98056r7750P0148
7607A25231m8646K5753J09316N3999q6414k5154j23575P7478L605K0223j159n8032
7595G2625P450Q6559r3856k5563N4100j15877J30235P049r66k3752K7719m4231
7583H1492r0381k5157O0856O4474j8513p7402k1629J32425J9142n9049L3855j1220
7571H8893R3991j9497K754L6063P2292o1478j46941k1525k0973j8269R5371k8083
7559G2598o075R1421m1307j9171M3671p1886q9763n4544K8462L3448O8980M2752
7547I8586k4607O5187m4822P2074r7395q121J13117k853J100J203J8626k6478
7535A65617m6035l8383k30J44645L6863o5649m8132J37168p4588j3976r212R7826
$$ y = [264967, 243337, 256970, 187457, 152105, 236242, 269229, 319911, 350889, 152833, 55083, 125231, 76585, 102338, 211654, 265653, 179239, 154085, 30510, 107988, 111593, 131816, 130657, 72625, 80075, 166634, 72778, 47215, 101315, -14562, 115673, 122722, 121756, 98004, 125723, 81492, -8889, -34046, 26810, 91284, 72771, -4631, -26260, 106165, 125307, 66258, 100113, 88893, 182884, 163387, 166141, 202204, 274496, 213018, 66077, 44552, 23579, 5310, 100681, 72598, 66523, 157944, 116637, 97466, 141137, 69251, -20512, -75056, -46594, -13146, 55834, 98586, 73979, 139166, 94344, 166418, 69023, 60902, 174019, 171166, 172266, 173469, 192095, 165617, 119582, 81199, 80969, 225614, 262477, 196828, 148696, 285864, 211276, 197300, 188088, 285914]
7523B85914l0998k5571N4238J32137m3145j07447J3008m7616O7351k05K4870j2317
7511C10219L7740m3643k2516J542o1659L1065L8054r881L8898P0861R780l8216
7499C62244o0929J53958L1887k8536P7842m4908p365Q5513j640r9176j1958q9739
7487C67193J80118R3397M3475M9r2096k84l4310j7735P0763J10433o8575k2517
7475F29911M5445l205p3417m3865Q8245R649J6185J06316M5725J2292Q083k8199
7463H13165k9061Q0183J02027l1631j56543O5517Q1041R2572O1671j40899K4318
7452I62360J33357N0789o6900P6228J350L3719N6615P5557j12449o9633N0414
7441A191407L4292J9058Q6303Q9974L2094L0623J1314k544J15098k8282n075R9882
$$ y = [285914, 254916, 229345, 283583, 415720, 372575, 265128, 278136, 230520, 297871, 297666, 322536, 310219, 347959, 304316, 281800, 283342, 221683, 252748, 290802, 280921, 319819, 390680, 400460, 362244, 301315, 455273, 487160, 458624, 536466, 491558, 484193, 569706, 568066, 468890, 456932, 367193, 547311, 640708, 684183, 684232, 592136, 591852, 557542, 539807, 610570, 721003, 652428, 629911, 675356, 672151, 598734, 554869, 643114, 652763, 668948, 775264, 820989, 833281, 841364, 813165, 784104, 864287, 966314, 934683, 778140, 843657, 924698, 1017270, 1078941, 938042, 962360, 1095717, 1146506, 1079606, 1155834, 1157184, 1190903, 1247518, 1323075, 1210626, 1140993, 1191407, 1225699, 1244757, 1331060, 1421034, 1453128, 1483751, 1495065, 1492521, 1607619, 1579337, 1574262, 1674144]
7429A674144P3471R5739M7761L3995J14978k5089p2927N0891J03852O7100J7749
7418B181664O2241P7554L9953K8289J45407j3165O3739J61667N1196J42292K8910
7407B969747Q8291K00459J84427J13156j8990N5452J72706K50835J58473R9286
7397D273842J91902K38078J62813J66367K59286L03925K24635K92823J86722L67776
7387F668169K66539K73877L42756M62119M15367M36842N37477O03322O49939P41288
7377A1397695Q51468Q95300J232769J381017J572208J968871K255429K481073
7369B4035830K367478K291114K032555J193011N98394k43092q95616j449282j737718
7360B8192674j848013j907528j731853j527687j077955q34396p96480m97807l28361
$$ y = [1674144, 1747615, 1843354, 1891115, 1925110, 2040088, 2014999, 1942072, 1992963, 2096815, 2163915, 2181664, 2243905, 2321459, 2361412, 2389701, 2535108, 2521943, 2585682, 2747349, 2798545, 2940837, 2969747, 3058038, 3258497, 3442924, 3556080, 3537090, 3592542, 3765248, 4016083, 4174556, 4273842, 4465744, 4703822, 4866635, 5033002, 5292288, 5596213, 5820848, 6113671, 6300393, 6668169, 6934708, 7208585, 7551341, 8013460, 8428827, 8865669, 9403146, 10006468, 10656407, 11397695, 12249163, 13144463, 14377232, 15758249, 17330457, 19299328, 21554757, 24035830, 26403308, 28694422, 30726977, 31919988, 32518382, 32275290, 31379674, 29930392, 28192674, 26344661, 24437133, 22705280, 21177593, 20099638, 19265242, 18468762, 17970955, 17642594]
7351A7642594k45167j5007Q7733R8322K08976M85859N62144N12514O20838Q70375
7341B0829181R48200R95903J166927J333381J460392J552586J676124J799951
7333C1762645J872791J853565J845248J630187J501441J345216J046590Q22321
7325D3680004N18132K24031K7895r4649k02870l83396j77045j97347j43686J5055
7315D3266124Q7742K33401L83660M36008L75583M86981L96973K02274j26303j76802
7305D5565641n90368q74919j274778j624053j830997k074055k212904k118297
7297C2965270k094108k106739k087720j856703j799575j638438j532299j500189
7289A8349499j198572r62604j016732q81966q28478q03221p07020o67977n81619
$$ y = [17642594, 17397427, 17382420, 17470153, 17568475, 17777451, 18263310, 18825454, 19337968, 19958806, 20829181, 21777381, 22773284, 23940211, 25273592, 26733984, 28286570, 29962694, 31762645, 33635436, 35489001, 37334249, 38964436, 40465877, 41811093, 42857683, 43680004, 44198136, 44422167, 44450062, 44355413, 44152543, 43769147, 43592102, 43394755, 43251069, 43266124, 43353866, 43587267, 43970927, 44406935, 44782518, 45269499, 45666472, 45868746, 45742443, 45565641, 44975273, 44100354, 42825576, 41201523, 39370526, 37296471, 35083567, 32965270, 30871162, 28764423, 26676703, 24820000, 23020425, 21381987, 19849688, 18349499, 17150927, 16188323, 15171591, 14289625, 13461147, 12657926, 11950906, 11282929, 10701310]
7280A0701310n50746m00566n04063m53841l81670l54141l51806l96950k32719
7271G074808k95096k87110k53288k01741k28823j61301j05085k57767j39172l01240
7261D844185j49564k26323j34137j58982k28891j70990n8613j19064q9119p4823
7251C433679r7312k79557k08420K2862k8975p4502j13995j67114k4166j03305
7241B359195K0563L0153o0531j02621j0307O1232j10396n9831j08461j39121L6819
7230A916694j3753o9480j188n2683q3581j5066j7785l3580K9359k7442m5560j11041
7218A474894j59020J08551J7754p6181j19653m2771j0754L9657p3366j12183N9957
7207A106885l1278O2629M413j27822J10530p5991p9460L1277j79477j2992M9098
$$ y = [10701310, 10150564, 9749998, 9245935, 8792094, 8410424, 8056283, 7704477, 7307527, 7074808, 6779712, 6492602, 6239314, 6037573, 5808750, 5647449, 5542364, 5284597, 5145425, 4844185, 4694621, 4468298, 4334161, 4175179, 3946288, 3775298, 3716685, 3597621, 3508502, 3433679, 3336367, 3056810, 2848390, 2871252, 2842277, 2767775, 2653780, 2486666, 2462500, 2359195, 2379758, 2409911, 2349380, 2246759, 2236452, 2297684, 2187288, 2127457, 2018996, 1879875, 1916694, 1902941, 1833461, 1832273, 1779590, 1696009, 1680943, 1663158, 1629578, 1658937, 1631495, 1585935, 1474894, 1315874, 1424425, 1442179, 1365998, 1246345, 1203574, 1192820, 1232477, 1159111, 1046928, 1106885, 1075607, 1138236, 1142649, 1014827, 1125357, 1049366, 969906, 1001183, 821706, 808714, 857812]
7196H57812L488L1859J4127J6447o8088q8180J0525L637L1012l4575k1860r8614
7184F57590J4618o2993j2525N7826J8227k4290m1848L2126L5744k5268l4239l0824
7172E84144J0612l9014J45450j13416j1660p2824n1218O1853J1745R2264j14776
7161E03160K785r799j29713P9588R1224k5288P3546j37392p9238P5160n6789j1605
7149C75639m3354l7399o2052j4379R900J2277N0744R6818j01435l410M0642J6962
7137C40953m6590l2723j8638P7359j6236q5557O0455J14377r9942j919r6392l2687
7125A62460P9845O5137l165j16960J08862m9355l8473J5712m4849M9939K2681
7114B51834l2142O7445m4693L8196J0995o0198o5035J04680n5102j7098J07008
$$ y = [857812, 861300, 893159, 907286, 923733, 855645, 767465, 777990, 781627, 812639, 778064, 756204, 657590, 672208, 609215, 596690, 654516, 672743, 648453, 606605, 638731, 674475, 649207, 614968, 584144, 594756, 555742, 701192, 587776, 576116, 503292, 452074, 513927, 525672, 617936, 503160, 505945, 496146, 366433, 446021, 537245, 511957, 585503, 448111, 368873, 444033, 387244, 375639, 332285, 294886, 232834, 218455, 228355, 240632, 291376, 388194, 286759, 283349, 323991, 340953, 294363, 261640, 243002, 320361, 304125, 218568, 279023, 393400, 293458, 291539, 195147, 162460, 242305, 307442, 304277, 187317, 296179, 246824, 208351, 224063, 179214, 229153, 251834, 219692, 287137, 242444, 280640, 291635, 231437, 166402, 271082, 215980, 198882, 305890]
7103C05890l3015L8963k7359o1972q9308k0041m5877M1788M0153L8188q3884j13670
7091a0144R5096m6971N2409K1237j3574J173k5730m3115P8326q3210N6737n1262
7079C0972P8308K3125o9237l1972K1480j4522n698K8643N119p6159J22358N5000
7067A67417q2143M3055j0868r9332M344N3300O8012o9810j26300P5065N6282j0943
7055F8079L1871n0107J1973k5205n7575L8672m9121j2562J8764l6490N204R3489
7043C6992j35238k8385N7279O1396L4695p9681J40063M5744j026j03921m1161
7032a3243M9058q3993l651J9816p012k5899P3842M2691K6219K8694J8842l6884
7020H8480L339o9632R8196j3393n9554l1867O9316P287k9181J8945L3102l0445
$$ y = [305890, 272875, 311838, 284479, 222507, 133199, 113158, 67281, 109069, 149222, 187410, 103526, -10144, 84952, 37981, 90390, 111627, 98053, 99226, 73496, 30381, 108707, 25497, 82234, 30972, 109280, 132405, 63168, 31196, 52676, 38154, 32456, 61099, 66218, -9941, 112417, 167417, 85274, 128329, 117461, 18129, 22473, 75773, 143785, 73975, -52325, 22740, 79022, 68079, 99950, 49843, 61816, 36611, -20964, 17708, -31413, -43975, -25211, -61701, -56497, 36992, -98246, -126631, -69352, -7956, 26739, -52942, 87121, 132865, 131839, 27918, -13243, 35815, -48178, -51829, -32013, -39025, -64924, 8918, 51609, 77828, 106522, 125364, 88480, 91819, 22187, 120383, 106990, 47436, 15569, 84885, 92172, 62991, 81936, 115038, 84593]
7008H4593o6792j7471J8392P4533J28j441o1338n10R3940p6363L5536O0463R223
6995A52893P503K0405k9261k0208O545o5981J4105m2346j6446M6754M3978R427
6983A27368j0140l8267L6909L9876m735L7620m1027j5544Q680J03536J53209l3209
6971C64276n3572J06004l890o4390o1876Q3673k4015M2819J8743J3587P0843o1861
6959D30341l2508M5080P803M228k8391l5110P600q28L7660J0380m9768n593o207
6946C84687o7388k3279R3909J4000k6706m0897N4966P7282q6300o225q949j5073
6934C50027R2994O3207m4678J787m821l4378m5377j13473L897P7741N0729L0739
6922D28394l303O1475n7929l7933l1130O2595L11j4033j2294q4542n0529m863
$$ y = [84593, 17801, 330, 18722, 93255, 93383, 91942, 30604, 30094, 124034, 47671, 83207, 143670, 152893, 160396, 180801, 151540, 131332, 137877, 71896, 86001, 43655, 27209, 73963, 117941, 127368, 117228, 78961, 115870, 155746, 151011, 188631, 147604, 132060, 140740, 244276, 397485, 364276, 310704, 416708, 412818, 348428, 286552, 370225, 346210, 389029, 407772, 421359, 492202, 430341, 397833, 442913, 450716, 454944, 426553, 391443, 399043, 398215, 435875, 446255, 396487, 390894, 384687, 317299, 294020, 387929, 401929, 375223, 334326, 389292, 466574, 380274, 374049, 365100, 350027, 443021, 506228, 461550, 463337, 458516, 424138, 378761, 265288, 269185, 346926, 397655, 428394, 425091, 486566, 428637, 390704, 359574, 422169, 422480, 408447, 396153, 311611, 261082, 256219]
6910B56219O1515R3024O8920Q3318K9452N3870P486p0796p6293P3578k5014K0131
6898E75410k8181O1158P2090m5778j07512o8356K6457m1241K0930K8152m892N1172
6886E39409k5669q402p1763J6402N7730N805J18371K526K5484q327j60013k717
6874D88836N7234J68828P7504p5605k3985K4878L8202r7522R1802M9872k0494
6863G79550j7375q4069L111m2285N3631M3596n460M0987m5781m1973M5929N3860
6851G83721j6269n8302Q1399L8991j4793Q6839r8385L6426Q4578q0919j8679M4949
6839H69556r6127J06468Q8636P236J4364j3708J7821p411m7352N5244m9949J668
6827I46446J04596l6484J71693N7987j70286l8410O6505N8314R114K9529M7497
$$ y = [256219, 317734, 410758, 479678, 562996, 592448, 646318, 653804, 583008, 506715, 580293, 555279, 575410, 547229, 608387, 680477, 634699, 527187, 458831, 485288, 444047, 464977, 493129, 488237, 539409, 513740, 505338, 433575, 449977, 507707, 513512, 631883, 634409, 659893, 651566, 491553, 488836, 546070, 714898, 792402, 716797, 692812, 717690, 755892, 658370, 750172, 800044, 779550, 762175, 678106, 681217, 638932, 692563, 736159, 730699, 771686, 725905, 683932, 729861, 783721, 767452, 709150, 790549, 829540, 814747, 901586, 803201, 839627, 924205, 843286, 824607, 869556, 773429, 879897, 968533, 975769, 990133, 976425, 994246, 986835, 939483, 994727, 944778, 946446, 1051042, 1014558, 1186251, 1244238, 1073952, 1035542, 1102047, 1160361, 1169475, 1199004, 1246501]
6816A246501n7439r5108J05095l5429J0369k5575m3747R9585k8040l193k9873
6805A143146J10354J16256k2886o566j3406N1406Q5746K959n1717o1733L9549
6794A393108M5076Q9181k4508P032J8505J7684m347R340J18114J6150k4037M4158
6782A705456N4950k1716J9400K270m1463o0818l903P2001n437J3075K03959k9275
6770A908499q9327J13178Q8305j7216R6316j1410l6909J42488k1779l4291O5761
6759B203615l751k6274k6438P1389M7961p216o5103L7664J1641l296J01917O0941
6747B403050O873J05980n2263p2581P7749L5816M4692k5531J34903J23236o0914
6736B721010m171O8276o489O978J02718j9376M7506p1591N706Q7964k0979R5549
$$ y = [1246501, 1189062, 1093954, 1199049, 1163620, 1173989, 1148414, 1104667, 1204252, 1176212, 1173019, 1143146, 1253500, 1369756, 1346870, 1340304, 1326898, 1378304, 1464050, 1467009, 1415292, 1353559, 1393108, 1438184, 1527365, 1502857, 1509889, 1528394, 1546078, 1541731, 1551071, 1669185, 1685335, 1661298, 1705456, 1760406, 1738690, 1758090, 1760360, 1718897, 1658079, 1654176, 1726177, 1720740, 1733815, 1937774, 1908499, 1819172, 1932350, 2020655, 2003439, 2099755, 2088345, 2051436, 2193924, 2172145, 2137854, 2203615, 2199864, 2173590, 2147152, 2218541, 2266502, 2259286, 2194183, 2231847, 2243488, 2240192, 2342109, 2403050, 2409923, 2515903, 2463640, 2391059, 2468808, 2504624, 2549316, 2523785, 2658688, 2781924, 2721010, 2716839, 2785115, 2778626, 2785604, 2888322, 2868946, 2916452, 2844861, 2850567, 2938531, 2917552, 3013101]
6724C013101K0074j7770k832J2828J7199K9429P2374O3043l5152P0381J5827Q2494
6712C340996j76181o96J39232L1343R9932J13720k5537j3133P7673O6932j0920
6701C643361N2057L6611O9784P0041L0541J52495K2347m1173k1767K4676O3825
6690D102798J2993J06821J41887n179j776N6617r163J87128R8494M6879O8257
6679D805756L8802O6279J53133J60121l8154J21960K39761J49781L1219J51375
6669E880033J40045J21530K13874J73402R8699Q9931K12123J89468O0377J89179
6659G368661K52983K30957L07862R0512L2779J64950K07172K56248J46853K10143
6649I269120K81761K42406J98412O8165J45022L33888J66897L17565K73682J93968
$$ y = [3013101, 3033175, 3015405, 3012573, 3025401, 3042600, 3072029, 3144403, 3207446, 3172294, 3242675, 3258502, 3340996, 3164815, 3164119, 3303351, 3334694, 3434626, 3548346, 3522809, 3509676, 3587349, 3654281, 3643361, 3695418, 3732029, 3801813, 3871854, 3902395, 4054890, 4077237, 4036064, 4014297, 4038973, 4102798, 4115791, 4222612, 4364499, 4359320, 4357544, 4414161, 4404998, 4592126, 4690620, 4737499, 4805756, 4844558, 4910837, 5063970, 5224091, 5185937, 5307897, 5547658, 5697439, 5728658, 5880033, 6020078, 6141608, 6355482, 6528884, 6627583, 6717514, 6929637, 7119105, 7179482, 7368661, 7621644, 7852601, 8160463, 8250975, 8283754, 8448704, 8655876, 8912124, 9058977, 9269120, 9550881, 9793287, 9991699, 10059864, 10204886, 10538774, 10705671, 11023236, 11296918, 11490886]
6639A1490886K46851K73164K88334L51532J77647K08315L38464J72289J13922
6630A3661404L6072K18971L35670K43597K47851J32632K41907Q7067J18091K52147
6620A5575409K66748K93621K79599L93917L34083K75021K38970L77190K78139
6611A8312697L38723M57939K39999K58961L37076K58000K61660L28355L24264
6602B1117674J73395K68547J88425K80446L38827L08750J22657K38038L74138
6593B3410897M02348L57029L51134L86397K83928M88143M52261M16347L94724
6584B6943208L64152M71360M11258L09263M37371M09707M33781L60017L48124
6575C0488241L35256L72977L32858L24953M58518N06468K86062L41988M88991
$$ y = [11490886, 11737737, 12010901, 12299235, 12650767, 12828414, 13036729, 13375193, 13547482, 13661404, 13697476, 13916447, 14252117, 14495714, 14743565, 14876197, 15118104, 15205171, 15323262, 15575409, 15842157, 16135778, 16415377, 16809294, 17143377, 17418398, 17657368, 18034558, 18312697, 18651420, 19109359, 19349358, 19608319, 19945395, 20203395, 20465055, 20793410, 21117674, 21291069, 21559616, 21748041, 22028487, 22367314, 22676064, 22798721, 23036759, 23410897, 23813245, 24170274, 24521408, 24907805, 25191733, 25679876, 26132137, 26548484, 26943208, 27307360, 27778720, 28189978, 28499241, 28936612, 29346319, 29780100, 30140117, 30488241, 30823497, 31196474, 31529332, 31854285, 32312803, 32819271, 33105333, 33447321, 33936312]
6566C3936312O42703O04481O03350Q35503Q42245R19758J048628J068170J169039
6557D1670189J194725J372953J488182J632111J609985J768319J902398J776687
6549E4415549J880805J890097J921270J857849J682216J666889J469035J170397
6541F7954107Q98548P61379N32040K92439l9787l78997o33355r15889j045218
6532F7425267j348841j404537j657599j756342j928920j943415j860298j745102
6524E3780213j702587j645700j674356j567705j483101j170473j097442q99615
6516D2539234o92980o63919o43374m54620k79079k32196r6864Q3164K42885L17956
6506D0120207L61404N52915O98758P44270Q65651R79084J078567J096230J314251
$$ y = [33936312, 34579015, 35183496, 35786846, 36622349, 37464594, 38384352, 39432980, 40501150, 41670189, 42864914, 44237867, 45726049, 47358160, 48968145, 50736464, 52638862, 54415549, 56296354, 58186451, 60107721, 61965570, 63647786, 65314675, 66783710, 67954107, 68852655, 69614034, 70146074, 70438513, 70398726, 70019729, 69386374, 68470485, 67425267, 66076426, 64671889, 63014290, 61257948, 59329028, 57385613, 55525315, 53780213, 52077626, 50431926, 48757570, 47189865, 45706764, 44536291, 43438849, 42539234, 41846254, 41182335, 40538961, 40084341, 39805262, 39573066, 39476202, 39559366, 39802251, 40120207, 40481611, 41034526, 41733284, 42477554, 43343205, 44322289, 45400856, 46497086, 47811337]
6497D7811337J313335J543175J800299J911468K088512K214275K304075K536011
6489F3522487K666013K833740K890497K905776K862750K459352K337278K077102
6481H4554995J671794J131833N20120J7453n07078p96361r44616j266668j539449
6472H2842023j527843j444782j381224j216581r37373q60766p00906m25383j52483
6463G4194682J22239L43533M28315O26152P74444P79632P45289P72034P46621
6454G9532941P62676N31927L63387K77655M9365k9772m2437j16374j15067j28678
6444H1085623j95532J03L2162J8776N4385L18896K70825K18839L31542K24461
6434H2360080J98045R3241O2586j29133k13068l27791n09230o47078o06498p65272
$$ y = [47811337, 49124672, 50667847, 52468146, 54379614, 56468126, 58682401, 60986476, 63522487, 66188500, 69022240, 71912737, 74818513, 77681263, 80140615, 82477893, 84554995, 86226789, 87358622, 87878742, 87896195, 87389117, 86592756, 85648140, 84381472, 82842023, 81314180, 79869398, 78488174, 77271593, 76334220, 75473454, 74772548, 74347165, 74194682, 74316921, 74660454, 75088769, 75714921, 76489365, 77268997, 78014286, 78786320, 79532941, 80295617, 80827544, 81190931, 81468586, 81517951, 81488179, 81445742, 81329368, 81214301, 81085623, 80890091, 80890194, 80922356, 80941132, 80995517, 81314413, 81585238, 81804077, 82135619, 82360080, 82558125, 82651366, 82713952, 82584819, 82371751, 82043960, 81534730, 80887652, 80281154, 79515882]
6424G9515882p77678o80346q55583r02630q44675q50740r05736q69069q80615
6415G1948810q89401j052500j288621j294575j602142j541130j782802j926832
6407F0570807j818418k067195k099769k176969k099285k078884j920054j988794
6399D4321439j939872j829242j669070j561420j430811j296364j211716j161866
6391C2221078j143585r88455p34056o61109n25350n06105m30137l09381k49358
6382B6673542j12950j53304J83760J52496K90078L07194M45822M64775M41511
6373B8692924M89659M69402M47672K59403J26937M5183j57619m47532l69462m91690
6363B9064877n74879o23437o54430o67566o81554o48460n76600m75965m64591
$$ y = [79515882, 78738204, 78057858, 77202275, 76299645, 75454970, 74604230, 73698494, 72829425, 71948810, 71059409, 70006909, 68718288, 67423713, 65821571, 64280441, 62497639, 60570807, 58752389, 56685194, 54585425, 52408456, 50309171, 48230287, 46310233, 44321439, 42381567, 40552325, 38883255, 37321835, 35891024, 34594660, 33382944, 32221078, 31077493, 30089038, 29354982, 28693873, 28168523, 27662418, 27232281, 26922900, 26673542, 26560592, 26407288, 26591048, 26743544, 27033622, 27340816, 27786638, 28251413, 28692924, 29182583, 29651985, 30099657, 30359060, 30485997, 30531180, 30373561, 29926029, 29556567, 29064877, 28489998, 27866561, 27212131, 26544565, 25863011, 25214551, 24637951, 24161986, 23697395]
6354B3697395n05874l76844m12340m21539l36187l76202m96853m21307m69525
6345A9880724n22275m63453n40717o27301o34143m83254m91095m91888n07328
6336A5119270n34001n22229l54978n22521m04649l18181m44416l34683k91050
6327A1392562l40187k61606k51792l49564j91665k07458k33778k43868j91082
6318I121562k65600k32927j09854j65888k08812m04238j19698j22972k32610m9573
6308G209390j23804j75419j04832m1746j46473j37701o4617j38882j35437j36840
6298F003639j22746j32008o6913M0212q9869m8379q8475r7029r7917j1088j69175
6287E120252Q4875J845r5049j6226n3534j75689p4180j63020q5035N8563k0232
$$ y = [23697395, 23191521, 22814677, 22402337, 21980798, 21644611, 21268409, 20771556, 20350249, 19880724, 19358449, 18894996, 18354279, 17726978, 17092835, 16609581, 16118486, 15626598, 15119270, 14585269, 14063040, 13708062, 13185541, 12780892, 12462711, 12018295, 11683612, 11392562, 11052375, 10790769, 10538977, 10189413, 9997748, 9790290, 9556512, 9312644, 9121562, 8855962, 8623035, 8513181, 8347293, 8138481, 7734243, 7614545, 7491573, 7258963, 7209390, 7085586, 6910167, 6805335, 6763589, 6617116, 6479415, 6414798, 6275916, 6140479, 6003639, 5880893, 5748885, 5681972, 5722184, 5632315, 5583936, 5495461, 5398432, 5300515, 5289427, 5120252, 5205127, 5206972, 5111923, 5095697, 5042163, 4866474, 4792294, 4629274, 4544239, 4602802, 4582570]
6276D582570r4776r3081N4258j0661m4938p8106j28382p275p7164m8417k6149
6265D027879k8563n5247n2207L6516j2096j15089j17216J5001j4893k5214J8525
6254C677396m5210j13599P1490J9976K8600r1598k8851j05040p8902K3540n9808
6243C297994L3007Q1821l9144q9222j65438j6538L5637J9980j14089k3945K2882
6232C042945m0168j695o969j18821r6651K7173q006J0437j01579K3129L8626j32197
6220B636224K5202m9442l9927Q4340j55206o3212k1516R50L3186k500n0456j36460
6208B261183r8549P610J36638n6452l7391K9938l9705p949O7133p3522J64k0974
6196B168124r4134o8715p970J48989m082o2689L2670O0505M9850j24853M7440
$$ y = [4582570, 4487794, 4394713, 4448971, 4438310, 4393372, 4315266, 4186884, 4179609, 4102445, 4054028, 4027879, 3999316, 3944069, 3891862, 3928378, 3916282, 3801193, 3683977, 3698978, 3684085, 3658871, 3677396, 3632186, 3518587, 3590077, 3610053, 3638653, 3547055, 3518204, 3413164, 3334262, 3357802, 3297994, 3331001, 3412822, 3373678, 3284456, 3119018, 3102480, 3138117, 3158097, 3044008, 3020063, 3042945, 3002777, 3001082, 2994113, 2875292, 2778641, 2805814, 2797808, 2808245, 2706666, 2729795, 2768421, 2636224, 2661426, 2611984, 2572057, 2656397, 2501191, 2437979, 2416463, 2417413, 2450599, 2448099, 2397643, 2261183, 2162634, 2170244, 2306882, 2250430, 2213039, 2242977, 2203272, 2195323, 2262456, 2188934, 2189098, 2168124, 2073990, 2005275, 1997305, 2146294, 2142212, 2079523, 2112193, 2172698, 2222548, 2097695, 2145135]
6185B145135l5785l3434L4478Q9139l3119p9951R5151O7348m9076M6974L7133
6174B283993j16858J157R2833J8153j05457J23314L2651M0025J4472j19694j04144
6163B160445J8425L8199j5535p664o6808p7325k0241j08410o8526m7266q5619
6152A719675O0321K3139M7842K3585j10019m5076K2006N240K7431O8707L0890
6141A873741q2655L6278K4861j5909P886N788l8709J0180J12120r8894o8779P1330
6129A837238j1325j09926r613k6898P1484N5262j9928j2546n0470n0427R4508
6118A767359m0759N706J2276p6922J1351J1112o9931M6036l368p2075q0053Q332
6106A519064m4653L5874K5404n1746n7197k313K3555J1366R6002j0461o1455q7926
$$ y = [2145135, 2109350, 2075916, 2110394, 2199533, 2166414, 2086463, 2181614, 2248962, 2199886, 2246860, 2283993, 2167135, 2168292, 2261125, 2279278, 2173821, 2297135, 2329786, 2369811, 2384283, 2264589, 2160445, 2178870, 2217069, 2201534, 2193870, 2127062, 2049737, 2029496, 1921086, 1852560, 1805294, 1719675, 1779996, 1803135, 1850977, 1874562, 1764543, 1719467, 1741473, 1746713, 1774144, 1842851, 1873741, 1791086, 1827364, 1852225, 1836316, 1844202, 1849990, 1811281, 1821461, 1933581, 1834687, 1765908, 1837238, 1825913, 1715987, 1706374, 1679476, 1750960, 1806222, 1786294, 1773748, 1723278, 1672851, 1767359, 1726600, 1732306, 1744582, 1667660, 1679011, 1690123, 1620192, 1666228, 1662860, 1590785, 1510732, 1519064, 1474411, 1510285, 1535689, 1483943, 1426746, 1424433, 1447988, 1459354, 1555356, 1544895, 1483440, 1395514]
6094A395514o7225m1605J5630l7382r2265L9310N0006j15404J4485n547P0805
6083A226322j7379j26655L4527J21490l5691n8804P3141K9261q6968j49639L1099
6072A040704J41102m9445l1596N4269k4064Q8196j0926L9258n9389r3215m4564
6061A050330L1149J5567Q1284J713o9118J6645P322P6908O012n6790k2759N1149
6049A189412K1751k433L5557P0530n9571p6166O4075R3824K5031r6972M9943Q38
6037A315819L2615k4862j8454N8282l7295p05K6671Q0986J2533J548q9536L899
6025A361501M1293m2241o8175N0235q0815N0098J21206j4102l273N5361p1447
6014A399641l7781Q4929K4348O502J4036L5506M7209o9350o9221l458M2321l5923
$$ y = [1395514, 1328289, 1286684, 1302314, 1264932, 1172667, 1211977, 1261983, 1146579, 1161064, 1155517, 1226322, 1208943, 1082288, 1116815, 1238305, 1202614, 1143810, 1216951, 1246212, 1159244, 1009605, 1040704, 1181806, 1132361, 1100765, 1155034, 1130970, 1219166, 1208240, 1247498, 1188109, 1094894, 1050330, 1081479, 1097046, 1178330, 1180043, 1110925, 1127570, 1134892, 1211800, 1217812, 1161022, 1138263, 1189412, 1211163, 1208730, 1244287, 1314817, 1255246, 1179080, 1243155, 1336979, 1362010, 1265038, 1314981, 1315819, 1348434, 1323572, 1305118, 1363400, 1326105, 1325400, 1352071, 1433057, 1445590, 1447138, 1357602, 1361501, 1402794, 1360553, 1292378, 1342613, 1261798, 1311896, 1433102, 1419000, 1415727, 1471088, 1399641, 1361860, 1446789, 1471137, 1477639, 1491675, 1527181, 1574390, 1505040, 1435819, 1432361, 1474682, 1438759]
6002A438759P7259K0231j77913j15707J07055J5435J26664m0252o2971k8413Q3052
5991A443199N5498L6859q1241j6391J3621K4601L2940j36121r1834p113M1608
5980A315626k3446M4345K1706p7115J82868k2695o8063N9506j8738o9414k9071
5969A315509L6024O204Q0968p2947n5885j5147P3449K8226l2041j58831J02919
5958A308448k6828n9112o2709n2660l6020l5718k6113L8740q3938m4520k3556
5947H96014J6091M2687j5390j4076m8209j67761m3813N8624Q2113L6244o8368
5936G74156K5100K0003J492K0106m2956O3691j35174l2483L6334l7037q5725l3767
5924E73740l1101P449j451o0650j5639J6448l3088p3850l2273L2180k0309j5824
$$ y = [1438759, 1516018, 1536249, 1358336, 1242629, 1349684, 1365119, 1491783, 1451531, 1388560, 1360147, 1443199, 1498697, 1535556, 1454315, 1437924, 1451545, 1476146, 1509086, 1372965, 1281131, 1274018, 1315626, 1292180, 1336525, 1358231, 1281116, 1463984, 1441289, 1373226, 1432732, 1413994, 1344580, 1315509, 1351533, 1357737, 1438705, 1365758, 1309873, 1294726, 1368175, 1396401, 1364360, 1205529, 1308448, 1281620, 1222508, 1159799, 1107139, 1071119, 1035401, 1009288, 1048028, 964090, 919570, 896014, 912105, 954792, 939402, 925326, 877117, 709356, 665543, 724167, 806280, 842524, 774156, 799256, 819259, 820751, 840857, 797901, 861592, 726418, 693935, 730269, 693232, 607507, 573740, 542639, 550088, 548637, 487987, 472348, 488796, 455708, 381858, 349585, 381765, 361456, 345632]
5912C45632L0288j3964k8820M0961L289j9600k2937q3022l818J5957P9250o279
5900C36937j40967m6125J10742l5356M8697J2424M4423n2245n485J04108l6361
5889C40792j1683J54447l2885k06864l9672N7559R4755J5610o2039P5788J11753
5878D97561o5553k4311N0656j6794N6578J4152m280O6365K5940j28974M8491n3844
5866D65987O2787R4699N562o2222K7324J1942r377Q6368L9309M2543J4363L9616
5854H18901J3727Q7921O5388N2539J15252O3213K3824R4580l9996O6727J25207
5843A487283Q3118J00552P1457Q7971J99474J07362J01818J65944J76264K05946
5833B787189K14731J57218K52747L86714K50365L50659M88617N38797P99407Q26797
$$ y = [345632, 375920, 361956, 333136, 374097, 377386, 357786, 334849, 251827, 248009, 263966, 343216, 336937, 195970, 149845, 260587, 225231, 273928, 286352, 330775, 278530, 273045, 377153, 340792, 329109, 483556, 450671, 243807, 204135, 261694, 356449, 372059, 310020, 385808, 497561, 432008, 407697, 458353, 441559, 498137, 512289, 508009, 574374, 600314, 471340, 519831, 465987, 528774, 623473, 629035, 566813, 594137, 606079, 596702, 683070, 722379, 764922, 779285, 818901, 832628, 920549, 985937, 1038476, 1153728, 1216941, 1240765, 1335345, 1295349, 1362076, 1487283, 1570401, 1670953, 1742410, 1830381, 2029855, 2137217, 2239035, 2404979, 2581243, 2787189, 3001920, 3159138, 3411885, 3798599, 4048964, 4399623, 4888240, 5427037, 6226444, 7053241]
5823G053241Q79514J141973J237432J323774J430785J271223R71707M41980N634
5814A5757263l69632q52489j081582j316142j349132j358433j200726j192948
5806G036179r26897p80153p40321m27570m73618m41574m02588l24291k16976k56006
5796B046185l01143k12733q0324r4196j78837q8867p7845Q6925L9039j07458j12774
5785I17972r4934n7937j8171J0145m5094l6814K9006J7366m0986n3071j5058k3997
5773E88427K2379L3444r8972k0441n4536o696p1182n6059J17369q6838n3440o0920
5761B52535p7385K8648n2782O6120K135J2356J3646P0525j1628m4073k548n9846
5749A97703L2292O3501j7424p4374n2078k5680P9175q4205P7694p97p4735R5446
$$ y = [7053241, 7932755, 9074728, 10312160, 11635934, 13066719, 14337942, 15309649, 15751629, 15757263, 15387631, 14535142, 13453560, 12137418, 10788286, 9429853, 8229127, 7036179, 6109282, 5329129, 4588808, 4161238, 3687620, 3246046, 2843458, 2519167, 2302191, 2046185, 1745042, 1532309, 1451985, 1357789, 1178952, 1090085, 1012240, 1099165, 1138204, 1030746, 917972, 823038, 765101, 746930, 757075, 711981, 675167, 704173, 721539, 680553, 627482, 612424, 588427, 610806, 644250, 545278, 524837, 470301, 463605, 392423, 336364, 453733, 366895, 313455, 252535, 175150, 203798, 151016, 217136, 219271, 231627, 245273, 315798, 304170, 260097, 257549, 197703, 229995, 293496, 276072, 201698, 149620, 123940, 203115, 118910, 196604, 195807, 121072, 216518]
5737B16518L3529L1721q4318J0873m7638L0605l8878j0855q069J45747J5853j7285
5725B77803m1753r534L5158K6096L8344r3663q9858m862O3765p110n367n5914
5713A33105R9018j5165R157m4672M8465J6011o307L4463J3420q511L9401m2559
5701B75826m2132N8791K4308o0003P3905N548J6422Q3842l7795o2852J14980O2512
5689E13352J0862o465r9847j4659J5770M6999k5956n4591L5603q2718M4300n75
5677C82075m585J23421l0466n4213L5179k2760K3400J18867q4792m3562o59j0866
5665D31039N911L9988j02401m9107M1145l8916O8124O5183j5866k7414l2350O5230
5653D50566L5882n5374k3492M5005K155L4084o1721q124m7671J06645O7196j517
$$ y = [216518, 250047, 281768, 197450, 208323, 160685, 191290, 152412, 141557, 133488, 279235, 295088, 277803, 236050, 226516, 261674, 287770, 326114, 232451, 142593, 137731, 201496, 194386, 189019, 133105, 232123, 216958, 226115, 181443, 229908, 245919, 239612, 274075, 287495, 278984, 318385, 275826, 233694, 292485, 316793, 256790, 330695, 336243, 352665, 436507, 398712, 335860, 450840, 513352, 524214, 517749, 417902, 403243, 419013, 466012, 440056, 385465, 421068, 338350, 382650, 382075, 377490, 500911, 470445, 416232, 451411, 428651, 452051, 570918, 486126, 442564, 441905, 431039, 436950, 476938, 374537, 325430, 366575, 327659, 395783, 460966, 445100, 417686, 385336, 450566, 486448, 431074, 407582, 452587, 454742, 488826, 427105, 418981, 371310, 477955, 545151, 543634]
5641E43634o465l9246Q3383l2922j3542j24520M9077l721p9136J14821n6529p0543
5629C64291J12789R9759J0031p1685o8637k0576M1233O1894m4931L056j2664Q540
5617D83100m9996n2611Q2935n3722J9594M9633p316L4033P3730l99j43318N5816
5605D91479K6243j6400P6001J10892l0559O6327P3424j1135K5841K8893R8651
5594I39657M093O0762p3610J06275J52871J88052l315M8800Q0773o332k0039k0964
5582A457023j47663j07751m1186q1373j05674j53495L5795k172j26412m4931L4612
5571G16773o754m5029r9440k3346q8948L4734j0585k4779J9653o9052l40L7365
5559D40252o7813m9065M2028j2691o5833N1839L8124j34169k6075J67500Q9193
$$ y = [543634, 537169, 497923, 581306, 548384, 534842, 410322, 459399, 455678, 376542, 491363, 434834, 364291, 477080, 576839, 586870, 515185, 446548, 425972, 467205, 529099, 484168, 487224, 474560, 483100, 433104, 380493, 463428, 409706, 429300, 478933, 471617, 505650, 579380, 578981, 435663, 491479, 517722, 501322, 577323, 688215, 657656, 723983, 797407, 786272, 812113, 841006, 939657, 943750, 1004512, 930902, 1037177, 1190048, 1378100, 1374785, 1423585, 1504358, 1498026, 1477987, 1457023, 1309360, 1201609, 1160423, 1079050, 973376, 819881, 855676, 853504, 727092, 682161, 716773, 710019, 664990, 565550, 542204, 453256, 487990, 477405, 452626, 472279, 403227, 402887, 440252, 372439, 323374, 365402, 352711, 286878, 338717, 376841, 242672, 216597, 384097, 473290]
5548D73290k7811j54261r027J5031J43703k901r9786l4507R4535N6059P1876l5440
5536D90761l4068n2888L0719N3240n571Q919q2703K1899j01769P5364J06362j45324
5524C64941j7110J47085L8027K3925l9763l7324r395J26343N9922k5793L78k01338
5512D29898j41531k3766J17155P3388N2736j7687K5907k8070r4010k3396R6571
5501D67195L686j1915L1599k7766m9142M9279J06957m3839N0661k212j15341j3534
5489D45628Q4950l5361P7299l6863O6733k1742L7657l8275j62064M0058Q718n830
5477D60908m7449n1263P6633P6095P2245j42254O1708J80853K2607K1986j17056
5466F15013j07660J14542q0119M9805Q7050o2582N9074n3801r910Q3883l3161
$$ y = [473290, 445479, 291218, 282191, 297222, 440925, 438024, 338238, 303731, 398266, 454325, 526201, 490761, 456693, 403805, 434524, 487764, 482193, 491112, 408409, 430308, 328539, 403903, 510265, 364941, 347831, 494916, 532943, 556868, 517105, 479781, 470386, 596729, 656651, 630858, 631236, 429898, 288367, 264601, 381756, 455144, 507880, 490193, 516100, 488030, 394020, 370624, 467195, 470881, 458966, 490565, 462799, 413657, 462936, 569893, 526054, 576715, 574503, 459162, 445628, 530578, 495217, 572516, 535653, 602386, 580644, 618301, 580026, 417962, 458020, 466738, 460908, 413459, 362196, 438829, 514924, 587169, 444915, 506623, 687476, 710083, 732069, 615013, 507353, 621895, 541776, 591581, 678631, 616049, 675123, 621322, 611412, 695295, 662134]
5455F62134j12723P6371N6565Q2986L4610j4977l0602R5855J4332M412o4729N5454
5443H59688j1609j26643R8969J3338Q0554L9394m961M325L8051L2403m4374o4527
5431I14608O8481K5358J16033l2397q3009N3190J10706k4352m3953l103J02675
5420A204237L833n79m124N0980K3981P1457M1725r560N4031R2824P9946N9152
5408A667903K5940q0293N8217M1533o5434Q3842O5593l906N7420J14464J46373
5397B111652M914J37106k902O3839J3030N9064n7781P6370K03050J21791N8108
5386B788241P502L0725P0620Q1784J22675J51719J57155O7900J02218J61781K13129
5375C955449J50840J25472J31470R3969K27102K26758K94653K30979J80595K21063
$$ y = [662134, 549411, 625782, 682347, 765333, 799943, 784966, 754364, 850219, 864551, 868963, 804234, 859688, 848079, 721436, 820405, 833743, 914297, 953691, 948730, 953055, 991106, 1023509, 979135, 914608, 983089, 1008447, 1124480, 1092083, 1009074, 1062264, 1172970, 1148618, 1104665, 1101562, 1204237, 1208070, 1207491, 1203367, 1254347, 1278328, 1349785, 1391510, 1381950, 1435981, 1528805, 1608751, 1667903, 1693843, 1613550, 1671767, 1713300, 1647866, 1731708, 1797301, 1793395, 1850815, 1965279, 2111652, 2116566, 2253672, 2250770, 2314609, 2327639, 2386703, 2328922, 2405292, 2608342, 2730133, 2788241, 2795743, 2826468, 2897088, 2978872, 3101547, 3253266, 3410421, 3478321, 3580539, 3742320, 3955449, 4106289, 4231761, 4363231, 4457200, 4684302, 4911060, 5205713, 5436692, 5617287, 5838350]
5365E838350K08282L01839L10794L19356K40131L72245L19985L52581M15054M60807
5355I139424N10372N07018N02535M85486O10537P02951N41488N36324N28622N86825
5345A4651582O02184N62604M08045K38546L21786J88075L410M9414k02249k93252
5335A6530145l19320m95398m61318p19697o61936n13712p31810o80111n13642
5326A1433201o18887o04742o14697n30315n51031m81074l91031l61692m51395
5317F828337n00343l32643k78606k74398j63235l64988k06394j60361k70467k44660
5307D032242j90653r5186j30602k00219r4201p2853j70974k29853j76411k6536
5297B644754j34285m5701m3661j24454p6654p4558r9112j02895r2848j0582R5481
$$ y = [5838350, 6046632, 6348471, 6659265, 6978621, 7218752, 7590997, 7910982, 8263563, 8678617, 9139424, 9649796, 10156814, 10659349, 11144835, 11755372, 12458323, 12999811, 13536135, 14064757, 14651582, 15253766, 15816370, 16224415, 16462961, 16784747, 16972822, 16976232, 17025646, 16823397, 16530145, 16210825, 15715427, 15254109, 14534412, 13872476, 13358764, 12626954, 11946843, 11433201, 10814314, 10209572, 9594875, 9064560, 8513529, 8032455, 7641424, 7279732, 6828337, 6327994, 5995351, 5716745, 5442347, 5279112, 4914124, 4707730, 4547369, 4276902, 4032242, 3841589, 3746403, 3615801, 3415582, 3321381, 3248528, 3077554, 2847701, 2671290, 2644754, 2510469, 2464768, 2421107, 2296653, 2219999, 2145441, 2046329, 1943434, 1850586, 1840004, 1935485]
5286A935485q5347j22760P497j07326o1334K9330L1121q3734r0176q2802o1548
5275A308406p436J7807l1037O7760L129j75333R335K6614K3813p2469n7943j8682
5263A093964r699l6504l1195q4098j2907j5829m856q3069N491K4492n1957p4203
5251G19630M2796R2386j217l1040N2385R856q6803m0502M767o6279P3382J07784
5239H77145p2900k8947k1603n582j35633J48825L1367j28675k3756N6689o474
5228F90456p3852L3194M3970L938M4848j9172j06619K128j4098m3823m4712j043
5216E15215l9676Q7967o8685J3799P6462m0532J0731k0582O5459q1512l7919j27953
5204C52774P2365J06695l0614L1439K3896K6714l78j39162J03268M0616m0694
$$ y = [1935485, 1850138, 1727378, 1734875, 1627549, 1566215, 1595545, 1626666, 1542932, 1452756, 1369954, 1308406, 1300970, 1318777, 1287740, 1355500, 1358629, 1183296, 1192631, 1219245, 1243058, 1170589, 1112646, 1093964, 1084265, 1047761, 1016566, 932468, 919561, 903732, 898876, 815807, 821298, 845790, 793833, 719630, 762426, 854812, 853595, 822555, 874940, 884796, 797993, 757491, 762258, 695979, 769361, 877145, 804245, 775298, 753695, 748113, 612480, 761305, 792672, 663997, 640241, 696930, 690456, 616604, 649798, 693768, 697706, 742554, 723382, 616763, 618891, 604793, 560970, 516258, 515215, 475539, 563506, 494821, 508620, 585082, 544550, 555281, 534699, 600158, 518646, 480727, 352774, 425139, 531834, 501220, 532659, 556555, 583269, 582891, 443729, 546997, 587613, 546919]
5193E46919L8373j5316Q9522j02818j3535j3295p7080k6336o0949l3271J12442
5182D44656O813n9988r886M5735J3634M4557M0296j41465J6534K3440Q381K3141
5170D55848j03643m0084j7464L100L4569j717m1977Q0265p400j7956K1596J20140
5158D85277p8864o529k7655o7024Q7816l2975l0490J1631P6224j02070L6143j03656
5146B47828r7041O0056R6045J05927k2696o017l6519M471o174r7981K772N2203
5134C02874K0467m8860j1760l9117P0448O5182P8089m2029o3631m8799l251P8994
5122C58607K983o434l6368l3990n3677L1465P0872M018K1801n0173J00148O5207
5110D74459R153M6884j03050m6841L8046J5695j7910q6295O225N4625M6311M2587
$$ y = [546919, 585292, 569976, 659498, 556680, 543145, 529850, 452770, 426434, 365485, 332214, 444656, 451469, 391481, 381595, 427330, 440964, 485521, 525817, 384352, 400886, 424326, 432707, 455848, 352205, 312121, 294657, 297757, 332326, 330609, 288632, 368897, 361497, 343541, 365137, 485277, 406413, 399884, 372229, 305205, 393021, 360046, 329556, 341187, 417411, 315341, 351484, 247828, 150787, 210843, 306888, 412815, 390119, 384102, 347583, 352054, 345880, 247899, 250671, 302874, 323341, 274481, 262721, 223604, 294052, 359234, 437323, 395294, 331663, 282864, 279613, 358607, 361590, 355156, 318788, 284798, 231121, 262586, 333458, 337476, 359277, 309104, 409252, 474459, 483612, 530496, 427446, 380605, 418651, 434346, 416436, 330141, 336366, 390991, 437302, 479889]
5098D79889j6819l3573j48563p3396J20332Q5413K01147n0099j23935N3462j7870
5087D75988R760j64924l8366M9812L2029o6295K2871O7082K055l3034K2291r6072
5075B83197k6055J61356K1234J02535M0005q9770m1397L9130J11032j4880p0051
5064E16336j7483J16068M1519j9L0655m1217M2840M8293p0075K338o4482l1654
5052E73119O1371m7908p066O5893N264L4415o2884p4814N5852O6073j40400k0874
5040E08041J35329m8058P565N4669N9864N565m958j3045K305o6060l3552J4005
5028F21670k1470K761M095J4274l5218p9170N9476J13985l4566L1177K1617O0065
5016G58696q0342p734j56229j3283R6755j0154J2549J14709O8082o7034J03034
$$ y = [479889, 463070, 429497, 280934, 207538, 327870, 413283, 614430, 564331, 440396, 493858, 475988, 485748, 320824, 282458, 332270, 364299, 298004, 320875, 387957, 390012, 356978, 379269, 283197, 257142, 418498, 439732, 542267, 582272, 492502, 451105, 490235, 601267, 586387, 516336, 498853, 614921, 656440, 656421, 687076, 645859, 688699, 736992, 666917, 669255, 604773, 573119, 634490, 586582, 579516, 645409, 650673, 685088, 622204, 547390, 603242, 669315, 528915, 508041, 643370, 595312, 602877, 657546, 717410, 722975, 718017, 704972, 707277, 641217, 607665, 621670, 600200, 602961, 607056, 621330, 586112, 506942, 566418, 680403, 645837, 677014, 698631, 758696, 678354, 670620, 514391, 501108, 597863, 587709, 600258, 714967, 783049, 716015, 819049]
5005H19049j06786O7240Q2693j3546j9700j7768j5228O538L0672P4N7828m4597
4993H46469O7853R4926k7159K148J609L3337J2855J19361m1802O5173O9727n407
4981A239090O7057J13780L2229K818k0869O0756Q4143j07713j9022O031R835l2352
4969A435783j16007J0875K3275L7548k3521L2791N0421o9194j13607N1134P1257
4958A390755j03019J21148R7268J20790r2118m6407Q1799K2978J4925P0973K6388
4947A705480N7974J05884j0532J7656n0686R0832J32616O7007R1813O4555R5487
4936B368086J96450J79848J39060J27426J80480K20228J78456K46183L31912L69257
4926D537386M71357N08990N94522O70822Q70418J020817R64195R74140P36477
$$ y = [819049, 712263, 779503, 862196, 848650, 828950, 811182, 795954, 802492, 833164, 833238, 891066, 846469, 914322, 1009248, 982089, 984237, 985846, 1019183, 1032038, 1151399, 1109597, 1174770, 1244497, 1239090, 1306147, 1419927, 1452156, 1454974, 1434105, 1494861, 1579004, 1471291, 1452269, 1458300, 1468135, 1435783, 1319776, 1330651, 1353926, 1391474, 1367953, 1400744, 1451165, 1381971, 1268364, 1319498, 1390755, 1287736, 1408884, 1506152, 1626942, 1534824, 1488417, 1570216, 1593194, 1608119, 1679092, 1705480, 1763454, 1869338, 1858806, 1876462, 1825776, 1916608, 2049224, 2116231, 2208044, 2272599, 2368086, 2564536, 2744384, 2883444, 3010870, 3191350, 3411578, 3590034, 3836217, 4168129, 4537386, 5008743, 5517733, 6112255, 6783077, 7653495, 8674312, 9638507, 10612647, 11349124]
4917A1349124N15846K72034p3658k06013p34757r40522q86116r36348p55537q56017
4907F748036o48441o70168n55731m38637m28848l41404k45160k11220k16170k40246
4897B752011j76560o9137j16996r9471j00827j16936j34295j31851j04385o5516
4887A636037o4115L0506O2835O7986n4432J9931o9979J25247K1471K5317K0567
4876A821371R2136J20572K1850K7561Q9342K868J54708J12944K2220J31128J87787
4865B784487J65404J67436J39578M9473K10223P9741K9702K991L962j13129r9997
4854C419871k51684j86396j72146k07832j15250j12535k45964l5962k06207j80164
4844A705731J3337m7651n1085j08473r4935K1760J44319j353O9246M6945j6656
$$ y = [11349124, 11864970, 12137004, 12063346, 11857333, 11122576, 10182054, 9295938, 8359590, 7604053, 6748036, 6099595, 5429427, 4873696, 4435059, 4006211, 3664807, 3419647, 3208427, 2992257, 2752011, 2575451, 2506314, 2389318, 2289847, 2189020, 2072084, 1937789, 1805938, 1701553, 1636037, 1571922, 1602428, 1665263, 1733249, 1678817, 1698748, 1628769, 1754016, 1775487, 1800804, 1821371, 1913507, 2034079, 2055929, 2083490, 2172832, 2175700, 2330408, 2443352, 2465572, 2596700, 2784487, 2949891, 3117327, 3256905, 3306378, 3516601, 3596342, 3626044, 3629035, 3632997, 3519868, 3419871, 3168187, 2981791, 2809645, 2601813, 2486563, 2374028, 2128064, 2092102, 1885895, 1705731, 1719068, 1671417, 1620332, 1511859, 1416924, 1438684, 1583003, 1581650, 1650896, 1697841, 1681185]
4833A681185j36420j20811J19087N4003P9825n1425n3318p4823l6404N8064R3916
4822A612879l3903j47871n2650n0853j8090o9015p1239j1960m4193l5222r1204
4811I86679L9357N628Q75R4984k2606m1126k8703o0840J3162J63532K5467o6782
4799A109627Q378J34967j48244L7437J10463K8663M4111k1322M5857K7291j7362
4788A359866n7395K4302Q7942N0440J4477K526m9411L538j6598o2460M3392J176
4776A401795p52N5070J7830o8671O4012P1729R1142Q9899L5925O4597N440P6238
4764A904254K92O5509J22802K1031K0544Q8938l3276N3458Q8444K7232K23638
4753B582866J27672l8748o1564Q644R5688P9956J26642P7919j5499L9893O4943
$$ y = [1681185, 1544765, 1423954, 1543041, 1597044, 1676869, 1625444, 1572126, 1497303, 1460899, 1518963, 1612879, 1578976, 1431105, 1378455, 1327602, 1309512, 1240497, 1169258, 1157298, 1113105, 1077883, 986679, 1026036, 1031664, 1032539, 1127523, 1104917, 1063791, 1035088, 974248, 987410, 1150942, 1176409, 1109627, 1118005, 1252972, 1104728, 1142165, 1252628, 1281291, 1325402, 1304080, 1349937, 1377228, 1359866, 1302471, 1326773, 1414715, 1465155, 1479632, 1482158, 1432747, 1436285, 1419687, 1357227, 1400619, 1401795, 1401043, 1456113, 1473943, 1405272, 1469284, 1541013, 1632155, 1722054, 1757979, 1822576, 1828016, 1904254, 1904546, 1970055, 2092857, 2113888, 2134432, 2223370, 2190094, 2243552, 2331996, 2359228, 2582866, 2710538, 2671790, 2610226, 2618870, 2714558, 2794514, 2921156, 2999075, 2983576, 3023469, 3088412]
4742C088412R3848J53868J6604J18545K38349M2158J1609J04690J27573N6759
4732D052415O1325J38153R9878J00240J68172J0465J19751R3333J4205j3929j84604
4721D659404o833m8634j08818k8203j41093l4932q0339j03131j05823r7289P0119
4710C974428o6755N6368Q7214q8659J92510J05450P4176J67382J39925Q1834J10003
4699D833876J93174O5461J22429J60020J75606K809L0005K921J54187N3611L7088
4688E831187M2089R1582J16538Q316k8813J32198P0797k2030J09362P0093M9940
4677F471259J24845J65603K5679O8418N5416J25356J98372J48605K05335K31576
4667G820464J12556L5200J24245J95068J63524N7410n4670J33480J08965J78341
$$ y = [3088412, 3182260, 3336128, 3352732, 3471277, 3709626, 3751784, 3763393, 3868083, 3995656, 4052415, 4113740, 4251893, 4351771, 4452011, 4620183, 4630648, 4750399, 4843732, 4857937, 4844008, 4659404, 4652571, 4603937, 4495119, 4466916, 4325823, 4290891, 4210552, 4107421, 4001598, 3904309, 3974428, 3907673, 3964041, 4051255, 3962596, 4155106, 4260556, 4334732, 4502114, 4642039, 4723873, 4833876, 5027050, 5092511, 5214940, 5374960, 5550566, 5553375, 5583380, 5586301, 5740488, 5794099, 5831187, 5873276, 5964858, 6081396, 6089712, 6060899, 6193097, 6263894, 6241864, 6351226, 6421319, 6471259, 6596104, 6761707, 6787386, 6855804, 6911220, 7036576, 7234948, 7383553, 7588888, 7820464, 7933020, 7968220, 8092465, 8287533, 8451057, 8508467, 8453797, 8587277, 8696242, 8874583]
4657H874583K13749K00932J98068K91995J75798J34619L56083L62395L36227L85197
4647A1529646L46512K85504M03307M04707M55535M23374N07827N74352O95384
4638A5626148O44864N48487O17562N50046O82727P42341O55637P60660P93228
4629B1621700P51477P05750O21640O49690O88144P84223P32512O14438N95305
4620B7764879P05278P08681Q71863R05553J097864J225030J244628J364419J458082
4611C7346277J481631J670542J689696J845657J841872J932288K055977K091718
4603E1955658K381341K563059K647845K971658L165459L470792L788612L999578
4595G6944002M439706M934066N410803O137832O831555P553204Q469373R552768
$$ y = [8874583, 9088332, 9289264, 9487332, 9779327, 9955125, 10089744, 10445827, 10808222, 11144449, 11529646, 11876158, 12161662, 12564969, 12969676, 13425211, 13848585, 14356412, 14930764, 15626148, 16271012, 16819499, 17437061, 17987107, 18669834, 19412175, 20067812, 20828472, 21621700, 22373177, 23078927, 23700567, 24350257, 25038401, 25822624, 26555136, 27169574, 27764879, 28470157, 29178838, 30050701, 30956254, 32054118, 33279148, 34523776, 35888195, 37346277, 38827908, 40498450, 42188146, 44033803, 45875675, 47807963, 49863940, 51955658, 54336999, 56900058, 59547903, 62519561, 65685020, 69155812, 72944424, 76944002, 81383708, 86317774, 91728577, 97866409, 104697964, 112251168, 120720541, 130273309]
4587A30273309J1128335J2964850J5230091J7675115K0548326K3486057K5958084
4580B57264167K7437038K7551494K6079438K2647594J7143514J0126383K323701
4573C90573329n770481j3493421j9763817k4516907k7456867k8659138k8240488
4566B42672210k6814674k4540720k1969956j9363270j6886813j4550480j2580553
4559A05965744j0917921r454578q157164p201535o281097n342748m517222l994191
4551E0099288l383076k872681k635567k335933j904712j783066j544708j390429
4543C2249116j255668j099685j004277q30362q05548o64349o09011n39159o24649
4534B4816408n66962n27856n60787n61502n17250p14231o35518o82955n82918
$$ y = [130273309, 141401644, 154366494, 169596585, 187271700, 207820026, 231306083, 257264167, 284701205, 312252699, 338332137, 360979731, 378123245, 388249628, 390573329, 384802848, 371309427, 351545610, 327028703, 299571836, 270912698, 242672210, 215857536, 191316816, 169346860, 149983590, 133096777, 118546297, 105965744, 95047823, 85593245, 77436081, 70234546, 63953449, 58610701, 54093479, 50099288, 46716212, 43843531, 41207964, 38872031, 36967319, 35184253, 33639545, 32249116, 30993448, 29893763, 28889486, 28059124, 27253576, 26589227, 25980216, 25441057, 24816408, 24249446, 23721590, 23160803, 22599301, 22082051, 21367820, 20732302, 20049347, 19466429]
4525A9466429n25276o48542n81345o96347p04023n68708m56522m66958n88718
4516A4229990l64617l39108m39635l04803l85094j95002q5199j73157q4690m3604
4506A1815081j77216j02812l6000p3924o7659o0297r9389q8197M5571j28387j43786
4495A0882985l9529J32979Q6252l0512M6362j4608p179P3132Q3524q472J60642
4484A1365576J50639K46371R8504K2556O7519o8887J05950k8517k45705k25888
4474A1488118j62633l87872n47593l89827m32076l16910l54367l59188l22671
4465H214981m52820l27019k23216k29416l20337k44165k08409j46872l09401j54101
4455E599225r5834l384n6144n1207K0488K6771l4261k7354j2570k0293j0794j8351
$$ y = [19466429, 18941153, 18292611, 17711266, 17014919, 16310896, 15742188, 15285666, 14818708, 14229990, 13865373, 13526265, 13086630, 12781827, 12396733, 12201731, 12116532, 11943375, 11858685, 11815081, 11637865, 11535053, 11499053, 11425129, 11357470, 11297173, 11197784, 11109587, 11155158, 11026771, 10882985, 10843456, 10976435, 11062687, 11032175, 11078537, 11063929, 11056750, 11129882, 11213406, 11204934, 11365576, 11516215, 11762586, 11861090, 11883646, 11951165, 11882278, 11988228, 11959711, 11714006, 11488118, 11325485, 10937613, 10390020, 10000193, 9568117, 9251207, 8896840, 8537652, 8214981, 7762161, 7435142, 7211926, 6982510, 6662173, 6418008, 6209599, 6062727, 5753326, 5599225, 5503391, 5500007, 5443863, 5392656, 5413144, 5439915, 5405654, 5378300, 5365730, 5345437, 5334643, 5316292]
4443E316292O1988Q145K2279k0003l4356L4934k2790N4340j58840j85080P4856
4432E151765R074q6330O5360l315k05142n0676R5718N7342K0421J96280K48173
4421E498670J19126Q5720J11163R1444J84525J26784J28788P7838J0112k13718
4411F220452j73961j75843n6433k70338l74870l24171l62269k34802k77427q3708
4401C886630k69055k17519j60460j61598j60169j22319o2296j05429j82400M003
4391B449388n6959p9751q31r2543o2671O8451j68495q1760j5735n5066o2346r142
4379A832540O0752l7685N0630K2060j4835L4445l1733j25818N4995j16852k8428
4368A700071j45636J06944j14191j26167N2655n0298j02874N0982j044k5377n8788
$$ y = [5316292, 5378280, 5386425, 5408704, 5388701, 5354345, 5389279, 5366489, 5420829, 5261989, 5076909, 5151765, 5160839, 5074509, 5139869, 5136554, 4931412, 4880736, 4976454, 5033796, 5054217, 5250497, 5498670, 5617796, 5703516, 5814679, 5906123, 6090648, 6217432, 6346220, 6424058, 6434170, 6220452, 6046491, 5870648, 5814215, 5543877, 5169007, 4844836, 4482567, 4247765, 3970338, 3886630, 3617575, 3400056, 3239596, 3077998, 2917829, 2795510, 2733214, 2627785, 2445385, 2449388, 2392429, 2312678, 2311847, 2219304, 2156633, 2225084, 2056589, 1974829, 1959094, 1904028, 1841682, 1832540, 1893292, 1855607, 1906237, 1928297, 1913462, 1947907, 1916174, 1790356, 1845351, 1728499, 1700071, 1554435, 1661379, 1547188, 1421021, 1473676, 1423378, 1320504, 1371486, 1370442, 1345065, 1286277]
4357A286277K4470k8463n7456O2917l3514L9281m3602j210k5880l4945K125P0298
4345A260298q6796l4635l5739j6154J45625K3482n7527j2623L3113M4790l7776
4334A226058L4155m8963j30030N5147q2626q9705m5790r8098p3716j42878o7134
4323E36420o85p3538J9290J16360J3407k0195N998J13191O3603j3277o2370M0642
4311G38846J18547N5704J40069L8701j8220j41089L8125J30813l4031O1932j659
4300A127738J4596O9777R025n2129J68297J16923J58781J69394J08780P4957N5141
4289B021280J08568J2870J21125M3986r5215j89314m7646l3695j37595j73032
4279A631332j17006j15137j51102j44179k8400n6300j41847k5698j01970M493
$$ y = [1286277, 1310747, 1282284, 1224828, 1287745, 1254231, 1293512, 1249910, 1248700, 1222820, 1187875, 1190000, 1260298, 1173502, 1138867, 1103128, 1086974, 1232599, 1256081, 1198554, 1185931, 1219044, 1263834, 1226058, 1260213, 1211250, 1081220, 1136367, 1053741, 964036, 918246, 820148, 746432, 603554, 536420, 535735, 462197, 481487, 597847, 611254, 591059, 597057, 710248, 773851, 760574, 698204, 738846, 857393, 913097, 1053166, 1091867, 1073647, 932558, 970683, 1101496, 1067465, 1129397, 1127738, 1142334, 1212111, 1221136, 1169007, 1337304, 1454227, 1613008, 1782402, 1891182, 1966139, 2021280, 2129848, 2142718, 2263843, 2307829, 2212614, 2023300, 1975654, 1941959, 1804364, 1631332, 1514326, 1399189, 1248087, 1103908, 1075508, 1019208, 877361, 851663, 749693, 754186]
4269G54186j0876J22878m6097j48438l8547P9660L0926n2586m7745K201L8151
4258F83713q892J3087j60946l8639q9832l7466L8143j06494M4417L2976n6563
4247C13504m8962l8389P168L9996Q8698n2373o662r4309l4143N2959q082O7628
4235B87033J15830J2569n9152J2589q6516k0469N7416R5546L638R5346k1548k7112
4223D65170O4452p6317K5974O8301J28267j45526l5496J20023L1539O3373o447
4212G03313J34151J16795Q989P8493J93371J44014K30486J15900q324q9684o8960
4201A558544m1813j30555p2662j63062j44239l1804J454n5640k9901k8456n1164
4190H10702k5613j71460k4942k4587J7050Q5085M7904r8929j8690k7028q1063
$$ y = [754186, 743310, 866188, 820091, 671653, 633106, 712766, 743692, 691106, 643361, 645562, 683713, 674821, 687908, 526962, 488323, 398491, 361025, 399168, 292674, 337091, 370067, 313504, 264542, 226153, 233321, 273317, 362015, 309642, 302980, 208671, 174528, 227487, 219405, 287033, 402863, 415432, 356280, 368869, 282353, 261884, 319300, 414846, 418484, 513830, 492282, 465170, 529622, 453305, 479279, 547580, 675847, 530321, 494825, 614848, 646387, 709760, 703313, 837464, 954259, 963248, 1041741, 1235112, 1379126, 1609612, 1725512, 1717188, 1627504, 1558544, 1516731, 1386176, 1313514, 1150452, 1006213, 974409, 975863, 920223, 890322, 861866, 810702, 785089, 613629, 588687, 564100, 581150, 666235, 714139, 615210, 596520, 569492, 488429]
4179D88429k8653N6640K360p6912r866m1005J6897R2995o2819l7686p0382n5371
4167B74627J0246L9207O8640o0170L1740n17j45875q664J18640J4593J35o3705
4155B78897L1252r7496P0681K796m0893J94861k4711p599K8673K5312J18452o9387
4143E10838n0958J14N9231J0321p9492M9732J1295m6646M2165R7355Q457j38450
4131D73962m1033k5878Q3952J12672J5811K6881R040l0201K0169J177k4498j54934
4119D67120N7830j1854K4932l5422l4402K8700J2417p149J3513j5325r2049p5227
4107C33084j2940J21323N766M1915M7701j04924N406j791j23046Q4388k6935O0242
4095D30189M6985j24614k6677J5910k8396k5314J68657P0813k1753j9543j8428
$$ y = [488429, 459776, 516416, 518776, 441864, 431998, 390993, 407890, 500885, 438066, 400380, 329998, 274627, 284873, 324080, 392720, 332550, 364290, 363773, 217898, 209234, 327874, 342467, 342602, 278897, 310149, 212653, 283334, 286130, 245237, 440098, 415387, 407788, 436461, 461773, 580225, 510838, 459880, 459994, 519225, 529546, 450054, 499786, 511081, 464435, 506600, 603955, 612412, 473962, 432929, 407051, 491003, 603675, 619486, 646367, 655407, 625206, 645375, 646552, 622054, 467120, 524950, 513096, 538028, 502606, 468204, 496904, 509321, 502172, 515685, 500360, 408311, 333084, 320144, 441467, 447233, 489148, 536849, 431925, 437331, 435540, 312494, 396882, 369947, 430189, 477174, 352560, 325883, 341793, 313397, 288083, 456740, 527553, 505800, 486257, 467829]
4084D67829o0065P9873l5565l2430J08200M1158J16118k02438l6832k1360J02283
4073E26771Q8747M2687m0960K7507Q2489R458j7688R4759J03195k664q979l6144
4061H69178O2243N1276L1149j6757J0561J16374J29990J99849J25197J06735K24656
4050A910451K11232R3947k0009M2763J19876r1363j13846o7246k44606j21317
4040A719882p8982q4860j35752j54042q9897j51911n845q2932J9731o0588n4918
4029H39886J45536j9844P633j0344O9511J15201J43744N1909K08168J15414J45647
4018A812461J44770R0673r019Q2841M5854n2592j87644k55940j61552j67489l5158
4007A307205k32273r4708p8421n5969n6022k1525j01009o3548j36513p3082L6563
$$ y = [467829, 407764, 487637, 452072, 419642, 527842, 569000, 685118, 482680, 445848, 424488, 526771, 615518, 658205, 617245, 644752, 727241, 736699, 719011, 813770, 916965, 914301, 905322, 869178, 931421, 982697, 1013846, 997089, 1007650, 1124024, 1254014, 1453863, 1579060, 1685795, 1910451, 2121683, 2215630, 2195621, 2238384, 2358260, 2266897, 2153051, 2085805, 1841199, 1719882, 1640900, 1556040, 1420288, 1266246, 1176349, 1024438, 1018593, 935661, 955392, 894804, 839886, 985422, 965578, 973211, 962867, 1032378, 1147579, 1291323, 1343232, 1551400, 1666814, 1812461, 1957231, 2047904, 2038885, 2121726, 2167580, 2114988, 1927344, 1671404, 1509852, 1342363, 1307205, 1074932, 980224, 901803, 845834, 789812, 768287, 667278, 603730, 467217, 394135, 430698]
3996D30698J946l8188k0469O143K0867Q82p1378m5290K2876l0879m6652n8071
3984A72485N2593J9260j5052k4084o4521j4907j5223R7303R076p2703M0676J219
3972A86122L8952m9892r590M9037r4991l4288j0417k2279p1752R3886j25928o4333
3960a15473P5516L435J28031Q5594p1982j05781M5739P9245j6878J3065o0184
3949F0327M4493m8977L2512J14410R6461q1271L4084L4659k9828N8310j30201
3938A84979J6534O4440p1223L5363k7561r8643P03O3698p6850Q3041k7759j11401
3926C5321J32168M8736o308n2274K6816q8978j1758M9427j0382L7553k4619r8543
3914C7159K2158R3572M9118J244P8353K186m1166o1352J8745o2914N5240M1172
$$ y = [430698, 432644, 394456, 373987, 380130, 400997, 401879, 330501, 285211, 308087, 277208, 230556, 172485, 225078, 244338, 229286, 205202, 140681, 125774, 110551, 207854, 216930, 144227, 184903, 186122, 225074, 175182, 165592, 214629, 119638, 85350, 74933, 52654, -19098, 74788, -51140, -115473, -39957, -36522, 91509, 177103, 105121, -660, 45079, 124324, 107446, 120511, 60327, 104820, 55843, 88355, 202765, 299226, 217955, 252039, 286698, 256870, 315180, 184979, 201513, 265953, 194730, 230093, 202532, 103889, 104592, 168290, 91440, 174481, 146722, 35321, 167489, 216225, 209917, 157643, 184459, 95481, 83723, 133150, 122768, 160321, 135702, 37159, 59317, 152889, 202007, 203251, 281604, 283790, 242624, 181272, 200017, 137103, 192343, 233515]
3902B33515m3525P958o2385n0340J23762L7081k73l5789Q0872k1657q4418R8368
3890B83169j2818O3464m6674l5883L6602L1740m7946L0740j0016J4903j9609K5280
3878C12952K6811o0597J00291J4051n2866J8119J02094N0340M422m3865n9053
3867D12699R6312j01128k3273n6221P7530O512p710j9851L4507j860k4385m2595
3855C50537K8377R6041m8439n531R0072q145o9639O2677M5753M1205q7187J4146
3843E09867J6753j8229j6620L6735r931P615k7757K6511N8769L7853M8017Q7561
3831G57144q6825k7820Q3725M3825m2755L3881P3359O7926L1508o7219O6081N3966
3819I86796j6934Q5424N8812J8126k5790Q0028J42411J9871j9012J1977m2814
$$ y = [233515, 189990, 197948, 135563, 85223, 208985, 246066, 245793, 210004, 290876, 269219, 184801, 283169, 270351, 333815, 287141, 251258, 287860, 319600, 271654, 302394, 292378, 307281, 287672, 312952, 339763, 279166, 379457, 393508, 340642, 358761, 460855, 511195, 515617, 471752, 412699, 509011, 407883, 384610, 328389, 405919, 412431, 404721, 384870, 419377, 417517, 393132, 350537, 378914, 474955, 426516, 420985, 511057, 502912, 433273, 495950, 541703, 582908, 495721, 509867, 526620, 508391, 491771, 528506, 518575, 526190, 498433, 524944, 583713, 621566, 669583, 757144, 670319, 642499, 726224, 770049, 727294, 761175, 834534, 902460, 933968, 866749, 932830, 986796, 969862, 1055286, 1114098, 1132224, 1106434, 1186462, 1328873, 1348744, 1329732, 1341709, 1298895]
3808A298895J7451N8767m2999J5639J2429n8968o3983o8393L4034n1761J3702
3797A164813M1675j09948j5859P7745R3399m4415N2402N0529j1546j5241N9288
3786A342842J21625l1417m0735L6282J6809J48224K5861l6007k8896k0196M4318
3775A578710J877r6054j01868N3464m4799m4896J16712k9603k2499L6160N9373
3764A506577n1627j2780N2133j0658O2338J29875P9221J3338k7651P1025Q9677
3753A901468P2981J77607l5854J61267N2748R284j5272J9811N6513N7461m6955
3742B411059n5530N4949P0458n3351q5174P7638p828R725K16735O8197j3726R9760
3730B792912O7890P2027J16915p7143n4210N5698L8808J4848p5134J1301J3591
$$ y = [1298895, 1316346, 1375113, 1332114, 1347753, 1360182, 1301214, 1237231, 1168838, 1202872, 1151111, 1164813, 1206488, 1096540, 1080681, 1158426, 1251825, 1207410, 1259812, 1310341, 1298795, 1283554, 1342842, 1464467, 1433050, 1392315, 1428597, 1445406, 1593630, 1619491, 1583484, 1554588, 1534392, 1578710, 1580587, 1484533, 1382665, 1436129, 1391330, 1346434, 1463146, 1433543, 1411044, 1447204, 1506577, 1454950, 1442170, 1494303, 1483645, 1545983, 1675858, 1755079, 1768417, 1740766, 1811791, 1901468, 1974449, 2152056, 2116202, 2277469, 2330217, 2339501, 2324229, 2344040, 2400553, 2458014, 2411059, 2355529, 2410478, 2480936, 2427585, 2342411, 2420049, 2412221, 2421946, 2638681, 2706878, 2693152, 2792912, 2860802, 2932829, 3049744, 2972601, 2918391, 2974089, 3012897, 3027745, 2952611, 2963912, 2977503]
3719B977503O6516j1659p3103j17373q5206j5572o6166j50632k3334K1437O7316
3708B589727L772m5084M4656L1342M3245J10922o2575N6000O060k4982M4400p693
3696B789790N7568J25574j03358J36321r2765j32472k0769O7794m159j42576O8691
3685B749639m117M0224Q5795M0165p7173M509M7466J35449P9623J07493o5551
3674C143522K9697J03569Q8782J91784P2499R1585J23278J41203J88680J67499
3664D342098L3139j8333J08883K776K8400k0024O4410J92563N8008l1027j00627
3653D660266j85714Q8876n3453m7817P4953r7808K7675r5656p8100P1419N1045
3642D415686J6943l3989k7029O3773J07909N4533j6867L694J84798K10235k2710
$$ y = [2977503, 3044019, 3032360, 2959257, 2841884, 2756678, 2741106, 2674940, 2524308, 2500974, 2522411, 2589727, 2593499, 2548415, 2593071, 2624413, 2667658, 2778580, 2716005, 2772005, 2778065, 2753083, 2797483, 2789790, 2847358, 2972932, 2869574, 3005895, 2913130, 2780658, 2759889, 2827683, 2823524, 2680948, 2749639, 2745522, 2785746, 2871541, 2911706, 2834533, 2839042, 2886508, 3021957, 3101580, 3209073, 3143522, 3173219, 3276788, 3365570, 3557354, 3629853, 3721438, 3844716, 3985919, 4174599, 4342098, 4375237, 4356904, 4465787, 4468563, 4496963, 4476939, 4541349, 4733912, 4791920, 4760893, 4660266, 4474552, 4563428, 4509975, 4462158, 4537111, 4439303, 4466978, 4371322, 4293222, 4364641, 4415686, 4432629, 4398640, 4371611, 4435384, 4543293, 4597826, 4580959, 4584653, 4769451, 4979686, 4956976]
3631D956976J67544J28068J0511J79764J61221K03590P1663k0984J40373K3686
3621F022412j83003J424L217j49790p5602j30353j55835k17252j46157j55200
3611D813861k04463k09631j37389o7660j57230j25983l2384j4874q2718j8697
3601C762832j108j17126K3073M1980Q240o1007p5188j25994j31614L7976m5439
3590C316625n5446m8230o9758K9061p5141l1917L8548j05466j4946m9387j9257
3579B914686j14248q9541l989N5369K0412r7344M6857M6197J3239k08N2282R7441
3567B941153j2789m7935q5207p0515M9056O5147P4462j8385k5098L4406O9505
3556B973800M7066r207k7055K5475N4710m6848L0183N5569J68110r489j6717L6065
$$ y = [4956976, 5124520, 5252588, 5263099, 5442863, 5604084, 5807674, 5879337, 5858353, 5998726, 6022412, 5839409, 5840833, 5844050, 5694260, 5618658, 5488305, 5332470, 5115218, 4969061, 4813861, 4609398, 4399767, 4262378, 4194718, 4037488, 3911505, 3879121, 3864247, 3781529, 3762832, 3761724, 3644598, 3667671, 3709651, 3717891, 3656884, 3581696, 3455702, 3324088, 3362064, 3316625, 3261179, 3212949, 3143191, 3172252, 3097111, 3065194, 3103742, 2998276, 2983330, 2933943, 2914686, 2800438, 2710897, 2706908, 2762277, 2782689, 2685345, 2732202, 2778399, 2791638, 2791430, 2843712, 2941153, 2928364, 2880429, 2795222, 2724707, 2773763, 2838910, 2913372, 2894987, 2869889, 2904295, 2973800, 3020866, 3011659, 2984604, 3010079, 3064789, 3017941, 3048124, 3103693, 3271803, 3262314, 3245597, 3281662]
3544C281662l1426p1171p0452j4815p8646r9699p3741r0226o5146o0871j14248
3533B511221m3969n9304o5036q3970K5516o211m8936M6990p7887J4476M8352R7712
3521B358954m8091K5317J20901n3271O9836N4602N5009q429R5816n91l7882K8693
3509B660864j28354j45548o1877n0768j25166j11430m9202k11979n0297O3867
3499A790110n6074l8436j42149k0633j13058R7589M397k5394n5205j5871J57647
3488A582923K592p3615l5090m0883m1535l4209J12064q8649p2483O7442p8231
3477A300326r254j6752l6543j603J0748q7029j62408M7289J05787j22025m3302
3466I85234M1478P689j0754J29246r771J9798q500l5770L6144J26543K204p2354
$$ y = [3281662, 3250236, 3179065, 3108613, 3093798, 3015152, 2915453, 2841712, 2751486, 2686340, 2625469, 2511221, 2467252, 2407948, 2342912, 2258942, 2284458, 2278247, 2229311, 2276301, 2198414, 2212890, 2261242, 2358954, 2310863, 2336180, 2457081, 2403810, 2473646, 2528248, 2583257, 2574828, 2670644, 2670053, 2632171, 2660864, 2532510, 2386962, 2325085, 2274317, 2149151, 2037721, 1988519, 1776540, 1726243, 1790110, 1734036, 1695600, 1553451, 1532818, 1419760, 1517349, 1521746, 1496352, 1441147, 1425276, 1582923, 1585515, 1511900, 1476810, 1435927, 1394392, 1360183, 1472247, 1383598, 1311115, 1378557, 1300326, 1291072, 1274320, 1237777, 1236174, 1246922, 1159893, 997485, 1044774, 1150561, 1028536, 985234, 1026712, 1034401, 1023647, 1152893, 1143122, 1162920, 1154420, 1118650, 1154794, 1281337, 1283541, 1211187]
3454A211187j0124L3090K4583P8130j08144J16833L1314o1977o1938l5826n1583
3443A165545R723O2513K1820m2797j3117n466M9536N0131J7786k8360j7409N6992
3431A326897k4245J0304L9104K9079N6209k5420K31306J8489N5667N1505j06072
3420A662823N2591R3320P3195J2004K05023L0378K6698J11700J21090P9442J99012
3409B667276J04302P9015J39157L26877R5648P1222J76572J49732J23529n117
3399C928213N0884O0131j3161J28893J1784l1677k2279j17008k9294J92455P8295
3388D237236n3322Q451P0465M6452l9443J3818J733K4020K2681q147J12459O1061
3376D497464J48546K13268J92127J43424K57247J95547L42908J98585J70059K90625
$$ y = [1211187, 1201063, 1234153, 1258736, 1336866, 1228722, 1345555, 1376869, 1314892, 1252954, 1217128, 1165545, 1175268, 1237781, 1259601, 1216804, 1203687, 1198221, 1247757, 1297888, 1315674, 1287314, 1269905, 1326897, 1302652, 1312956, 1352060, 1381139, 1437348, 1411928, 1643234, 1661723, 1717390, 1768895, 1662823, 1715414, 1808734, 1881929, 1893933, 2098956, 2129334, 2156032, 2267732, 2388822, 2468264, 2667276, 2771578, 2850593, 2989750, 3316627, 3412275, 3483497, 3660069, 3809801, 3933330, 3928213, 3979097, 4039228, 4026067, 4154960, 4166744, 4135067, 4112788, 3995780, 3966486, 4158941, 4237236, 4183914, 4192365, 4262830, 4309282, 4269839, 4283657, 4285390, 4309410, 4332091, 4323944, 4436403, 4497464, 4646010, 4859278, 5051405, 5194829, 5452076, 5647623, 5990531, 6189116, 6359175, 6649800]
3366F649800L60065J98436J18907J96666J1612J504l0106j51707j98803k54048
3356F902326j33610j42347j47787p9890j13222j86018j23341j18357k38715k35301
3346E383738j16603j73482q7162q4854k87746j06817m4616Q3360k1513j1120q2353
3335D450832M9576J34582P5665J22662J55567K0225k8516L5711J13444m8564j66284
3324D914900j62352k6679k4164j1471j76985k09610j06078q8842j16345j34717
3314C857657m1610k48600j19888j15215p1377j33993j83026j07454k48984o5261
3304B522249j58671q5564m8352o6501n5298P703j25455m578O4543k8613m3354
3293A978109j3657l4189j29442J6798M8341Q668m3667l1128r7360q2923M4684
$$ y = [6649800, 7009865, 7208301, 7327208, 7523874, 7535486, 7536990, 7506884, 7355177, 7156374, 6902326, 6768716, 6626369, 6478582, 6398692, 6285470, 6099452, 5976111, 5857754, 5619039, 5383738, 5267135, 5093653, 5006491, 4921637, 4633891, 4527074, 4482458, 4565818, 4544305, 4533185, 4450832, 4500408, 4634990, 4710655, 4833317, 4988884, 5009109, 4980593, 5016304, 5129748, 5081184, 4914900, 4752548, 4725869, 4701705, 4690234, 4513249, 4303639, 4197561, 4108719, 3992374, 3857657, 3816047, 3567447, 3447559, 3332344, 3260967, 3126974, 2943948, 2836494, 2587510, 2522249, 2363578, 2278014, 2229662, 2163161, 2107863, 2115566, 1990111, 1985533, 2050076, 2021463, 1978109, 1964452, 1930263, 1800821, 1817619, 1865960, 1874628, 1830961, 1799833, 1702473, 1619550, 1664234]
3282A664234j0011j53025P1186n4718m5446R7395K2823n080r6069l3530J0630
3271A468389L4454N0149q3428m35N6610m3765j7657k1351J260J6564j3555q9739
3259A357496j7911K640m122j17364J6295Q9964r2665N779q9702m0423n092o0761
3247A044134j5207m4022r0881N3546J18814j7179o7629n8364n1683K3604L6845
3236I31978o4522p1306q4765k3502j4467Q5356q5967j19274j9567k1390L852o1975
3224D54451j19504O9427J56425m9267n5708k8569j55224j7089J88829l6453Q382
3213D15700l516m2640o1445O4753o4549L8028J6477j03063n3465M4890M1329j63905
3201A28594p946Q5479r8711p1014P4938L978P789N4460M9596O9018m3621j40279
$$ y = [1664234, 1654223, 1501198, 1572384, 1517666, 1472220, 1569615, 1592438, 1587358, 1491289, 1457759, 1468389, 1502843, 1552992, 1469564, 1469129, 1525739, 1481974, 1464317, 1442966, 1444226, 1460790, 1447235, 1357496, 1339585, 1342225, 1338103, 1220739, 1237034, 1326998, 1234333, 1240112, 1150410, 1109987, 1104895, 1044134, 1028927, 984905, 894024, 947570, 1066384, 1049205, 981576, 923212, 871529, 895133, 931978, 867456, 796150, 711385, 687883, 673416, 758772, 672805, 553531, 533964, 512574, 516426, 454451, 334947, 404374, 560799, 511532, 455824, 427255, 272031, 254942, 443771, 407318, 415700, 412184, 369544, 308099, 372852, 308303, 346331, 362808, 259745, 206280, 251170, 292499, 128594, 120648, 206127, 107416, 36402, 111340, 115318, 123107, 177567, 227163, 296181, 252560, 112281]
3189A12281q496n1501P3784m7859L4420M9658j56460k1567J3577n5363N3900j15685
3177a19311J76811J80150j03037r5395j6299k9496p8065P4541N30n676K659k306
3165a4894n550P8811m0353j3322m2794P5830N6343l7243L3652J08455j44849j33180
3153g9094J33918K4378K5580J01962j66981n9214O3464m8598k7565N2235R31O0770
3141H1786O4142j04585k2342o5726K9896M6468Q511J474n943K1129j5732O9709
3129A08787J05241m7993j7381R913K85j605o5498l2258Q1506j7852L6939m2232
3117A17852k6132k7486L4867J43001l6744j6407P3318m8309o5147Q1467o0870
3106A69410l1045K0289J17660k5237N228Q7753k957n5674O638J3669O2163o1949
$$ y = [112281, 103785, 52284, 126068, 78209, 112629, 162287, 5827, -15740, -2163, -57526, -3626, -119311, 57500, 237650, 134613, 39218, 22919, -6577, -84642, -10101, -9571, -15247, -12588, -14894, -20444, 58367, 18014, 4692, -38102, 37728, 94071, 56828, 90480, 198935, 54086, -79094, 54824, 79202, 104782, 206744, 39763, -19451, 44013, -4585, -32150, 20085, 21016, 81786, 145928, 41343, 19001, -46725, -16829, 29639, 38150, 39624, 33681, 54810, 39078, 108787, 214028, 166035, 148654, 158567, 158852, 157247, 91749, 59491, 140997, 123145, 160084, 117852, 91720, 64234, 99101, 242102, 205358, 188951, 262269, 213960, 148813, 230280, 169410, 138365, 158654, 276314, 251077, 256305, 344058, 341101, 285427, 292065, 305734, 367897, 305948]
3094C05948R3163P7424m2653K4197L5560j24478n5144P5306p1939J29755Q4685
3083E31824o069j01946o9450N0388M0896n7089M3986m9452k531J5092n5900k0996
3071C18753n2649O4216M4564m8484Q0375K1984L9485P6482N3075O2303l0755j03849
3059E25500j1498R82R2283J08880n2435l9289O7225J8294j5177J0352J12813J1225
3047H29155J2312K0323K8214n6044N5474N4906R775r417l3636J26350O5580M5362
3035A148354m531M1888O6259P2164M4409o8815J22634J01034m3453n4961L0306
3024A455288J10067M8769K7212L7124P3795M0785K5226P1380n74o929J43523J45627
3012B171293j5842p8806M9900j00652j5698O0395p693Q6614J08101r652N0813
$$ y = [305948, 399111, 476535, 433882, 458079, 493639, 369161, 314017, 389323, 317384, 447139, 531824, 525755, 423809, 354359, 404747, 445643, 388554, 432540, 383088, 380557, 395649, 339749, 318753, 266104, 330320, 374884, 326400, 406775, 428759, 468244, 544726, 597801, 660104, 629349, 525500, 514002, 514984, 607267, 716147, 663712, 624423, 691648, 709942, 694765, 705117, 817930, 829155, 841467, 861790, 890004, 833960, 889434, 944340, 954115, 944698, 911062, 1037412, 1102992, 1148354, 1143823, 1185711, 1251970, 1324134, 1368543, 1299728, 1422362, 1523396, 1479943, 1424982, 1455288, 1565355, 1614124, 1641336, 1678460, 1752255, 1793040, 1818266, 1889646, 1889072, 1882143, 2025666, 2171293, 2155451, 2076645, 2126545, 2025893, 2010195, 2070590, 2062897, 2149511, 2257612, 2247960, 2298773]
3001B298773Q9990O6715L5066J1274J39301P7864M6584L058M8239j630j5851J8391
2989B817774l6115N6087J2055J62331O0711K966L4129J05446K2777m8444l4564
2978C155153k0269R4374K9843k2143m9150r7935r3790j18652k1664m8242M0840
2967B848365n4448q0516L5944L1338j2812j4477j04233j02086J0805n336J0561
2956B563105l7161K4193O4817j86693j739J59131o5772k7189j22232n3704M2441
2945B359197R6730N7701q0596m8855j07453N1156j4469j05445n9554j32601j49491
2934A866320j23165L6861n6909K2550j31959k20041k6832k4363j11780j08687
2924A121995K3609J28191N6460n4941j29652j18100J5207M0395q529j38775N40
$$ y = [2298773, 2388763, 2455478, 2490544, 2501818, 2641119, 2718983, 2765567, 2768625, 2816864, 2815234, 2799383, 2817774, 2781659, 2837746, 2849801, 3012132, 3072843, 3075809, 3109938, 3215384, 3238161, 3189717, 3155153, 3134884, 3229258, 3259101, 3236958, 3187808, 3089873, 2996083, 2877431, 2855767, 2807525, 2848365, 2793917, 2713401, 2749345, 2780683, 2767871, 2753394, 2649161, 2547075, 2557880, 2552544, 2563105, 2525944, 2550137, 2614954, 2428261, 2426522, 2585653, 2519881, 2492692, 2370460, 2316756, 2359197, 2455927, 2513628, 2433032, 2384177, 2276724, 2327880, 2313411, 2207966, 2148412, 2015811, 1866320, 1743155, 1780016, 1723107, 1745657, 1613698, 1393657, 1366825, 1342462, 1230682, 1121995, 1145604, 1273795, 1330255, 1275314, 1145662, 1027562, 1042769, 1083164, 1074635, 935860, 936400]
2913I36400k8533K0040M0700j04830N719r7002j70061N2913J0297n4499l4609
2902E76535O9872m5672l6788j03013k5001j1401j21004N9212L4193k3128j19588
2891B54217J9360K4982J1615j52511j62383o1526J48414K3479K8518K813m6643
2880I0335m2468j7754Q5533m5683K8660K8072L674L6413Q595j47325o769J6837
2868C8120j16198J7076o0557K8664K545R462P4843p8126p9713R3790j3277m168
2856h7539J0967L18n4038j8327j9542l9203P772j8885j2734J06838m0678n2494
2844b17545m2399M9941P6485O4420Q93k1398O701l9615m7129O121L9174R0211
2832c4140P8840n4453j810k1182j3243k9417o2999n3338k0236l7133N9632J8795
$$ y = [936400, 907867, 927907, 968607, 863777, 869496, 772494, 602433, 655346, 665643, 611144, 576535, 646407, 600735, 563947, 460934, 435933, 424532, 303528, 362740, 396933, 373805, 254217, 273577, 298559, 310174, 157663, -4720, -66246, 82168, 105647, 134165, 136978, 90335, 47867, 30113, 115646, 69963, 98623, 126695, 130369, 166782, 175377, 28052, 21283, 38120, -78078, -61002, -121559, -92895, -90350, -80888, -6045, -84171, -163884, -70094, -83371, -87539, -76572, -76254, -130292, -148619, -168161, -207364, -199592, -218477, -231211, -124373, -165051, -217545, -259944, -210003, -133518, -69098, -68205, -89603, -82902, -122517, -169646, -163525, -124351, -34140, 44700, -9753, -11563, -32745, -45988, -75405, -138404, -191742, -211978, -249111, -189479, -170684]
2820a70684N0492L8928p7222K9575o7889P6910j4793j19895Q0664M7972J4248
2809a11694j02039j1021j1077N616j212k8681k4619J53971k062L2241J4121J3244
2797g3212Q717o5429N2631N728J4714m702m7932Q5689n6865l5744K1705l1789
2785a26489M7460O4797q2827L9763n665O3660M2750k6474m7028M0418o3569p3127
2773a26331J3800J39543J16666L2303J5237m5657p9550N2373M8809J8551O5051
2762B50795J6777N095Q0684m358K6047O777k5299j68958k7349P1822m9643q093
2750A74297j06577J9654p4855m8638O5509k1287P053j16q9741Q936J8465R1781
2738D4481m1754l8759m2315l2021o4810l739k8616Q965M4885j3279m7296K20793
$$ y = [-170684, -120192, -81264, -158486, -128911, -196800, -119890, -134683, -254578, -173914, -125942, -111694, -213733, -224754, -235831, -230215, -231427, -260108, -284727, -130756, -132818, -100577, -86456, -73212, -64495, -129924, -77293, -71565, -56851, -61553, -109485, -23796, -80661, -116405, -94700, -126489, -79029, -14232, -97059, -57296, -62961, 699, 43449, 16975, -30053, 10365, -53204, -126331, -112531, 27012, 143678, 175981, 191218, 145561, 66011, 118384, 167193, 185744, 250795, 267572, 272667, 353351, 348993, 375040, 381817, 356518, 187560, 160211, 232033, 182390, 174297, 67720, 87374, 12519, -36119, 29390, 8103, 15156, 15040, -74701, -65765, -47300, 44481, 2727, -36032, -78347, -110368, -175178, -178917, -207533, -198568, -153683, -166962, -214258, 6535]
2726F535O6944j29064J2055n7003n7121Q4132J9547M802l1236K1621p1263n9211
2714a89262o7083M7391J34948j04798j8149J16287K0879R4356k0807R2057J6955
2703A22774j36197j8858k666n7157M6087k2837K9994j8667P9915K4688j15376
2692f8300k4746J275N5749n9634O3985P0111O1181r8566J2130J16996j8113p1753
2680D0315j9748K9542J7018N7297M7342j01430q0409L6924L4996M2411O3634n9077
2668A08815m6531N5105j2987J0965L220K8392J5255r3490N5716J006m1268q5882
2656a684P4113R7729m5078M8154N1346n1074j2788K8332j9674R6151k1134r2162
2644A52231O4878M0956J2391K3162k7672n8036J4232L1385l0923k5654L2310k2725
$$ y = [6535, 73479, -55585, -43530, -100533, -157654, -73522, -53975, -49173, -80409, -58788, -130051, -189262, -256345, -208954, -74006, -178804, -196953, -80666, -59787, 34569, 13762, 105819, 122774, -13423, -32281, -34947, -92104, -46017, -68854, -38860, -57527, 22388, 47076, -68300, -93046, -91771, -36022, -95656, -31671, 38440, 99621, 1055, 13185, 130181, 112068, 40315, 20567, 50109, 67127, 124424, 171766, 70336, -10073, 26851, 61847, 104258, 167892, 108815, 62284, 117389, 104402, 115367, 118587, 146979, 162234, 68744, 124460, 125466, 84198, -1684, 72429, 170158, 125080, 173234, 224580, 173506, 160718, 189050, 169376, 265527, 244393, 152231, 217109, 258065, 270456, 293618, 265946, 207910, 222142, 253527, 222604, 196950, 229260, 206535]
2632B06535p2051M0780j1413r8497j809J75119R5402j55404j0189O3099j4616
2621B16956R0838J2866N0732R2979J8098o3431m8894L6581J59185R5968n8428
2610F03450p2342J18840l3318m7914J26467k5080N8791L5608p6538j15596K2578
2599E94946L3081J7912m4586Q5485J1274O553j0555Q1449L6325K5291P3982O3910
2587I75067Q5690l3276k3313p0840O6466M9410N4218j7353k6630O5268K0067P9222
2575A223996J30991l1838L1125j23644l6837J51305P0066J67245j36453L112Q3270
2564A532338M1939J10340J43997J4360Q4724P1536J32870J22472J38062J39076
2554B531714J32439K2627K2819J16277q078k0839J82875J32555J14641L4640J35068
$$ y = [206535, 134484, 175264, 163851, 65354, 63545, 238664, 334066, 178662, 168473, 231572, 216956, 307794, 320660, 371392, 464371, 482469, 419038, 370144, 406725, 565910, 661878, 603450, 531108, 649948, 616630, 568716, 695183, 670103, 728894, 764502, 687964, 572368, 594946, 628027, 645939, 601353, 686838, 698112, 704665, 694110, 775559, 811884, 837175, 911157, 975067, 1060757, 1027481, 1004168, 933328, 999794, 1049204, 1103422, 1086069, 1059439, 1124707, 1144774, 1223996, 1354987, 1323149, 1354274, 1230630, 1193793, 1345098, 1415164, 1582409, 1445956, 1449068, 1532338, 1574277, 1684617, 1828614, 1842974, 1927698, 1999234, 2132104, 2254576, 2392638, 2531714, 2664153, 2686780, 2709599, 2825876, 2817798, 2796959, 2979834, 3112389, 3227030, 3261670, 3396738]
2543C396738P0789N6838J64344J65888J30769P4701J28690J63808K02156J54714
2533D709435J35022K54660M96358L17620J77655P7808L50573L47687L46997L34728
2523G548543L26459L92243M05031M30701N85323O33376O08227O25258O95237Q13223
2513A3063621R99177R24556J107541J292504J426555J443143J495323J763351
2505B3515771J944098K205835K684544L161406L826054M735040N575938O257815
2497E3906501O937703O751176N987349M585524K551308K56587k097689m008279
2489G4870180n607884o643383o899701o703226o118467n346595m428729l790668
2481B9331527l350422k750377k358087k135476j944927j564097j379782j327487
$$ y = [3396738, 3467527, 3524365, 3688709, 3854597, 3985366, 4060067, 4188757, 4352565, 4554721, 4709435, 4844457, 5099117, 5595475, 5913095, 6090750, 6168558, 6519131, 6866818, 7213815, 7548543, 7875002, 8267245, 8672276, 9102977, 9688300, 10321676, 10929903, 11555161, 12250398, 13063621, 14062798, 14987354, 16094895, 17387399, 18813954, 20257097, 21752420, 23515771, 25459869, 27665704, 30350248, 33511654, 37337708, 42072748, 47648686, 53906501, 60844204, 67595380, 73582729, 78168253, 80719561, 80976148, 78878459, 74870180, 69262296, 62618913, 55719212, 49015986, 42897519, 37550924, 33122195, 29331527, 25981105, 23230728, 20872641, 18737165, 16792238, 15228141, 13848359, 12520872]
2473A2520872j255181j161979q44478o98034o68032n95438m54298l92084m24415
2464F026933m17840l16909k45287l16833k98179j92154j80299j79664j33214j56788
2454C589766j98649q0004q7432j30743j69306o8340j41734r9442j04969o0379
2444B448768j0432j69804j25895p1362j65160K8084k6051j92903p2692j38489
2434A504064K2317r3785j26848p4277J0573k338m3911m8626L8908p6841R7434
2423A206670L6133k07353j4537O5280Q1322M2330j67946r3055l03M2284p5213
2412I15612j04486J7029k5874l8329j6810m1414J6630M692O601j15825m2787j0077
2400E64962j1449j5905m454o905R026m3485M9610J9230J4765L0992p1398m8252
$$ y = [12520872, 11265691, 10103712, 9259234, 8561200, 7893168, 7297730, 6843432, 6451348, 6026933, 5609093, 5292184, 5046897, 4730064, 4431885, 4239731, 4059432, 3879768, 3746554, 3589766, 3391117, 3311113, 3223681, 3092938, 2923632, 2855292, 2713558, 2614116, 2509147, 2448768, 2438336, 2268532, 2142637, 2071275, 1906115, 1934199, 1908148, 1715245, 1642553, 1504064, 1526381, 1432596, 1305748, 1231471, 1242044, 1239706, 1195795, 1147169, 1186077, 1109236, 1206670, 1242803, 1035450, 1020913, 1086193, 1167515, 1209845, 1041899, 948844, 948541, 990825, 915612, 811126, 828155, 802281, 763952, 747142, 705728, 722358, 727050, 733651, 617826, 575039, 564962, 553513, 537608, 533154, 526249, 535275, 491790, 541400, 560630, 575395, 606387, 534989, 486737]
2388D86737L6941N8108k1284p3284j04456l4788K9688J1291j03559M2939N148
2377C33481R198r4249n1132J9709p7995J54819R496m1202o5801p767j5284L7293
2365B10566Q6988L7736j54309O5138R7018n723n8717m5291p9767j9309P9183q6617
2353A26896l9647j7400N0670M5494n1932O842K9045j10165r8568m415l2750R6852
2341I22P7226p9812k9056p7639N7325k3009N9793o8419J24994m1980j6740L7471
2329B1076M4367j01029p3974K1743l3032J4952Q2195q5684P9742N5362o1641N2400
2317A6477r3213j1364J5380J3014N7397Q3367p1467j36414L7332j5330l6735K9315
2305a12241j47Q6574K764j12519K7114J3469n6984J079R4528O2972o483j7718
$$ y = [486737, 523678, 581786, 560502, 487218, 382762, 347974, 377662, 388953, 285394, 328333, 333481, 342679, 248430, 197298, 217007, 139012, 293831, 303327, 262125, 196324, 188557, 173273, 210566, 297554, 335290, 180981, 246119, 343137, 337414, 278697, 233406, 153639, 134330, 213513, 126896, 87249, 69849, 120519, 166013, 114081, 120923, 149968, 39803, -58765, -63180, -95930, 922, 78148, -1664, -30720, -108359, -51034, -74043, -14250, -82669, 42325, 345, -16395, 21076, 65443, -35586, -109560, -87817, -120849, -105897, -23702, -109386, -29644, 25718, -35923, 16477, -76736, -88100, -72720, -59706, -2309, 81058, 9591, -126823, -89491, -104821, -141556, -112241, -112388, -25814, -23050, -135569, -108455, -94986, -151970, -150891, -56363, 6609, 126, -17592]
2293a7592j14416n9027P0337R0214o9366O4624l3819m5218J21003j3055m1199
2282d7514l550m6823j61944n3019L8253N4272J02465j07456J8061M3416M1740
2271a22099m8312O2350K7247K4278o8637K5748N6731n3303o3689n6790M2233J0960
2259a63283R1704j6265K5423k2652N3808M8959n0469r0998n3553N2292O6110j3
2247e8937n9581o9208j1517N5505J4250N8584l6094j33343O7104N2113J3644o5947
2235a73427P9499k1730K0073K2210J28765O9938L176k0816j3537j7149M1516K5979
2223A44497p337K6279P4468k8542m7274J0348j40837p3042k3385N543j38867r2312
2211b90461Q0649Q4189J1308j48310M2957J02958n9663J1136o1273M7889Q842
$$ y = [-17592, -132008, -191035, -120698, -30484, -99850, -35226, -69045, -114263, 6740, -6315, -47514, -51064, -97887, -259831, -312850, -274597, -220325, -117860, -225316, -207255, -163839, -122099, -170411, -108061, -80814, -56536, -125173, -99425, -42694, -95997, -159686, -216476, -174243, -163283, -71579, -87844, -62421, -85073, -31265, 17694, -32775, -123773, -177326, -125034, -58924, -58937, -118518, -187726, -199243, -143738, -129488, -70904, -106998, -240341, -173237, -121124, -107480, -173427, -93928, -115658, -95585, -73375, 55390, 125328, 128504, 107688, 94151, 77002, 118518, 144497, 137160, 163439, 237907, 209365, 162091, 172439, 31602, -41440, -64825, -59282, -198149, -290461, -209812, -125623, -114315, -262625, -219668, -116710, -176373, -165237, -226510, -178621, -169779]
2200a69779n8376L9580M0853L4964m58K3682j6345m6038n0714p1096J34168j6727
2188a56286N6552O177l9202L0294j4782O428J01863r3191l9094N4715o7563m510
2176a58599M2139j29066l336l474J06663k151o0385N2844M8274o938o7640j08990
2164b90659l206Q3824O5463O1150n5057K1727m8190k3911r820o3610J8100M8479
2152a95710j2096p5390R2163Q3046m5549n5454Q7182j09384q0369J04252J46462
2141f0847q1843Q192r0067J4301K4745Q877K5556j99645O1915P3504o5527M6743
2129b34096k6411m600Q1500M230L8805j30203R492L4995L183o470m9354j2669
2117b91598K701L5819K5915N5126m6526m1858M4983k77M4751N9096m4373q3728
$$ y = [-169779, -228155, -188575, -147722, -112758, -113216, -89534, -105879, -151917, -202631, -273727, -139559, -156286, -99734, -93557, -132759, -102465, -117247, -110819, -8956, -102147, -141241, -86526, -154089, -158599, -116460, -245526, -248862, -252336, -145673, -147824, -208209, -155365, -107091, -114029, -181669, -290659, -293865, -210041, -144578, -83428, -138485, -116758, -164948, -188859, -198679, -262289, -244189, -195710, -207806, -283196, -191033, -107987, -153536, -208990, -121808, -231192, -311561, -207309, -60847, -142690, -134498, -224565, -210264, -185519, -176642, -151086, -350731, -288816, -215312, -280839, -234096, -260507, -265107, -183607, -179377, -140572, -270775, -261283, -226288, -223105, -229575, -278929, -291598, -288897, -253078, -227163, -172037, -218563, -260421, -215438, -215715, -170964, -111868, -156241, -239969]
2105b39969K2387l0345Q6426j3979j1506M7315L9392j38834L841Q09L7082M6081
2093a51300m0866n6458O9154P6874J08897r9526K2377p7298j13708k5621K7210
2082b60265l5290r897P3761J2123m179m6871o7710M9820j8801J05273P7098O5030
2070e9908k8889m3306L4489J01502j56072R68K1553n8887L3041q8050M6179m1973
2058b39353p977P848Q1740N5755P6002j34478M0125n6584m1004P8830L3963P2365
2046c2768K3386m7410m7467j02645L0100o3023K431j0958O6142M8641m2486n2083
2034b28140j1167k5001M6213J4944L8694M8118k4099n9942m3440M1607J2456n7374
2022b47131r7285K7938k8445M1412P8532J17546j3712r9620q8315Q4862j8280
$$ y = [-239969, -217582, -247927, -161501, -175480, -186986, -139671, -100279, -239113, -235272, -234463, -197381, -151300, -192166, -248624, -179470, -102596, 6301, -93225, -70848, -148146, -261854, -287475, -260265, -295555, -305452, -231691, -219568, -223747, -270618, -338328, -288508, -307309, -202036, -124938, -59908, -88797, -132103, -97614, 3888, -152184, -151216, -129663, -188550, -155509, -243559, -197380, -239353, -247330, -239482, -157742, -101987, -25985, -160463, -120338, -176922, -217926, -139096, -105133, -32768, -9382, -56792, -104259, -206904, -176804, -239827, -237396, -248354, -182212, -133571, -176057, -228140, -239307, -264308, -218095, -203151, -164457, -116339, -140438, -200380, -243820, -202213, -189757, -247131, -344416, -316478, -344923, -303511, -224979, -107433, -121145, -220765, -309080, -224218, -242498]
2011b42498k1285l5617m0266P2657J26652k2628j32540L5491L3331K5879O3947
2000a36877m2876j03750N3490J3548L7955R7957J2118k31114M2910j1296m5191
1989c13126k0580J78696K6984q3335o2713J63993N6601j12535O7898N250M5292
1978d7575o5248o7848L1577j9404o8883J07965n0156k7308J26851O0240n7451
1967g7240j8572j82027l4286J58556o2171O5658j4025K2961O141m7799O2548Q9480
1955c0776j05239o9948o8952J2174P9832K355K2632p6641L1694K0693m6318l8832
1943b67326o79M3310J19981k6950n9866o480j2942N1736k1158r2834n76M4117
1931b29667n4914R9071L5771j10043J11283Q6132l6835k654o3725p9757N0642
$$ y = [-242498, -263783, -299400, -339666, -267009, -140357, -162985, -295525, -260034, -226703, -200824, -136877, -179753, -283503, -230013, -216465, -178510, -80553, -68435, -299549, -256639, -267935, -313126, -333706, -155010, -128026, -211361, -274074, -110081, -53480, -166015, -98117, -92867, -47575, -112823, -180671, -149094, -168498, -237381, -129416, -179572, -206880, -80029, -19789, -77240, -95812, -277839, -312125, -153569, -215740, -150082, -164107, -141146, -135005, -182804, -120256, -30776, -136015, -205963, -274915, -262741, -182909, -180554, -157922, -234563, -202869, -182176, -228494, -267326, -268005, -224695, -104714, -131664, -191530, -198010, -210952, -159216, -180374, -273208, -273784, -229667, -284581, -185510, -149739, -259782, -148499, -62367, -99202, -101856, -165581, -245338, -194696]
1920a94696O3150L3612l1111k848p5627j1862j3444M872K8031l305P7532j4637
1908a40333k9782j8405q2821j3857n7859N7937Q8921M3764J7612m6686R0754J6168
1896g4587o1790k4878l9926K2359K245J7349L94j3905n5065J7952K6781O6349
1884a16722n1001m2406L5343l6643L4420j4127P0397P1472J3233j46263j264J2722
1872a70839m4895n5595N9473j2672l4624R3975n5037O6052N3157K2572o0579l3934
1860a72946j04925M2335P0675J1388r8482M7632J17914J00170k7931j4456j4712
1849d3338j07096n7500N2787J9437o4824q784l5461L6276M4631L9777L5453n8834
1837a47476j05910l876J63184N1304q5673r88J2659n6608J4708n1137R081J32895
$$ y = [-194696, -131546, -97934, -129045, -131893, -207520, -219382, -232826, -227954, -199923, -203228, -125696, -140333, -170115, -188520, -271341, -285198, -343057, -285120, -196199, -152435, -134823, -181509, -90755, -74587, -136377, -161255, -201181, -178822, -176577, -159228, -158834, -172739, -227804, -209852, -183071, -116722, -167723, -210129, -174786, -211429, -177009, -191136, -120739, -49267, -36034, -182297, -183561, -170839, -215734, -271329, -211856, -224528, -259152, -165177, -220214, -154162, -101005, -78433, -139012, -172946, -277871, -235536, -164861, -153473, -251955, -204323, -86409, 13761, -14170, -28626, -43338, -150434, -207934, -155147, -135710, -200534, -209318, -244779, -208503, -163872, -124095, -88642, -147476, -253386, -257262, -94078, -42774, -128447, -129435, -116776, -173384, -158676, -209813, -200732, -67837]
1825f7837j41882m8724j5240P1895J11445O1921L8268p0671J0092p63Q8620j11543
1813g4419j2399O5107q7166o4598r0630q0840J5996J50903L6417J00151r1752
1802a33230j5764m114k8852J0242Q3430j08844j09597J15513L1796O423J73360
1791B0363k2338j26326N3071o9520j11629R8100L8715L1082k5413q5922K6415
1780a73402R7348M2224P4960k3869k4434j16257k956k116o3869J5836K5711R7199
1768e3625l4304N0285K6377j15145j26067K2828N1299N8117k1852K8814M2252
1757g1021J7396q7397k4546L1175n0642K2202r514l727j9486L4445k1030M7786
1745a34359L9960K4247m441J2071o4477l3300N2401n1100j9080k780j14016N8425
$$ y = [-67837, -209719, -258443, -273683, -201788, -90343, -28422, 9846, -60825, -50733, -51496, 37124, -74419, -86818, -21711, -108877, -173475, -264105, -344945, -328949, -178046, -141629, -41478, -133230, -148994, -153108, -181960, -171718, -88288, -197132, -306729, -191216, -159420, -152997, 20363, -1975, -128301, -75230, -144750, -256379, -158279, -119564, -88482, -113895, -199817, -173402, -76054, -33830, 41130, 17261, -7173, -123430, -126386, -128502, -192371, -176535, -150824, -53625, -87929, -37644, -11267, -126412, -252479, -229651, -178352, -120235, -142087, -113273, -71021, -53625, -141022, -165568, -134393, -185035, -162833, -172347, -176074, -195560, -161115, -182145, -134359, -94399, -70152, -74593, -62522, -126999, -160299, -107898, -158998, -178078, -180858, -294874, -236449]
1733b36449J47886k2994r5023o5275Q242R5237J21183p6740L6285M2536r2673
1722a37785L7665J13042o5053R3325n502r7815j09124l1405R3578R6649J7411
1711D986q7048K2867N0183j3166n6347L066l2528j4975K9422n4075r884P3713
1699h3786j8180l5316Q0066o4696n088O222l3658m6240J25040l7613n6277l1296
1687b00822n1412L3529P426P2709M4270J7693j34L9031m0733p790n9836o1061
1675b07130j3134M2744k7868m4577K1263J48508J1741n3063j5425J95j0546m9546
1663a96838O4618k2335o3413q8287M5791P5221N1766m3974m118J0780K9916N5832
1651h5041m9215Q5130l7233j00896m8253J6173L2688J11719j778q3786O3696P7222
$$ y = [-236449, -88563, -111557, -206580, -271855, -263613, -168376, -47193, -123933, -87648, -45112, -137785, -100120, 12922, -52131, 41194, 35692, -62123, -171247, -202652, -109074, -12425, 4986, -82062, -59195, -9012, -22178, -78525, -75459, -107987, -122962, -93540, -147615, -157499, -83786, -101966, -137282, -57216, -121912, -127000, -120778, -154436, -200676, -75636, -113249, -169526, -200822, -252234, -218705, -211279, -138570, -94300, -76607, -76741, -37710, -78443, -86233, -146069, -207130, -220264, -177520, -205388, -249965, -228702, -80194, -68453, -121516, -136941, -136746, -147292, -196838, -132220, -154555, -217968, -306255, -260464, -185243, -133477, -177451, -181569, -170789, -140873, -85041, -134256, -49126, -86359, -187255, -235508, -219335, -186647, -74928, -76706, -160492, -96796, -19574]
1639a9574m3219r518M0724l9881j9067p5176R3155l6776O6132J04522m1762j12459
1627i2899n0615j5303m5448P6010M2091P034K1091m226o7105m6431m6541R9331
1615a23011J6989l8140l9687P8232j864r4311m7045N2866M6572K235M8543l0721
1603a29342l5241o7026P2437k7950J01029k1565r7093k5889K69j21508O6705J05637
1591a79537M9162j2699L988M9547j02036O5089L6780L0109r0974L667J08603o9298
1579a07599n6315J02798m7482J6901m2043P5138R0071n5283p4234O063K5922J520
1567f4543o8893j2822N594K1367J4688K2061p0374o489p2523Q7654K9818p6091
1555a90553r6289J06981R16P912J14580l6715p3671M0458N2787o5771k003p4336
$$ y = [-19574, -62793, -72311, -31587, -71468, -90535, -165711, -72556, -109332, -43200, 61322, 19560, -92899, -143514, -158817, -204265, -128255, -86164, -79130, -58039, -62265, -129370, -175801, -222342, -123011, -106022, -144162, -183849, -105617, -107481, -201792, -248837, -195971, -149399, -147164, -98621, -129342, -164583, -231609, -159172, -187122, -86093, -107658, -204751, -230640, -230371, -351879, -285174, -179537, -130375, -143074, -139086, -89539, -191575, -126486, -89706, -59597, -150571, -146904, -38301, -107599, -163914, -61116, -108598, -91697, -133740, -58602, 31469, -23814, -98048, -91985, -66063, -64543, -133436, -146258, -140664, -119297, -104609, -82548, -152922, -159411, -231934, -144280, -114462, -190553, -286842, -179861, -178945, -171033, -56453, -93168, -166839, -126381, -73594, -139365, -141368, -215704]
1543b15704Q3736J08625n5063j20403J27177Q9814O2190n3357j00258r6857M3567
1532a26533J1518j3148j3656R4409j0782j1586r991n573N7036O556l2192Q4922
1520C0980o7730p07L6717L3044j3033p2402o8953p9485J21837o6327J9075m0910
1508a67894R6867L170N0366Q16j18614O8395n5252l7774J12306J60466n6394o1927
1496e469m6217M1726n1181o908m4763n3783J06496r523q3129N1542K9215n9797
1484a31791p8803K8095J89740N3069j36324p5940J59019j26111l011q598o6239
1473a96894Q5654J39122k0693m5288K6683p6541P5276n4302M4858r455n2141r5430
1461a79151k607N9837k9566L0432P1212M3528l4922J06147r6552o2024P6769O735
$$ y = [-215704, -131968, -23343, -78406, -198809, -71632, 18182, 80372, 27015, -73243, -170100, -126533, -115015, -128163, -141819, -47410, -58192, -69778, -79769, -85342, -28306, -21750, -53942, 30980, -36750, -37457, -740, 32304, 19271, -53131, -122084, -201569, -79732, -146059, -126984, -167894, -71027, -67857, -17491, -16675, -135289, -66894, -122146, -159920, -47614, 112852, 56458, -5469, -51686, -9960, -61141, -68049, -112812, -166595, -60099, -69622, -152751, -101209, -71994, -131791, -210594, -182499, 7241, 60310, -76014, -151954, 7065, -119046, -122057, -130655, -196894, -111240, 27882, 7189, -38099, -11416, -87957, -12681, -66983, -22125, -31580, -83721, -179151, -181758, -121921, -151487, -121055, -49843, -6315, -41237, 64910, -31642, -93666, -16897, -10162]
1449a0162O757J6067r3877m9363K4110Q5417l0989k8032k4334n406N9575J3450
1437c6787q153p3908J66441p4306j6461Q0239O1704j05597j8254j29643m590J48648
1425a0667J5539J1766m1433n8601l0353N6136Q8652o3573m7670K3931n6847l0895
1413a44015k3128J95787l7192l7371J7256j8650k6998j7226K1315J7430M3086
1402i706N517n2101Q734n078J05974k5784J0774m0818n6824o3977m320K3550J20899
1389A6840P0675M598l8965k3496R930n5247r1386K9993j3856K6392j2142p8622
$$ y = [-10162, -3405, 12662, -81215, -130578, -106468, -21051, -52040, -80072, -104406, -109812, -50237, -36787, -44940, -118848, 47593, -26713, -43174, 37065, 98769, -6828, -25082, -154725, -159315, -10667, 4872, 16638, -24795, -83396, -113749, -57613, 31039, -32534, -80204, -56273, -113120, -144015, -167143, 28644, -8548, -45919, -28663, -47313, -74311, -91537, -70222, -52792, -9706, -4189, -56290, -47556, -52634, 53340, 27556, 38330, -2488, -59312, -123289, -127609, -104059, 16840, 87515, 92113, 53148, 29652, 39582, -15665, -107051, -77058, -90914, -64522, -76664, -155286]
$$ [...]
##END NTUPLES=NMR SPECTRUM
##END=
