##TITLE=1H_CA-9425-1
 200.13MHz,DMSO-d6.
 8 sc
 
 20.2.2026
##JCAMPDX= 6.0         $$ Bruker NMR JCAMP-DX V2.0
##DATA TYPE= NMR SPECTRUM
##DATA CLASS= NTUPLES
##ORIGIN= UXNMR, Bruker Analytische Messtechnik GmbH
##OWNER= pz
$$ XWIN-NMR		Version 3.5
$$ Fri Feb 20 15:29:56 2026 Russian Standard Time (UT+4h)  she@DPX200
##.OBSERVE FREQUENCY= 200.1313
##.OBSERVE NUCLEUS= ^1H
##.ACQUISITION MODE= SIMULTANEOUS
##.ACQUISITION SCHEME= undefined
##.AVERAGES= 8
##.DIGITISER RES= 18
##SPECTROMETER/DATA SYSTEM= spect
##.PULSE SEQUENCE= zg30
##.SOLVENT NAME= D2O
##.SHIFT REFERENCE= (INTERNAL, D2O, 0, 15.4659)
##AUDIT TRAIL= $$ (NUMBER, WHEN, WHO, WHERE, WHAT)
$$ ##TITLE= Audit trail, XWIN-NMR		Version 3.5
$$ ##JCAMPDX= 5.01
$$ ##ORIGIN= Bruker BioSpin GmbH
$$ ##OWNER= she
$$ F:/spectra/data/she/nmr/H-C/1/pdata/1/auditp.txt
$$ ##AUDIT TRAIL=  $$ (NUMBER, WHEN, WHO, WHERE, WHAT)
(   1,<2026-02-20 15:27:31.85 +0400>,<she>,<DPX200>,
      <created by zg, POWCHK disabled, PULCHK disabled
       configuration hash MD5:
       00 E9 B6 7A A2 85 ED C7 34 08 36 98 17 FE 4E 26
       data hash MD5: 16K
       D3 DA 1A 66 B7 7C 20 55 EF CF 3C F4 B6 EA 75 C4>)
(   2,<2026-02-20 15:27:34.85 +0400>,<she>,<DPX200>,
      <Start of raw data processing
       efp BC_mod = 2 LB = 0.25 FT_mod = 6 PKNL = 1 PHC0 = -3706.38 PHC1 = 12.59232 SI = 16K 
       data hash MD5: 16K
       3D 03 43 27 7F 7E 68 BD 72 C3 D2 2F EB C6 17 FD>)
(   3,<2026-02-20 15:27:51.81 +0400>,<she>,<DPX200>,
      <pk PHC0 = 8.685412 PHC1 = -7.6 
       data hash MD5: 16K
       9F A4 09 35 0D 65 BB 77 43 47 CB DB 7A C0 3E F7>)
(   4,<2026-02-20 15:28:00.75 +0400>,<she>,<DPX200>,
      <abs ABSG = 5 
       data hash MD5: 16K
       B7 42 38 A3 21 8C 20 A0 93 3D AD 8E A0 65 F3 D2>)
$$ ##END=
$$ 
$$ hash MD5
$$ 97 09 1D 19 E2 82 43 18 0C F4 16 53 8B 5C 2C CA
##$RELAX= 
##$RELAX= 
##$RELAX= 
##$RELAX= 
##$RELAX= 
##$RELAX= 
$$ Bruker specific parameters
$$ --------------------------
##$DU= <F:/spectra>
##$EXPNO= 1
##$NAME= <H-C>
##$PROCNO= 1
##$TYPE= <nmr>
##$USER= <she>
##$AMP= (0..31)
100 100 100 100 100 100 100 100 100 100 100 100 100 100 100 100 100 100 
100 100 100 100 100 100 100 100 100 100 100 100 100 100 
##$AQSEQ= 0
##$AQ_mod= 1
##$AUNM= <au_zg>
##$AUTOPOS= <>
##$BF1= 200.13
##$BF2= 200.13
##$BF3= 200.13
##$BF4= 200.13
##$BF5= 200.13
##$BF6= 200.13
##$BF7= 200.13
##$BF8= 200.13
##$BYTORDA= 1
##$CFDGTYP= 0
##$CFRGTYP= 5
##$CHEMSTR= <none>
##$CNST= (0..31)
1 1 145 1 1 1 1 1 1 1 1 1 1 1 1 1 1 1 1 1 1 1 1 1 1 1 1 1 1 1 1 1 
##$CPDPRG= <>
##$CPDPRG1= <>
##$CPDPRG2= <>
##$CPDPRG3= <>
##$CPDPRG4= <mlev>
##$CPDPRG5= <mlev>
##$CPDPRG6= <mlev>
##$CPDPRG7= <mlev>
##$CPDPRG8= <mlev>
##$CPDPRGB= <>
##$CPDPRGT= <>
##$D= (0..31)
0 0.7 0 0 0 0 0 0 0 0 0 0.03 0 0 0 0 0 0 0 0 0 0 0 0 0 0 0 0 0 0 0 0 
##$DATE= 1771586851
##$DBL= (0..7)
120 120 120 120 120 120 120 120 
##$DBP= (0..7)
150 150 150 150 150 150 150 150 
##$DBP07= 0
##$DBPNAM0= <>
##$DBPNAM1= <>
##$DBPNAM2= <>
##$DBPNAM3= <>
##$DBPNAM4= <>
##$DBPNAM5= <>
$$ [...]
##$SUBNAM3= <"">
##$SUBNAM4= <"">
##$SUBNAM5= <"">
##$SUBNAM6= <"">
##$SUBNAM7= <"">
##$SUBNAM8= <"">
##$SUBNAM9= <"">
##$SW= 18.0517328524113
##$SWIBOX= (0..15)
0 0 2 0 0 0 0 0 0 0 0 0 0 0 0 0 
##$SW_h= 3612.71676300578
##$TD= 16384
##$TD0= 1
##$TE= 0
##$TE2= 300
##$TE3= 300
##$TEG= 300
##$TL= (0..7)
0 120 120 120 120 120 120 120 
##$TP= (0..7)
150 150 150 150 150 150 150 150 
##$TP07= 0
##$TPNAME0= <>
##$TPNAME1= <>
##$TPNAME2= <>
##$TPNAME3= <>
##$TPNAME4= <>
##$TPNAME5= <>
##$TPNAME6= <>
##$TPNAME7= <>
##$TPOAL= (0..7)
0.5 0.5 0.5 0.5 0.5 0.5 0.5 0.5 
##$TPOFFS= (0..7)
0 0 0 0 0 0 0 0 
##$TUNHIN= 0
##$TUNHOUT= 0
##$TUNXOUT= 0
##$USERA1= <user>
##$USERA2= <user>
##$USERA3= <user>
##$USERA4= <user>
##$USERA5= <user>
##$V9= 5
##$VALIST= <valist>
##$VCLIST= <CCCCCCCCCCCCCCC>
##$VD= 0
##$VDLIST= <DDDDDDDDDDDDDDD>
##$VPLIST= <PPPPPPPPPPPPPPP>
##$VTLIST= <TTTTTTTTTTTTTTT>
##$WBST= 1024
##$WBSW= 4
##$XGAIN= (0..3)
0 0 0 0 
##$XL= 0
##$YL= 0
##$YMAX_a= 187852
##$YMIN_a= -216418
##$ZGOPTNS= <>
##$ZL1= 120
##$ZL2= 120
##$ZL3= 120
##$ZL4= 120
##$ABSF1= 15.47805
##$ABSF2= -2.573799
##$ABSG= 5
##$ABSL= 3
##$ALPHA= 0
##$AQORDER= 0
##$ASSFAC= 0
##$ASSFACI= 0
##$ASSFACX= 0
##$ASSWID= 0
##$AUNMP= <proc_1d>
##$AZFE= 0.1
##$AZFW= 0.1
##$BCFW= 0
##$BC_mod= 2
##$BYTORDP= 0
##$COROFFS= 0
##$CY= -3
##$DATMOD= 1
##$DC= 0
##$DFILT= <>
##$DTYPP= 0
##$F1P= 0
##$F2P= 0
##$FCOR= 1
##$FTSIZE= 16384
##$FT_mod= 6
##$GAMMA= 0
##$GB= 0
##$INTBC= 1
##$INTSCL= 3.241238e-09
##$ISEN= 128
##$LB= 0.25
##$LEV0= 0
##$LPBIN= 0
##$MAXI= 10000
##$MC2= 0
##$MEAN= 0
##$ME_mod= 0
##$MI= 1.114404
##$NCOEF= 0
##$NC_proc= -6
##$NLEV= 6
##$NOISF1= 3.799351
##$NOISF2= 2.8
##$NSP= 0
##$NTH_PI= 0
##$NZP= 0
##$OFFSET= 15.46593
##$PC= 1
##$PHC0= -3697.695
##$PHC1= 4.992321
##$PH_mod= 1
##$PKNL= yes
##$PPARMOD= 0
##$PSCAL= 0
##$PSIGN= 0
##$REVERSE= no
##$SF= 200.130011162238
##$SI= 16384
##$SIGF1= 3
##$SIGF2= 2
##$SINO= 0.751879
##$SIOLD= 32768
##$SREGLST= <19F.Aceton>
##$SSB= 0
##$STSI= 16384
##$STSR= 0
##$SW_p= 3612.71676300578
##$SYMM= 0
##$S_DEV= 0
##$TDeff= 16384
##$TDoff= 0
##$TI= <>
##$TILT= no
##$TM1= 0
##$TM2= 0
##$TOPLEV= 0
##$USERP1= <user>
##$USERP2= <user>
##$USERP3= <user>
##$USERP4= <user>
##$USERP5= <user>
##$WDW= 1
##$XDIM= 16384
##$YMAX_p= 292255192
##$YMIN_p= -358854
$$ End of Bruker specific parameters
$$ ---------------------------------
##NTUPLES= NMR SPECTRUM
##VAR_NAME=  FREQUENCY,     SPECTRUM/REAL,   SPECTRUM/IMAG
##SYMBOL=    X,             R,               I
##VAR_TYPE=  INDEPENDENT,   DEPENDENT,       DEPENDENT
##VAR_FORM=  AFFN,          ASDF,            ASDF
##VAR_DIM=   16384,         16384,           16384
##UNITS=     HZ,            ARBITRARY UNITS, ARBITRARY UNITS
##FACTOR=    0.220516191357247, 1,           1
##FIRST=     3095.19674054172, 0,            0
##LAST=      -517.520022464056, 0,           0
##MIN=       -517.520022464056, -358854,     0
##MAX=       3095.19674054172, 292255192,    0
$$ Real data points
##PAGE= N=1
##DATA TABLE= (X++(R..R)), XYDATA
$$ [...]
5448c4321j06181n122O6052J43286l3844j3141j9639K5643o0729j04495L4957
5437a07534J60792K3230o2650P6560L522r0917N4724O2805n5670O3992M2244k5597
5425A45501L5050j02085l2809n5616k0932m6296J7101P0715r4442R31K14059J49263
5413B80440r4644k6930n6383n2598O4869j93349N1966L0616O9483k9773q4806
5402d1109K3735M0667N8975J10743L4050j29287J3945j04507j06535L1991Q2339
5391A5007Q5928o2436K2080r5465M8901J41437j36548J9857N4632j12083K6525
5380G835J99086j10348k4799O0370L4482l3556k5983m0016J1340P6523q8953M8809
5368A14790P797j4789n140Q9266k9274o7118K1543M6506K0767j10404o6471k8242
$$ y = [-34321, -140502, -145624, -79572, 63714, 29870, 16729, -2910, 22733, -37996, -142491, -107534, 53258, 76488, 13838, 90398, 93920, 3003, 57727, 120532, 64862, 128854, 171098, 145501, 180551, 78466, 45657, -9959, -30891, -77187, -60086, 10629, -83813, -82882, 131177, 280440, 185796, 158866, 102483, 49885, 114754, -78595, -26629, 3987, 73470, 43697, -41109, -17374, 23293, 82268, 193011, 227061, 97774, 111719, 7212, -99323, -67332, 15007, 100935, 38499, 60579, -34886, 14015, 155452, 18904, 38761, 93393, -18690, 7835, 206921, 96573, 71774, 132144, 166626, 133070, 107087, 67071, 78411, 154934, 65981, 114790, 122587, 107798, 102658, 191924, 162650, 95532, 117075, 163581, 184348, 73944, 7473, -20769]
5356b0769J55558j7797o3376M6059j5203O4690l4461o1390J0837j5085M9795Q6019
5344A84877M7384Q5676l8075q4219j0144R8897K9091j22006p14M6589n4734L1380
5332B14002m1381J05209j5648o9985M9519l6862M5668J6501m5805J31074O0432
5321D12724N956k1030M1764q0222K4939j6032m3215l681j7543J73667J7989K2031
5309E17347j01013P1818m3105j66141o0491J29871j6592n7754O6277j21905j47550
5298G0762P9760K35997L8281m5703j9999O5658L214k50032J35695L3533j72983
5287A74183k675R8279m3737m3386K4581o3716J313Q3679Q6569l169j18101N000
5275A98820k1508q6232O9571R2434r8468K7162J20472j17561K4593O5888q5145
$$ y = [-20769, 134789, 116992, 53616, 99675, 84472, 149162, 114701, 53311, 64148, 49063, 98858, 184877, 232261, 317937, 279862, 195643, 185499, 284396, 313487, 191481, 190767, 237356, 182622, 214002, 172621, 277830, 262182, 192197, 241716, 204854, 250522, 267023, 221218, 352292, 412724, 418680, 397650, 439414, 359192, 384131, 368099, 324884, 321203, 303660, 477327, 495316, 517347, 416334, 488152, 445047, 278906, 218415, 348286, 331694, 273940, 340217, 218312, 70762, 150522, 386519, 424800, 379097, 359098, 424756, 427970, 177938, 313633, 347166, 174183, 171508, 269787, 226050, 182664, 207245, 143529, 144842, 228521, 315090, 311921, 193820, 198820, 177312, 91080, 160651, 253085, 154617, 181779, 302251, 184690, 209283, 275171, 190026]
5264A90026q4338J43690p4043k5669P1056P474K7953j2809q2269P7671J9860j25152
5252A33450J15739J30203j8548j55130J42679Q2988M2169j19674q6455P7205O3789
5241D08415M0835o6371l4820J17934j5640j7976j2938l4136j03113p890q6785
5230A87515P6319J11804R5258N6948o0632O0582j07331M4607O2819o6298K3284
5219D84875p2193L5526N6183K0239o087l2919K2411k2122J30945q3492M387J38058
5207F75811N5917L5663L8881J53106j2372j24010Q4405M1222k0051K7793R3721
5196A050086P887Q9282k588R716o7746R2388P457n0991k8908J59541K6931j7683
5184A275372q0423N0755O6062K0837K9516M1936J4150J58680m7059J64187O0439
$$ y = [190026, 105688, 249378, 175335, 149666, 220722, 228196, 256149, 243340, 161071, 238742, 258602, 133450, 249189, 379392, 360844, 205714, 348393, 431381, 473550, 353876, 267421, 344626, 408415, 449250, 382879, 348059, 465993, 450353, 432377, 419439, 385303, 282190, 274300, 187515, 263834, 375638, 470896, 527844, 467212, 527794, 420463, 465070, 527889, 461591, 484875, 412682, 448208, 504391, 524630, 518543, 485624, 508035, 485913, 616858, 533366, 537753, 675811, 731728, 767391, 806272, 959378, 947006, 822996, 907401, 948623, 928572, 956365, 1050086, 1057973, 1147255, 1144667, 1154383, 1086637, 1179025, 1186482, 1135491, 1106583, 1266124, 1293055, 1275372, 1194949, 1245704, 1311766, 1332603, 1362119, 1404055, 1418205, 1576885, 1529826, 1694013, 1754452]
5173A754452q0300O9243J45697O0647n5351J41792J20509J45629j1209K16091
5163B507200J0975o2814o8731N0614J48541m9788M7950R6346J5781Q2625R0493
5152B869192Q7565J1217M1393J57370M3937k4331J28510J45963K45435J30101
5142C836352K27716J28574J54507J35505J64991L07907L17067J56211J19258O6118
5132E614206J39602J18421P9456J5537P0301o2054P2956j8867r1682q3619j55637
5121E698620m1102M6936j35421m2102j11471k969K4861m0305J21513K50712M01673
5110F170945O17564J142328J272426R49081m22251j200756j300767j055825q30405
5101E342340o32980o08844l51804k23706p4280k38780k21891j58765n0897o0444
$$ y = [1754452, 1674152, 1743395, 1889092, 1949739, 1894388, 2036180, 2156689, 2302318, 2291109, 2507200, 2518175, 2455361, 2386630, 2437244, 2585785, 2535997, 2583947, 2680293, 2696074, 2778699, 2869192, 2956757, 2967974, 3009367, 3166737, 3210674, 3186343, 3314853, 3460816, 3706251, 3836352, 4064068, 4192642, 4347149, 4482654, 4647645, 4955552, 5272619, 5428830, 5548088, 5614206, 5753808, 5872229, 5951685, 5967222, 6037523, 5975469, 6048425, 6029558, 5937876, 5854257, 5698620, 5657518, 5704454, 5569033, 5526931, 5415460, 5412491, 5437352, 5397047, 5518560, 5769272, 6170945, 6788509, 7930837, 9203263, 10152344, 9730093, 8529337, 7228570, 6172745, 5342340, 4709360, 4100516, 3748712, 3525006, 3450726, 3211946, 2990055, 2831290, 2780393, 2719949]
5091B719949j67492q6974o9093O4265r9364j44738j51590r7615k7533M9447m2348
5080A946914j84321j75408R4318J86742P0615n5657j71456j07023L7676p2056
5070A570344N530j24610n0782K5470R483r9301k492J5687j103m4603j46861O4319
5058A221081m1636M2279p5293n7517k2868K4434N5918m4682P5007j0113j5134
5047A151476k5558j2497k1686r4284R590M7158l7966L6835O7368L0383m0227p8609
5035A031983N1497J70502j51912j64586N8766Q5115L1372n1794K9985O0516M727
5024A156171j53904J28950M8917K9136m9332o9868j6199O0095O0027J0539p439
5013A197093l6547J12820n6703l9239J41755R908k5745p9104M6799J02517L5573
$$ y = [2719949, 2552457, 2465483, 2396390, 2460655, 2361291, 2216553, 2064963, 1967348, 1939815, 1989262, 1946914, 1762593, 1587185, 1681503, 1868245, 1938860, 1883203, 1711747, 1604724, 1642400, 1570344, 1575874, 1451264, 1400482, 1425952, 1435435, 1336134, 1333642, 1349329, 1348226, 1303623, 1156762, 1221081, 1179445, 1221724, 1146431, 1088914, 1066046, 1090480, 1146398, 1101716, 1176723, 1166610, 1151476, 1125918, 1113421, 1091735, 997451, 1007041, 1054199, 1016233, 1053068, 1120436, 1150819, 1110592, 1031983, 1083480, 1253982, 1102070, 937484, 996250, 1081365, 1112737, 1060943, 1090928, 1151444, 1156171, 1002267, 1131217, 1180134, 1209270, 1159938, 1090070, 1073871, 1133966, 1193993, 1204532, 1197093, 1160546, 1273366, 1216663, 1177424, 1319179, 1329087, 1303342, 1224238, 1271037, 1373554, 1409127]
5002A409127N9621q399L8808J03657R1668J22900r2247l556J58292L0536k0148
4991A890259O6866J13041K3155J2942L7692J67275J90399l5127j3389R5393q6846
4980B461660j83205m8406n1172k92548J0203M8066n6995K860p4823O7341j039
4969A881942J8428J15719q2154Q1610N9005j01874R1549J02517L6296n9811n1997
4958B091230L478j19936J10675Q2307K6588k1050j15222k3998p0518P9876J61679
4947B205109R4643K0769j23059O3975J55891o2149J40431K96114O7016j49958
4937B708782R0961J03818J5426J20746J05612N697n3351J1414o7469M1054k825
4926C079865j1809M86J03767O299j4401M5651N1815J90893J3799K0814K44446
$$ y = [1409127, 1468748, 1460349, 1499157, 1602814, 1694482, 1817382, 1725135, 1721579, 1879871, 1910407, 1890259, 1957125, 2070166, 2093321, 2106263, 2143955, 2311230, 2501629, 2466502, 2453113, 2548506, 2461660, 2278455, 2230049, 2178877, 1886329, 1896532, 1944598, 1887603, 1890463, 1815640, 1882981, 1881942, 1900370, 2016089, 1933935, 2015545, 2074550, 1972676, 2064225, 2166742, 2203038, 2143227, 2091230, 2094708, 1974772, 2085447, 2167754, 2194342, 2173292, 2058070, 2034072, 1963554, 2043430, 2205109, 2299752, 2320521, 2197462, 2261437, 2417328, 2355179, 2495610, 2791724, 2858740, 2708782, 2799743, 2903561, 2918987, 3039733, 3145345, 3151042, 3097691, 3109105, 3041636, 3082690, 3079865, 3068056, 3068542, 3172309, 3178608, 3164207, 3209858, 3261673, 3452566, 3466365, 3487179, 3731625]
4915C731625L7540k3825M8665J7871J76983K29531K14646j09785O0994K24955
4905D609200J76368J45182L7666K63384J54686O4880J05902J13824K07161p3568
4895E804685J14636J76283M7911J30637O5849K22969J30837J00176J39607k0272
4885F913318K28268K22983K38685K05943L12518K08633K34227J82032J42386L89348
4875I278341J97640K12978J73981L45883M24394L23393M26165M79999N52573N98188
4865A3013535L92697N72761L82361K54076L35514M75383O03724M64309M65542
4856A6959902N63830P86902Q18173J003570J144243J236459J234353J401217J596992
4847B6745641J612790J989556K181403K288364K543010L084767L424827L937271
$$ y = [3731625, 3769165, 3745340, 3794005, 3811876, 3988859, 4218390, 4433036, 4323251, 4384245, 4609200, 4785568, 4930750, 4968416, 5231800, 5386486, 5451366, 5557268, 5671092, 5878253, 5804685, 5919321, 6095604, 6143515, 6274152, 6340001, 6562970, 6693807, 6793983, 6933590, 6913318, 7141586, 7364569, 7603254, 7809197, 8121715, 8330348, 8564575, 8746607, 8888993, 9278341, 9475981, 9688959, 9862940, 10208823, 10633217, 10956610, 11382775, 11862774, 12415347, 13013535, 13406232, 13978993, 14361354, 14615430, 14950944, 15426327, 16030051, 16494360, 16959902, 17523732, 18310634, 19128807, 20132377, 21276620, 22513079, 23747432, 25148649, 26745641, 28358431, 30347987, 32529390, 34817754, 37360764, 40445531, 43870358, 47807629]
4839D7807629M243594M791852N679635P403499R456198R592538L801748k013327
4831I0763366m202831l673503j953288j581308j082015j018941p53249l02635
4823G6195596L28172P61938J507850J925755K535952K931372L116039L004704
4815I2307378L148707K953164K999170L132906K924720K458912J443651M01253
4807A11769861n21012j187400j636897k029899k533657l300069m146614m674411
4799I1739902m848440m681961m374831l583625k736969k321997j574045j013034
4791F6605000o74775k96727J3928L36597K21384J97662J03192j30034l16052q14822
4781F5245353j078122j392498j767047k051386k229757k392770k622886k802492
$$ y = [47807629, 52051223, 56843075, 62522710, 69926209, 79382407, 88974945, 92776693, 90763366, 86560535, 82887032, 80933744, 79352436, 78270421, 77251480, 76498231, 76195596, 76523768, 77285706, 78793556, 80719311, 83255263, 86186635, 89302674, 92307378, 95456085, 98409249, 101408419, 104541325, 107466045, 109924957, 111368608, 111769861, 111248849, 110061449, 108424552, 106394653, 103860996, 100560927, 96414313, 91739902, 86891462, 82209501, 77834670, 74251045, 71514076, 69192079, 67618034, 66605000, 65930225, 65633498, 65647426, 65984023, 66205407, 66403069, 66506261, 66376227, 66060175, 65245353, 64167231, 62774733, 61007686, 58956300, 56726543, 54333773, 51710887, 48908395]
4773D8908395k912259k661322k601412k250419k078404j620932j320303j157917
4765C2305427r14530q18220n50225m19220l49397l51594k97974o138K5548J33255
4755B8756932J66210L55006M63996O00460R01722J142677J258988J519415J934460
4746C7099866K119319K300036K495558K692196K302588K096615J923963J543292
4738E4573433J307824J301016J463382J236641J002797O54874K90502K97852J01413
4729F2229734P0179K05319K07670M96986J072134J430511K070191K800545L488108
4720G4071377M043100M531038M941051M780197M540011L856751K898946K254392
4712A05916863J868305J750939J534238N44498q85126j978557k780324k891311
$$ y = [48908395, 45996136, 43334814, 40733402, 38482983, 36404579, 34783647, 33463344, 32305427, 31390897, 30572677, 30022452, 29603232, 29253835, 28902241, 28604267, 28598129, 28623677, 28756932, 28923142, 29278148, 29742144, 30342604, 31244326, 32387003, 33645991, 35165406, 37099866, 39219185, 41519221, 44014779, 46706975, 49009563, 51106178, 53030141, 54573433, 55881257, 57182273, 58645655, 59882296, 60885093, 61539967, 61830469, 62128321, 62229734, 62299913, 62505232, 62712902, 63209888, 64282022, 65712533, 67782724, 70583269, 74071377, 78114477, 82645515, 87586566, 92366763, 96906774, 100763525, 103662471, 105916863, 107785168, 109536107, 111070345, 111614843, 110729717, 108751160, 105970836, 103079525]
4704A03079525k975736k896840k853052k851215l197492l006834k616136k268584
4696H0413636j693850j063987n63274j75569O7519n0052l42200p14559j345215
4687G4532449j841395k270994k452478k820302l182750l365242l730937l734693
4679E1133658l686481l472753l280270k868334k735510k375860j981538j940869
4671B8792043j780899j526230j300036j143819r21576j058364r27602q83334q03078
4662A8447105o91799n64226n53024n79434l63243n80954m57197m52119l84507
4653A3820602n10351l29991l48807k60851m12625j92759k61466m86449k31355
4644A0785948j92676k48096j64373j52839k01563j75076j79610j74970o8671p1240
$$ y = [103079525, 100103789, 97206949, 94353897, 91502682, 88305190, 85298356, 82682220, 80413636, 78719786, 77655799, 77092525, 76916956, 76984475, 76934423, 76592223, 75877664, 74532449, 72691054, 70420060, 67967582, 65147280, 61964530, 58599288, 54868351, 51133658, 47447177, 43974424, 40694154, 37825820, 35090310, 32714450, 30732912, 28792043, 27011144, 25484914, 24184878, 23041059, 22119483, 21061119, 20133517, 19250183, 18447105, 17755306, 17191080, 16638056, 16058622, 15695379, 15114425, 14657228, 14205109, 13820602, 13310251, 12980260, 12631453, 12370602, 11957977, 11765218, 11503752, 11017303, 10785948, 10593272, 10345176, 10180803, 10027964, 9826401, 9651325, 9471715, 9296745, 9228074, 9156834]
4634I156834m6668p0589K5122R7769J16290M24741O42774J077474J511384Q29793
4624A3764924n34742j157755j314965r65913p17946n22819k50779j46019r7287
4615H056699J9371R2306J87677L39362M22503O80768P99456N17009L36986J58879
4605A1611016J27862K73459M77970J042970J315189R88612M58632l23024m44653
4596A5528033p6868O1848Q06564J308149J192450L98265n35782j270897j223737
4587A6188025q44581m86348J04733K87712R7564m03763j110093j325647r70604
4578A1536998p98630o68568j54872j79430l72615o91429p53558o87404o79466
4569F551026m22023n19548n20071l85845j78926k01724j04349j33617j56671k120
$$ y = [9156834, 9110166, 9039577, 9064699, 9162468, 9278758, 9703499, 10346273, 11423747, 12935131, 13764924, 13230182, 12072427, 10757462, 9791549, 9073603, 8550784, 8300005, 8153986, 8056699, 8076070, 8168376, 8356053, 8695415, 9117918, 9798686, 10598142, 11115151, 11452137, 11611016, 11738878, 12012337, 12490307, 13533277, 14848466, 15837078, 16295710, 15972686, 15528033, 15451165, 15513013, 16319577, 17627726, 18820176, 19218441, 18682659, 17411762, 16188025, 15343444, 14857096, 14961829, 15249541, 15347105, 14943342, 13833249, 12507602, 11536998, 10738368, 10069800, 9914928, 9735498, 9362883, 8671454, 7917896, 7230492, 6551026, 6129003, 5609455, 5089384, 4703539, 4524613, 4322889, 4218540, 4084923, 3928252, 3926132]
4559C926132j97828j42018Q810j32579J1534j58451j62523o1530q678n6605m4243
4548B982021m8999k7293q0238P6007m0251j29826j12486m1167K3969p3564j49582
4537B378591K0306L9448j28077J02683L4122r4188k5649N3109J08578Q4148r2902
4526B480169m4513J01984j27576j29280L0095J38679l471n102j93382J7049Q686
4515B273338k3778m1660L3830N4973N9394j26100l7239P626j19359m6946j76195
4504A857884M2631R5940n9543L4194L8458k5698J67786r7270n3755J1322k7322
4493A984627n8316l7876j18725m3564R3336j2400j1986M2125j4514o8744m8219
4482A705744k4404j40638P9639P9114o5408p6874R0170j6292o2069M9519j56190
$$ y = [3926132, 3728304, 3586286, 3595096, 3462517, 3474051, 3315600, 3153077, 3091547, 3082869, 3026264, 2982021, 2933022, 2905729, 2825491, 2901498, 2861247, 2731421, 2618935, 2577768, 2601737, 2528173, 2378591, 2398897, 2438345, 2310268, 2412951, 2447073, 2352885, 2327236, 2380345, 2488923, 2573071, 2480169, 2435656, 2537640, 2410064, 2280784, 2310879, 2449558, 2446087, 2440985, 2247603, 2264652, 2273338, 2249560, 2207900, 2241730, 2296703, 2356097, 2229997, 2192758, 2200384, 2081025, 2034079, 1857884, 1900515, 1996455, 1936912, 1971106, 2009564, 1983866, 2151652, 2054382, 2000627, 2011949, 1984627, 1926311, 1888435, 1769710, 1726146, 1819482, 1807082, 1795096, 1837221, 1822707, 1753963, 1705744, 1681340, 1540702, 1620341, 1699455, 1634047, 1557173, 1647343, 1631051, 1568982, 1618501, 1462311]
4471A462311l5895M8639q6209K1056k8549j29942n4174K426L4552m6657j9072
4460A168486o1832M5231N0048m7886Q1800O5852r3466j35904l4093Q6722p591
4449A117367j14622o6233J28833J73869p1294O1981P3992j53538r6575l7761J87115
4438A203134Q5644j54625M5990r507m2006k8421J27313L640J4083o7881N7718
4427A235082j2064n6267R2276P1176M2228O7397j13072l1822k2380l06j7114J07349
4415A362483n3101p7785n6453q7063J68389L4380J9488m2055o7148R6079J6490
4404A313704q9851m1258P935J12957j01832K9091r853M3202k666k2776r530l3403
4392A195720r4999j46279l6902L6118J09197Q8209K9234j0677J6053j57849l816
$$ y = [1462311, 1426416, 1475055, 1388846, 1409902, 1381353, 1251411, 1197237, 1199663, 1234215, 1187558, 1168486, 1106654, 1151885, 1201933, 1154047, 1235847, 1301699, 1208233, 1072329, 1038236, 1124958, 1117367, 1002745, 936512, 1065345, 1239214, 1167920, 1229901, 1303893, 1150355, 1053780, 1016019, 1203134, 1288778, 1134153, 1180143, 1170636, 1128630, 1100209, 1227522, 1231162, 1245245, 1177364, 1235082, 1223018, 1166751, 1259027, 1330203, 1372431, 1439828, 1326756, 1294934, 1272554, 1272248, 1255134, 1362483, 1309382, 1231597, 1175144, 1088081, 1256470, 1290850, 1310338, 1268283, 1201135, 1297214, 1313704, 1223853, 1182595, 1190530, 1303487, 1201655, 1230746, 1220893, 1264095, 1261429, 1238653, 1229123, 1195720, 1100721, 954442, 917540, 953658, 1062855, 1151064, 1180298, 1169621, 1185674, 1027825, 1024009]
4381A024009l113o059Q3713L0173j1231M5060O1451j19225p0299J49763m5544
4370A138698o5239P281L7457M5979L4822L9586Q744P0062P915j26806J5258J35874
4358A349631K1993q981l1582K1402p030l4668J23422R5065m5177Q1704O4097j14405
4346A515471l3763N9624p6005J24417j547K4960R076N9814R6227k8745m4832l906
4334A700791M8089j4707J00618m2139k620J00677j14907O8973L6717k9152j9551
4323A832789R5102R2817l5066k3151O6094j46073m0517n7376m4780J12975J11326
4312A964140N323q7120P4547J64420r3674P2954r6467L4308j6151n1684p5117
4301A895479J34704J37451J7452j06684M9213j4928M2440m5971l8190J07936q1806
$$ y = [1024009, 1020896, 1014837, 1098550, 1128723, 1117492, 1162552, 1224003, 1104778, 1034479, 1184242, 1138698, 1073459, 1080740, 1118197, 1164176, 1198998, 1238584, 1247328, 1317390, 1325305, 1198499, 1213757, 1349631, 1371624, 1362643, 1331061, 1352463, 1345433, 1310765, 1434187, 1529252, 1484075, 1565779, 1629876, 1515471, 1481708, 1541332, 1465327, 1589744, 1588197, 1613157, 1622233, 1682047, 1778274, 1749529, 1704697, 1700791, 1748880, 1734173, 1834791, 1792652, 1790032, 1890709, 1775802, 1844775, 1881492, 1852340, 1832789, 1927891, 2020708, 1985642, 1962491, 2028585, 1882512, 1841995, 1784619, 1739839, 1852814, 1964140, 1969463, 1882343, 1956890, 2121310, 2027636, 2100590, 2004123, 2038431, 2022280, 1970596, 1895479, 2030183, 2167634, 2185086, 2078402, 2127615, 2112687, 2155127, 2109156, 2070966, 2178902, 2097096]
4290B097096p6755J2982J2504j71109M3956j1977m4848M0918J52851M4508k6155
4279B073971L5780J81317M715j6243j53688J07908L8360p1176J3742J36639j23763
4268B227562m2565l7566p4237N4281J43220p8942o5982n6860l3948k7350P7195
4257B084808J40471j12365j10965j24468j56100J60252L6615N1629q5747K6693
4247A910823J21879M4503k1311J4353M5904j06436K0867M7911N4498O6818m4677
4236B155132J42126Q5169p8913J05638p3380P9374n7969j35154j2847j14681J26261
4225B220756O0706K3266n6711q2480n6893l5268K11170j07606j21215J00261M6101
4214B202087l1796m6324n6261N8511J07020J36909K6230R5919J994L2519O9815
$$ y = [2097096, 2020341, 2033323, 2045827, 1874718, 1918674, 1906697, 1861849, 1902767, 2055618, 2100126, 2073971, 2109751, 2291068, 2295783, 2279540, 2125852, 2233760, 2272120, 2200944, 2214686, 2351325, 2227562, 2184997, 2147431, 2073194, 2127475, 2270695, 2191753, 2125771, 2068911, 2034963, 2007613, 2084808, 2225279, 2112914, 2001949, 1877481, 1721381, 1881633, 1918248, 1969877, 1884130, 1910823, 2032702, 2077205, 2055894, 2070247, 2116151, 2009715, 2030582, 2078493, 2132991, 2199809, 2155132, 2297258, 2382427, 2303514, 2409152, 2335772, 2415146, 2357177, 2222023, 2209176, 2094495, 2220756, 2281462, 2304728, 2248017, 2165537, 2108644, 2073376, 2284546, 2176940, 2055725, 2155986, 2202087, 2170291, 2123967, 2067706, 2126217, 2233237, 2370146, 2396376, 2492295, 2494289, 2526808, 2596623]
4203B596623J9947k2228m5890M9560J43801O9692j1745L5263p2131P4062J24507
4192B961461p3339k0309O7218K1048L5260p2761M8438J06041R6285R0144p1192
4181C188294J01828J05837j00271k5266J5756J47523M5539Q588L2619L1974n77
4170C551844J46289O8271O4582R3547M8803P9885k672N0840r3921J4759N6234
4159D078461J23630P0540K4108P6762J92770Q7417k8596J32094J48552J2727r591
4148D908874K08437O2041M9307J71725Q2466l535q759L37398J53479j48058J04188
4137E917563J89074J65904J11980J94527L06715J90186J91044J01198K11531J30752
4127G710474J60459K40336L07534J57019L01834M24841K81360L06168M73242M11756
$$ y = [2596623, 2616570, 2594342, 2548452, 2598012, 2741813, 2811505, 2799760, 2835023, 2762892, 2836954, 2961461, 2888122, 2867813, 2935031, 2956079, 2991339, 2918578, 2967016, 3073057, 3169342, 3259486, 3188294, 3290122, 3395959, 3295688, 3270422, 3286178, 3433701, 3479240, 3487828, 3520447, 3552421, 3551844, 3698133, 3766404, 3830986, 3924533, 3973336, 4053221, 4050549, 4101389, 4007468, 4022227, 4078461, 4202091, 4272631, 4296739, 4373501, 4566271, 4653688, 4625092, 4757186, 4905738, 4918465, 4908874, 5117311, 5179352, 5228659, 5400384, 5482850, 5479315, 5470556, 5807954, 5961433, 5813375, 5917563, 6106637, 6272541, 6384521, 6579048, 6885763, 7075949, 7266993, 7368191, 7579722, 7710474, 7870933, 8111269, 8418803, 8575822, 8877656, 9302497, 9583857, 9890025, 10363267, 10775023]
4117A0775023M49686M98276L95418N60504N17398P16649O45277P80656O27975
4108A5966862O95069P14051N63931P39555N96014O58736P28214O71121N35062
4099B1868615N09633O15760P55371O27281R02029J155039R21243Q54732R08537
4090B9118240N52714L27678M57067M08478L59055M70242O09115P58585R06741
4081C3967915J099231J393393J594400J928687K382349K455308J851388J288447
4073D7961118R00239J043206J422727J573435J974936K605890L195382L491414
4065F4168347L736714L450843K914332K412154J963654J711487J623779J744964
4057H3726274J726200J877563K243562K401192K645166K797163L087579L651360
$$ y = [10775023, 11224709, 11722985, 12118403, 12678907, 13196305, 13912954, 14558231, 15338887, 15966862, 16661931, 17375982, 17939913, 18679468, 19275482, 19934218, 20662432, 21333553, 21868615, 22378248, 22994008, 23749379, 24376660, 25278689, 26433728, 27354971, 28209703, 29118240, 29670954, 29998632, 30455699, 30864177, 31223232, 31693474, 32302589, 33061174, 33967915, 35067146, 36460539, 38054939, 39983626, 42365975, 44821283, 46672671, 47961118, 48861357, 49904563, 51327290, 52900725, 54875661, 57481551, 60676933, 64168347, 67905061, 71355904, 74270236, 76682390, 78646044, 80357531, 81981310, 83726274, 85452474, 87330037, 89573599, 91974791, 94619957, 97417120, 100504699, 104156059]
4049A04156059M106545M767044N817254P022007Q199804Q753211Q079604N939712
4041A56841240L253345O69610l84944l16156N33100J397719J852991K192771K162125
4032A68201801K153674J746006J224949O98946L65365J2658m16374j132915j817625
4023A71036485k316633k929021l307705l159312k806953j913545q22813l2022
4015A53748481n0774j537505m123524o286158p554311p875498p316733o340085
4007A12663893n408005m545547l608008l022989k720579k524052k472677k471248
3999H5890788k536072k508639k310005j894657j673177j940042k228378k677566
3991F8122252l095778l420249l418232l098654k693470k273220j857404j693701
$$ y = [104156059, 108262604, 113029648, 118846902, 125868909, 134068713, 142821924, 150901528, 156841240, 160094585, 160764195, 160379251, 160063095, 160596195, 161993914, 163846905, 166039676, 168201801, 170355475, 172101481, 173326430, 174025376, 174390741, 174403399, 173987025, 172854110, 171036485, 168719852, 165790831, 162483126, 159323814, 156516861, 154603316, 153780503, 153748481, 153697707, 152160202, 148036678, 141750520, 134196209, 126320711, 119003978, 112663893, 107255888, 102710341, 99102333, 96079344, 93358765, 90834713, 88362036, 85890788, 83354716, 80846077, 78536072, 76641415, 74968238, 73028196, 70799818, 68122252, 65026474, 61606225, 58187993, 55089339, 52395869, 50122649, 48265245, 46571544]
3983D6571544j703461j733642j864646j652007j837229j601731j431703j255061
3975C3492064j069457q33402p63203o82955n16538k52372k59081j56551l8858
3966B8919647J96618L09982L36182n466q80814j767638k014927j419068j285045
3957B2389471j085113r62461r98952j050940q09532o24696n51374n66152m65428
3948A5274823m40260m25659m05135n20312n08845m77248l63199m32292m19909
3939A1281964k16737l64111j96586P3819j1865N26375P83269P46229j60563r20135
3929A1541659j178487j158841o32542m11530n18972n20055j66471l47751j80571
3920F426439j17911l15535k19995j96854j07563n8672k50010n935n8j29721k52144
$$ y = [46571544, 44868083, 43134441, 41269795, 39617788, 37780559, 36178828, 34747125, 33492064, 32422607, 31589205, 30826002, 30143047, 29626509, 29374137, 29115056, 28958505, 28919647, 29116265, 29426247, 29762429, 29756963, 28876149, 27108511, 25093584, 23674516, 22389471, 21304358, 20341897, 19342945, 18292005, 17482473, 16857777, 16306403, 15740251, 15274823, 14834563, 14408904, 14003769, 13483457, 12974612, 12497364, 12134165, 11701873, 11281964, 11065227, 10701116, 10504530, 10578349, 10566484, 11092859, 11876128, 12622357, 12461794, 11541659, 10363172, 9204331, 8571789, 8160259, 7641287, 7121232, 6954761, 6607010, 6426439, 6308528, 5992993, 5772998, 5576144, 5468581, 5409909, 5159899, 5153964, 5153906, 5024185, 4772041]
3909D772041L007j46501j27175r3673n2753j34069j88444R1708L717j21537j33188
3898C873133L1380l9820j87837j01574R4785L1857k07186j16308n4207N2682j84545
3887C192360j96207K6514O1465o3437o2242M6984j53968j2121n4313r3034L6758
3876B728759J8423p2809p4934M2475m4340l1498q8930k1798j0053l3995Q473J9059
3864B438832O2352r0148j23747j7250J3588J1735j6757Q8108j9145l3041n0194
3853B264333j40781K0576N920k3392R1650O1168r5329o5746J38560k2356m9022
3842B185581j16995j1971J04551m8564n8813k2510N0926o2157p3675N1743n4169
3831A943947n360j4048o3502K998P7168P5975j12585L1659l4042Q421n2814j88876
$$ y = [4772041, 4775048, 4628547, 4501372, 4407699, 4354946, 4220877, 4032433, 4124141, 4127858, 4006321, 3873133, 3904513, 3864693, 3676856, 3575282, 3670067, 3701924, 3494738, 3378430, 3324223, 3376905, 3192360, 2996153, 3022667, 3084132, 3020695, 2958453, 3005437, 2851469, 2839348, 2785035, 2692001, 2728759, 2747182, 2674373, 2599439, 2641914, 2597574, 2566076, 2477146, 2455348, 2445295, 2411300, 2419773, 2438832, 2501184, 2411036, 2287289, 2270039, 2283627, 2295362, 2278605, 2366713, 2347568, 2314527, 2264333, 2123552, 2144128, 2150048, 2126656, 2218306, 2279474, 2184145, 2118399, 2256959, 2234603, 2185581, 2068586, 2056615, 2161166, 2112602, 2053789, 2031279, 2082205, 2020048, 1946373, 1998116, 1943947, 1938587, 1924539, 1861037, 1864035, 1941203, 2017178, 1904593, 1936252, 1902210, 1910631, 1857817, 1668941]
3819A668941j06521K14158r0887L4806m4077m1980k6687o8757J8525J25932j70121
3808A513332o5427J42123N7459k1714m0598N1763r6612K4127O7861O2044m7154
3797A647204K5219l7852K2473j849p5122O1758K3820o6147r7259J6524J14752
3786A633521r6511n6105L4352J00602O0641Q552J8991o1949Q9959o771n2208J8984
3774A692058r959J3020q9471j3043l3272J84590Q287m3236l0891r806P217O8737
3762A744231p6934n9501J5680O1531J5642l9298m777j67814M6070J38087J4959
3751A687876m4936K7927J2452L0707J3545J26305j44121n6485r632K3069p8829
3740A587878n4734L6498k4035j02019O4282Q7122l7172o7373O9843M095N8711
$$ y = [1668941, 1562420, 1776578, 1685691, 1720497, 1676420, 1634440, 1607753, 1538996, 1557521, 1683453, 1513332, 1447905, 1590028, 1647487, 1625773, 1585175, 1636938, 1540326, 1564453, 1632314, 1694358, 1647204, 1672423, 1634571, 1657044, 1655195, 1580073, 1641831, 1665651, 1599504, 1502245, 1518769, 1633521, 1537010, 1480905, 1515257, 1615859, 1676500, 1685052, 1704043, 1642094, 1732053, 1725282, 1673074, 1692058, 1682099, 1695119, 1605648, 1592605, 1559333, 1743923, 1752210, 1708974, 1678083, 1668277, 1675494, 1744231, 1667297, 1607796, 1623476, 1685007, 1700649, 1661351, 1656574, 1488760, 1534830, 1672917, 1687876, 1642940, 1670867, 1683319, 1714026, 1727571, 1853876, 1709755, 1653270, 1643638, 1666707, 1587878, 1533144, 1569642, 1545607, 1443588, 1507870, 1594992, 1557820, 1490447, 1560290, 1564385, 1623096]
3729A623096J5369n8348J8833j00398q0795n674M8737O0876j12869N7288O6616
3718A532731j24182M7684r9813J6809Q0497l1318q376l7588j3873N1195o0084
3707A353682r2337j27409K7903L7080J78K4255N2257M7472j06834j47488R2487
3696A161246O4162j49610n4297J19153l148j06178L7231j5499P5434m3085j17563
3685I67846N7902o5192j07634J22067P0825n4998p1400j20964K08595m9658j28101
3674H29288o1218N9202P7690r654k3191N3403j86831L2459K48m0284J00868J01330
3662I33310L3694j91924J0251R178k8496p5637N3208l5164J9486K9549r4237L9716
3650G02934l8002q5528J52866N5012N3596k7878l4409l4039j05148L2923Q6509
$$ y = [1623096, 1638465, 1580117, 1598950, 1498552, 1417757, 1412083, 1460820, 1521696, 1408827, 1466115, 1532731, 1408549, 1456233, 1356420, 1373229, 1453726, 1422408, 1414032, 1376444, 1362571, 1413766, 1353682, 1261345, 1133936, 1161839, 1198919, 1199097, 1223352, 1275609, 1323081, 1216247, 1068759, 1161246, 1225408, 1075798, 1021501, 1140654, 1137506, 1031328, 1068559, 1053060, 1128494, 1085409, 967846, 1025748, 960556, 852922, 974989, 1045814, 990816, 919416, 798452, 1007047, 957389, 829288, 768070, 827272, 904962, 895308, 872117, 925520, 738689, 771148, 771396, 731112, 831980, 933310, 967004, 775080, 785331, 794509, 766013, 690376, 743584, 708420, 727906, 757455, 663218, 702934, 664932, 579404, 732270, 787282, 840878, 813000, 778591, 744552, 639404, 672327, 758836]
3639G58836o5741j53029j4783J04439N2575o4835J02501j2519j10602j6925o9715
3628E10202k5936m5568M0382O5120n9273l2479J31894Q5582K4440j00140q3728
3617E10496Q8727j08399o3789J21860Q2917r7419l0093J339O3547J4271l4705
3606E48752r829L1079K0521L3323m0975p966j08993o9398R1788J33032k4654o9438
3594E27242J7940n6797N2540n8566P9071Lj2991M4257n5484O4763j8848J30208
3582G13338P1701K3404j04597p6334n6229m2869P5520n8561Q829K799Q7083p4855
3570E69229j416L5513M6233l4773r2555J8616J09378j33566P1651J26365N7094
3559G71769j48449j23716M6417o309O1548O8226N751R52L9742R4090o3886m4665
$$ y = [758836, 693095, 540066, 525283, 629722, 682297, 617462, 719963, 707444, 596842, 579917, 510202, 484266, 438698, 479080, 544200, 484927, 452448, 584342, 669924, 694364, 594224, 510496, 599223, 490824, 427035, 548895, 631812, 534393, 504300, 505639, 569186, 583457, 548752, 538923, 570002, 590523, 623846, 582871, 574905, 465912, 396514, 488302, 621334, 596680, 527242, 545182, 488385, 540925, 482359, 561430, 561433, 548442, 592699, 537215, 601978, 583130, 713338, 785039, 808443, 703846, 627512, 571283, 528414, 603934, 545373, 554202, 557001, 644084, 569229, 567813, 603326, 649559, 614786, 522231, 540847, 650225, 516659, 588310, 714675, 771769, 623320, 499604, 546021, 539712, 601260, 669486, 675237, 676189, 715931, 810021, 746135, 701470]
3547G01470j36181K6113J06766k1175o6738m6633J0267O3925J20363K0027q8007
3536F90197r4036P5744Q1543k7657j18879J27004O2624l2251o8145J10242J9195
3525H25581j27672J6708M7307J32022L1237k36936N6046N6710J26514q9603j45933
3514F91981M6833N5924j2556l89p2001k3676P0185M7397P2159M959j6427J39000
3502A003389J29382l2140L689J39926j1864L867J42264l7295k4310N0504R6537
3491A463949n4081j85688N249L5949l6179O4678p0752k7115j0733J32612K0521
3480A338410l3104M2872K2573K3210k4294r0316J48996N879j53927j25769r4674
3469A059856m1903o6041q7341K4270l7092J2968P5229n6133j91375p976K707n4199
$$ y = [701470, 565289, 591402, 698168, 676993, 610255, 563622, 573889, 637814, 758177, 778204, 690197, 596161, 671905, 753448, 725791, 606912, 733916, 796540, 764289, 696144, 806386, 825581, 697909, 714617, 761924, 893946, 925183, 688247, 744293, 801003, 927517, 837914, 691981, 738814, 794738, 782182, 781793, 709792, 686116, 756301, 803698, 875857, 880816, 864389, 1003389, 1132771, 1100631, 1104320, 1244246, 1232382, 1236249, 1378513, 1341218, 1316908, 1367412, 1463949, 1409868, 1224180, 1229429, 1265378, 1229199, 1293877, 1223125, 1196010, 1185277, 1317889, 1338410, 1305306, 1348178, 1370751, 1393961, 1369667, 1279351, 1428347, 1434226, 1280299, 1154530, 1059856, 1017953, 951912, 864571, 888841, 851749, 864717, 939946, 883813, 692438, 684462, 687169, 632970]
3457F32970J4314M2612q658n8103Q8693k5597j81006m5471J00140p1960p7641
3446D10293K4847j2527L3252R1947j04290j79887O2865K33225j02047l947q0102
3435C73629N9523N0008j01524p048M8988l7727q8707l503J00499M0709p7525P4304
3423D31626J28148M1280r3350Q5490k8144j20217j31404L4763M5765N7913p2014
3412C79856j0637k9000J1222m7261j139M3788O5665O1984q7698M0079l98J23835
3400E50296l6183j09493r5359J30528o9937j6781K262q2296P2683K7692m2966
3389C30446p5006l5766N8640O7730K5585J11311l0174o9057Q3594m7640M5709
3378D65372N1171j24963n1621M8815M4762j37080R159J44157j67677L7441k7437
$$ y = [632970, 647284, 689896, 681238, 623135, 711828, 686231, 505225, 459754, 559894, 487934, 410293, 435140, 422613, 455865, 547812, 443522, 263635, 326500, 559725, 457678, 453731, 373629, 433152, 483160, 381636, 374588, 423576, 385849, 297142, 293639, 394138, 434847, 357322, 431626, 559774, 601054, 507704, 593194, 565050, 444833, 313429, 348192, 393957, 451870, 379856, 369219, 340219, 351441, 304180, 303041, 346829, 412494, 474478, 386780, 426859, 426461, 550296, 514113, 404620, 309261, 439789, 369852, 353071, 355333, 273037, 345720, 373412, 330446, 255440, 219674, 278314, 346044, 371629, 482940, 452766, 383709, 467303, 419663, 465372, 516543, 391580, 339959, 388774, 433536, 296456, 305615, 449772, 282095, 319536, 292099]
3367B92099L3468Q1592J0959n9778J29404q002q260L2535q1708j17605Q5240O862
3355C96806M1095k097M109J45632J3989Q5493K03067J2543j31471j06979j09411
3344E52776M1653o4221j17651m6243l3335J2009m0297r6067J62325j31317j262
3333B38370M2561k4593j65913L4671Q6385J42158q5669o0P4005j28843j44699
3322F8373R8329J20160j09659J9487J03714J22889q9953O1779M9369m2833L1091
3311D32746n5508L694p8152J6099O5117j06552Q3303k0528l9643N3597j76801
3300A77372R1700K9788k4257j02418m7546M5383M5320Q529O178K3610J341k0181
3288B34819M4097k0183M85M8943q1189J1869R1647K8362j61133o6685k4537q0903
$$ y = [292099, 325567, 407159, 418118, 358340, 487744, 479742, 471482, 504017, 422309, 304704, 389944, 396806, 437901, 435804, 439913, 585545, 599534, 685027, 888094, 900637, 769166, 662187, 552776, 594429, 530208, 412557, 366314, 332979, 344988, 304691, 208624, 370949, 239632, 238370, 280931, 256338, 90425, 125096, 211481, 353639, 267970, 267910, 341915, 213072, 68373, 166702, 286862, 177203, 196690, 300404, 423293, 333340, 395119, 444488, 401655, 432746, 377238, 380932, 302780, 318879, 383996, 277444, 360747, 340219, 300576, 354173, 177372, 269072, 298860, 274603, 172185, 124639, 170022, 215342, 223871, 230049, 253659, 255000, 234819, 278916, 258733, 259218, 308161, 226972, 238841, 330488, 358850, 197717, 131032, 106495, 25592]
3276B5592J2899K22894k0927j2696O1354j07374j06935Q0774P5949j36723l5597
3265E9210k8560O3530J37188q7514j28147o7488Q6175J38551j5834j78865J0175
3254a1579P2263P238l8520k8787j918k635J03322j21754M5037J20725N2210m8757
3242A46845k8107P0146L0765K780p6229l8051J03525J09094O0302j37833K5381
3231B68618L0658r8321j02267P7538K5303j113p6649p822P4355j1967o6959k7138
3219H4236L029m8559Q172N0524J19925q5757M6773L7299n9829m288N1309o5488
3207A37346K8046m8829q3313p9994K34601Q4489j1316j8400j50944L4993L22n016
3195A21985L6214R014O7054o8378o055k8309k1402L9997J44004R1724j4017j93444
$$ y = [25592, 38491, 261385, 240458, 227762, 289116, 181742, 74807, 155581, 231530, 94807, 59210, 30650, 94180, 231368, 143854, 15707, -51781, 34394, 172945, 157111, -21754, -11579, 60684, 67922, 29402, 615, -1303, -3938, 99384, -22370, 22667, 143392, 195602, 146845, 118738, 188884, 219649, 222429, 146200, 108149, 211674, 320768, 381070, 243237, 268618, 299276, 200955, 98688, 176226, 201529, 200416, 123767, 115945, 190300, 178333, 111374, 84236, 87265, 38706, 46878, 97402, 217327, 131570, 178343, 215642, 155813, 151525, 202834, 137346, 165392, 116563, 33250, -46744, 187857, 272346, 261030, 242630, 91686, 126679, 127001, 121985, 158199, 167213, 234267, 165889, 159834, 131525, 110123, 150120, 294124, 385848, 371831, 178387]
3183A78387J42619N1592k2982J24326J7387P8641q320j01565n8103l5137R1426
3172D58271K2878q4223m3760J54055O8034j61410O7502j02624L9282J39516p1751
3161D85770p7104J11331q5401M3068L0000J23851N2086k0858J13448l3806Q3934
3150H26319j7978j25948L2876j8932j34898Q2269N5777q7726k26437p328J62698
3139E40692J5477j62407k7425j9973j6802l0869m2576J6200l9095N3919P8966
3128C66107K6877Q3488L4943p7131J3009L2249j3072q5191R9406p9848k5721o5873
3116C09243M2711J5770j49148J28608m5272j00912j15O5167O4639l056J6247r4243
3104B49639m7715p1057J76690J46939j88441n9875K9606p7432J55527o838r7155
$$ y = [178387, 321006, 372598, 349616, 473942, 491329, 569970, 561650, 460085, 401982, 366845, 458271, 481149, 396926, 353166, 507221, 575255, 413845, 481347, 378723, 418005, 557521, 485770, 408666, 519997, 434596, 477664, 507664, 631515, 683601, 662743, 776191, 742385, 826319, 808341, 682393, 715269, 696337, 561439, 643708, 699485, 611759, 385322, 377994, 540692, 556169, 393762, 366337, 346364, 329562, 298693, 256117, 272317, 233222, 287141, 366107, 392984, 476472, 511415, 434284, 447293, 479542, 466470, 381279, 480685, 400837, 375116, 309243, 351954, 367724, 218576, 347184, 301912, 201000, 200885, 266052, 330691, 327635, 343882, 249639, 201924, 130867, 307557, 454496, 266055, 206180, 235786, 158354, 313881, 307043, 209888]
3093B09888L8518j35872N8828o337j5907j3205l3185l6082L7170l3338J3412M8624
3081A32514Q040j021J6300m4655j57891J50865L4834j44355J4053j5139Q515O8317
3069G0377l6016r098J7546p5075J4654N1238J50028j3356j02312l0281m0010N9031
3057E6726M1677J1029j72263J36947L4650j00379l5001m3955J34132O5604j12484
3046A6683L6350p827l8878L629o8541J13625P1426r1288O9072Q5860Q486j87333
3034A1264M5222j25800J6306k2072J4291J42436k98587L8932K08316p0472P8155
3023C7991Q6971l6608l4373k2590o108n6719q1204J27660O1838K3635j04079l9512
3011d3098O5797L8180l7653j18990J50466N7828p4581j24054M8617j8523N220
$$ y = [209888, 248406, 112534, 171362, 165025, 149118, 135913, 102728, 66646, 103816, 70478, 83890, 132514, 140554, 139533, 155833, 111178, -46713, 104152, 138986, -5369, 8684, -6455, 2060, 70377, 34361, 25263, 42809, -32266, -17612, 33626, 183654, 170298, 67986, 37705, -2305, 56726, 98403, 109432, -62831, 74116, 108766, 8387, -26614, -70569, 63563, 129167, 16683, 53033, 45206, 6328, 9957, -58584, 55041, 126467, 35179, 104251, 190111, 198597, 11264, 56486, -69314, -53008, -75080, -60789, 81647, -216940, -178008, 30308, -40164, 37991, 124962, 88354, 53981, 31391, 25283, -31436, -112640, 15020, 76858, 100493, -3586, -43098, 22699, 60879, 23226, -95764, 54702, 112530, 37949, -86105, -37488, -56011, -50791]
3000e0791M9951L7712r1844k6260o0278Q5236J8595o18O5895j02176o8918J39740
2988c756P810L1520p8550M7113j3628k61176J09555J7166j0039j00691J23397
2977a31279J44228P540k5668r6386J6218n8621O1130k5827J23961J70613k7692
2966A58217n7721M4340M6353m3853p2083m4790p0560l6750L8897R2550p9709K5753
2954F44m8095l5980L4040j8652J31162M5443j9789O255M6704n8515j48626j836
2942f7245L0875m8951M2916j62219l3664J32277K8864J6970k5664J1490j08056
2931a82407L6025L3666N8501R577L7323o2451M0313j4137j16714R8244K1107K3018
2919a7935r1432o411Q7850j2744n2824R4197n0341M2822l2770l048J17348q5494
$$ y = [-50791, -840, 36872, -54972, -81232, -141510, -56274, -37679, -38297, 27598, -74578, -143496, -3756, 4054, 35574, -42976, 4137, -9491, -270667, -161112, -143946, -153985, -254676, -131279, 12949, 20489, -5179, -101565, -85347, -143968, -82838, -108665, 15296, 185909, 158217, 100496, 144836, 191189, 147336, 75253, 30463, -40097, -76847, -37950, 54600, -25109, 644, -47451, -83431, -49391, -68043, 63119, 108562, 88773, 95028, 141732, 83217, -65409, -67245, -36370, -85321, -42405, -204624, -238288, -106011, -77147, -60177, -85841, -74351, -182407, -146382, -112716, -54215, -44638, -7315, -69766, -29453, -43590, -160304, -62060, -40953, -17935, -109367, -115778, -27928, -40672, -93496, 701, -49640, -6818, -39588, -42636, 74712, -10782]
2907a0782o0207M2671J0101j31103r6353R7089N4129J2185M6942M0397m5820j2024
2895e2775O287M7263L3788q0448r0670k9470L6717M4709m419o3402P4195N2103
2883b6122o4736M7427J6106p5264J5132J20043J674j05602Q1483o3130j19827
2872a72816p239J28689p753J12234q1972N5906j24887j24607n425J58322R7445
2861B7897j81910Q1738M0213M4597Q1791l3164j87006q4402L4096J09000M2723
2850b4427l9841m2789J08172j0644p2632m1050P799K2044J0294L8054l8888M7290
2838c6618m5n7951r499j09012l8235J02995O3125j0218J71927n6752r057P0986
2826H1646q9704k24206K8571J24494J46007q146q28q359K5668o6018L4780M5444
$$ y = [-10782, -70989, -28318, -18217, -149320, -245673, -148584, -94455, -82270, -35328, 5069, -40751, -52775, -46488, 775, 34563, -45885, -136555, -166025, -129308, -84599, -89018, -152420, -78225, -26122, -90858, -43431, -27325, -102589, -87457, 32586, 34260, -71342, 10141, -52989, -172816, -180055, -51366, -59119, 53115, -28857, 27049, -97838, -222445, -227870, -69548, 27897, -154013, -72275, -32062, 12535, 94326, 61162, -125844, -210246, -176150, -67150, -24427, -64268, -107057, 1115, -9529, -82161, -123211, -115412, -93368, -83074, -45020, -83908, -36618, -36663, -94614, -104113, -213125, -251360, -148365, -85240, -95458, 76469, 19717, 10660, 81646, -8058, -232264, -203693, -79199, 66808, 58662, 57834, 49475, 75143, 9125, 43905, 89349]
2814H9349r153L4267r6449k428J00691k4257m3902j9942L0291r2815j27196O6162
2802i5382Q0540r5454J19033p619N9305l1234r4077m6504J09196o493r0355P7159
2790b1885r21n7432K0360N9358M6680n5491r870J54405p9008n870q835N4371o7554
2777B8308Q5831k6268l1477l2468j40098R4899O3494O4907K1145P2034j39685
2766F0622L1110P6799l9279j38945P9370k5103j49309J46844j3952r4029M3069
2755b2803J05984j25201O843j70104P7967K09867J4115M7945p8195m4336J15920
2744A38002k8384j713j8215q8496q763O4896N5485J3827j3296r49n3569L6733
2732I5558m9779j11379n8383Q5837n6738J90324j4229o0821o929L7586L8194q2651
$$ y = [89349, 80196, 114463, 18014, 15586, 116277, 92020, 48118, 28176, 58467, -34348, -161544, -95382, -14842, -110296, 8737, 1118, 60423, 29189, -64888, -111392, -2196, -8689, -99044, -21885, -22806, -80238, -59878, -520, 46160, -9331, -19201, 135204, 56196, 50326, 41491, 95862, 28308, 114139, 87871, 56394, 23926, -116172, -21273, 42221, 107128, 128273, 200307, 60622, 91732, 168531, 129252, -9693, 69677, 44574, -104735, 42109, 28157, -65872, -22803, 83181, -42020, -35177, -205281, -127314, 82553, 96668, 144613, 66418, 22082, 138002, 109618, 107905, 89690, 1194, -7569, 57327, 112812, 126639, 113343, 112394, 58825, 95558, 45779, -65600, -123983, -38146, -94884, 95440, 81211, 20390, 13461, 51047, 89241, 6590]
2720F590n7051l5342M4498J22295m1497n370p0367l4042Q2742O9669m6366p806
2708B7953n4729N3826N3586P2428o5076J1204K1146M923M8483n5008j62582n147
2696d8993m8979L9727P1877L1101M6576l281j5524j538O1009p5714j3164j4064
2684B9033l3828M463Q5711J7629j42590p7918J32908R539p6189J274M7508l313
2672e773j15250l4364O8352O271O3819N5787M2085j31917j18005j7201J26682
2661e9514j9212P0702M4693q268k3189n8786p1364N4756l3214P2997L6284k4448
2649a8563J32427O5802j0934M0183o7692n3723n1531R515Q6059O7609l9907q2244
2637G7001r196r5700l3346Q8665M1358J16548p1736Q7558J37525j16282k5163
$$ y = [6590, -50461, -85803, -41305, 80990, 39493, 34123, -36244, -70286, 12456, 82125, 35759, 27953, -26776, 27050, 80636, 153064, 87988, 99192, 120338, 125261, 173744, 118736, -43846, -48993, -97972, -58245, 13632, 44733, 91309, 88028, 72504, 70966, 131975, 56261, 43097, 29033, -4795, -332, 85379, 103008, -39582, -117500, 15408, 24947, -51242, -49968, -2460, -5773, -121023, -155387, -87035, -80764, -16945, 38842, 80927, -50990, -168995, -186196, -59514, -78726, -8024, 36669, 28401, 5212, -53574, -124938, -70182, -103396, -30399, 5885, -18563, 113864, 179666, 168732, 208915, 141223, 87500, 35969, 45484, 131543, 199152, 159245, 77001, 67805, -27895, -61241, 27424, 68782, 185330, 113594, 201152, 338677, 222395, 197232]
2626A97232J43345o5259j98126Q4053P7921M0804R4716M5508K40174J56743J83477
2615A000588K98684J34792o3692n6940j86147k03007j17176j05716k57847n2178
2605C91361O9656q7821l6147J4255l6888m7974J632Q3237p816j37326m0081J21899
2593B87987k5141j74170n1750O3972J16981P3653p5033l9814j03425m3184O0797
2582I0873O0896Q2554N5034K569o0338r6326K0275M9929L9035Q5627n43l1803
2570B97782J4136j00697K5724R1477o1730m5146R6594j36889j26144J46850k4112
2559A77845J44954n2831j52485M3824j1499m8165R0206L3964k2768j88241O5049
2548G9853j8808j14638K7344K10803Q8854J4931R1703l3938L9692k4023r4631
$$ y = [197232, 340577, 275318, 77192, 161245, 239166, 279970, 374686, 420194, 660368, 817111, 1000588, 1299272, 1434064, 1370372, 1313432, 1127285, 924278, 807102, 701386, 443539, 391361, 461017, 373196, 337049, 351304, 314416, 266442, 268074, 351311, 343495, 206169, 166088, 287987, 262846, 88676, 36926, 100898, 217879, 291532, 216499, 176685, 73260, 30076, 90873, 151769, 234323, 289357, 291926, 231588, 135262, 155537, 205466, 244501, 330128, 329585, 297782, 311918, 211221, 236945, 328422, 266692, 221546, 318140, 181251, 55107, 201957, 177845, 322799, 269968, 117483, 161307, 149808, 101643, 191849, 225813, 203045, 14804, 79853, 61045, -53593, -26249, 184554, 273408, 288339, 380042, 346104, 385796, 361773, 267142]
2537B67142j24734N2104r2187j1747P5199P6928j15739L4159n6471M6236J63312
2526C14202L2973p7826J1224J54423j22997q1906L9812M1190K7390O0954j26622
2515B72817m348p734Q4859J02380J46749l4923n2585Q1752J21394P837q9802k1237
2503F07159M5995k6243l0146p097L3090M5563j07398J279J31257l3845P1834O4452
2491G95900K048k18903L3200O5113p7051j314L9676p0603J946J04216J59528O5484
2479H99240o0727p5568O1875K8132J54543L8967r2607M1923J3322j22269J06459
2468I93290m5415n4784J46648Q3694j23804r8332J23104L884p7091J89584R511
2457A150289L6399o3918J97674K1081N7132J2957j6172J58093l9845p6349N5854
$$ y = [267142, 142408, 194512, 102325, 90578, 165777, 242705, 126966, 161125, 104654, 150890, 314202, 347175, 269349, 280573, 434996, 311999, 230093, 269905, 311095, 338485, 399439, 272817, 268469, 260735, 345594, 447974, 594723, 559800, 507215, 588967, 710361, 718198, 628396, 607159, 653154, 626911, 596765, 589668, 622758, 668321, 560923, 562202, 693459, 659614, 731448, 795900, 797948, 579045, 612245, 677358, 600307, 598993, 638669, 568066, 570012, 674228, 833756, 899240, 838513, 762945, 824820, 852952, 1007495, 1046462, 953855, 995778, 1009100, 886831, 993290, 947875, 893091, 1039739, 1123433, 999629, 901297, 1024401, 1028285, 951194, 1140778, 1150289, 1186688, 1122770, 1320444, 1341525, 1398657, 1411614, 1395442, 1553535, 1513690, 1437341, 1493195]
2446A493195J16905m3328j05686K8237j3526L4803K08509R4095K6812O2228J2213
2435A914457k3178k4138P7061J21284J43968J23376r4473P5134l7577L0393J74392
2424B480699J09371Q5961K4871r3652J22550N6565j18591R6319K55345J50981
2414C170419K33440K2936o2698r122J12932l6477O3390J74602L6316K11718q2881
2403C834575o8176J73794J4956J19705J09343K20184L45144J90617l4802J69282
2393E074622K02554J91147M0419K03509J30021J15756K47751L50465J02879M01029
2383G060152O0666J26286R8838L78461K18380N15446L94834O41022M74565Q89745
2373A0858395O10750M65321M82656P83958P70229J176894J429612K144000K453296
$$ y = [1493195, 1610100, 1566772, 1461086, 1489323, 1475797, 1510600, 1719109, 1813204, 1840016, 1902244, 1914457, 1891279, 1867141, 1944202, 2065486, 2209454, 2332830, 2238357, 2313491, 2275914, 2306307, 2480699, 2590070, 2676031, 2700902, 2607250, 2729800, 2786365, 2667774, 2764093, 3019438, 3170419, 3403859, 3426795, 3364097, 3354975, 3467907, 3431430, 3494820, 3669422, 3705738, 3917456, 3834575, 3766399, 3940193, 3955149, 4074854, 4184197, 4404381, 4749525, 4940142, 4905340, 5074622, 5277176, 5468323, 5508742, 5712251, 5842272, 5958028, 6205779, 6556244, 6659123, 7060152, 7120818, 7247104, 7345942, 7724403, 7942783, 8458229, 8853063, 9494085, 9968650, 10858395, 11469145, 11934466, 12417122, 13201080, 13971309, 15148203, 16577815, 18721815, 21175111]
2364B1175111L217259L515411L281560J709987J513211J378900K332850L417038
2356D1541327N394458O582701Q471725R654946J3557714J9212364L3322289N2168733
2348A89906257O6798479L5550456k6578022n3879316n5814578l7246209k4609922
2341I4127145j8433866j5280247j0700728p424111n333189l996702k307761j134240
2333B9516301k51182r56518k152696k604625k246069j628389j454803j365476
2325A6856543j305783j070515j171978r37882p87889n79807m84016m56488m49357
2316I612828l00383m55589k75802m05981o45076m46635l54083k69935k32938k70731
2306E955675k04514k77899k06891k04708j19515J2534k32687l77995k98750j08191
$$ y = [21175111, 24392370, 27907781, 31189341, 32899328, 34412539, 35791439, 38124289, 41541327, 46935785, 53518486, 61990211, 71645157, 85202871, 104415235, 137737524, 189906257, 256704736, 292255192, 265677170, 211797854, 155983276, 118737067, 94127145, 75693279, 60413032, 49712304, 42288193, 36955004, 32958302, 30650541, 29516301, 29265119, 28308601, 26155905, 23551280, 21305211, 19676822, 18222019, 16856543, 15550760, 14480245, 13308267, 12370385, 11582496, 11002689, 10518673, 10062185, 9612828, 9312445, 8856856, 8581054, 8175073, 7529997, 7083362, 6729279, 6459344, 6226406, 5955675, 5751161, 5473262, 5266371, 5061663, 4942148, 4954682, 4721995, 4344000, 4045250, 3937059]
2296C937059M4498l5511M3044j30156j04919j22521q9100k12898j05064j74399
2286C050033j88789j17057l7742j818k02955o913q7500j30068K8022N78R6371
2275B402162k3344K5161k17965l08602r8320j19721j00893P727J32498R374M4560
2264A752637P0185q6283M8776r8137m3947N522j18730k9969q0382j29149K10962
2253A501485k19839k3103K5600P2737j5340q0895k46533J5195k1935p9548j34343
2242G93481J64264N0964j0621j24533M8230J875j9969m9674Q6282m3832o3016
2231H33451M9659Q0756j11342j29594l2309Q787L4700J2458q2560r7666q2794
2220D83546R5217O975Q2540J20131n6979j07677o442J6451O738J9616j52720j34482
$$ y = [3937059, 3981557, 3946046, 3989090, 3858934, 3754015, 3631494, 3542394, 3329496, 3224432, 3050033, 2861244, 2744187, 2706445, 2704627, 2501672, 2494759, 2407259, 2277191, 2305213, 2305791, 2402162, 2378818, 2403979, 2186014, 1877412, 1779092, 1659371, 1558478, 1566205, 1698703, 1708077, 1752637, 1822822, 1736539, 1785315, 1687178, 1643231, 1648753, 1530023, 1500054, 1419672, 1290523, 1501485, 1281646, 1258543, 1284143, 1356880, 1341540, 1260645, 1014112, 1029307, 1007372, 927824, 793481, 957745, 1008709, 998088, 873555, 921785, 923660, 903691, 854017, 940299, 896467, 833451, 883110, 963866, 852524, 722930, 690621, 699408, 734108, 746566, 664006, 566340, 483546, 578763, 585738, 668278, 788409, 731430, 623753, 617311, 633762, 640500, 660116, 507396, 372914]
2208C72914P8229J1005M3879K7825k3493k15592J31J54543J9053n851j86871j18920
2196A56852l6353J55818P3764N213o6402p9485k2382J09565j7583J1208j72937
2185A17278k9686J22405M8717M2044M8700J80731m6899j40068J39962j14723l7952
2174C30509q4322k5512l7721J53437K9009n2849j3455l3146J45075r6343l9073
2163B75609P2112L620J10046n7292M2909j10523j29241m3150Q7169l4199j09848
2152A07212J32868J05495r1066j3420k5914P8981q4424q8111R2296L0786L6920
2141B81623k13M6200M140j12055o5474R0739K1939q5761j60227l1061J17421n1752
2129E5519m7279N9027N8240n354n2676M2266M719j47289q8612J05729N2902j5208
$$ y = [372914, 451143, 462148, 506027, 533852, 510359, 294767, 294898, 449441, 468494, 462643, 275772, 156852, 120499, 276317, 350081, 355294, 288892, 209407, 187025, 296590, 279007, 290215, 117278, 87592, 209997, 258714, 300758, 349458, 530189, 483290, 343222, 483184, 368461, 330509, 246187, 220675, 182954, 336391, 365400, 312551, 299096, 265950, 411025, 314682, 275609, 347721, 351341, 461387, 404095, 447004, 336481, 207240, 164090, 251259, 217060, 107212, 240080, 345575, 254509, 241089, 215175, 294156, 209732, 121621, 213917, 244703, 281623, 281410, 327610, 331750, 219695, 154221, 244960, 266899, 181138, 20911, -10150, 107271, 55519, 8240, 67267, 125507, 120153, 67477, 109743, 114462, -32827, -121439, -15710, 37192, 21984]
2117B1984o1279L8912J28395m7777P305p8613n7788L03696q8249j03686J0519
2106G3419n7670J48595r19p3267O4385n9172k6895N2062q5486J53289J42868q8705
2094B42504P1532k05248P1473L8363K7160j4440r9412P6560m6204P6676J33193
2083C72157Q1090J10487J36964N7668K63620J53305k6396n4068k3961j90935j81751
2072F98180p0137j52956k68291k4469P9432J6814o9554n8230p144q0566j03020
2061c9941J03242l3023q7194l5139P5134K4286P9880m8085p2296K00881j80249
2050a2504q3114P6670J7226j02662R4461K16068j01523l8459R3423O8298p4046
2039A53838J19093o7838j10223n9590j9655P6557J17236j79963q3051J82276r778
$$ y = [21984, -39295, -383, 128012, 80235, 87540, 8927, -48861, 254835, 166586, 62900, 73419, 15749, 164344, 163425, 90158, 154543, 95371, 68476, 120538, 35052, 188341, 331209, 242504, 314036, 108788, 180261, 218624, 245784, 231344, 131932, 208492, 162288, 238964, 372157, 453247, 563734, 700698, 758366, 1021986, 1175291, 1148895, 1094827, 1070866, 879931, 698180, 628043, 475087, 206796, 182327, 261759, 278573, 209019, 150789, 143645, 63079, -39941, 63301, 30278, -56916, -92055, -16921, 7365, 87245, 39160, -33136, 167745, -12504, -95618, -18948, -1722, -104384, -9923, 206145, 104622, 66163, 159586, 227884, 153838, 272931, 205093, 94870, 35280, 15625, 92182, 209418, 29455, -53596, 128680, 118902]
2028A18902K027k0840r5964Q3704K9508M8268O1342q1703N2321n4652k0952n0453
2016G1508j17222m6594J46367J27523K9204j85023O352J44064L1939p6680j13173
2005A8265r5900n8892J28767m1004j894P0108J4684j6994J1738O3956p580o930
1993G8324j46253Q1057K601o041m7254m2827j0786P6452M3296P3276k5529k4513
1981E1803j6702l7252L6537P811n3905L5004m594j35991J37805J515N1713L8055
1969A11799j31657K0497j00180k4121P8518l595N1946l9516o1451J29561m5449
1958a3648K406o885j6952l7056J22191j05064l8184j86899J2207Q2289k5378P9883
1946a31090N3483K15053j211j43839R6110l7652j64741O369Q5161n5298j74867
$$ y = [118902, 120929, 100089, 4125, 87829, 117337, 165605, 226947, 145244, 197565, 142913, 121961, 71508, -45714, -92308, 54059, 181582, 210786, 25763, 32115, 176179, 208118, 131438, 18265, -77635, -136527, -7760, -48764, -50658, 19450, 34134, 17140, 28878, 92834, 85254, 78324, -67929, 13128, 15729, 9688, -37566, -80393, -91179, -14727, 28569, 101845, 76316, 51803, 35101, -2151, 34386, 42197, -11708, 23296, 18702, -117289, 20516, 22031, 73744, 111799, -19858, 639, -99541, -123662, -45144, -48739, 3207, -36309, -97760, 31801, -13648, -11242, -18127, -35079, -72135, 50056, -55008, -93192, -280091, -267884, -185595, -210973, -131090, -77607, 137446, 136235, -7604, 88506, 50854, -113887, -107518, -22357, -77655, -252522]
1935b52522J88390L4002m9368j59580j376J11041Q33L0350J12474j9296l2305
1924c7357p6250q0668P2817m2880Q7552J2433q835N5695j03740j29629N9045O403
1912a85414Q0111J04936j9810J05032k0545k71273M2257J47705m8027j04325P511
1901a61842Q9853o1733l0821J50020l0062j40916K9054l2680J89822k5453j39643
1890a64401k2920J10239q5335P4695l5707j58466M8600J9396J39070M574j24387
1879a94642K3270J2991K8142P1605j8110q1771J15904M4070R7511j24164j9997
1868d5191N153m2267M3050Q612j6570M4983n221l0553L0447Q7180j45583O7245
1856A285O3647M6016j08466P026k1701J11463k7479j48180L1089N3391J6165K8410
$$ y = [-252522, -64132, -30130, -79498, -239078, -240454, -129413, -128580, -98230, 14244, -5052, -37357, -113607, -194275, -121458, -164338, -76786, -64353, -73188, -17493, -121233, -250862, -191817, -185414, -105303, -367, -20177, 84855, 64310, -206963, -164706, -17001, -65028, -169353, -161842, -71989, -133722, -164543, -14523, -44585, -185501, -156447, -189127, 695, -24758, -164401, -187321, -77082, -162417, -87722, -123429, -281895, -233295, -213899, -74829, -70255, -194642, -171372, -158381, -130239, -58634, -76744, -158515, -42611, 1459, 98970, -25194, -45191, -40038, -82305, -39255, -30643, -47213, -2230, -7451, -38004, -7557, 79623, -65960, 1285, 64932, 110948, 2482, 9508, -12193, 99270, 71791, -76389, -45300, 8091, 24256, 52666]
1844E2666Q9850q7946m1997j07324J4240Q8465j32361J3465M2018N9583K7699
1833A8358l2357L9390n4247J11717n7701k8406j65945J03121j17340N2655j7431
1822a48186Q796M4123o2821j0293N1899k2856L7685O6621j05716L4489O0372r5738
1810a41625O8471J59899j02004j71295o9645J12300P0176k2363J49502K2427j09618
1799c3775j27136P1995O9350l9413P19M5676o5500m0655Q6288k1934L4293k3601
1787d3693N6200n6082n6948m6631p9376P1452K2922Q0933L7995p2628k6842k3225
1775a35923N5759M448k818j33667l3131N2199j5559l5510j4138N2103L8725J30797
1763c6715M4138p320j1726J5737o0622p6548q8812P4108n422Q7483O6426r1405
$$ y = [52666, 142516, 54570, 12573, -94751, -80511, 7954, -124407, -110942, -68924, -9341, 18358, -13999, 25391, -28856, 82861, 25160, -3246, -169191, -66070, -183410, -130755, -148186, -139390, -95267, -158088, -168381, -116482, -139338, -101653, -35032, -140748, -106259, -45887, -141625, -73154, 86745, -15259, -186554, -256199, -143899, -73723, -96086, 53416, 75843, -33775, -160911, -88916, -19566, -58979, -58260, -12584, -78084, -118739, -32451, -54385, -20092, -43693, 12507, -43575, -100523, -147154, -226530, -155078, -132156, -51223, -13228, -85856, -112698, -135923, -80164, -75716, -78534, -212201, -245332, -193133, -208692, -244202, -258340, -206237, -167512, -36715, 7423, 103, -11623, 4114, -56508, -133056, -221868, -147760, -153182, -65699, 727, -90678]
1751i0678j3709J25039k826l6027o5569J40675N4985j60763M4517J0235o8049
1740f2170q3426m200L8863M5448j1276M188J03432N414J2472j08891n5055M2401
1728g2800J56909O7861m9776j55042j67950N3981n4957R8575J05057m037K0925
1717a254k7348Q8999q0509m8945Q1085J9363N6989p4491n2156q5237O7805j2600
1705f8299l2626J0282p7051j6503K05042k1773l3810m6465j18737J51861l7789
1694h5868P7892K7027l4853Q5088k1670q5766n9479J567r2191J60482P5638p5659
1682b7792p0352Q5675K4231q9525Q2683R2221p7916r2331j22260M2923N0947k0929
1670a22425J35299J18704j4117J6715j2511Q3463j17075q4095k0934j6448n164
$$ y = [-90678, -104387, 20652, 17826, -18201, -83770, 56905, 111890, -48873, -4356, 5879, -62170, -145596, -149796, -110933, -65485, -76761, -72573, 30859, 36273, 48745, -60146, -115201, -72800, 84109, 151970, 102194, -52848, -220798, -166817, -221774, -123199, -18142, -22179, -1254, -28602, 60397, -20112, -69057, 12028, 31391, 88380, 13889, -38267, -123504, -55699, -68299, -100925, -90643, -167694, -184197, 20845, -928, -34738, -81203, -199940, -48079, -85868, -7976, 19051, -15802, 69286, 47616, -38150, -97629, -96062, -188253, -27771, 47867, -27792, -98144, -12469, 11762, -77763, 4920, 97141, 19225, -73106, -195366, -152443, -101496, -122425, 12874, 131578, 117461, 134176, 121665, 205128, 88053, 3958, -16976, -33424, -38588]
1659c8588r1434P3302P288j9962M9457l4841p4767J47027q366o0915k7680Q349
1647g1130M1524J9366l7926L4703o3207n9096J1708p9104l897N5318M7526n6864
1635a61079Q4879j4078j18919M2547N0915o4334R8815L2393k3629J9660k4258
1624g7088r3567j0524K3675l2442Q3397R7389R001k6646k7301K2128r5638P3616
1612e4000j0406o3176L6040K939K7183J0562j2142o0926J1734p2045j2897P7105
1600a20029O8664q3314J7558N3947J02559j8827o8197k5349J6578N835J3681K3055
1588a3839q8661j5837R4113o3150j03724L0585J87415Q5094k07260J631N243J638
1576h6752o3160O7327J47542j11295m7460m5022M4184O6308j6155n7454P431J1806
$$ y = [-38588, -130022, -56720, -49432, -69394, -19937, -54778, -129545, 17482, 9116, -51799, -79479, -71130, -29606, -10240, -48166, -13463, -76670, -135766, -124058, -203162, -207059, -151741, -104215, -161079, -76200, -90278, -209197, -166650, -115735, -180069, -81254, -48861, -72490, -52830, -77088, -170655, -181179, -157504, -189946, -106549, -9160, -159, -26805, -54106, -31978, -127616, -54000, -64406, -127582, -91542, -88603, -61420, -50858, -63000, -123926, -112192, -184237, -197134, -120029, -51365, -134679, -117121, -63174, 39385, 20558, -47639, -72988, -56410, -50575, -36894, -13839, -102500, -118337, -24224, -87374, -191098, -160513, 26902, 111996, -95264, -93633, -88390, -86752, -149912, -82585, 64957, -46338, -93798, -138820, -94636, -28328, -44483, -101937, -94506, -82700]
1564h2700K02931L3917O5854j66431k14970M3069j1529J09927p3863M2368O6256
1553A4829k8361q1234n4277J0534K5711Q0349M5540k0113j13441n4692J1898R4750
1541f8507Q9471K9398r9955j1239P5254P6393r0452m2974k4465N7344J950m5090
1529e2872l075P7383Q7385j6228j06742M0617K2728K1249n5015k5364J24069o371
1517A07764l9235K2657o4300j5905J6663j04586J13380r1422P0738P5729k3822
1506F7661j71113r7422J92202j4784P4375K584k0368o805j14106k5318O4913J19503
1494G1322q0321P0545j8103K1307r8797o5688L1913K0130n8448M7783Q6236m1277
1482a3398r5335Q3353l5102O9899j3502N2709o375n9809L5285l7280n7609p7155
$$ y = [-82700, 120231, 154148, 220002, 53571, -161399, -118330, -129859, -19932, -93795, -51427, 14829, -13532, -94766, -149043, -138509, -112798, -32449, 13091, -7022, -120463, -175155, -163257, -68507, 20964, 50362, -49593, -60832, 14422, 90815, 363, -42611, -67076, -9732, -7782, -52872, -55947, 21436, 108821, 92593, -14149, 26468, 49196, 70445, 15430, -9934, 114135, 107764, 68529, 91186, 26886, 10981, 27644, -76942, 36438, -54984, 15754, 91483, 67661, -103452, -200874, -8672, -23456, 50919, 53503, 33135, 26330, -87776, -113094, -48181, 71322, -8999, 61546, 43443, 64750, -34047, -99735, -67822, -47692, -106140, -58357, 27879, -13398, -108733, -25380, -60482, 9417, -4085, 48624, 42249, -17560, 17725, -19555, -77164, -154319]
1470a54319J33874O1553j21468m1403J45806N8532K8798J7944J1419j06811q5349
1459e1424q9976R198j0289K18218j06220j03670K43691j2009j63446o0299O4675
1448f1551J47976j09703j87391M4242R1013J4247k0130j15654L9847l7746J61634
1437c3216L165j214L5150p4036r6722N6310K9467j450j7305j1331M2217m2268
1425a11233p316P614J08679N7841P950j15497N2540J27164J2981r7307n547k5669
1413A2200j11682M4419J01205l8728M2050j10928O536Q2360N3976j81886o9452
1402a69930R6002Q5j7568k4920p3389R9382J7825m3000j9218R8566k5634r7185
1390a58984J291J95598l8196r7861L135M137J56764J9596p2709N975m6043k0290
$$ y = [-154319, -20445, 41108, -80360, -121763, 24043, 82575, 111373, 129317, 140736, 33925, -51424, -141400, -132202, -142491, 75727, -30493, -134163, 109528, 97519, -65927, -126226, -61551, 86425, -23278, -210669, -166427, -75414, -61167, -81297, -196951, -157104, -194850, -33216, -30051, -31265, 3885, -70151, -166873, -110563, -81096, -82546, -99851, -111182, -68965, -111233, -118549, -110935, -2256, 55585, 63535, -51962, 578, 127742, 140723, 43416, 37869, 12200, -99482, -55063, 46142, 7414, 49464, -61464, -54928, 27432, 81408, -100478, -169930, -73928, -73843, -91411, -116331, -189720, -90338, -72513, -115513, -134731, -36165, -61799, -158984, -157693, 37905, -291, -98152, -95017, -90880, 65884, 85480, 12771, 18746, -27297, -47587]
1378d7587n5472P7279K7710Q6381n5908r0337Q313K9021J56758k7899m5623j04818
1366d2182Q9241j34591Q9475Q3676l557L8768R8567j43086j86693M3095L1265
1355c6022j31079l256q058O1839J21558l7201o2990m4353R2759K5176m1246N647
1343e7226M6451J88972j25129l989j40286N6371J045n1321K1898j8151J16012
1332C4647q8719l2991J8108L3906P1788k963M2257K8707j34181J4633o7419l5541
1320a17768J03771j1866m8323n5873o123q9649N5421K10020k9367o5594l6944
1309i2295P9629R5204J02667j6680j45894l1067J10999j74059k8393L897M7950
1298d8042l2555J0916K2733O4659l7467J9643j59483P9428L9752r7444R747p4342
$$ y = [-47587, -103059, -25780, 1930, 88311, 32403, -57934, -49621, -20600, 136158, 108259, 62636, -42182, 47059, -87532, 1943, 85619, 82062, 120830, 219397, 76311, -110382, -67287, -36022, -167101, -170357, -178415, -116576, 4982, -32219, -95209, -139562, -46803, -21627, -62873, -57226, -10775, 178197, 53068, 49079, -91207, -34836, -33791, -85112, -63214, -81365, 34647, -54072, -87063, -68955, -35049, 36739, 33776, 76033, 104740, -29441, -14808, -82227, -117768, -13997, -25863, -74186, -130059, -136182, -225831, -170410, 39610, 10243, -55351, -92295, -12666, 82538, 185205, 168525, 22631, -8436, 102563, -71496, -99889, -95992, -48042, -80597, -69681, -46948, 17711, -19756, -113, -159596, -80168, -40416, -137860, -128113, -202455]
1286b02455M3356m294P285J07078n9818O2732j7025O4822p1569l5356M8437P3545
1274A6738N2339n1987j3510j32175q6355J71160J98151j25810l6051m4797M4740
1263g557j0820N8766j7648R6075N250l6556M3782n042j63615r4664l0995Q2356
1251h0668k5157N2514l8229k364l985R5366O4797R9235K4100l3507k047n4424
1239I5631k6843m0751j17539O798q0063J6733J9116R7780K7295j11372r3733k4783
1227b31731L7642J08108J29050J0169n6159j8086J7784K37p7770J32433M0304
1216I1981j55078O6531p4348j3613N4194P2223J38556j14034r2823K2886j03220
1205a06745O4045O6130O4846k9580l4663O5145J1944j43257K1073M0920N4899
$$ y = [-202455, -159099, -163393, -156108, -49030, -108848, -46116, -63141, 1681, -69888, -105244, -56807, 16738, 69077, 17090, 3580, -128595, -214950, -43790, 154361, 28551, -7500, -52297, -7557, -18377, 40389, 22741, 118816, 124066, 87510, 131292, 126250, -37365, -132029, -163024, -80668, -105825, -53311, -91540, -93904, -97889, -2523, 62274, 161509, 185609, 152102, 150055, 95631, 68788, 28037, -89502, -82704, -162767, -146034, -126918, -29138, -1843, -113215, -206948, -231731, -194089, -85981, 43069, 53238, -2921, -21007, -3223, -2986, -80756, 51677, 91981, -63097, 3434, -70914, -84527, -30333, 41890, 180446, 66412, -26411, -3525, -106745, -42700, 23430, 88276, 58696, 24033, 89178, 101122, -42135, -21062, 19858, 74757]
1194G4757L1202m6564j17348N8468J6763n5440j8766L4390q4880j8299M1245J91062
1182A06590J4577n4507O7195l6447N0989q6033j73817J02233j04351m7660O6436
1171i4795P5328P2095Q0510k9298o39l1369j45354m8390k1558K7420R8563J037
1159a6450Q2924j0235r4291R0140j27792J5980M4506m9871N8995k5263j36153
1148a67510m495M4027O9638K7435P8975p5856P1793n3906M5226k1938k0442J9170
1136A2117K8359L0159j68009Q7205O4038K128N1201m2846o0953P4917l0056J8920
1124F7180N7118j59580l5957L1284l856k3656j51414L4736J45339Q7490j18772
1113g0088O8583Q5371p7346j18109R8752N0145r2676n6026M7883J1692J5125M1985
$$ y = [74757, 105959, 59395, -57953, 515, 17278, -38162, -56928, -22538, -107418, -125717, -84472, 106590, 121167, 66660, 133855, 97408, 148397, 62364, -111453, -9220, -113571, -161231, -94795, -19467, 52628, 133138, 103840, 103201, 71832, -73522, -121912, -143470, -116050, -17487, -16450, 66474, 56239, -38052, 52088, -75704, -59724, -15218, -65089, -6094, -31357, -167510, -172005, -127978, -58340, -30905, 48070, -27786, 44007, -9899, 35327, 13389, -7053, 12117, 40476, 70635, -97374, -10169, 53869, 55997, 107198, 64352, 3399, 78316, 48260, 67180, 124298, -35282, -71239, -39955, -43811, -67467, -218881, -184145, -38806, 48684, -70088, -1505, 83866, 6520, -111589, -12837, 37308, -55368, -111394, -63511, -51819, -36694, 5291]
1101E291O2310j24889k3932K4176K1882L525n9381Q4777J6182r1543M9198q6306
1089a18710r8026Q1971L8516P8244Q0218O7982n952M8512k32558J9000M2197J1425
1077A2819M0837J9582k1672K9038J7915R7452q9433q6593l5328r2571p3982m126
1065a86062J87233l5241j1562R739O3242q1266k7046J23553q8233J6120J5840
1054a3683m1328J5936Q9959K3641j4147j35370M5376R0666q0747j43910J33284
1043c0323P9154m8700O5072p6095O2526j2645m1333L7646J03142p4775J4287q872
1031F9084j38145J29690q8973o2468L4774O1547m8547o5473K9945K7907M7839
1020b820j51597J04969J45026l4999n5834l4198J37478p1257K8494J05012j36097
$$ y = [5291, 67601, -57288, -81220, -57044, -35162, -31637, -91018, -6241, 9941, -81602, -32404, -118710, -216736, -134765, -96249, -18005, 62213, 130195, 124243, 172755, -59803, -40803, 1394, 12819, 53656, 73238, 51566, 80604, 98519, 195971, 106538, 19945, -15383, -107954, -181936, -186062, 1171, -34070, -45632, -35893, 27349, -53917, -80963, 42590, -45643, -29523, -13683, -55011, -39075, 50884, 74525, 60378, -74992, -29616, 61050, -19697, -163607, -30323, 48831, 131, 65203, -10892, 51634, 38989, -2344, 35302, 138444, 63669, 77956, 69084, -69061, 60629, -28344, -90812, -56038, 5509, -43038, -108511, -78566, -50659, -2820, -154417, -49448, 95578, 60579, 4745, -29453, 108025, 36768, 65262, 170274, 34177]
1009C4177k28079J2101R0770J15420o3451m5136j2796J21370j7697j49214Q4238
998e8297N6158k6187N0387J3418L8025R3427n3992O7M6452l9507K0066o4310r5617
985a9910m4440o4384J02629n6557M3400q2511J9260L6723o2402L9763K2781P8489
973A2841M0550k21125N1600j7736m0836O9693J45324M2940l6883j01722L8347
962a7007N3458P7710r282q4382j20633J21803Q2850j45520J6761J4223J8017q553
950e55K3527o0608o7479P7426p2334o314M079J8477N6869j9764j6502l2411J07986
937A2397J2493P1429N9836j7085o0844p9277N0459L8762J736m1702K3177N3103
925A24484r6953K5389L3048r1704r1827O4294K0160n0704L2869J7547M6201J36670
$$ y = [34177, -193902, -181801, -91031, 24389, -39062, -84198, -96994, 24376, 6679, -142535, -58297, -2139, -28326, 22061, 35479, 73504, 166931, 112939, 113006, 159458, 119951, 140017, 75707, -19910, -64350, -128734, -26105, -82662, -39262, -121773, -102513, -65790, -128192, -88429, -65648, 12841, 53391, -167734, -116134, -133870, -174706, -105013, 40311, 83251, 46368, -55354, -17007, 36451, 114161, 104879, 20497, -100136, 21667, 104517, -41003, -24242, -10019, 7998, -555, 22972, -37636, -105115, -27689, -100023, -106337, -102258, -83781, -26912, -46676, -63178, -95589, 12397, 24890, 96319, 156155, 139070, 78226, -1051, 49408, 88170, 89906, 48204, 71381, 124484, 27531, 52920, 85968, -5736, -97563, -33269, -13109, -63813, -30944, -13397, 32804, 169474]
913A69474r5746r8227n8174J18152n5023j55368J87041P3404o798j5777j12298
902d9340J56455J6768N7899j20648l1878l1692j52554J16409o2008L0545J04655
891C4611P5715l9149p8935p7361J22859n4924l874J14999q8720k5923M3903p5604
879e2403K7050N9887j6643K1324l9564m6033Q5098n696m8730M6290j23464l8039
867a30923O0864Q2058r4097j15904R5376Q723R483Q5941j24588j9319J622J07095
855c3669M2968O219m0175k2807m0133j10546P2861P6946O7616n6703K0207j8936
843c6152R2419J4518n9551J8659L1036J2046N0577m5131j90056j75006J27151
832a59490J86922l6067o1009N0963J12347o6525p163j6230N8227k0643p0693L8927
$$ y = [169474, 73728, -24499, -82673, 35479, -19544, -174912, 12129, 85533, 78735, 62958, -49340, 107115, 123883, 181782, 61134, 29256, -2436, -154990, -38581, -100589, -70044, 34611, 110326, 71177, -7758, -85119, 37740, -17184, -21058, 93941, 5221, -20702, 23201, -52403, -25353, 34534, 17891, 39215, -349, -46382, 38716, 33020, -15710, 30580, -92884, -130923, -70059, 11999, -82098, -198002, -102626, -93903, -84420, 1521, -123067, -142386, -140764, -33669, 9299, 15518, -24657, -47464, -87597, -198143, -125282, -48336, 19280, -37423, -17216, -36152, 56267, 70785, 11234, 29893, 60929, 72975, 123552, 78421, -111635, -286641, -159490, 27432, -8635, -69644, -18681, 93666, 27141, 19978, 3748, 61975, 41332, -29361, 9566]
820I566J8018j22301p887J24655N9245n8326n0789J61630o6082k1457J8348p7619
808a2999j26740M1929P0862N1805J22435j34220N2440J5049p2355l978n1191J2782
796c4181p2203J39010j9325n4745O7468r1382O8972l0219k6749O5081l5117J3835
784i555J50101L4665o8116N371j4998j1918l1914n2131J33506N6660k0379m6660
772A24632J28009m3465j56749K6022K0982N4453r4799n5276p6665L6376Q3330
761D6850L0259P629l8409j00702O77N9351j14453J14402R1807r3925l2818J0775
749a8557K5166N7303k6214r4208P0279o1887k5333J06088l0426P8390m0082k208
737C8311j32896L75J5148N2774p8851j74269K5923K21129J24193p0332o3121J59786
$$ y = [9566, 27584, -94717, -102604, 22051, 81296, 22970, -27819, 133811, 67729, 46272, 64620, -12999, -139739, -97810, -26948, 24857, 147292, 13072, 65512, 80561, 8206, 4228, -46963, -34181, -106384, 32626, 13301, -41444, 26024, -65358, 3614, -26605, -53354, 11727, -23390, -9555, 140546, 175211, 107095, 112466, 97468, 85550, 53636, 1505, 135011, 191671, 171292, 124632, 252641, 209176, 52427, 78449, 99431, 153884, 59085, 3809, -72856, -36480, 46850, 77109, 84738, 46329, -54373, -53696, 5655, -108798, 5604, 97411, 3486, -29332, -18557, 6609, 63912, 37698, -56510, 13769, -48118, -73451, 32637, 2211, 80601, 40519, 38311, -94585, -94210, -79062, -26288, -105139, -279408, -253485, -32356, 91837, 21505, -41616, 118170]
725A18170n8736n3775K5191n9433J6890n1609o5847R1287J07626q6873k7299Q2316
713C7908l500j26152K07568Q256n2279J9386Q5801J9528j53432j14718Q1773Q266
701A8405r8636J53558j6584j07806J06530p7443p0696l2240J13019J2708M1975
690D2790p4204p6393L4042M6806M50K4943k4324O8052r3306N5166O0309L9083
678A03414q7441J14692r4159K9697O6091J14035p8058j50851O8932L5995j09119
667A3228o1952R3253R565q2671N69J50481j06066j50925M0595N9026O6662L7987
655F9752p1020J7641p7915R8813m3888J06511m5549r7718L1669J73403j05343
644E6356N2563r3212j27907O2079O0542M8757L2849o1321R265j2078J31143K1407
$$ y = [118170, 59434, 5659, 30850, -28583, -11693, -63302, -129149, -37862, 69764, -17109, -44408, 37908, 34408, -91744, 115824, 124080, 71801, 91187, 176988, 196516, 43084, -71634, 10139, 18405, -80231, 73327, 56743, -51063, 55467, -21976, -92672, -124912, -11893, 815, 42790, -31414, -107807, -73765, -26959, -26509, -1566, -25890, 42162, -51144, 4022, 64331, 103414, 15973, 130665, 36506, 66203, 132294, 246329, 168271, 17420, 86352, 122347, 13228, -48724, 44529, 54094, -28577, -28008, 122473, 16407, -134518, -93923, -34897, 31765, 69752, -1268, 16373, -61542, 37271, -6617, 99894, 54345, -43373, -11704, 161699, 56356, 108919, 15707, -112200, -50121, 10421, 59178, 92027, 30706, 39971, 27893, 159036, 180443]
632A80443p990p7421j14060m056K8080J40651n2695r8030n7565J01441N3708m9487
620D3019Q4037j0843l2461o2137K1588M8933j18876N7551Q2979o2532n1964L5610
608C4904N6444k9590j39734O1415Q598p6079L2624J09539R9760K637K3002j17517
596F6003n4442L4809J06703J229q7547n6171R6706n7600j7880M0351o0124o0925
584d8888J514p0568N5937J47356p0294n0241J03169J9426j5356j18289P3731K045
572B9542R5477m7381j75604O3526J2555K27417k7907j58735n4765M7863m420m7018
560c9450m534K7675P6040J5548J1975m2954Q1784p1314P226J02303q8134O6326
548A42491p6053M3186q7621R3233p5864k7030N8827j33982q9508J88883O1295
$$ y = [180443, 172453, 95032, -19028, -23084, 4996, 145647, 92952, -5078, -62643, 38798, 92506, 43019, 127056, 116213, 83752, 21615, 43203, 92136, -26740, 30811, 113790, 51258, -706, 34904, 91348, 61758, -77976, -16561, -7963, -84042, -51418, 58121, 157881, 160518, 183520, 66003, 11561, 46370, 153073, 154302, 66755, 10584, 107290, 49690, 31810, 72161, 12037, -48888, -47374, -117942, -62005, 85351, 15057, -35184, 67985, 87411, 72055, -46234, 27497, 29542, 125019, 77638, -97966, -34440, -21885, 205532, 177625, 18890, -35875, 11988, 7568, -39450, -43984, -16309, 59731, 75279, 87254, 44300, 126084, 54770, 61996, 164299, 76165, 142491, 66438, 109624, 22003, 115236, 39372, 12342, 71169, -62813, -152321, 36562, 97857]
537I7857m1968j4459o0175M6991o8375J4684M644O5517l149p185J0111l6982O5775
524G3286M297N9880K9977n713j34763R0264n6648R994O8972m8071m8008R44M2595
511H7006Q761J5039P3854o4028j91087J13874N5154j01836J3338m557M0511j6767
499B9262Q3291m8126j75753Q1483N9677j7743m1696L7328J19887J6610o8182l7000
487C9038r0565O2226L0661j97115R4603J17421k42K4494Q070P3623m4531n7122
475F0561j01151N6289O4809m9227K860n2258k3346J20710k6190M3544K4043n0138
463G0506J0118m6372m7315K7064J34835q6273J4835m0472m443l6331M8813K1451
451F6416r1000j7819M5714J87046J7951K8401o7729J7602q511m5538j5610j03513
$$ y = [97857, 55889, 41430, -18745, 28246, -40129, -25445, -20801, 44716, 41567, 34382, 44493, 7511, 73286, 77583, 137463, 167440, 161727, 26964, 117228, 60580, 70574, 139546, 91475, 43467, 44411, 87006, 95767, 110806, 184660, 120632, -70455, 43419, 98573, -3263, 10075, 5518, 46029, 29262, 112553, 64427, -111326, -29843, 29834, 12091, -29605, 7723, 127610, 144220, 76038, 39038, -51527, 10699, 41360, -155755, -61152, 56269, 56027, 80521, 88591, 162214, 117683, 60561, -40590, 15699, 80508, 31281, 34141, -18117, -41463, 79247, 53057, 96601, 120644, 70506, 80624, 34252, -13063, 14001, 148836, 62563, 77398, 36926, 32483, -3848, 44965, 66416, -24584, -42403, 3311, 190357, 208308, 236709, 168980, 186582, 178071, 132533, 116923, 13410]
439A3410m7304N4780j579P251o718l6198J41372q3845N8659Q0548o7479Q7669
427B00566j46621l631J3246M864j3425K967L8854o0171j72220J2600J02698M0558
415B0285N9554J11548j48339j02437L0835J8790l0384J7117n4940l1903R925J53377
403E3428J30745k494j41920j1521M2255n0898L7878M6298j26804O1122k7525j1838
391a274m9801K5896R7603o2606J6720L0361l461J2429J0657L4618R5424j7848
379A88718j05596n9192n4539j44914o7504J51632J05301N3910L5705j86840j69020
368b52339J32269J83758M6057K7972p7223J6194m8872J7099l7212L7853N5169
357A00725K6706q000l6949n5476J16660L6507r8134o7092K5995l8229j2254J12316
$$ y = [13410, -33894, 20886, 19307, 26558, 19840, -16358, 125014, 41169, 99828, 180376, 112897, 200566, 53945, 50314, 63560, 68424, 54999, 57966, 96820, 36649, -135571, -122971, -20273, 20285, 79839, 191387, 43048, -59389, -28554, -9764, -40148, -23031, -77971, -109874, -99949, 53428, 184173, 181679, 39759, 28238, 70493, 19595, 57473, 103771, -23033, 38089, 10564, -1274, -51075, -25179, 72424, 9818, 26538, 56899, 53438, 65867, 76524, 111142, 206566, 188718, 83122, 23930, -30609, -175523, -243027, -91395, 13906, 67816, 103521, -83319, -252339, -120070, 63688, 109745, 137717, 60494, 76688, 27816, 44915, 7703, 45556, 100725, 127431, 119431, 82482, 27006, 143666, 180173, 82039, 14947, 40942, 2713, -9541, 102775]
345A02775l4631j42493L4272N4722L3233j2662P7252j7130n7414o3813k6703J38318
333H5726Q9670p3137r7844o2268k9131l5165N6402N6173O2102K8215M1524j78486
321e6219O6245j55028M9988M9808k4824R983n6906L0572M8784P8602r0946m4712
309i4653j1O4720R332J32567K6561j31372j224J77959K4191j02976o3630O9224
297A10688O1577j06328j23056N457M3961M6784r786M5j659L1994R0677P0389j99020
284B1723q5264J03859R9209l5325o6447L6667k0873Q4704r5616k8791J02475j14652
272A669O1295Q1237j15073l0339o3192R9971J05524j04724J00243L6800m7822
261A25589j33837j45472O7740J48934p6854L1040J27897m5367j23068L998J10769
$$ y = [102775, 68144, -74349, -40077, 14645, 47878, 35216, 112468, 95338, 37924, -25889, -52592, 85726, 175396, 102259, 4415, -57853, -86984, -122149, -65747, -9574, 52528, 80743, 122267, -56219, 10026, -145002, -95014, -45206, -70030, -60047, -116953, -86381, -37597, 41005, -49941, -94653, -94664, -29944, -20612, 111955, 138516, 7144, 5920, 183879, 208070, 105094, 41464, 110688, 172265, 65937, -57119, -51662, -7701, 39083, 29297, 29342, 27683, 59677, 150354, 220743, 21723, -63541, 40318, 139527, 104202, 37755, 74422, 53549, 138253, 42637, 13846, 116321, 1669, 62964, 144201, 29128, -1211, -64403, 35568, 141092, 36368, 136611, 173411, 125589, -8248, -153720, -85980, 62954, -13900, 17140, 145037, 99670, -23398, -19400, 91369]
250I1369j28700r2256J51851J38620l9361j34039Q2769K8476m2960l0770J6765
239D1764m2339N3404Q698l8002J01497L7066q7214n9997N0383l8479o5254Q214
227c0259P5832J11251q8209r542q2260Q1502M5961j9207q5111j0941p4212N7635
215b7560O3113J32392J0486r0938n3801J1132p28k5622o990r665P3299J0994N0761
202A36873k9805o0599o022P2311l4308O7431l566j09687l9524K2756n6559j5672
190e6371j29498N8043J78642J05499n6684m1105q377j04565L2068M7962O8171
179I3785J669p5825P7444Q7645k9676p8709M7094L32o2997l9686K4363L1965k8100
166D9304n3332j1476j3420O6170o2772R903l3856L8271J9694M8906k3070l9276
$$ y = [91369, -37331, -129587, 22264, 160884, 121523, -12516, 70253, 98729, 55769, 24999, 41764, -575, 52829, 61527, 23525, 125022, 162088, 74874, 14877, 65260, 26781, -38473, -30259, 45573, 156824, 68615, 59073, -23187, 58315, 104276, 85069, -42, -10983, -85195, -27560, 35553, 167945, 178431, 87493, 33692, 44824, 44096, 18474, 11484, 1819, 75118, 86112, 136873, 107068, 46469, 40447, 112758, 78450, 145881, 142315, 32628, -6896, 15860, -40699, -56371, -185869, -127826, 50816, 156315, 99631, 58526, 50149, -54416, -22348, 25614, 93785, 95454, 19629, 97073, 184718, 155042, 76333, 123427, 123759, 60762, 21076, 45439, 77404, 49304, -4028, -15504, -28924, 37246, -25526, -15623, -49479, -11208, 8486, 57392, 34322, -4954]
154d954J26431k2713r931l3367p5495Q2859k2737L1739k0104l7129M734M7460
142F6793J4627n9594q5197l454J39528k9249o6054J5599O6945j3290r4118L6884
130a0580P2952l9361L7428n2261n1010Q2513l5949j0183O5319L1397m2420j7004
118C0841M7075L21l4237O2039n0252j7219K7027k967J9807n6985M8257R4889j03454
105F5142j5240n507L208M3055j596j3530p5350l6062R7326P1538l2943L7362j13225
92B4178P0267M5056M755L0048j1362o930r555k67l0662j27911J03304O0320j9946
79A31295j9875k7407J056k6539p320M6282p2833k0689N1834l9638O0933q0979
67c880Q0293P5865n1057J8277J2020N631J399j01177n5741P7349Q8119o7127j3602
$$ y = [-4954, 121477, 98764, 88833, 55466, -20029, 62830, 40093, 71832, 51728, 14599, 19333, 66793, 81420, 21826, -63371, -66825, 72703, 43454, -22600, -7001, 59944, 46654, -47464, -10580, 62372, 23011, 60439, 8178, -42832, 39681, 3732, -6451, 58868, 90265, 47845, 30841, 77916, 78237, 44000, 106039, 55787, 38568, 65595, 62628, 82435, 25450, 73707, 168596, 65142, 49902, 44395, 47603, 90658, 89062, 75532, 182, -35880, 61446, 132984, 100041, 137403, 24178, 94445, 139501, 144256, 174304, 162942, 156012, 146457, 146190, 115528, -12383, 90921, 151241, 131295, 111420, 84013, 85069, 58530, 51210, 97492, 24659, 3970, 55804, 16166, 77099, -3880, 76413, 152278, 101221, 119498, 131518, 137149, 138548, 37371, -18370, 58979, 147098, 79971, 66369]
54F6369P178k9056K3138M0951m3469j06676J4393Q5675J3397p3509M8563K868
42D9822M8195j17487L0902J9031p0688K6340K6032l143j2846l79L7911Q902l9477
29C115L7613l3193P1901j7833j7991O4442k6732J19724n8071q5069n0759n2392
17d5245J3182R8349q1038L2562P8062k7227m2780Q75L3847K1576N5475n065K7381
4A59954J919p3588N5950l8400
0A05835
$$ y = [66369, 73547, 44491, 67629, 108580, 65111, -41565, -27172, 58503, 71900, -1609, 46954, 49822, 98017, -19470, 11432, 30463, -40225, -13885, 12147, 9004, -3842, -4221, 33690, 42592, 3115, 40728, 7535, 79436, 61603, 43612, 108054, 81322, 201046, 142975, 57906, 7147, -45245, -32063, 66286, -14752, 17810, 95872, 68645, 25865, 26740, 60587, 82163, 137638, 132573, 159954, 161873, 88285, 144235, 105835]
$$ Imaginary data points
##PAGE= N=2
##DATA TABLE= (X++(I..I)), XYDATA
16383h09235q755Q8713l8448K136L1281K4139n3838L3731Q1786J5709J0824L4058
16371e87899o7160k4006Q1704J08889L0213m1547j04821K2640P3732N470l0991
16360e33776Q3266N5303m3615M9420Q2300M0728m8309k2243k2674j2117j6109
16349c87826J15020L7763M1043n664M1459N0247k2971p1699K3992K5017J9908
16338a33711k4393L791K7365l4265M6643Q1735N0252M4938n7757J7135P2892p5908
16326A8717O8136r935r770J1687l5351L484N5887n4625J1854K6017k1210K4386
16314H9277M1953q3917P7041J60792m3430r7660J0563Q5134K8640j3173J06625
16303C61845J0477R8361j8497n4301J54527L0195J1282o8707j56707L0108K5399
$$ y = [-809235, -817990, -729277, -767725, -765589, -734308, -710169, -764007, -730276, -648490, -632781, -621957, -587899, -655059, -679065, -597361, -488472, -458259, -499806, -604627, -581987, -508255, -502785, -533776, -450510, -395207, -438822, -389402, -307102, -266374, -314683, -336926, -359600, -371717, -387826, -272806, -235043, -194000, -199664, -158205, -107958, -130929, -202628, -178636, -153619, -133711, -158104, -154313, -126948, -161213, -114570, -32835, 17417, 62355, 4598, 21733, 94625, 18717, 86853, 76918, 67148, 78835, 43484, 46968, 102855, 48230, 60084, 86101, 64891, 89277, 131230, 47313, 124354, 285146, 241716, 144056, 154619, 239753, 268393, 255220, 361845, 372322, 470683, 452186, 397885, 552412, 582607, 593889, 525182, 368475, 398583, 423982]
16292D23982j5951M2985M7483Q319n7729J05819Q9244o1883p460J1763l4344L2444
16280E84672L4885q0587l2539J46373j4233K0452l6066J3702K8163J14120K5624
16269H04566m7531N0527N8891k7522m1578r7100j4392J33508k1200o7127M8657
16258G79699Q1226J7585k3217Q5081n2432J322o1705N7533R6857j8670j19633
16247H43646J11389l2879k2524R7526p1027p3913J11166K9726o3648J9629L7719
16236I86810J05371p5307M3587P9933O582K7043j43124O1123N257J09375J0083
16225A216733j04400Q2696n5230k3354o7101q930m833j2679m9648Q0680P3094
16214A127028J2457Q4174M3929j11278p4490P1331o3451J3866J66052K2968o3774
$$ y = [423982, 408031, 451016, 498499, 506818, 449089, 554908, 644152, 582269, 574809, 586572, 552228, 584672, 619557, 538970, 506431, 652804, 638571, 659023, 622957, 636659, 664822, 778942, 804566, 757035, 807562, 866453, 838931, 797353, 700253, 685861, 819369, 798169, 731042, 779699, 860925, 878510, 855293, 940374, 887942, 889264, 827559, 885092, 981949, 963279, 843646, 955035, 922156, 899632, 997158, 926131, 852218, 963384, 993110, 929462, 949091, 986810, 1092181, 1016874, 1060461, 1140394, 1146976, 1174019, 1030895, 1092018, 1097275, 1206650, 1216733, 1112333, 1195029, 1139799, 1116445, 1049344, 1040414, 1035581, 1022902, 973254, 1053934, 1127028, 1139485, 1223659, 1267588, 1156310, 1081820, 1153151, 1089700, 1103566, 1269618, 1292586, 1228812]
16203A228812m4638J70898l8262j09191K740J13200J2006O5497n6263J0002o3965
16192A290836j8343R0288q78M1332m919K506j8359L7506j26741l1599J22434m4851
16180A339212k9935o931m2190J34919L1985j202n235L0509J3820j6831M042j5871
16168A436292o1883j02583J4875J09082k2806L8475M7393m6789k4149k2595P5137
16157A440449J12355j8104p421P2802j56182n9642P4669Q1288l8747m4008J02228
16146A559687N0680O4744j91494j33207J49987r0728K9744Q2107J17297j53173
16136A485644P9406J00018m249j16529l85J10006K4414o6738J25820k0285j16638
16125A600484j20241l4657O2062J06217R1432l6801n1376M4720r937j94737N1158
$$ y = [1228812, 1184174, 1355072, 1316810, 1207619, 1210359, 1323559, 1335565, 1401062, 1344799, 1354801, 1290836, 1272493, 1362781, 1361903, 1403235, 1398316, 1400822, 1382463, 1419969, 1293228, 1261629, 1384063, 1339212, 1309277, 1302346, 1260156, 1395075, 1427060, 1425858, 1420623, 1451132, 1464952, 1448121, 1452163, 1436292, 1374409, 1271826, 1286701, 1395783, 1372977, 1411452, 1458845, 1412056, 1387907, 1365312, 1440449, 1552804, 1534700, 1527279, 1600081, 1443899, 1384257, 1458926, 1540214, 1501467, 1457459, 1559687, 1610367, 1675111, 1483617, 1350410, 1500397, 1409669, 1439413, 1521520, 1638817, 1485644, 1565050, 1665068, 1660819, 1544290, 1543905, 1653911, 1678325, 1611587, 1737407, 1717122, 1600484, 1480243, 1445586, 1507648, 1613865, 1705297, 1668496, 1617120, 1661840, 1651903, 1457166, 1508324]
16114A508324J8541J50731K2981l7077n6202o7274Q9139l13J7808k384m4849j41973
16102A457452J3454J59610J16042K5560k35042N1047J11312p765j79705q3027
16092A428938K9489R7636k3551M0002J48426l3871r3898P603M1987m0721r6187
16081A505853o1553K4052Q8175P4774J65674j5335j38842k9091j13859n4503J33120
16070A578465R1848J2935o8421J41909N28K7013j14838M3451p0651j96788J31324
16059A576775p9882J40513J04166j22990k6972l1954n7817J47916M7250o9142
16049A627863J22519p8208o9211r3020o3304R2820L8156o15j2094K5399O3212
16038A653517l363j08977l5808Q5668o4645q4830K9138O2906Q584K1783J60916
$$ y = [1508324, 1526865, 1677596, 1700577, 1663500, 1607298, 1540024, 1629163, 1628850, 1646658, 1644274, 1599425, 1457452, 1470906, 1630516, 1746558, 1772118, 1537076, 1588123, 1699435, 1691670, 1511965, 1428938, 1458427, 1556063, 1532512, 1572514, 1720940, 1687069, 1593171, 1600774, 1642761, 1602040, 1505853, 1444300, 1468352, 1556527, 1631301, 1796975, 1781640, 1642798, 1613707, 1499848, 1445345, 1578465, 1670313, 1683248, 1614827, 1756736, 1757264, 1784277, 1669439, 1712890, 1642239, 1445451, 1576775, 1496893, 1637406, 1741572, 1618582, 1591610, 1559656, 1501839, 1649755, 1697005, 1627863, 1750382, 1672174, 1602963, 1509943, 1446639, 1539459, 1577615, 1577000, 1564906, 1590305, 1653517, 1650154, 1541177, 1505369, 1591037, 1526392, 1441562, 1470700, 1533606, 1542190, 1563973, 1724889]
16027A724889J25243K0801j15921j28492p6325j2013P3429N6338n8163j37861
16017A471925R5320R9637l1867j78312r6192J41256k9457M8302J54805J11505
16007A786922O1541j02472o2675k3142j16152K5253J37243k8293p9801q790O9554
15996A659188R9231r7838j33152O3356k8158n4438N6251L6181o6705M5406J01994
15985A681316l440q4749R7919l3563L4708M3327p3926J9760m4153P7637p0323
15974A644513j9909k0282p7199j7559R1938l4908L6285K7921M4417K3689n3279
15963A645627R168P8383o2977k2441K0076K0787j26005M9040J4360m0003K8491
15952A614506M3133J8527q1491P1046M1529n5424Q795o1067L1761R0030K7499
$$ y = [1724889, 1850132, 1870933, 1755012, 1626520, 1550195, 1538182, 1611611, 1667949, 1609786, 1471925, 1567245, 1666882, 1635015, 1456703, 1360511, 1501767, 1472310, 1520612, 1675417, 1786922, 1848463, 1745991, 1683316, 1660174, 1544022, 1569275, 1706518, 1678225, 1598424, 1589634, 1659188, 1758419, 1660581, 1527429, 1590785, 1562627, 1508189, 1564440, 1600621, 1533916, 1579322, 1681316, 1677876, 1593127, 1691046, 1657483, 1692191, 1735518, 1661592, 1681352, 1637199, 1714836, 1644513, 1624604, 1604322, 1527123, 1509564, 1601502, 1566594, 1602879, 1630800, 1675217, 1698906, 1645627, 1654795, 1733178, 1670201, 1647760, 1667836, 1688623, 1562618, 1611658, 1626018, 1586015, 1614506, 1657639, 1676166, 1594675, 1665721, 1707250, 1651826, 1660621, 1599554, 1631315, 1721345, 1748844]
15941A748844r9731j18540M4721Q9976K8944n9461j197q6811l8547l8619R9603
15930A569182J10477L1687N961r8675j4234J07381m9185L2076P4926r2309L9449
15919A716736m0556o1152n9729j05331R07J20328P4571j1010k092P0939O2589
15908A766200o947j70864p8557M7968Q5367J1374m4021J3031n9552q921O558k2061
15896A539575K09036r6628p0883J03211o7065N3330J6112r3007l3850J14076M5890
15885A719797k5211p699o2215J74063j33690q9677O3366q555k4794J17088r4415
15874A628058J0346J4410N2367L9526j41040l7772P5306J098j35608M6355O7182
15863A620228m955r1006J30857J201N4122K3940J01018m6518J5140o7858L7460
$$ y = [1748844, 1649113, 1530573, 1575294, 1665270, 1694214, 1634753, 1633556, 1546745, 1508198, 1469579, 1569182, 1679659, 1711346, 1717307, 1618632, 1604398, 1711779, 1662594, 1694670, 1769596, 1677287, 1716736, 1676180, 1615028, 1555299, 1449968, 1450875, 1571203, 1645774, 1634764, 1632672, 1703611, 1766200, 1759253, 1588389, 1509832, 1557800, 1643167, 1654541, 1610520, 1623551, 1563999, 1555078, 1561636, 1539575, 1748611, 1651983, 1581100, 1684311, 1617246, 1670576, 1686688, 1593681, 1559831, 1673907, 1719797, 1694586, 1686887, 1624672, 1798735, 1665045, 1575368, 1638734, 1630179, 1605385, 1722473, 1628058, 1638404, 1652814, 1705181, 1744707, 1603667, 1565895, 1641201, 1642299, 1506691, 1553046, 1620228, 1615273, 1524267, 1655124, 1656325, 1710447, 1734387, 1835405, 1788887, 1804027, 1736169, 1773629]
15852A773629M0335k3505m2995K1006P866P599j01615Q2835p1737R437L8897k2657
15840A719095n3374j1627Q9017R4145q9668m1715l4187q4020k6876j3436J2557
15829A559911R6898J1517J3934J5706M2527n3544j37245Q918J09894j41078r5470
15818A431968O0238K5837J29088J5023J1041n9812O8451K8665O1155j01577r3005
15807A577072O2954q8341R8927N0945k984l1525m5482R186J69j4472j51484J51445
15795A616410j8153n4478L455m009R3869R0244p3889L2264J9294l5593j32466
15784A536948l4643J38614L4127n3715K0673N2137K4411Q9357r7942q6922k9340
15773A593705Q2020K1833l4360J6313J3605l5937j17018K7668R2091O4105n6886
$$ y = [1773629, 1813964, 1790459, 1747464, 1768470, 1776336, 1783935, 1682320, 1765155, 1693418, 1702855, 1741752, 1719095, 1665721, 1654094, 1743111, 1837256, 1747588, 1705873, 1671686, 1587666, 1560790, 1547354, 1559911, 1656809, 1668326, 1682260, 1697966, 1740493, 1686949, 1549704, 1558622, 1668516, 1527438, 1431968, 1492206, 1518043, 1647131, 1662154, 1673195, 1613383, 1681834, 1710499, 1771654, 1670077, 1577072, 1640026, 1551685, 1650612, 1701557, 1698573, 1667048, 1621566, 1630752, 1630921, 1616449, 1464965, 1616410, 1598257, 1543779, 1547234, 1543225, 1637094, 1727338, 1653449, 1685713, 1705007, 1669414, 1536948, 1502305, 1640919, 1675046, 1621331, 1642004, 1694141, 1718552, 1807909, 1709967, 1623045, 1593705, 1675725, 1697558, 1663198, 1679511, 1693116, 1657179, 1540161, 1567829, 1659920, 1724025, 1667139]
15762A667139L3381R9872p015p2587O8256o2952N4706M5693j29107J17288J1930
15751A826604M5573r6762n5204l4565P9842J0102r3631L5926k6980J31451m7756
15740A774600j56800j3575J60733K1417R128j04966m5288M7728k1908j2748m799
15729A653522n5234J12191L3282o7468J10127J7716q5865J16806j92126J9924
15719A662875N8947j34248j7239J40465p6157o4764P4837j7013R1643R0799o8133
15708A742012Q3947n0242n9475Q6400j39318l6510M7252Q5899j49292J44308J53777
15697A908758j13338k4218j07006j64721J59303J13254j02295K9181k3103l2942
15687A642873J0168O1872J46341Q0542j27566k0410k6769P916K2280r2432j28465
$$ y = [1667139, 1700520, 1800392, 1793377, 1720790, 1789046, 1726094, 1780800, 1826493, 1697386, 1814674, 1826604, 1872177, 1775415, 1720211, 1685646, 1765488, 1775590, 1681959, 1717885, 1690905, 1822356, 1774600, 1617800, 1604225, 1764958, 1786375, 1795503, 1690537, 1645249, 1692977, 1671069, 1658321, 1653522, 1598288, 1710479, 1743761, 1676293, 1786420, 1804136, 1718271, 1835077, 1642951, 1662875, 1721822, 1587574, 1570335, 1710800, 1634643, 1569879, 1644716, 1627703, 1719346, 1810145, 1742012, 1825959, 1775717, 1716242, 1802642, 1663324, 1626814, 1674066, 1759965, 1610673, 1754981, 1908758, 1795420, 1771202, 1664196, 1499475, 1658778, 1772032, 1669737, 1698918, 1675815, 1642873, 1653041, 1714913, 1861254, 1941796, 1814230, 1793820, 1767051, 1774967, 1797247, 1704815, 1576350]
15676A576350N0408m048j6781P9275m037P6453M9512k31448l3834J42819M4215
15665A728884j42435j5881J97012K0423o3443j25623l9278N7910M9990p8108P3749
15654A663200L4374m0729m6188Q1558p2749r5501N4338J2133k1621N5150l7563
15643A586402K2914j0026O786O6784P244M318Q7616n8789N2518j8017j6012n9087
15631A672651J74727L4531p9113m5259J2830m7828O0458N688L2721m3972n2951
15620A724483J703l3852O3118j12769K926N428J4049J38185q0729Q568j5701m1306
15608A674103l8687k4541O8932R2038K7897k0329R4949j31373o0278j5287P7480
15597A744904m9279L948j15400J1303J36128p0045K0143L9376J89123j97610M7646
$$ y = [1576350, 1626758, 1622710, 1605929, 1685204, 1681167, 1757620, 1807132, 1575684, 1541850, 1684669, 1728884, 1586449, 1570568, 1767580, 1788003, 1724560, 1598937, 1559659, 1617569, 1667559, 1589451, 1663200, 1697574, 1656845, 1610657, 1692215, 1619466, 1523965, 1578303, 1590436, 1568815, 1623965, 1586402, 1609316, 1599290, 1606076, 1672860, 1680104, 1684422, 1772038, 1713249, 1765767, 1747750, 1731738, 1672651, 1847378, 1881909, 1802796, 1757537, 1770367, 1722539, 1782997, 1788685, 1821406, 1777434, 1724483, 1726186, 1692334, 1755452, 1642683, 1645609, 1651037, 1665086, 1803271, 1722542, 1731110, 1715409, 1674103, 1635416, 1610875, 1679807, 1771845, 1799742, 1779413, 1874362, 1742989, 1682711, 1667424, 1744904, 1695625, 1699573, 1584173, 1595476, 1731604, 1661559, 1681702, 1721078, 1910201, 1712591, 1760237]
15586A760237J22431n9275l6362L5400P3346p1352m8045J5914p6351m0708J5795
15575A691030j06779J79751R400k5099o188m387N8797O751O637Q350j116R7267
15563A914414j12099l0735l8677J07913J6779k9647o4086j57647J1118Q7170L5044
15552A739547K4313n4671M6651k6273J10904m3408l5322N8637j11665r2919M7317
15541A663111J36830k7235N3291o5304l5294J06260j58853p559l2412J5446P7844
15530A726125l9341O8805j8119j12617J2202l3273j1053P962L2693k6766j07188
15519A499430K18979L2153j50367K3228K026p7500k8794J17231o674N7209J7415
15508A704336K4669l8431k0753J44482K8362m8642o2998l2988P3700L0266N4374
$$ y = [1760237, 1882668, 1823393, 1787031, 1822431, 1895777, 1824425, 1776380, 1792294, 1715943, 1675235, 1691030, 1584251, 1764002, 1773402, 1748303, 1742115, 1737728, 1796525, 1803276, 1809913, 1818263, 1817147, 1914414, 1802315, 1771580, 1732903, 1840816, 1857595, 1827948, 1763862, 1606215, 1617333, 1704503, 1739547, 1763860, 1709189, 1755840, 1729567, 1840471, 1797063, 1761741, 1820378, 1708713, 1615794, 1663111, 1799941, 1772706, 1825997, 1760693, 1725399, 1831659, 1672806, 1665247, 1632835, 1648281, 1726125, 1686784, 1755589, 1737470, 1624853, 1637055, 1603782, 1592729, 1600691, 1633384, 1606618, 1499430, 1718409, 1750562, 1600195, 1623423, 1625449, 1547949, 1519155, 1636386, 1629712, 1686921, 1704336, 1729005, 1690574, 1669821, 1814303, 1842665, 1794023, 1731025, 1698037, 1771737, 1802003, 1856377]
15497A856377L8659j29084j80403J13172R6122n7628m1862P098J73430O9400K3658
15486A968939j13234q8583n3418j59806L4629J50783j48046J27492N9974j4480
15476A764250L3544k2019p102O0970q2972r7069J40964o1676q2855r701L4881
15465A671215L1429p6373O496J56716p0949M2033J700J165R0530p5641n6373l7528
$$ y = [1856377, 1895036, 1765952, 1585549, 1698721, 1794843, 1737215, 1695353, 1702451, 1875881, 1945281, 1968939, 1855705, 1767122, 1713704, 1553898, 1588527, 1739310, 1591264, 1718756, 1778730, 1764250, 1797794, 1775775, 1768673, 1829643, 1746671, 1649602, 1790566, 1728890, 1646035, 1636334, 1671215, 1702644, 1626271, 1632767, 1789483, 1718534, 1760567, 1762267, 1763432, 1853962, 1778321, 1721948, 1684420]
$$ [...]
##END NTUPLES=NMR SPECTRUM
##END=
