##TITLE=1H_CA-9424-5
 200.13MHz,DMSO-d6.
 8 sc
 
 19.2.2026
##JCAMPDX= 6.0         $$ Bruker NMR JCAMP-DX V2.0
##DATA TYPE= NMR SPECTRUM
##DATA CLASS= NTUPLES
##ORIGIN= UXNMR, Bruker Analytische Messtechnik GmbH
##OWNER= pz
$$ XWIN-NMR		Version 3.5
$$ Thu Feb 19 13:46:32 2026 Russian Standard Time (UT+4h)  she@DPX200
##.OBSERVE FREQUENCY= 200.1313
##.OBSERVE NUCLEUS= ^1H
##.ACQUISITION MODE= SIMULTANEOUS
##.ACQUISITION SCHEME= undefined
##.AVERAGES= 8
##.DIGITISER RES= 18
##SPECTROMETER/DATA SYSTEM= spect
##.PULSE SEQUENCE= zg30
##.SOLVENT NAME= DMSO
##.SHIFT REFERENCE= (INTERNAL, DMSO, 0, 15.4009)
##AUDIT TRAIL= $$ (NUMBER, WHEN, WHO, WHERE, WHAT)
$$ ##TITLE= Audit trail, XWIN-NMR		Version 3.5
$$ ##JCAMPDX= 5.01
$$ ##ORIGIN= Bruker BioSpin GmbH
$$ ##OWNER= she
$$ F:/spectra/data/she/nmr/H-C/1/pdata/1/auditp.txt
$$ ##AUDIT TRAIL=  $$ (NUMBER, WHEN, WHO, WHERE, WHAT)
(   1,<2026-02-19 13:45:12.87 +0400>,<she>,<DPX200>,
      <created by zg, POWCHK disabled, PULCHK disabled
       configuration hash MD5:
       00 E9 B6 7A A2 85 ED C7 34 08 36 98 17 FE 4E 26
       data hash MD5: 16K
       24 E7 23 CA 16 71 CB 7B E2 FD 7B E6 82 22 75 D6>)
(   2,<2026-02-19 13:45:15.29 +0400>,<she>,<DPX200>,
      <Start of raw data processing
       efp BC_mod = 2 LB = 0.25 FT_mod = 6 PKNL = 1 PHC0 = -3700.482 PHC1 = 9.192321 SI = 16K 
       data hash MD5: 16K
       83 50 2C 9D F4 D7 AC 86 38 66 2F E0 C5 A9 5E 18>)
(   3,<2026-02-19 13:45:34.34 +0400>,<she>,<DPX200>,
      <pk PHC0 = 0.1718446 PHC1 = -0.4 
       data hash MD5: 16K
       91 10 98 C5 AB 7C 1F 63 89 9D 0A 72 80 54 85 59>)
(   4,<2026-02-19 13:45:38.62 +0400>,<she>,<DPX200>,
      <abs ABSG = 5 
       data hash MD5: 16K
       47 AA B0 96 D1 53 12 D3 2F 84 7D 8D 66 32 B5 70>)
$$ ##END=
$$ 
$$ hash MD5
$$ 51 DA ED DF 38 1A 1C 03 93 4E C3 74 7E EF FE 79
##$RELAX= 
##$RELAX= 
##$RELAX= 
##$RELAX= 
##$RELAX= 
##$RELAX= 
$$ Bruker specific parameters
$$ --------------------------
##$DU= <F:/spectra>
##$EXPNO= 1
##$NAME= <H-C>
##$PROCNO= 1
##$TYPE= <nmr>
##$USER= <she>
##$AMP= (0..31)
100 100 100 100 100 100 100 100 100 100 100 100 100 100 100 100 100 100 
100 100 100 100 100 100 100 100 100 100 100 100 100 100 
##$AQSEQ= 0
##$AQ_mod= 1
##$AUNM= <au_zg>
##$AUTOPOS= <>
##$BF1= 200.13
##$BF2= 200.13
##$BF3= 200.13
##$BF4= 200.13
##$BF5= 200.13
##$BF6= 200.13
##$BF7= 200.13
##$BF8= 200.13
##$BYTORDA= 1
##$CFDGTYP= 0
##$CFRGTYP= 5
##$CHEMSTR= <none>
##$CNST= (0..31)
1 1 145 1 1 1 1 1 1 1 1 1 1 1 1 1 1 1 1 1 1 1 1 1 1 1 1 1 1 1 1 1 
##$CPDPRG= <>
##$CPDPRG1= <>
##$CPDPRG2= <>
##$CPDPRG3= <>
##$CPDPRG4= <mlev>
##$CPDPRG5= <mlev>
##$CPDPRG6= <mlev>
##$CPDPRG7= <mlev>
##$CPDPRG8= <mlev>
##$CPDPRGB= <>
##$CPDPRGT= <>
##$D= (0..31)
0 0.7 0 0 0 0 0 0 0 0 0 0.03 0 0 0 0 0 0 0 0 0 0 0 0 0 0 0 0 0 0 0 0 
##$DATE= 1771494312
##$DBL= (0..7)
120 120 120 120 120 120 120 120 
##$DBP= (0..7)
150 150 150 150 150 150 150 150 
##$DBP07= 0
##$DBPNAM0= <>
##$DBPNAM1= <>
##$DBPNAM2= <>
##$DBPNAM3= <>
##$DBPNAM4= <>
$$ [...]
##$SUBNAM3= <"">
##$SUBNAM4= <"">
##$SUBNAM5= <"">
##$SUBNAM6= <"">
##$SUBNAM7= <"">
##$SUBNAM8= <"">
##$SUBNAM9= <"">
##$SW= 18.0517328524113
##$SWIBOX= (0..15)
0 0 2 0 0 0 0 0 0 0 0 0 0 0 0 0 
##$SW_h= 3612.71676300578
##$TD= 16384
##$TD0= 1
##$TE= 0
##$TE2= 300
##$TE3= 300
##$TEG= 300
##$TL= (0..7)
0 120 120 120 120 120 120 120 
##$TP= (0..7)
150 150 150 150 150 150 150 150 
##$TP07= 0
##$TPNAME0= <>
##$TPNAME1= <>
##$TPNAME2= <>
##$TPNAME3= <>
##$TPNAME4= <>
##$TPNAME5= <>
##$TPNAME6= <>
##$TPNAME7= <>
##$TPOAL= (0..7)
0.5 0.5 0.5 0.5 0.5 0.5 0.5 0.5 
##$TPOFFS= (0..7)
0 0 0 0 0 0 0 0 
##$TUNHIN= 0
##$TUNHOUT= 0
##$TUNXOUT= 0
##$USERA1= <user>
##$USERA2= <user>
##$USERA3= <user>
##$USERA4= <user>
##$USERA5= <user>
##$V9= 5
##$VALIST= <valist>
##$VCLIST= <CCCCCCCCCCCCCCC>
##$VD= 0
##$VDLIST= <DDDDDDDDDDDDDDD>
##$VPLIST= <PPPPPPPPPPPPPPP>
##$VTLIST= <TTTTTTTTTTTTTTT>
##$WBST= 1024
##$WBSW= 4
##$XGAIN= (0..3)
0 0 0 0 
##$XL= 0
##$YL= 0
##$YMAX_a= 750233
##$YMIN_a= -1005970
##$ZGOPTNS= <>
##$ZL1= 120
##$ZL2= 120
##$ZL3= 120
##$ZL4= 120
##$ABSF1= 15.42846
##$ABSF2= -2.623389
##$ABSG= 5
##$ABSL= 3
##$ALPHA= 0
##$AQORDER= 0
##$ASSFAC= 0
##$ASSFACI= 0
##$ASSFACX= 0
##$ASSWID= 0
##$AUNMP= <proc_1d>
##$AZFE= 0.1
##$AZFW= 0.1
##$BCFW= 0
##$BC_mod= 2
##$BYTORDP= 0
##$COROFFS= 0
##$CY= -3
##$DATMOD= 1
##$DC= 0
##$DFILT= <>
##$DTYPP= 0
##$F1P= 0
##$F2P= 0
##$FCOR= 1
##$FTSIZE= 16384
##$FT_mod= 6
##$GAMMA= 0
##$GB= 0
##$INTBC= 1
##$INTSCL= 3.241238e-09
##$ISEN= 128
##$LB= 0.25
##$LEV0= 0
##$LPBIN= 0
##$MAXI= 10000
##$MC2= 0
##$MEAN= 0
##$ME_mod= 0
##$MI= 1.114404
##$NCOEF= 0
##$NC_proc= -6
##$NLEV= 6
##$NOISF1= 3.799351
##$NOISF2= 2.8
##$NSP= 0
##$NTH_PI= 0
##$NZP= 0
##$OFFSET= 15.40092
##$PC= 1
##$PHC0= -3700.31
##$PHC1= 8.792321
##$PH_mod= 1
##$PKNL= yes
##$PPARMOD= 0
##$PSCAL= 0
##$PSIGN= 0
##$REVERSE= no
##$SF= 200.130024170263
##$SI= 16384
##$SIGF1= 3
##$SIGF2= 2
##$SINO= 0.751879
##$SIOLD= 32768
##$SREGLST= <19F.Aceton>
##$SSB= 0
##$STSI= 16384
##$STSR= 0
##$SW_p= 3612.71676300578
##$SYMM= 0
##$S_DEV= 0
##$TDeff= 16384
##$TDoff= 0
##$TI= <>
##$TILT= no
##$TM1= 0
##$TM2= 0
##$TOPLEV= 0
##$USERP1= <user>
##$USERP2= <user>
##$USERP3= <user>
##$USERP4= <user>
##$USERP5= <user>
##$WDW= 1
##$XDIM= 16384
##$YMAX_p= 480098863
##$YMIN_p= -472923
$$ End of Bruker specific parameters
$$ ---------------------------------
##NTUPLES= NMR SPECTRUM
##VAR_NAME=  FREQUENCY,     SPECTRUM/REAL,   SPECTRUM/IMAG
##SYMBOL=    X,             R,               I
##VAR_TYPE=  INDEPENDENT,   DEPENDENT,       DEPENDENT
##VAR_FORM=  AFFN,          ASDF,            ASDF
##VAR_DIM=   16384,         16384,           16384
##UNITS=     HZ,            ARBITRARY UNITS, ARBITRARY UNITS
##FACTOR=    0.220516191357247, 1,           1
##FIRST=     3082.18647468226, 0,            0
##LAST=      -530.530288323522, 0,           0
##MIN=       -530.530288323522, -472923,     0
##MAX=       3082.18647468226, 480098863,    0
$$ Real data points
##PAGE= N=1
##DATA TABLE= (X++(R..R)), XYDATA
$$ [...]
7767F6702n6313j11934m7284R5665J2026L3902k9449M9408K8144r0463O4391J07193
$$ 66702 10389 -101545 -148829 -53164 -41138 -7236 -36685 12723 40867 -49596 14795 121988
7755A21988L2n1085N0151r9992k9865n1212L7128O0717J10832P6971L17521K01656
$$ 121988 122020 70935 121086 21094 -8771 -59983 -22855 37862 148694 225665 543186 744842
7743G44842k7465p0633r2941j24615p8319j84911p3526J1116O3052J0833l4646
$$ 744842 717377 646744 553803 429188 350869 165958 92432 103548 166600 177433 142787
7732A42787J04342j14360m5895r656j32109j63005K0208Q9780j3707r2025J7210
$$ 142787 247129 132769 86874 77218 -54891 -217896 -197688 -107908 -121615 -213640 -196430
7721a96430R7520n6417M0381J29699J29446L0458m1654N5828n0335m069p1544
$$ -196430 -98910 -155327 -114946 14753 144199 174657 133003 188831 138496 134427 62883
7710F2883L0935o0064J78224O1565j74654j09473M9068n1925j68006K3718P2588
$$ 62883 93818 33754 211978 273543 98889 -10584 38484 -13441 -181447 -157729 -85141
7699h5141M7672j2780p9020j9342m2182o4435m0267P8845J4288j10152o8572L3690
$$ -85141 -37469 -50249 -129269 -148611 -190793 -255228 -295495 -216650 -202362 -312514 -381086 -347396
7687c47396M5742k808k1030R0768O8361o1018J6940L00n540J4112l2137L9278
$$ -347396 -301654 -304462 -325492 -234724 -166363 -227381 -210441 -210141 -215681 -201569 -233706 -194428
7675a94428N6628n1395P2145J4983j41415J2528L9076n4898m795N5971R9507k1722
$$ -194428 -137800 -189195 -117050 -102067 -243482 -230954 -191878 -246776 -251571 -195600 -96093 -117815
7663a17815j15679J15914l0626k9044P5053K590n0067J8698n8180R3641j15618
$$ -117815 -233494 -117580 -148206 -177250 -102197 -99607 -149674 -130976 -189156 -95515 -211133
7652b11133o4558Q5816n4321j5790K1895l7029R2631J7540j60505j13185J71111
$$ -211133 -275691 -189875 -244196 -259986 -238091 -275120 -182489 -164949 -325454 -438639 -267528
7641b67528M1157j00141K6167J4317L8155K6068o997j2394L3335r2687L9179R8888
$$ -267528 -226371 -326512 -300345 -286028 -247873 -221805 -228802 -241196 -207861 -300548 -261369 -162481
7629a62481k0404p4560K6950n390k1108m0712P755O3886L2788l2695L044k9823
$$ -162481 -182885 -257445 -230495 -235885 -256993 -297705 -289950 -226064 -193276 -225971 -222927 -252750
7617b52750p6746M8592J26042l8916M7556l2029k1215Q3414m4275q3490n9925
$$ -252750 -329496 -280904 -154862 -193778 -146222 -178251 -199466 -116052 -160327 -243817 -303742
7606c03742l3069J04231J03404j7902j35076N222M6824j0551k1469K6652L9284
$$ -303742 -336811 -232580 -129176 -147078 -282154 -276932 -230108 -240659 -262128 -235476 -196192
7595a96192o1578o518P0406J3728L1775q9586Q2088L663k4397r5129M5689p6572
$$ -196192 -257770 -264288 -193882 -180154 -148379 -237965 -155877 -152214 -176611 -271740 -226051 -302623
7583c02623M5796Q5862K8544M0516l9851p9939j34000j3168O7316j8817j6643
$$ -302623 -256827 -170965 -142421 -101905 -141756 -221695 -355695 -368863 -301547 -320364 -337007
7572c37007K7765K875P3431j05248K1199j7520K0701J98673N6790j07422P8698
$$ -337007 -309242 -306367 -232936 -338184 -316985 -334505 -313804 -115131 -58341 -165763 -87065
7561h7065j6253j70914l4861j4247P2080N1098n0645r5321N6050R6357n0282J4593
$$ -87065 -103318 -274232 -309093 -323340 -251260 -200162 -250807 -346128 -290078 -193721 -244003 -229410
7549b29410k7993Q8591L8265q7908o1049J06273j88581p3481J64586L7741n2930
$$ -229410 -257403 -168812 -130547 -218455 -279504 -173231 -361812 -435293 -270707 -232966 -285896
7538b85896l6807J8230J00775n4553p1983J18123r0336K1022L5335j430j22126
$$ -285896 -322703 -304473 -203698 -258251 -330234 -212111 -302447 -281425 -246090 -247520 -369646
7527c69646L1749R7112j619L7342m9313n7115K110Q0673M6514n68n9730q0185
$$ -369646 -337897 -240785 -242404 -205062 -254375 -311490 -309380 -228707 -182193 -182761 -242491 -322676
7515c22676k259L7578M5359Q9555j4535n3404j1326l04m3120n5890J3934J16840
$$ -322676 -324935 -287357 -241998 -152443 -166978 -220382 -231708 -232012 -275132 -331022 -317088 -200248
7503b00248p946M5412q1743j7821R2624j11461p0471J5393J70074j06754n0425
$$ -200248 -208194 -162782 -244525 -262346 -169722 -281183 -351654 -336261 -166187 -272941 -323366
7492c23366J27615m0675j15061K6982J27486m4431l0200P2100O8811o1649j05084
$$ -323366 -195751 -236426 -351487 -324505 -197019 -241450 -271650 -199550 -130739 -192388 -297472
7481b97472M2677p0443O0901M499M7781N3480j71550m596J71142k8484q7123P4877
$$ -297472 -254795 -325238 -264337 -259838 -212057 -158577 -330127 -334723 -163581 -192065 -279188 -204311
7469b04311J56679R3034k57050o1415m766k798L1856K3049P8171m761k10713J02956
$$ -204311 -47632 45402 -211648 -273063 -277829 -280627 -248771 -225722 -147551 -152312 -363025 -260069
7457b60069J08735J11257j3927K584K2002j04895m9148J0624k9542j09523R3490
$$ -260069 -151334 -40077 -54004 -51420 -29418 -134313 -183461 -172837 -202379 -311902 -218412
7446b18412J12349r8139j00921J01391q4490K8188K6776n3647Q1373N4477Q4249
$$ -218412 -106063 -204202 -305123 -203732 -288222 -260034 -233258 -286905 -205532 -151055 -66806
7435f6806R4823p8147l1052P9721o9793j32291m2394N3779J58565r8188r1404
$$ -66806 28017 -50130 -81182 -1461 -71254 -203545 -245939 -192160 -33595 -131783 -223187
7424b23187l9496L2418J287K7906J25041j34118j15763P4912J9649r892L2208
$$ -223187 -262683 -230265 -228978 -201072 -76031 -210149 -325912 -251000 -231351 -241243 -209035
7413b09035o2738Q4981M7428q418Q8658k6355j38167j280o1299L3050M7496N9814
$$ -209035 -271773 -186792 -139364 -147782 -59124 -85479 -223646 -224926 -286225 -253175 -205679 -145865
7401a45865M4413j26181j15160J54126l170p9732K3383N5455n68J2293K420n0382
$$ -145865 -101452 -227633 -342793 -188667 -191837 -271569 -248186 -192731 -193299 -181006 -178586 -228968
7389b28968N6573r6500l7944J39358L727K6156j7579j20689L7654L2130k7839
$$ -228968 -172395 -268895 -306839 -167481 -163754 -137598 -155177 -275866 -238212 -206082 -233921
7378b33921J13191L9711j24689l4214p953n5554L7379K44686n8557j96945L8387
$$ -233921 -120730 -81019 -205708 -239922 -247875 -303429 -266050 -21364 -79921 -276866 -238479
7367b38479N5650m787q8815R6449l5767j39777l6270K2886Q7031J8839J70154
$$ -238479 -182829 -187616 -276431 -179982 -215749 -355526 -391796 -368910 -281879 -263040 -92886
7356i2886k3580n6787n2143n1905o4026J03518j6276N8870k3485j07651r4792
$$ -92886 -116466 -173253 -225396 -277301 -341327 -237809 -254085 -195215 -218700 -326351 -421143
7345d21143M5014P5067O7879L8800N2666R9677m7661j00040K6509p9311m5959
$$ -421143 -376129 -301062 -233183 -194383 -141717 -42040 -89701 -189741 -163232 -242543 -288502
7334b88502J67300r045j29606J18670Q5697K568J11912O3396j49655J20961R7369
$$ -288502 -121202 -130247 -259853 -141183 -55486 -52918 58994 122390 -27265 93696 191065
7323A91065j04161p4850K2223q1586M0484M9107L4073m3884m9314N5204k0812
$$ 191065 86904 12054 34277 -47309 -6825 42282 76355 32471 -16843 38361 17549
7312A7549J1326J0390o4523n6390K0096j14101N097M0954m1847j7680J3163p888
$$ 17549 28875 39265 -25258 -81648 -61552 -175653 -170556 -129602 -171449 -189129 -175966 -183854
7300a83854l3852M5574Q8275p1962M2558K4181p2368j28677J86672J23001k499
$$ -183854 -217706 -172132 -83857 -155819 -113261 -89080 -161448 -290125 -103453 19548 17049
7289A7049j9745l8322k18946O6060R3824R7843n666J0270l7997J3281m2043J4653
$$ 17049 -2696 -41018 -259964 -193904 -100080 -2237 -7903 2367 -35630 -22349 -64392 -49739
7277d9739J17535m8533n6935n6552J8261O9796o8399j6720R4396N657k13019K2651
$$ -49739 67796 19263 -37672 -94224 -75963 -6167 -74566 -91286 3110 8767 -204252 -181601
7265a81601O5368p0251n0522N425J61513q7157j28823R3317M8735N0210K1522
$$ -181601 -116233 -186484 -237006 -231581 -70068 -157225 -286048 -192731 -143996 -93786 -72264
7254g2264L2827l351j25857P210m90k118K0433J04298k13216M8266R409m0148
$$ -72264 -39437 -42788 -168645 -161435 -161925 -164043 -143610 -39312 -252528 -204262 -194853 -235001
7242b35001J17062L6354o4527o594J51937m1839q8896m9762P2552k9245p5000
$$ -235001 -117939 -81585 -146112 -152706 -769 -42608 -131504 -181266 -108714 -137959 -212959
7231b12959N9253K2775L6196P2528N5196j43229p4993P6736m5517L6423K9153
$$ -212959 -153706 -130931 -94735 -22207 32989 -110240 -185233 -108497 -154014 -117591 -88438
7220h8438l2573l2953J9143l1051p519L7665r4983J01926J07373k5192j34730
$$ -88438 -121011 -153964 -134821 -165872 -173391 -135726 -230709 -128783 -21410 -46602 -181332
7209a81332o719J52003j0667j15090J39085j5045j40863J03852K7664j0296q2663
$$ -181332 -188051 -36048 -46715 -161805 -22720 -37765 -178628 -74776 -47112 -57408 -140071
7198a40071l840M8611K2910N137J16937p335j13123q7408o054M2479O7092p434
$$ -140071 -143911 -95300 -72390 -67253 49684 42349 -70774 -158182 -164236 -121757 -54665 -62099
7186f2099k5350L487j8448j691r7984k6244J29874r922P1717N5704M3694M3849
$$ -62099 -87449 -83962 -102410 -104101 -202085 -228329 -98455 -108377 -36660 19044 62738 106587
7174A06587j4321n1971K8590j13607R637J09902J7027L2903j12142P4993K6260
$$ 106587 92266 40295 68885 -44722 -35085 74817 91844 124747 12605 87598 113858
7163A13858j35612n0851R2180J11875N23M7347L1506r832P28q8856K999k5895
$$ 113858 -21754 -72605 19575 131450 131973 179320 210826 200994 201722 112866 115865 89970
7151H9970R8840R2761n5129r0877l8104r6540O1121R0935J06001M7870M2024p152
$$ 89970 188810 281571 226442 135565 97461 921 62042 152977 258978 306848 348872 341720
7139C41720k0869L386P2776l3756P9255N9027K7047O9894K4821P4991J10323O547
$$ 341720 320851 324237 397013 363257 442512 501539 528586 598480 623301 698292 808615 815162
7127H15162R5259P3980Q0103J62685J61354J72214K57531K68733L36460L46548
$$ 815162 910421 984401 1064504 1227189 1388543 1560757 1818288 2087021 2423481 2770029
7117B770029N25139M36683M18234L46306L15190J23274o6978k18640k48672k29354
$$ 2770029 3295168 3731851 4150085 4496391 4811581 4934855 4867877 4649237 4400565 4171211
7107D171211l01506k93956j93005j31738j08680N5986j50940O8762L5220K07244
$$ 4171211 3869705 3575749 3382744 3251006 3142326 3198312 3047372 3116134 3151354 3358598
7097C358598J55772K84560L94848L04801K60019M02602L27517o25p6054k89335
$$ 3358598 3514370 3798930 4193778 4498579 4758598 5161200 5488717 5488092 5412038 5122703
7087E122703m45442n86411n23430l92119l84568l86039l43793l35822k94983r0247
$$ 5122703 4677261 4090850 3567420 3175301 2790733 2404694 2060901 1725079 1430096 1339849
7077A339849j50727j90595r8820l4747k6607l6883j0291j98069l6528K1778j41320
$$ 1339849 1189122 998527 899707 864960 838353 801470 791179 593110 556582 578360 437040
7066D37040q3928p7798K1930L100L238R9385k9044j80887q9445N4495R0298p7076
$$ 437040 353112 275314 297244 300344 303582 402967 373923 193036 103591 158086 248384 171308
7054A71308J2784p4994R278j7553N319o0453J6686l921J02367p3827l1055L1929
$$ 171308 184092 109098 118376 100823 106142 45689 62375 58454 160821 86994 55939 87868
7042H7868n267k282l2493l0851j72792j03417O8879Q6673K8960M665O2404L2021
$$ 87868 82601 80319 47826 16975 -155817 -259234 -190355 -103682 -74722 -70057 -7653 24368
7030B4368n4227L8072j7027R0511n520r3359o8469P1395P929m7392m1242J30603
$$ 24368 -29859 8213 -8814 81697 76177 -17182 -85651 -14256 -6327 -53719 -94961 35642
7018C5642J23525j25900k7304k9344O2908o2249Q6428J52428r6591m4097N8690
$$ 35642 159167 33267 5963 -23381 39527 -22722 63706 216134 119543 75446 134136
7007A34136o2301j01451L6840O7773j39357N1318K3236q710l6132l6029L9515
$$ 134136 71835 -29616 7224 74997 -64360 -13042 10194 1484 -34648 -70677 -31162
6996c1162P8404m0609J961l8719M389J28936o8162o3036n0142P0074r6802L6478
$$ -31162 47242 6633 8594 -30125 -25736 103200 35038 -27998 -78140 -8066 -104868 -68390
6984f8390P7525j5917l9912J8283j39230L3185P1800K7235k2223N9720k9237l4474
$$ -68390 9135 -6782 -46694 -28411 -167641 -134456 -62656 -35421 -57644 2076 -27161 -61635
6972f1635k6323l6384L6018j3997k0050P383L9656M4769R008n5690n1042R9951
$$ -61635 -87958 -124342 -88324 -102321 -122371 -114988 -75332 -30563 -21555 -77245 -128287 -28336
6960b8336q1544l4372L8586J0361m207J24758j41135j2578K5176o8440J06083
$$ -28336 -109880 -144252 -105666 -95305 -99512 25246 -115889 -128467 -103291 -171731 -65648
6949f5648J91119L006n0895j5831j097q469o77p9666n4132O0212n51J1330n5864
$$ -65648 125471 128477 77582 61751 60654 52185 51508 -28158 -82290 -22078 -22629 -11299 -67163
6936f7163M3303l812n5955o5290L7911R1301q4664p5284O4043m5692P3440P8786
$$ -67163 -23860 -27672 -83627 -148917 -111006 -19705 -104369 -179653 -115610 -161302 -87862 -9076
6924i076K1356j11083N8440R740j25745P1226R5153o2536m5563N7475p2223o4389
$$ -9076 12280 -98803 -40363 -30623 -156368 -85142 10011 -52525 -98088 -40613 -112836 -177225
6912a77225R1617Q726n5694J38435K6468r0282o39Q3093m7607l2802J1640j68291
$$ -177225 -85608 -76882 -132576 5859 32327 -57955 -58594 24499 -23108 -55910 -44270 -212561
6900b12561L1125M5440J04348r6558k1180j2395O6326l1812q9703P4638m8316
$$ -212561 -181436 -135996 -31648 -128206 -149386 -161781 -95455 -127267 -216970 -142332 -190648
6889a90648K1688N8712k9787o4077N3935k8173J8123K1423Q6044L2633Q925r4299
$$ -190648 -168960 -110248 -140035 -204112 -150177 -178350 -160227 -138804 -52760 -20127 -11202 -105501
6877a05501p4026J71n1270n1426p5609J47071N5276N2956J25936M1533r217l8237
$$ -105501 -179527 -179356 -230626 -282052 -357661 -210590 -155314 -102358 23578 65111 55894 17657
6865A7657j11018m2407J04092l4810l4930J5903q2610k1110q3877J09154J05550
$$ 17657 -93361 -135768 -31676 -66486 -101416 -85513 -168123 -189233 -273110 -163956 -58406
6854e8406N6691J9178j2310k12456q8553J18545m1936N8859q173P8639P2518m9359
$$ -58406 -1715 17463 5153 -207303 -295856 -177311 -219247 -160388 -168561 -89922 -17404 -66763
6842f6763K8044l1336Q33J0812n3886L2788p7673K4303K7918N7560q108N7679
$$ -66763 -38719 -70055 -69222 -58410 -112296 -79508 -157181 -132878 -104960 -47400 -55508 2171
6830B171k2998l4445J1531n725l1058J0115M0074J4087q7387j62991O0366P2376
$$ 2171 -20827 -55272 -43741 -49466 -80524 -70409 -30335 -16248 -103635 -266626 -206260 -133884
6818a33884N0026P4701q9831r2184K0490j11643O5534L9170j759j04269L8122
$$ -133884 -83858 -9157 -98988 -191172 -170682 -282325 -216791 -177621 -179380 -283649 -245527
6807b45527M4701N896n3883R0563J06970k9586n8520O8226j09103J8848J32381
$$ -245527 -200826 -194930 -248813 -158250 -51280 -80866 -139386 -71160 -180263 -161415 -29034
6796b9034j3001m9833j3773N4692L6673N9235o3542j28013k2702n1379O5744N892
$$ -29034 -42035 -91868 -105641 -50949 -14276 44959 -18583 -146596 -169298 -220677 -154933 -149041
6784a49041O9335R6799l3027o1221M2769k5512q8015O7792k1950J06562j7697
$$ -149041 -79706 17093 -15934 -77155 -34386 -59898 -147913 -80121 -102071 4491 -13206
6773a3206j2735j03083k9251n5431Q3196M8365j3202k4537Q9209l9935K3942J69248
$$ -13206 -25941 -129024 -158275 -213706 -130510 -82145 -95347 -119884 -30675 -70610 -46668 122580
6761A22580P7044j31224j13172N0407l775K757o6086L2975R8085L1316J3019p5047
$$ 122580 199624 68400 -44772 5635 1860 4617 -61469 -28494 69591 100907 113926 38879
6749C8879r7340L5708Q7729j42790J18843n4925j27316O1398J48023n663J7640
$$ 38879 -58461 -22753 64976 -77814 41029 -13896 -141212 -79814 68209 62546 80186
6738H0186j04270Q342P9816P179N3792j43623o8789J20018L2058j44804M7924
$$ 80186 -24084 -15742 64074 71253 125045 -18578 -87367 32651 64709 -80095 -32171
6727c2171r6965l7032O8312J26089M6192K7129m6072j0857P161j9239n9012L2100
$$ -32171 -129136 -166168 -97856 28233 74425 101554 55482 44625 51786 32547 -26465 5635
6715E635n993N913M754k6720m62j02632N1208O8419R6967M9129P7626J0482o6823
$$ 5635 -358 5555 10309 -16411 -16873 -119505 -68297 122 97089 146218 223844 234326 167503
6702A67503k6644q9929l1122P594j916K202J70678j2247j79617O5627L7736l8759
$$ 167503 140859 50930 19808 27402 25486 27688 198366 186119 6502 72129 109865 71106
6690G1106O7117J11351j82109j83067L9744J74695J3944m0445L8457L2464o9013
$$ 71106 138223 249574 67465 -115602 -75858 98837 112781 72336 110793 143257 74244
6679G4244M2079R1271n9235l4548R4317O1567o6092J2837p3079Q5814l0283m8018
$$ 74244 116323 207594 148359 113811 208128 269695 203603 216440 143361 229175 198892 150874
6667A50874J62996r2284n7363N7350o6706N8765o2795k9401R0983J17056j29577
$$ 150874 313870 221586 164223 221573 154867 213632 150837 121436 212419 329475 199898
6656A99898J28635N7267q5549k1451j9177P2386K5597L6889J41182J28741l7033
$$ 199898 328533 385800 300251 278800 259623 332009 357606 394495 535677 664418 627385
6645F27385m4360J58870n223j72543L0359O3070m4748p0710N9420N0076q6149
$$ 627385 583025 741895 736672 564129 594488 657558 612810 542100 601520 651596 565447
6634E65447J07133O733O8310o7746l5678P3056n3212o5217n0265N2828j21177
$$ 565447 672580 679313 747623 679877 644199 717255 664043 598826 548561 601389 480212
6623D80212m4906L0542N8108L41J9262K7994o4867j54572q2288p4935N6170J44905
$$ 480212 435306 465848 523956 524297 543559 571553 506686 352114 269826 194891 251061 395966
6611C95966R3315j3363K8926j7649k8312M3598j14720p7500R4036N9478p4010
$$ 395966 489281 475918 504844 487195 458883 502481 387761 310261 404297 463775 389765
6600C89765p3841M1578L2766j9671K3753J1280p1841J1282Q0921L3737R309p9509
$$ 389765 315924 357502 390268 370597 394350 405630 333789 345071 425992 459729 469038 389529
6588C89529o8075O7232O5799M5155j6583q7400r3178J88851Q7638J7600N2380
$$ 389529 321454 388686 454485 499640 483057 395657 302479 491330 578968 596568 648948
6577F48948J39082J09548k3885l0772N5746J7657L7573j4163m087o819o8792q0331
$$ 648948 788030 897578 873693 842921 898667 916324 953897 939734 935647 928828 860036 779705
6565G79705K9411J26722j15433R9906K08404J3652m4204N1392j22008j37868l2306
$$ 779705 809116 935838 820405 920311 1128715 1142367 1098163 1149555 1027547 889679 857373
6554H57373m627K1961k2609j11127J8185M1432j18538n7771J9934m0541J29235
$$ 857373 852746 874707 852098 740971 759156 800588 682050 624279 644213 603672 732907
6543G32907P2781K7651j5306j02201L4576L3415m6777N0122Q4285j5225O439m0020
$$ 732907 805688 833339 818033 715832 750408 783823 737046 787168 871453 856228 862667 822647
6531H22647p4112P2340J08067n5662j11347K7689j29916m8521Q1369k9031O807
$$ 822647 748535 820875 928942 873280 761933 789622 659706 611185 692554 663523 670330
6520F70330m8539j04901o9107L969j7808J52546J45483o5253l3055j7611o3892
$$ 670330 621791 516890 447783 451752 433944 586490 731973 666720 633665 616054 552162
6509E52162P8856j6176o7992m5783O6812N0944J30473n8041n743O1700m209l8792
$$ 552162 631018 614842 546850 501067 567879 618823 749296 691255 685512 747212 743003 704211
6497G04211O330p1211m8465J29054N3827j4031K6292j01714p522P7323o3848l4619
$$ 704211 710541 639330 590865 719919 773746 759715 786007 684293 676771 754094 690246 655627
6485F55627K0648k7100p801R6161N287K20483L7821l7692M6404J43926K2711O4632
$$ 655627 676275 649175 641374 737535 742822 963305 1001126 963434 1009838 1153764 1176475 1241107
6473A241107q6346j33497O706L8233p3406Q1965O0918N280K6554n6598K19773
$$ 1241107 1154761 1021264 1027970 1066203 992797 1074762 1135680 1140960 1167514 1110916 1330689
6462A330689L4883j4629P9454R1270j54573q5000M9449N3993q0637o0139K8502
$$ 1330689 1365572 1350943 1430397 1521667 1367094 1282094 1331543 1385536 1304899 1244760 1273262
6451A273262M5280R6702P0495n3563k6694k5801J26676J8048o6216J25937L792
$$ 1273262 1318542 1415244 1485739 1432176 1405482 1379681 1506357 1524405 1458189 1584126 1587918
6440A587918k8810J44280J05122P1448J43576n6110q5j2589j4724O0596K0639
$$ 1587918 1559108 1703388 1808510 1879958 2023534 1967424 1967339 1954750 1940026 2000622 2021261
6429B021261l4877Q6461m2202J37178L5138l9749J36215J89512P1230p3031k7147
$$ 2021261 1986384 2072845 2030643 2167821 2202959 2163210 2299425 2488937 2560167 2487136 2459989
6418B459989L4470M9798j01253j4506J55610M2832p403J15874K11284J46028J03557
$$ 2459989 2494459 2544257 2443004 2428498 2584108 2626940 2619537 2735411 2946695 3092723 3196280
6407C196280j07195n3606j8018P0227J06534P9628J54889N9831J3858Q359J33111
$$ 3196280 3089085 3035479 3017461 3087688 3194222 3273850 3428739 3488570 3502428 3510787 3643898
6396C643898K42712J26143O5767N1479p1488N7442J38032L9703J15594J56395
$$ 3643898 3886610 4012753 4078520 4129999 4058511 4115953 4253985 4293688 4409282 4565677
6386D565677L3457j17419N1348P6963Q4442K06501J52369J45266J13141M2810
$$ 4565677 4599134 4481715 4533063 4610026 4694468 4900969 5053338 5198604 5311745 5354555
6376E354555J59997J91884N7885R7309K01862K28608J20242K13887K45996L61849
$$ 5354555 5514552 5706436 5764321 5861630 6063492 6292100 6412342 6626229 6872225 7234074
6366G234074L92111L61298L38355K21933L23914M94041N27220N01996M21661M30269
$$ 7234074 7626185 7987483 8325838 8547771 8871685 9365726 9892946 10394942 10816603 11246872
6356A1246872O32802M99660N20170P49904P87291J089433J354860J429246J765385
$$ 11246872 11879674 12379334 12899504 13649408 14436699 15526132 16880992 18310238 20075623
6347B0075623K152966K330822K789978L177453M112210N244393O946336R015497
$$ 20075623 22228589 24559411 27349389 30526842 34639052 39883445 46829781 55845278
6339E5845278J1108597J2163711J1019408P951018L790456m81070m204297o682056
$$ 55845278 66953875 79117586 90136994 98088012 101878468 101397398 97193101 90511045
6331I0511045p054224n930407l624394n15323L067743O430591Q494092Q663577
$$ 90511045 83456821 77526414 73902020 73386697 76454440 82885031 91379123 100042700
6323A00042700O043505J611497l101464p409534j0476966j1734939j1377372r856493
$$ 100042700 106086205 107697702 104596238 97186704 86709738 74974799 63597427 53740934
6315E3740934q039360o329357m899346l769890k891299k289917j829750j456572
$$ 53740934 45701574 39372217 34472871 30702981 27811682 25521765 23692015 22235443
6307B2235443j287481j114231r58890p66221o15960o68776m45128l47076l21391
$$ 22235443 20947962 19833731 18874841 18108620 17492660 16823884 16378756 16031680 15710289
6298A5710289k62854k5750J19815R2127P9487K70455K88421L10328N08455M59025
$$ 15710289 15447435 15421685 15541500 15633627 15713114 15983569 16271990 16582318 17090773 17549798
6288A7549798M39210M82824O92105N10255N91160O37748P65401J084541J509367
$$ 17549798 17989008 18471832 19163937 19674192 20265352 20903100 21668501 22753042 24262409
6279B4262409J636082K029534K707786L218357L635571M149791N053125O267738
$$ 24262409 25898491 27928025 30635811 33854168 37489739 41639530 46692655 52960393
6271E2960393P728652J0238513J3758067J6893157J8749120J8021646J3989128
$$ 52960393 60689045 70927558 84685625 101578782 120327902 138349548 152338676
6264A52338676P846846Q03689n443952r707221j1458838j0218486p046339k400202
$$ 152338676 160185522 160989211 155545259 145838038 134379200 124160714 117114375 114714173
6256A14714173K799133P772481J1443606J1917763Q928296L443505l097007r416314
$$ 114714173 117513306 125285787 136729393 148647156 157575452 161018957 157921950 148505636
6248A48505636j4540114j6975483j7231711j5737015j3223826j0763195q437927
$$ 148505636 133965522 116990039 99758328 84021313 70797487 60034292 51596365
6241E1596365o815753n469719m372242l458066k913616k499964j960285j824189
$$ 51596365 44780612 39310893 34938651 31480585 28566969 26067005 24106720 22282531
6233B2282531j722614j542950j405374j237977j127962q69426p43474p19763o23174
$$ 22282531 20559917 19016967 17611593 16373616 15245654 14376228 13632754 12912991 12289817
6224A2289817n58420n32451m07996k78539l87700k58261k76645l49292k88766
$$ 12289817 11731397 11198946 10790950 10512411 10124711 9866450 9589805 9240513 8951747
6215H951747j88043j60821k64216k06074k81032j45253j68951j68495r0888j77833
$$ 8951747 8763704 8602883 8338667 8132593 7851561 7706308 7537357 7368862 7277974 7100141
6205G100141j49689k35194j14445j41569k06958j99393j90622O2686R508j57977
$$ 7100141 6950452 6715258 6600813 6459244 6252286 6052893 5862271 5924957 5934465 5776488
6195E776488k25323j8126o3529j9109j65694j5895J2689k14611j77114O3903K3059
$$ 5776488 5551165 5533039 5469510 5450401 5284707 5268812 5281501 5066890 4889776 4953679 4976738
6184D976738L2708R317l4276L3431m7174J13750P0874M8082J7126j7743N15j26359
$$ 4976738 5009446 5018763 4984487 5017918 4970744 5084494 5155368 5203450 5220576 5202833 5203348 5076989
6172E076989j61130L498j2248n0781M4049R110n113K0388o0768J22870L4855n505
$$ 5076989 4915859 4919357 4907109 4856328 4900377 4909487 4904374 4924762 4863994 4986864 5021719 5016214
6160E016214J03199J00073J8137P4288m033j59236l7624J22334J12570J14205
$$ 5016214 5119413 5219486 5237623 5311911 5307878 5148642 5111018 5233352 5345922 5460127
6150E460127R8646J78914K35741J42532M4499J84803K68557R7519N8877K67800
$$ 5460127 5558773 5737687 5973428 6115960 6160459 6345262 6613819 6711338 6770215 7038015
6140G038015R1929Q777J20320L31610K72063J28171J22066K79153K37368J27742
$$ 7038015 7129944 7138721 7259041 7590651 7862714 7990885 8112951 8392104 8629472 8757214
6130H757214K00631K89124j4465J0480l7627J03324r1734q270J98877J71726K02900
$$ 8757214 8957845 9246969 9232504 9242984 9205357 9308681 9216947 9208677 9407554 9579280 9782180
6119I782180K71488L86669L21214M01249L90762O14205M68979L59738M47946L35226
$$ 9782180 10053668 10440337 10761551 11162800 11553562 12167767 12636746 12996484 13444430 13779656
6109A3779656J40072K13109J15131R0946j24881o8503J16059k3282m7575m7197
$$ 13779656 13919728 14132837 14247968 14338914 14214033 14145530 14261589 14238307 14190732 14143535
6099A4143535j7816K6523n3203J29717K32472p3554j35236K53450O8401J14267
$$ 14143535 14125719 14152242 14099039 14228756 14461228 14387674 14252438 14505888 14574289 14688556
6089A4688556J87055L50041N28701L56879M34855N87703N70690N18395N35645
$$ 14688556 14875611 15225652 15754353 16111232 16546087 17133790 17704480 18222875 18758520
6080A8758520N03710N24676L37539K15446K32938J66384L5424o3047j36903j04278
$$ 18758520 19262230 19786906 20124445 20339891 20572829 20739213 20774637 20711590 20574687 20470409
6070B0470409q9732j69238O2227Q3607K00888L45598M03765M49933M56661N63034
$$ 20470409 20380677 20211439 20273666 20357273 20558161 20903759 21307524 21757457 22214118 22777152
6060B2777152O24167P71793J027848J304375J389135J672005K374976K821557
$$ 22777152 23401319 24173112 25200960 26505335 27894470 29566475 31941451 34763008
6052C4763008L184501L790036M500760N306419O266688Q233217J0864480J3814644
$$ 34763008 37947509 41737545 46238305 51544724 57811412 66044629 76909109 90723753
6044I0723753J6767457J7785071J5544215R927732K828089m161991j0271587j4343826
$$ 90723753 107491210 125276281 140820496 150748228 153576317 149414326 139142739 124798913
6036A24798913j5548341j4343909j2096508r344357o774581m917255l101278j567420
$$ 124798913 109250572 94906663 82810155 73465798 66691217 61773962 58672684 57105264
6028E7105264k81894J006667K249615L522491N165862P515839J0615505J4384119
$$ 57105264 56823370 57830037 60079652 63602143 68768005 76283844 86899349 101283468
6020A01283468J7290448J7429711J3952709P454610j83371p562482j3469808j6699451
$$ 101283468 118573916 136003627 149956336 157410946 157227575 149665093 136195285 119495834
6012A19495834j7028125j5149538j2703877r952875p730448o278098n042940l988119
$$ 119495834 102467709 87318171 74614294 64661419 56930971 50652873 45609933 41621814
6004D1621814l184031k621315k171611j690538j451860j278747q49117n56372
$$ 41621814 38437783 35816468 33644857 31954319 30502459 29223712 28374595 27818223
5996B7818223k79011k20562J23013K74660L82058N18293M77317M48762M16754
$$ 27818223 27539212 27318650 27441663 27716323 28098381 28616674 29093991 29542753 29959507
5987B9959507L37211L06049L90002M89660N36436Q86332J281400J542793J921055
$$ 29959507 30296718 30602767 30992769 31482429 32018865 32905197 34186597 35729390 37650445
5978C7650445K356593L160215M155079N857899Q363409J0836895J2004819J1367762
$$ 37650445 40007038 43167253 47322332 53180231 61543640 72380535 84385354 95753116
5970I5753116Q308046L816265j121651n552929q707263j0038284r437741q010511
$$ 95753116 104061162 107877427 106755776 101202847 92495584 82457300 73019559 65009048
5962F5009048o211055m722456l254141k211456j325991o22886n267Q81012J417254
$$ 65009048 58797993 54075537 50821396 48609940 47283949 46661063 46655796 47536808 48954062
5953D8954062K376891L858882N916554Q392611J0483165J1398220R905481N683193
$$ 48954062 51330953 55189835 61106389 69499000 79982165 91380385 101285866 106969059
5945A06969059O97822m223981q356687j1067239j1619315j0689365q834592p015529
$$ 106969059 107666881 103442900 95086213 84018974 72399659 61710294 52875702 45860173
5937D5860173n648548m606906l800098l114005k626365k065187j834128j695863
$$ 45860173 40211625 35604719 31804621 28690616 26064251 23999064 22164936 20469073
5929B0469073j432981j145935j147197j149346j065501p19677p69358o20045n80314
$$ 20469073 19036092 17890157 16742960 15593614 14528113 13808436 13039078 12419033 11838719
5920A1838719m76488m10219k54576j73374k89031l42939j90108o6471j99650j14170
$$ 11838719 11362231 10952012 10697436 10524062 10235031 9892092 9701984 9635513 9435863 9321693
5910I321693o203o9852l19756q5364k67888k00475m5803j84078k74942k97369
$$ 9321693 9315490 9245638 8925882 8840518 8572630 8372155 8326352 8142274 7867332 7569963
5900G569963l47120k08281k42332k20542j31980j45957n9700j71379j85806l995
$$ 7569963 7222843 7014562 6772230 6551688 6419708 6273751 6214051 6042672 5856866 5852871
5890E852871Q179l5966j07083j31719k31626k84872k24184j54001l898j63851
$$ 5852871 5861050 5825084 5718001 5586282 5354656 5069784 4845600 4691599 4687701 4523850
5880D523850j33353j55623j34165p164l981j33561j02431j7129o8477j18386p8724
$$ 4523850 4390497 4234874 4100709 4093545 4089564 3956003 3853572 3836443 3767966 3649580 3570856
5869C570856j17053p3216o4889r6276p637j09339n1216P3897J905r6284j37373
$$ 3570856 3453803 3380587 3315698 3219422 3211785 3102446 3051230 3125127 3127032 3030748 2893375
5858B893375p6389n3814j15755j32266j1814l4772p3097q1389m0999r8527j26478
$$ 2893375 2816986 2763172 2647417 2515151 2503337 2468565 2395468 2314079 2273080 2174553 2048075
5847B048075m0587j8854j8654M9019j9989k8163P0790l8950L030m1640q9227j5264
$$ 2048075 2007488 1988634 1969980 2018999 1999010 1970847 2041637 2002687 2005717 1964077 1874850 1859586
5835A859586K9445j2625l1788m6758q9415o4362l7085K9416L0018J4635j5065
$$ 1859586 1889031 1876406 1844618 1797860 1708445 1644083 1606998 1636414 1666432 1681067 1666002
5824A666002R7988l4190N617n8218K152n897R8851J3505Kl4247p3780P0094m4658
$$ 1666002 1763990 1729800 1735417 1677199 1679351 1673454 1772305 1785810 1785812 1751565 1677785 1747879 1703221
5811A703221j8515Q0929K8034l3541k7518j03058j8169K8861J3387m506m0744
$$ 1703221 1684706 1765635 1793669 1760128 1732610 1629552 1611383 1640244 1653631 1649125 1608381
5800A608381L7115Q3617J7370K6009P2701L17344M640O0831K23280M4351J36443
$$ 1608381 1645496 1729113 1746483 1772492 1845193 2162537 2167177 2228008 2451288 2495639 2632082
5789B632082N3044p7402L8720l9898q6880K20092Q6891J58527K89150L87399M24939
$$ 2632082 2685126 2607724 2646444 2606546 2519666 2739758 2826649 2985176 3274326 3661725 4086664
5778D086664N89163N49368O83148Q57221J316172K296087M447101O572181O480861
$$ 4086664 4675827 5225195 5908343 6765564 8081736 10377823 14824924 21397105 27877966
5769B7877966M045466o5569j034657l015729n742402n623916m253845k757605
$$ 27877966 31923432 31857863 30823206 27807477 22065075 16441159 12187314 9429709
5761I429709j942770j233244r47747n85617o00218n74266j70262k18066m25070
$$ 9429709 7486939 6253695 5305948 4720331 4120113 3545847 3375585 3157519 2732449
5752B732449k96932p1419j60444j65526o7556j61949q4321j25528p3862J81j07015
$$ 2732449 2435517 2364098 2203654 2038128 1970572 1808623 1724302 1598774 1524912 1525093 1418078
5741A418078P8261M788r6587o0302l5999n8681M2127l7001P8069J05020J05440
$$ 1418078 1496339 1501127 1404540 1344238 1308239 1249558 1291685 1254684 1332753 1437773 1543213
5730A543213M1909M143N0144r6691j81029M8968R2376j54864j25662K0142k1387
$$ 1543213 1585122 1589265 1639409 1542718 1361689 1410657 1503033 1348169 1222507 1242649 1221262
5719A221262l5961l0043J27481J6205k6710K6379n7964j2940L0242O6989L578
$$ 1221262 1185301 1155258 1282739 1298944 1272234 1298613 1240649 1227709 1257951 1324940 1328518
5708A328518m7355r120J7252m7293k2400m0308J61042j30122m5803k2806J3308
$$ 1328518 1281163 1272043 1289295 1242002 1219602 1179294 1340336 1210214 1164411 1141605 1154913
5697A154913o4784p1033L1381j00785K8347j60714q6834O4160j32342m9155J2899
$$ 1154913 1090129 1019096 1050477 949692 978039 817325 730491 794651 662309 613154 626053
5686F26053J31992J22688j64403m9417Q1132O926j3874K5393O518j44404m7230
$$ 626053 758045 880733 716330 666913 748045 754971 741097 766490 773008 628604 581374
5675E81374n7921n1388L7867P9693k0624L4083L4414Q3790p36p2508m841Q8982
$$ 581374 523453 472065 509932 589625 569001 603084 637498 721288 720552 648044 643203 732185
5663G32185L2061j21502P8537J18218l4460p7373P3988K4574J30982O8328L1998
$$ 732185 764246 642744 721281 839499 805039 727666 801654 826228 957210 1025538 1057536
5652A057536l0356j20744j59674p1671j334k5539J5330K0522L1112l1653M1061
$$ 1057536 1027180 906436 746762 675091 673757 648218 663548 684070 715182 683529 724590
5641G24590n4836j01554j8656Q6903O9416K7168O2179J13656k3369j2419Q9025
$$ 724590 669754 568200 549544 636447 705863 733031 795210 908866 885497 873078 962103
5630I62103K4862l6959O792k6649n2078j4975l6588K7827L0622j43684m6915J33549
$$ 962103 986965 950006 956798 930149 878071 863096 826508 854335 884957 741273 694358 827907
5618H27907Q3159k3845q2078n138N5032j49989J04541J22326n8321j00200O6790
$$ 827907 911066 887221 805143 800005 855037 705048 809589 931915 873594 773394 840184
5607H40184J69446o7285o6505M8170J54067M7120l671P8468j3789n2741m6463
$$ 840184 1009630 942345 875840 924010 1078077 1125197 1121526 1199994 1186205 1133464 1087001
5596A087001J05443M1685j80729L8995L3575J06040j51490j5352O4140j9197j24289
$$ 1087001 1192444 1234129 1053400 1092395 1125970 1232010 1080520 1065168 1129308 1110111 985822
5585I85822J52459N3730M8342N9596m2676k5294r2243L629k2186Q197J7081K7434
$$ 985822 1138281 1192011 1240353 1299949 1257273 1231979 1139736 1143365 1121179 1129376 1146457 1173891
5573A173891p7466P7099j14215j99441R1001P4367L749K8667k8597j50678j08092
$$ 1173891 1096425 1173524 1059309 859868 950869 1025236 1028985 1057652 1029055 878377 770285
5562G70285P6523M7426j03442j17349J65431M6534r9005P0078L3069l6189j45367
$$ 770285 846808 894234 790792 673443 838874 885408 786403 856481 889550 853361 707994
5551G07994M9984P5273q6267p5757l2130R1589o1811j82814J23059J48364j57809
$$ 707994 757978 833251 746984 671227 639097 730686 668875 486061 609120 757484 599675
5540E99675j9651J0020N2500O7399p2516K4448m8578m8539l7319J02523L025K9809
$$ 599675 580024 590044 642544 709943 637427 661875 613297 564758 527439 629962 632987 662796
5528F62796L9007r9326L2258k7750l8130N6643k0186n7227N5053J19598P0854
$$ 662796 701803 602477 634735 606985 568855 625498 605312 548085 603138 722736 793590
5517G93590j99044j902N0297p5787p4112O2517M5134M2380L8997n9525J3136Q5141
$$ 793590 594546 592644 642941 567154 493042 555559 600693 643073 682070 622545 635681 720822
5505G20822L9231n24o6166K5339K0931j48124J3659R8726l1625k2161J27557L2912
$$ 720822 760053 759529 693363 718702 739633 591509 605168 703894 672269 650108 777665 810577
5493H10577P2297O1598j12141l6147l4561j5035l0046J8984K5199k0346Q235k224
$$ 810577 882874 944472 832331 796184 761623 746588 716542 735526 760725 740379 748614 746390
5481G46390M0498n4000K2851K5565j07760j2519J77650l2418q2980J04493m1176
$$ 746390 786888 732888 755739 781304 673544 661025 838675 806257 723277 827770 786594
5470G86594L4481l140J3254k478n7044L4252j04479j42423N1374N953J7080N5258
$$ 786594 821075 817935 831189 828711 771667 805919 701440 559017 610391 616344 633424 688682
5458F88682o414m3788O204K0859M2922J5108j2236L1264k6385n4390m1475l363
$$ 688682 682268 638480 644684 665543 708465 723573 711337 742601 716216 661826 620351 616988
5446F16988j4573O701M5250N5999M5508j871j66421R2051R799k1235K1619M6822
$$ 616988 602415 609116 654366 710365 755873 754002 587581 679632 689431 668196 689815 736637
5434G36637k9970j45684L2232M7990J18622J27122J26168j38438q6721O5962l8832
$$ 736637 706667 560983 593215 641205 759827 886949 1013117 874679 787958 853920 815088
5423H15088q1062O1687N5807l5741J9447k6964P1671p8800Q9403L6366o7341K9651
$$ 815088 734026 795713 851520 815779 835226 808262 879933 801133 890536 926902 859561 889212
5411H89212Q8339j12996J46848J41358j37142j25044M6421Q72n4886J07763R2728
$$ 889212 977551 864555 1011403 1152761 1015619 890575 936996 937868 882982 990745 1083473
5400A083473L8101q9579q7113l3257Q3940l0486L0754R1406m8652q9028R1695
$$ 1083473 1121574 1031995 944882 911625 995565 965079 995833 1087239 1038587 949559 1041254
5389A041254L2497J1224K2457Q0148R3760l6210r6287K1362R6272q433J2435L9345
$$ 1041254 1073751 1084975 1107432 1187580 1281340 1245130 1148843 1170205 1266477 1258044 1270479 1309824
5377A309824r6878M9555J9856n3752k7996k5860R8698J8951l5592J3183J3543
$$ 1309824 1212946 1262501 1282357 1228605 1200609 1174749 1273447 1292398 1256806 1269989 1283532
5366A283532k3282q9426L0247n8524J14021K262R4143J10471n6205j425M880J41439
$$ 1283532 1260250 1170824 1201071 1142547 1256568 1258830 1352973 1463444 1407239 1405814 1410694 1552133
5354A552133r7439k7137J59851k7134l5510q23O7383J6846P9340j39740N8389
$$ 1552133 1454694 1427557 1587408 1560274 1524764 1523941 1591324 1608170 1687510 1547770 1606159
5343A606159R8684j10448N1457J52505N7528j39653L590N0798M6329R323K29674
$$ 1606159 1704843 1594395 1645852 1798357 1855885 1716232 1719822 1770620 1816949 1826272 2055946
5332B055946J14961k1361J7060J43370J18360L8973l1908J6328J39203l8686Q7936
$$ 2055946 2170907 2149546 2166606 2309976 2428336 2467309 2435401 2451729 2590932 2552246 2640182
5321B640182L3346J50315J43954j34992M7859j0387j14215M4175J06719M2300
$$ 2640182 2673528 2823843 2967797 2832805 2880664 2870277 2756062 2800237 2906956 2949256
5311B949256M0868N2534L7007J55318K104M1587J41453k8035P4454J27184k0089
$$ 2949256 2990124 3042658 3079665 3234983 3237087 3278674 3420127 3392092 3466546 3593730 3573641
5300C573641k8000J19918m008P2513J11857L1294Q3538K00253J58800n99n8630
$$ 3573641 3545641 3665559 3661551 3734064 3845921 3877215 3960753 4161006 4319806 4319207 4260577
5289D260577q767p3473P8857P654N2463L3793J71849J49576J56703O6697J95147
$$ 4260577 4251810 4178337 4257194 4264848 4317311 4351104 4522953 4672529 4829232 4895929 5091076
5278E091076P5441l5354J88138M2832J05845J63674N635J05842J92297J01086
$$ 5091076 5166517 5131163 5319301 5362133 5467978 5631652 5637287 5743129 5935426 6036512
5268F036512Q0686m5188R0724K58802J37901R8500K03538J96132j7873Q1288J51584
$$ 6036512 6117198 6072010 6162734 6421536 6559437 6657937 6861475 7057607 7039734 7121022 7272606
5257G272606M9255L43930L17195K85093J78589K69637J50201K51914K27587K64926
$$ 7272606 7321861 7665791 7982986 8268079 8446668 8716305 8866506 9118420 9346007 9610933
5247I610933L50118L07466L11238K81971L08250M97202O06363L91619N91619Q56845
$$ 9610933 9961051 10268517 10579755 10861726 11169976 11667178 12273541 12665160 13256779 14113624
5237A4113624Q96314R46274R80747J108251J502716J596018K015168K669524L471334
$$ 14113624 15009938 15956212 16936959 18045210 19547926 21143944 23159112 25828636 29299970
5228B9299970M338731M775138M564489L638265K408287J386290M93721j14368
$$ 29299970 33638701 38413839 42978328 46616593 49024880 50411170 50904891 50790523
5220E0790523R6500J050467K707984M641706O624441Q218473Q505940P656319
$$ 50790523 50887023 51937490 54645474 59287180 65911621 74130094 82636034 90292353
5212I0292353N964786M085986K554418J378938M72803M1710O01231J862533L562192
$$ 90292353 96257139 100343125 102897543 104276481 104749284 104790994 105392225 107254758 110816950
5203A10816950M939032N359097M694034L589760K548572K068590J727379J665612
$$ 110816950 115755982 121115079 125809113 129398873 131947445 134016035 135743414 137409026
5195A37409026J684561J246245J054789Q37415J3328j261100j992106j920806
$$ 137409026 139093587 140339832 141394621 142232036 142245364 140984264 138992158 137071352
5187A37071352j518704m86766M76954L17749j249415l002222m379528n442428
$$ 137071352 135552648 135065882 135542836 135860585 134611170 131608948 127229420 121786992
5179A21786992n861323n159274l757116k332353o06254P15096Q26142k44745k196657
$$ 121786992 115925669 110766395 107009279 104676926 104070672 104785768 105611910 105367165 103170508
5170A03170508m350246o481551q070979q695531q198086o871811m923733k917797
$$ 103170508 98820262 92338711 84267732 75572201 67374115 60502304 55578571 52660774
5162E2660774j169000j4006L76437k04084j368150k711265l805715m402939m677893
$$ 52660774 51491774 51477768 51854205 51650121 50281971 47570706 43764991 39362052 34684159
5153C4684159m283522l614027l031929k428121j840883j563520j110233r65405
$$ 34684159 30400637 26786610 23754681 21326560 19485677 17922157 16811924 15846519
5145A5846519p65815o01117n33514m57123n58086l95222m39327l07369j26139
$$ 15846519 15080704 14479587 13946073 13488950 12930864 12535642 12096315 11788946 11662807
5136A1662807j92421j11504o2029j09517l4524j1431j06585n0158J15237R6591
$$ 11662807 11470386 11358882 11296853 11187336 11152812 11141381 11034796 10984638 11099875 11196466
5126A1196466J51117J12375K21778L26203K35501M39209K61903J41600J79550
$$ 11196466 11347583 11459958 11681736 12007939 12243440 12682649 12944552 13086152 13265702
5117A3265702O2483j22905j44682l07710n61073n34617k70514m14733l97120l77270
$$ 13265702 13328185 13205280 13060598 12752888 12191815 11657198 11386684 10971951 10574831 10197561
5107A0197561m32073l41031l56961l99694j94901j84810j80321k60924k72702
$$ 10197561 9765488 9424457 9067496 8667802 8472901 8288091 8107770 7846846 7574144
5098G574144k44595k36067j67764k50521r3086q9313q6299k8631k28398j94863
$$ 7574144 7329549 7093482 6925718 6675197 6582111 6492798 6406499 6377868 6149470 5954607
5088E954607J0505j18731p7211m1951k0289n2742L2114l1886n1182m3393j52719
$$ 5954607 5965112 5846381 5769170 5727219 5706930 5654188 5686302 5654416 5603234 5559841 5407122
5077E407122L7204J18275n668j09232J4131o6060q5922o3317k831O5310N4852
$$ 5407122 5444326 5562601 5556933 5447701 5461832 5395772 5309850 5246533 5243702 5309012 5363864
5066E363864J58115J0515j51126p4249k122o4879N6142K9496k1763K0558r6135
$$ 5363864 5521979 5532494 5381368 5307119 5304997 5240118 5296260 5325756 5303993 5324551 5228416
5055E228416o4318l1249J80104J26730O9461O1692J7322j3605o6047m4873k1186
$$ 5228416 5164098 5132849 5312953 5439683 5509144 5570836 5588158 5574553 5508506 5463633 5442447
5044E442447J54011J45486J30852K51107O9959q0537j9207J49186n4801j19809
$$ 5442447 5596458 5741944 5872796 6123903 6193862 6113325 6094118 6243304 6188503 6068694
5034F068694J25099p1821n7121J1583n9776j26752l8007J2883l389O810M4561
$$ 6068694 6193793 6121972 6064851 6076434 6016658 5889906 5851899 5864782 5861393 5868203 5912764
5023E912764n093j67427r604N0857p1461J06604j9392O554J74406J10103N6524
$$ 5912764 5907671 5740244 5730640 5781497 5710036 5816640 5797248 5803802 5978208 6088311 6144835
5012F144835q1343k4095Q9477o8131p4457l3908k1025o3477L6822J74004k5240
$$ 6144835 6063492 6039397 6128874 6060743 5986286 5952378 5931353 5867876 5904698 6078702 6053462
5001F053462J17217L7876J8372Q6734N772J74076R8880J38470O7814P6112k4731
$$ 6053462 6170679 6208555 6226927 6313661 6319433 6493509 6592389 6730859 6798673 6874785 6850054
4990F850054K3601K2725J95977J79349L9856Q5424Q1018J65739J56135L05077
$$ 6850054 6873655 6896380 7092357 7271706 7311562 7396986 7478004 7643743 7799878 8104955
4980H104955K30456J74366K55761J47411N6898L3346j0999R2615J5785Q8013R76
$$ 8104955 8335411 8509777 8765538 8912949 8969847 9003193 8992194 9084809 9100594 9188607 9189583
4969I189583j5795J33772R6846L4369J26019L93117L29601L26047M20731L83525
$$ 9189583 9173788 9307560 9404406 9438775 9564794 9957911 10287512 10613559 11034290 11417815
4959A1417815L15227K39573K19587L57386K55466J1977J2663k6902n3497m1511
$$ 11417815 11733042 11972615 12192202 12549588 12805054 12817031 12829694 12802792 12749295 12707784
4949A2707784J3948K27650K55124K14671L86405M58532L75578J35762J63535K07815
$$ 12707784 12721732 12949382 13204506 13419177 13805582 14264114 14639692 14775454 14938989 15146804
4939A5146804M7928r8883j28999J15462J25800J84207K62820K24098K98554K16985
$$ 15146804 15194732 15095849 14966850 15082312 15208112 15392319 15655139 15879237 16177791 16394776
4929A6394776K13626J08409K01324L50514J75364L12615M57363K60849L39664
$$ 16394776 16608402 16716811 16918135 17268649 17444013 17756628 18213991 18474840 18814504
4920A8814504M36133L85835N28612M25915N35700L64186L54392M49689L88561
$$ 18814504 19250637 19636472 20165084 20590999 21126699 21490885 21845277 22294966 22683527
4911B2683527M77033O40542P16433O87124O42576O69177M56677L42741L65117
$$ 22683527 23160560 23801102 24517535 25204659 25847235 26516412 26973089 27315830 27680947
4902B7680947L81371K72990J97254L50300L86201O06126N03681P74356Q42089
$$ 27680947 28062318 28335308 28532562 28882862 29269063 29875189 30378870 31153226 31995315
4893C1995315P81250Q24137Q42138Q63891P38382M68267L72537L17359J73881
$$ 31995315 32776565 33600702 34442840 35306731 36045113 36513380 36885917 37203276 37377157
4884C7377157K22853L60939L93056M49926M43740M86138N73510P32671Q04831
$$ 37377157 37600010 37960949 38354005 38803931 39247671 39733809 40307319 41039990 41844821
4875D1844821J015560J223078J265667J419297J642205J650114J819166K235371
$$ 41844821 42860381 44083459 45349126 46768423 48410628 50060742 51879908 54115279
4867E4115279K393739K663760L138304L503036L995881N096303O918882Q954793
$$ 54115279 56509018 59172778 62311082 65814118 69809999 74906302 81825184 90779977
4859I0779977R729975Q828742O564835O243079N639145M074175M541418N709419
$$ 90779977 100509952 109338694 115903529 122146608 127785753 131859928 136401346 142110765
4851A42110765O812868P169426O958905O283501N346953M337323L430032K401966
$$ 142110765 148923633 156093059 163051964 169335465 174682418 179019741 182449773 184851739
4843A84851739J915217J184531P37437N54188L84438N29498J010755J612547K495463
$$ 184851739 186766956 187951487 188688924 189243112 189627550 190157048 191167803 192780350 195275813
4834A95275813L769779N282007O805072Q175435R601684J0753180J1762585J2495499
$$ 195275813 199045592 204327599 211132671 219308106 228909790 239662970 251425555 263921054
4826B63921054J2941799J3176987J2758861J1591205R900206P260435M010497
$$ 263921054 276862853 290039840 302798701 314389906 324290112 331550547 335561044
4819C35561044Q84645k146368m691871o443476p768591q403937q281635p293755
$$ 335561044 336445689 334299321 329607450 323163974 315395383 306991446 298709811 291416056
4811B91416056m736539k03377O465073J2914003J5379794J1982567M372876k372689
$$ 291416056 286679517 286476140 292941213 305855216 321235010 333217577 337590453 335217764
4803C35217764p853250j3218978j4431720j1085754o182956j160968K586740N308542
$$ 335217764 327364514 314145536 299713816 288628062 282445106 281284138 283870878 289179420
4795B89179420P418763R543884J1850298J5330975K0006218K4525125K5427335
$$ 289179420 296598183 306142067 317992365 333323340 353329558 377854683 403282018
4788D03282018K2423618J8408669J6364413J3436171O183974l484529j2575641
$$ 403282018 425705636 444114305 460478718 473914889 480098863 476614334 464038693
4781D64038693j8532412k3768731k8355126k8470709k4717929j9845594j5291177
$$ 464038693 445506281 421737550 393382424 364911715 340193786 320348192 305057015
4774C05057015j1355920p770622m339659o11662M021538J0192189J7484822K2693274
$$ 305057015 293701095 285930473 281590814 280979152 285000690 295192879 312677701 335370975
4766C35370975K2172348J5679923P154613R53502m923945r467788r137488n724636
$$ 335370975 357543323 373223246 380377859 381331361 376407416 366939628 357802140 352077504
4758C52077504j693816J494772L441366M254890L785563K246633O5341k788142
$$ 352077504 350383688 351878460 355319826 359574716 363360279 365606912 365672253 362884111
4750C62884111o067006r168679j1361680j2871316j3638692j3816077j3348635
$$ 362884111 356817105 347648426 336286746 323415430 309776738 295960661 282612026
4743B82612026j2470521j1455284j0193283q725945p156816n837016m391064l032525
$$ 282612026 270141505 258686221 248492938 239766993 232610177 226773161 222382097 219349572
4735B19349572j822439j091088o81070o00496o74960j001027j640132k363737
$$ 219349572 217527133 216436045 215754975 215154479 214479519 213478492 211838360 209474623
4727B09474623l380760m904297o447798p828078r394501j0397091j0731511j0939659
$$ 209474623 206093863 201189566 194741768 186913690 177519189 167122098 156390587 145450928
4719A45450928j0514561r996218r434755q674779q233054p525849o823005o226991
$$ 145450928 134936367 124940149 115505394 106830615 98597561 91071712 84248707 78021716
4711G8021716n613017m924714m210274l759706l510891l019481k617143k488233
$$ 78021716 72408699 67483985 63273711 59514005 56003114 52983633 50366490 47878257
4703D7878257k226299j882899j894703j643661j470162j393596j246044j229886
$$ 47878257 45651958 43769059 41874356 40230695 38760533 37366937 36120893 34891007
4695C4891007j130605r94488q46898o83859p94954q74001p17295q88197o45729
$$ 34891007 33760402 32765914 31919016 31235157 30440203 29566202 28848907 27960710 27314981
4686B7314981o26922o64667n97861n79377m21548l99323n37822m41900n19936
$$ 27314981 26688059 26023392 25425531 24846154 24424606 24025283 23487461 23045561 22525625
4677B2525625m21442l82536l71088l82796m73884l29897m22648m95256m52214
$$ 22525625 22104183 21721647 21350559 20967763 20493879 20163982 19741334 19246078 18793864
4668A8793864l78462n02450l65731k30855n31089m08642l77535l85654l88012
$$ 18793864 18415402 17912952 17547221 17316366 16785277 16376635 15999100 15613446 15225434
4659A5225434l36127k65338k42770j96077j67707j72974l02045k49736j79897
$$ 15225434 14889307 14623969 14381199 14185122 14017415 13844441 13542396 13292660 13112763
4650A3112763k13436l02189k76332j64107q6863k08049m3361o5144k42129j57928
$$ 13112763 12899327 12597138 12320806 12156699 12069836 11861787 11818426 11753282 11511153 11353225
4640A1353225p569m8765k7517r2917J05309J8630j27694J66622M1097j34932K70309
$$ 11353225 11345656 11296891 11269374 11176457 11281766 11300396 11172702 11339324 11380421 11245489 11515798
4629A1515798N92061Q63662R69151P56307J81685j93669j65674p60575r23036
$$ 11515798 12107859 12971521 13940672 14696979 14878664 14684995 14519321 13758746 12835710
4620A2835710o88081n01287l91205k77570m8094K11815K92956L93913N40161M88844
$$ 12835710 12147629 11646342 11255137 10977567 10929473 11141288 11434244 11828157 12368318 12857162
4610A2857162N29624O25584K79646J91600M20276M38528N77169P50620P20499
$$ 12857162 13386786 14012370 14292016 14483616 14903892 15342420 15919589 16670209 17390708
4601A7390708O92557M89994K32795J56359p9695J64527N51182N65806P30151M88038
$$ 17390708 18083265 18573259 18806054 18962413 18882718 19047245 19598427 20164233 20894384 21382422
4591B1382422N2367l19872m85470n00070l51921m9162O8965Q1130k16926k75626
$$ 21382422 21434789 21114917 20629447 20129377 19777456 19728294 19797259 19878389 19661463 19385837
4581A9385837m87460p00995o12152l65956j60440k35500k26686j33759k60159
$$ 19385837 18898377 18197382 17585230 17219274 17058834 16823334 16596648 16462889 16202730
4572A6202730k67502j97919j98270j1544j07918m0208J94750Q2835L72686L63317
$$ 16202730 15935228 15737309 15539039 15527495 15419577 15379369 15574119 15656954 16029640 16392957
4562A6392957K79180N47199O26697N50116M62619O01801O51412P18649N97835
$$ 16392957 16672137 17219336 17846033 18396149 18858768 19460569 20111981 20830630 21428465
4553B1428465R81406J063082J283534J612369J869694K503641K891871L294532
$$ 21428465 22409871 23472953 24756487 26368856 28238550 30742191 33634062 36928594
4545C6928594L948969M716771N734046P556062J0538393J5372616K0928857K4395971
$$ 36928594 40877563 45594334 51328380 58884442 69422835 84795451 105724308 130120279
4537A30120279K2891876J5961602O766930j337181q498976j3442832j3503650
$$ 130120279 153012155 168973757 175740687 174403506 165904530 152461698 138958048
4530A38958048q811981j636795O437042J3866678J7178869J4339954O830043j356343
$$ 138958048 130146067 128509272 134946314 148812992 165991861 180331815 187161858 185805515
4522A85805515q009815j3817002j6154592j3618468p224238Q96661Q501123J3171071
$$ 185805515 177795700 163978698 147824106 134205638 126981400 127878061 136379184 149550255
4514A49550255J2364071O769389O8172n877699j1421862j4182340j2689829q084018
$$ 149550255 161914326 168683715 168751887 162874188 151452326 137269986 124580157 116496139
4506A16496139j680310N271244J0839361J2106810Q278275J256936n750129j1713516
$$ 116496139 114815829 120087073 130926434 143033244 151311519 152568455 146818326 135104810
4498A35104810j6737469j8622583j7162913j4094525j0721036q065909o094365
$$ 135104810 118367341 99744758 82581845 68487320 57766284 49700375 43606010
4491D3606010m619935l743097k939921k405749j879706j645412j669100j457223
$$ 43606010 38986075 35242978 32303057 29897308 28017602 26372190 24703090 23245867
4483B3245867j294665j246517j039026p03313p21838o14591l68908m48111n05386
$$ 23245867 21951202 20704685 19665659 18962346 18240508 17625917 17257009 16808898 16303512
4474A6303512k77048m03416n59486m21073k08194N758J07694L14009L53157L61651
$$ 16303512 16026464 15623048 15063562 14642489 14434295 14440053 14547747 14861756 15214913 15576564
4464A5576564J34267j16177l64475p45006q23663p71972r20533p23961m91271
$$ 15576564 15710831 15594654 15230179 14485173 13661510 12889538 11969005 11245044 10753773
4455A0753773m38271k53557j00919N3642K5081J2852J04391L06773L18032L69910
$$ 10753773 10315502 10061945 9961026 10014668 10039749 10052601 10156992 10463765 10781797 11151707
4445A1151707L86035L84165M17999K36392n6900l21997m13176p00082p80032p62399
$$ 11151707 11537742 11921907 12339906 12576298 12519398 12197401 11784225 11084143 10304111 9541712
4435I541712n49669m18406l99508k72100j33768j56475j22730P2063J26363K05599
$$ 9541712 8992043 8573637 8174129 7902029 7768261 7611786 7489056 7561119 7687482 7893081
4425G893081K87785L04504K27414N1621q8402j93930j93357j45271k01790o6423
$$ 7893081 8180866 8485370 8712784 8764405 8676003 8482073 8288716 8143445 7941655 7875232
4415G875232R3314J99576O03067R07234J424570J774543J210342O14774J20148
$$ 7875232 7968546 8168122 8771189 9678423 11102993 12877536 14087878 14702652 14822800
4406A4822800o63860j357478j472633j380010r75826q19087n66969l16745m29057
$$ 14822800 14158940 12801462 11328829 9948819 8972993 8153906 7586937 7270192 6841135
4397F841135l61177k27726r7463o2806o6489j53249r082M6003m7155P3914J09719
$$ 6841135 6479958 6252232 6154769 6091963 6025474 5872225 5863143 5909146 5861991 5935905 6045624
4386F045624J18421J20751L2161j03194j21518k9237l0023j86527k33024k30450
$$ 6045624 6164045 6284796 6316957 6213763 6092245 6063008 6032985 5846458 5613434 5382984
4376E382984j00784J23601o5469J2434O1742j14495k9082l7046p0386J49676k247
$$ 5382984 5282200 5405801 5340332 5352766 5414508 5300013 5270931 5233885 5163499 5313175 5310928
4365E310928K4256j1926p6270k2314j06845k59991m2782M7287j01254k5603J0820
$$ 5310928 5335184 5323258 5246988 5224674 5117829 4857838 4815056 4862343 4761089 4735486 4746306
4354D746306o4968j9159N7109K5827q2438p0483N4021k172r0j00768n0580M3677
$$ 4746306 4681338 4662179 4719288 4745115 4662677 4592194 4646215 4644043 4643953 4543185 4492605 4536282
4342D536282k35227l1883Q1236j62129L0658P0839R8119P487q5298q0870J25742
$$ 4536282 4301055 4269172 4350408 4188279 4218937 4289776 4387895 4395382 4310084 4229214 4354956
4331D354956n6201q2111p2631l1089m5997j40005n273J42892J9582m1783J04982
$$ 4354956 4298755 4216644 4144013 4112924 4066927 3926922 3921649 4064541 4084123 4042340 4147322
4320D147322p183Q024o3718r988J8890n3643J2427N3118L6526K9050J9874M2861
$$ 4147322 4140139 4148163 4084445 4074457 4093347 4039704 4052131 4105249 4141775 4170825 4190699 4233560
4308D233560k7998k4658J08996P7877j04371J6408K16219P3485n7585j17652m3917
$$ 4233560 4205562 4180904 4289900 4367777 4263406 4279814 4496033 4569518 4511933 4394281 4350364
4297D350364l8736P134P8600k3420j03229j0516j1526Q5685J38677P2562l4431
$$ 4350364 4311628 4318762 4397362 4373942 4270713 4260197 4248671 4334356 4473033 4545595 4511164
4286D511164J44593m0782O3241L0937J63549J14351N601L4699l4938p0570K5782
$$ 4511164 4655757 4614975 4678216 4709153 4872702 4987053 4992654 5027353 4992415 4921845 4947627
4275D947627J08079J606K1068N7704K8234J01432P8395J1339K0930K3303Q3503
$$ 4947627 5055706 5057312 5078380 5136084 5164318 5265750 5344145 5355484 5376414 5399717 5483220
4264E483220L1623m043J8190L5245p4972n1138J02282K34865K9054R7029O4307
$$ 5483220 5514843 5510800 5528990 5564235 5489263 5438125 5540407 5775272 5804326 5901355 5965662
4253E965662J76116P5169L4444R1996J18813K573m3416P8414J19115R2622J58630
$$ 5965662 6141778 6216947 6251391 6343387 6462200 6464773 6421357 6499771 6618886 6711508 6870138
4242F870138J32188J96443N697J55271K78358R5753K5008J62539J50273O7223
$$ 6870138 7002326 7198769 7204466 7359737 7638095 7733848 7758856 7921395 8071668 8138891
4232H138891J22992J11771J49265J90953j3189K19106K61914K04154J22748J13752
$$ 8138891 8261883 8373654 8522919 8713872 8700683 8919789 9181703 9385857 9508605 9622357
4222I622357K46136O3642J10922K10966Q0920J80894L16304J84869J53410J18467
$$ 9622357 9868493 9932135 10043057 10254023 10334943 10515837 10832141 11017010 11170420 11288887
4212A1288887K15237L95805K27748J84254L94025J34543K82361L30919K65276
$$ 11288887 11504124 11899929 12127677 12311931 12705956 12840499 13122860 13453779 13719055
4203A3719055L93934L97358L25852K60208M38017K12783L37105M80983L73875
$$ 13719055 14112989 14510347 14836199 15096407 15534424 15747207 16084312 16565295 16939170
4194A6939170N35616M91553M51153N64973O61285O20443P49916P71819Q68181
$$ 16939170 17474786 17966339 18417492 18982465 19643750 20264193 21014109 21785928 22654109
4185B2654109R35287J162877J302559J556635J715480J476313J453218J484198
$$ 22654109 23589396 24752273 26054832 27611467 29326947 30803260 32256478 33740676
4177C3740676J544363J453523J403219J923558K187660K193353K318300K490664
$$ 33740676 35285039 36738562 38141781 40065339 42252999 44446352 46764652 49255316
4169D9255316K317730K028794J741271J594585J330712J161609J196178J333839
$$ 49255316 51573046 53601840 55343111 56937696 58268408 59430017 60626195 61960034
4161F1960034J507225J751781K335628K675541K764964K985842L141744K848164
$$ 61960034 63467259 65219040 67554668 70230209 72995173 75981015 79122759 81970923
4153H1970923K512568K565740K351585K116325K203454K290406K601418K566178
$$ 81970923 84483491 87049231 89400816 91517141 93720595 96011001 98612419 101178597
4145A01178597K514982K590655K339816K167904K071557K297878K349560K538543
$$ 101178597 103693579 106284234 108624050 110791954 112863511 115161389 117510949 120049492
4137A20049492K701492K572804K489102K603936L164977L747852M663396N576430
$$ 120049492 122750984 125323788 127812890 130416826 133581803 137329655 141993051 147569481
4129A47569481O220313O578193O184346N302473M088905K646242J316365P88493
$$ 147569481 153789794 160367987 166552333 171854806 175943711 178589953 179906318 180694811
4121A80694811N81897O40877Q84461J217817J530225J381032J216881J204717
$$ 180694811 181276708 181917585 182802046 184019863 185550088 186931120 188148001 189352718
4113A89352718J190949J139882J128654J212801J301857J033770J225479J625329
$$ 189352718 190543667 191683549 192812203 194025004 195326861 196360631 197586110 199211439
4105A99211439K354847L572193N012052O693314Q180179Q835716R040376Q979478
$$ 199211439 201566286 205138479 210150531 216843845 225024024 233859740 242900116 251879594
4097B51879594Q403288P661535P204365O816223O412184N908036N314722M457261
$$ 251879594 260282882 267944417 275148782 281965005 288377189 294285225 299599947 304057208
4089C04057208L276518K055817R75466r3525q84627j288973j388837j114436l25840
$$ 304057208 307333726 309389543 310365009 310271484 309386857 308097884 306709047 305594611 305268771
4080C05268771L77206J419282J910277J952793J722595J107568L60105m21779
$$ 305268771 305645977 307065259 308975536 310928329 312650924 313758492 314118597 313696818
4072C13696818p88474j055089j073758n16558K71647Q99191J652516J747849J672608
$$ 313696818 312908344 311853255 310779497 310262939 310534586 311433777 313086293 314834142 316506750
4063C16506750J281842M39554m05050j177682j907432k294250k954996l638101
$$ 316506750 317788592 318228146 317823096 316645414 314737982 312443732 309488736 305850635
4055C05850635m020745m336231m976917n600563o701652p826973q790798r764597
$$ 305850635 301829890 297493659 292516742 286916179 280214527 272387554 263596756 253832159
4047B53832159r772946r286079q291781o793541n067096l695723k845695k131197
$$ 253832159 244059213 234773134 226481353 219687812 214620716 210924993 208079298 205948101
4039B05948101j741896j549157j678151j940503k028625k248855k682043k857230
$$ 205948101 204206205 202657048 200978897 199038394 197009769 194760914 192078871 189221641
4031A89221641l004800l046458k768073k431948j820002r95697o99007j010986
$$ 189221641 186216841 183170383 180402310 177970362 176150360 175154663 174455656 173444670
4023A73444670j604137k910478m159590n221638o273408o377370n850999n230957
$$ 173444670 171840533 168930055 164770465 159548827 153275419 146898049 141047050 135816093
4015A35816093m264945l649083l278939l084587l056149l296535l144091l319262
$$ 135816093 131551148 127902065 124623126 121538539 118482390 115185855 112041764 108722502
4007A08722502l357032l173147k985207k794638k750306k415732k388534k101186
$$ 108722502 105365470 102192323 99207116 96412478 93662172 91246440 88857906 86756720
3999H6756720j946535j907395j992183k162522k567206k810463k867997k670803
$$ 86756720 84810185 82902790 80910607 78748085 76180879 73370416 70502419 67831616
3991F7831616k323467j982816j918513j913767k222451k182812k354045k571989
$$ 67831616 65508149 63525333 61606820 59693053 57470602 55287790 52933745 50361756
3983E0361756k443817j811784j616454j667551j551409j588562j471215j754647
$$ 50361756 47917939 46106155 44489701 42822150 41270741 39682179 38210964 36456317
3975C6456317j780610j795783j793083j763049j525486j544588j404592j222174
$$ 36456317 34675707 32879924 31086841 29323792 27798306 26253718 24849126 23626952
3967B3626952j059363j085551j040168p47742p91137n38573l08548p1260J48828
$$ 23626952 22567589 21482038 20441870 19694128 18902991 18364418 18055870 17984610 18133438
3958A8133438R9877r4869m00011o43616q16263r66836r36734o36991o63679n08999
$$ 18133438 18233315 18138446 17738435 17094819 16278556 15311720 14374986 13737995 13074316 12565317
3948A2565317m17772l81190m02568j89128k18711k02431k49229l32732k14865
$$ 12565317 12147545 11766355 11363787 11174659 10955948 10753517 10504288 10171556 9956691
3939I956691j38911k38185j08568k34072k78805j65147o8143j66038q2628k63079
$$ 9956691 9817780 9579595 9471027 9236955 8958150 8793003 8724860 8558822 8476194 8213115
3929H213115j91569n1643j98443q3950j29991j97585l02662L8084M522j55725
$$ 8213115 8021546 7969903 7771460 7687510 7557519 7359934 7057272 7095356 7099878 6944153
3919F944153j42293k6867j34356o4637j06124m0694j2550n0244q9352p0383j38613
$$ 6944153 6801860 6774993 6640637 6576000 6469876 6429182 6416632 6366388 6277036 6206653 6068040
3908F068040j47906K393j6403p1151r5488k3479O056n0440j88725p0148j524j63055
$$ 6068040 5920134 5922527 5906124 5834973 5739485 5716006 5722062 5671622 5482897 5412749 5411225 5248170
3896E248170j33292N438j08493k19528p0758O7536q320j18354J0345n764n2881
$$ 5248170 5114878 5120316 5011823 4792295 4721537 4789073 4780753 4662399 4672744 4666980 4614099
3885D614099O4814j01529j30083k1926q5313k7897J2417j2664K1554r984K888
$$ 4614099 4678913 4577384 4447301 4425375 4340062 4312165 4324582 4311918 4333472 4323488 4326376
3874D326376n4939O0173m3343q6983J52523j6627o8855o3905j79948K3249P5153
$$ 4326376 4271437 4331610 4288267 4201284 4353807 4337180 4268325 4204420 4024472 4047721 4122874
3863D122874o8637Q8602p3731m3405l3460M7342q3850M310K0760Q2510l06q4107
$$ 4122874 4054237 4142839 4069108 4025703 3992243 4039585 3955735 3960045 3980805 4063315 4063009 3978902
3851C978902R0243k6084j63634M0064J06279J1322J28158l3834j6601J30801l256
$$ 3978902 4069145 4043061 3879427 3919491 4025770 4037092 4165250 4131416 4114815 4245616 4242360
3840D242360l2499P0430n47j4314Q4657n4225k24885j03094J18583M0580J1453
$$ 4242360 4209861 4280291 4279744 4265430 4350087 4295862 4070977 3967883 4086466 4127046 4138499
3829D138499P8898r5026R1678l7464k702Q4854l6808o4674N4824r5891r1018m6231
$$ 4138499 4217397 4122371 4214049 4176585 4173883 4258737 4221929 4157255 4212079 4116188 4025170 3978939
3817C978939o120J15941j08193q852p8112r41k9193q7028p5727j1304P444n5657
$$ 3978939 3972819 4088760 3980567 3971715 3893603 3892662 3863469 3776441 3700714 3689410 3696854 3641197
3805C641197J3469K3350j3485Q001r5233O674n6928r2054N2292L427Q6206R2833
$$ 3641197 3654666 3678016 3664531 3672532 3577299 3583973 3527045 3434991 3487283 3490710 3576916 3669749
3793C669749j6486m7132k32579j54882J74450n261o4486Q085M8493K7646j19299
$$ 3669749 3653263 3606131 3373552 3218670 3393120 3387859 3323373 3331458 3379951 3407597 3288298
3782C288298j19373M0520L421j774M0299L8525R4596J3110j18947L6904k6571
$$ 3288298 3168925 3209445 3212866 3211092 3251391 3289916 3384512 3397622 3278675 3315579 3289008
3771C289008o095K5126L0794n860q5398r545J5519O9672k7055N3115N7480q275
$$ 3289008 3282913 3308039 3338833 3332973 3247575 3238030 3253549 3323221 3296166 3349281 3406761 3398486
3759C398486N2710O330k3160j03944J9260p3459Q0708j1846J7541J4427m8592
$$ 3398486 3451196 3457526 3434366 3330422 3349682 3276223 3356931 3345085 3362626 3377053 3328461
3748C328461O7418j13393m1626o949J8898J40168l2739J7108q5984j6940M628
$$ 3328461 3395879 3282486 3240860 3233911 3252809 3392977 3360238 3377346 3291362 3274422 3279050
3737C279050n4095r1144L5432k6472q0242Q886J36892p838q465k9626j57J06613
$$ 3279050 3224955 3133811 3169243 3142771 3062529 3071415 3208307 3200469 3192004 3162378 3162221 3268834
3725C268834l8608M7339j22279m5965n1652k9397J24291M3146n5640K4833l93
$$ 3268834 3230226 3277565 3155286 3109321 3057669 3028272 3152563 3195709 3140069 3164902 3164509
3714C164509p4429p3189R7364R761P6840J16621N9469p9659r4136R1031K2345
$$ 3164509 3090080 3016891 3114255 3124016 3200856 3317477 3376946 3297287 3203151 3294182 3316527
3703C316527n4013P7231R2038J67522j3778L5429Q2547J13717L5692J08987J27122
$$ 3316527 3262514 3339745 3431783 3599305 3585527 3620956 3703503 3817220 3852912 3961899 4089021
3692D089021O718j6759Q7860J22658j5206J5555M8679o1765J5315Q7811J21749
$$ 4089021 4095739 4078980 4166840 4289498 4274292 4289847 4338526 4276761 4292076 4379887 4501636
3681D501636J51465J7210Q7574J97893K4964M1095J49146J82429R4922N2298J95944
$$ 4501636 4653101 4670311 4757885 4955778 4980742 5021837 5170983 5353412 5448334 5500632 5696576
3670E696576J06026O0848J78280R8020J48310K18695M6579K16195J42327L9495
$$ 5696576 5802602 5863450 6041730 6139750 6288060 6506755 6553334 6769529 6911856 6951351
3660F951351J93713K52719J24605J77340L13843K11724M10056K88340J39766M54382
$$ 6951351 7145064 7397783 7522388 7699728 8013571 8225295 8635351 8923691 9063457 9517839
3650I517839M31495J76575J81981M75517L31569R684L40579L78074K50976K65848
$$ 9517839 9949334 10125909 10307890 10783407 11114976 11124660 11465239 11843313 12094289 12360137
3640A2360137K79659L13457L00111N23732M00503L95184O03466O60749O22871
$$ 12360137 12639796 12953253 13253364 13777096 14177599 14572783 15176249 15836998 16459869
3631A6459869Q24365Q11648O70301P68869P28987O95834O64322P39289O72142
$$ 16459869 17284234 18095882 18766183 19535052 20264039 20959873 21624195 22363484 23035626
3622B3035626O67693N67661L53679K47708K14156K51584K16451K29348K32562
$$ 23035626 23703319 24270980 24624659 24872367 25086523 25338107 25554558 25783906 26016468
3613B6016468L58501K40852K81427L59631N50799P23309P69817J007157J151149
$$ 26016468 26374969 26615821 26897248 27256879 27807678 28530987 29300804 30307961 31459110
3604C1459110J167473J449916J635229J812883J835237J685740J680433J645534
$$ 31459110 32626583 34076499 35711728 37524611 39359848 41045588 42726021 44371555
3596D4371555J564836J544170J471258J430914J400195J365669J547135J498400
$$ 44371555 45936391 47480561 48951819 50382733 51782928 53148597 54695732 56194132
3588E6194132J324656J003932P80836Q24387P81758P49539J003585J217953J294811
$$ 56194132 57518788 58522720 59303556 60127943 60909701 61659240 62662825 63880778 65175589
3579F5175589J631704J931908K137954K522591K821204L366448L599021L568083
$$ 65175589 66807293 68739201 70877155 73399746 76220950 79587398 83186419 86754502
3571H6754502L414173L270732K964459K853018K882694K897043L337003L759747
$$ 86754502 90168675 93439407 96403866 99256884 102139578 105036621 108373624 112133371
3563A12133371M254753N203007O396208P624466R191869J0821391J2709812J4062691
$$ 112133371 116388124 121591131 127987339 135611805 144803674 155625065 168334877 182397568
3555A82397568J5188264J6014700J6095503J5579340J4251523J1798181Q412445
$$ 182397568 197585832 213600532 229696035 245275375 259526898 271325079 279737524
3548B79737524M447669L45526l746781p758586j0813413j2284031j2862785j2751346
$$ 279737524 284185193 284530719 280783938 273025352 262211939 249927908 237065123 224313777
3540B24313777j1734013j0434859r257005q570423q125659q271209q386571q359759
$$ 224313777 212579764 202144905 192887900 184317477 176191818 167920609 159534038 151174279
3532A51174279q500043q476020q427414q280917p880262p437569p016953o664499
$$ 151174279 142674236 134198216 125770802 117489885 109609623 102172054 95155101 88490602
3524H8490602n986623n622647n288019m851756m424670l875205l740913l442614
$$ 88490602 82503979 76881332 71593313 66741557 62316887 58441682 54700769 51258155
3516E1258155k853229k329149k299136k154728j683512j589022j544744j381426
$$ 51258155 48404926 46075777 43776641 41621913 39938401 38349379 36804635 35423209
3508C5423209j495841j523182j532923j531872j301261j159857j169997j167880
$$ 35423209 33927368 32404186 30871263 29339391 28038130 26878273 25708276 24540396
3500B4540396j049036r81285q29890p43165o10923o38618p38039m93546o04780
$$ 24540396 23491360 22510075 21680185 20937020 20326097 19687479 18949440 18455894 17851114
3491A7851114o09875n62735m76254n42488o72328o51128n31765p49770p30436
$$ 17851114 17241239 16678504 16202250 15659762 14987434 14336306 13804541 13054771 12324335
3482A2324335n15002l78327l61357n86466m33580k94717m17007k39872l21088
$$ 12324335 11809333 11431006 11069649 10483183 10049603 9754886 9337879 9098007 8776919
3473H776919k87309l12922k23902j14681j61747k79460k12891R73l54589k99529
$$ 8776919 8489610 8176688 7952786 7838105 7676358 7396898 7184007 7184980 6830391 6530862
3463F530862j85282j19451l08416j52173j28297j29762j97710j81943K9857n1497
$$ 6530862 6345580 6226129 5917713 5765540 5637243 5507481 5309771 5127828 5157685 5106188
3453E106188M67j22558j70206m9445k24713k70152k3285P8719j52700m2099n1607
$$ 5106188 5106655 4984097 4813891 4764446 4539733 4269581 4246296 4325015 4172315 4130216 4078609
3442D078609l7978j19977j00735k061l5705k406n53P2738m7687l5484m9610q5381
$$ 4078609 4040631 3920654 3819919 3817858 3782153 3779747 3779194 3851932 3804245 3768761 3719151 3633770
3430C633770j73265q1008J42847k1301j24533n5585r742j1497j04905J14787Q8527
$$ 3633770 3460505 3379497 3522344 3501043 3376510 3320925 3311183 3299686 3194781 3309568 3398095
3419C398095r9268j06858n3629J06417k3730o5600o2997L4629p0284j39357r8888
$$ 3398095 3298827 3191969 3138340 3244757 3221027 3155427 3092430 3127059 3056775 2917418 2818530
3408B818530n1946m2748p7789M5237O838o2874k8209R6896L5855K6141q69J1517
$$ 2818530 2766584 2723836 2646047 2691284 2698122 2635248 2607039 2703935 2739790 2765931 2765062 2776579
3396B776579j7924m531p70k6852K1975o4534j08363j14383M2881R1529l4590O0981
$$ 2776579 2758655 2754124 2753354 2726502 2748477 2683943 2575580 2461197 2504078 2595607 2561017 2621998
3384B621998J16417O547l5295K9361Q4352J31222J2069j9538q65j35195j14069
$$ 2621998 2738415 2744962 2709667 2739028 2823380 2954602 2966671 2947133 2946268 2811073 2697004
3373B697004j38327N579N9917j19602K2271J6750Q3279n4828n3009M3797p8745
$$ 2697004 2558677 2564256 2624173 2504571 2526842 2543592 2626871 2572043 2519034 2562831 2484086
3362B484086j12398l8965J21864J7355q1050j00842O8034P4898N1639J01616k6626
$$ 2484086 2371688 2332723 2454587 2471942 2390892 2290050 2358084 2432982 2484621 2586237 2559611
3351B559611J36781L4035O5473Q1615J9715M887Q4770Q1822o9149m2578L1483
$$ 2559611 2696392 2730427 2795900 2877515 2897230 2902117 2986887 3068709 2999560 2956982 2988465
3340B988465J18997P2748K7530L9907N4324k3574N1649J19152K2026O3881J14937
$$ 2988465 3107462 3180210 3207740 3247647 3301971 3278397 3330046 3449198 3471224 3535105 3650042
3329C650042J13651J9704l26N4930M6347L1107M8718K09407J67100R4500J5182
$$ 3650042 3763693 3783397 3783071 3838001 3884348 3915455 3964173 4173580 4340680 4435180 4450362
3318D450362K27979K33249N9183J05834K97026J55621R4728J75604K61020J06689
$$ 4450362 4678341 4911590 4970773 5076607 5373633 5529254 5623982 5799586 6060606 6167295
3308F167295m2968K02688Q0358J9471K06060O1274M9784N3877K86180K58169J88388
$$ 6167295 6124327 6327015 6407373 6426844 6632904 6694178 6743962 6797839 7084019 7342188 7530576
3297G530576L20642R9038K68647J00930O9118P0297J49035n4697J01639K34259
$$ 7530576 7851218 7950256 8218903 8319833 8388951 8459248 8608283 8553586 8655225 8889484
3287H889484L51175L43878K14479M01775K96490L45577N77856N04232L42874L20283
$$ 8889484 9240659 9584537 9799016 10200791 10497281 10842858 11420714 11924946 12267820 12588103
3277A2588103L89342L78869K36241K68709K38549J47864J08588K65133K46306
$$ 12588103 12977445 13356314 13592555 13861264 14099813 14247677 14356265 14621398 14867704
3268A4867704K52578M55864N89700M34611M43077M96860N61131N32959N54233
$$ 14867704 15120282 15576146 16165846 16600457 17043534 17540394 18101525 18634484 19188717
3259A9188717P98838R88702R55466J109336J268285J506837J463747J621359K015014
$$ 19188717 19987555 20976257 21931723 23041059 24309344 25816181 27279928 28901287 30916301
3250C0916301K078555K245000K636740K954783L244592L660326L972670M706726
$$ 30916301 32994856 35239856 37876596 40831379 44075971 47736297 51708967 56415693
3242E6415693N367371N683376O151851O447427O003204N319917L896709K533423
$$ 56415693 61783064 67466440 73618291 80065718 86068922 91388839 95285548 97818971
3234I7818971J243316K45621m17937p47207o80273p50236m41900m58518m88681
$$ 97818971 99062287 99307908 98889971 98142764 97462491 96712255 96270355 95811837 95323156
3225I5323156n42013m69331j55477J47051O90305J083134J524253J957830K267829
$$ 95323156 94781143 94311812 94156335 94303386 94993691 96076825 97601078 99558908 101826737
3216A01826737K929942L976036N528377Q168200J2486414J8707287K4454978K5151323
$$ 101826737 104756679 108732715 114261092 122429292 134915706 153622993 178077971 203229294
3208B03229294J8804738P384423k163987j1012524k0058576k3613649k2269096
$$ 203229294 222034032 229418455 227254468 216241944 196183368 172569719 150300623
3201A50300623j8458360j4637099j1543721q733930o789685n536265m516215l701948
$$ 150300623 131842263 117205164 105661443 96927513 90137828 84601563 80085348 76383400
3193G6383400l093379k484468k086294j485260r52778o03310j90793J43102O60925
$$ 76383400 73290021 70805553 68719259 67233999 66281221 65677911 65487118 65630220 66291145
3184F6291145J287081K066808K845391L688675L999048L978166L225836J585739
$$ 66291145 67578226 69645034 72490425 76179100 80178148 84156314 87382150 88967889
3176H8967889m08808k716187m429952n915779o551054o499586o311357n675415
$$ 88967889 88559081 85842894 81412942 75497163 68946109 62446523 56135166 50459751
3168E0459751m848915m254979l721187l038405k540241k330093k140627j873743
$$ 50459751 45610836 41355857 37634670 34596265 32056024 29725931 27585304 25711561
3160B5711561j816987j674261j435691j371269j289386j089216j088447q45534
$$ 25711561 23894574 22220313 20784622 19413353 18123967 17034751 15946304 15100770
3152A5100770o16599n33802p69656o40088n64267p38650o30349n84147n56680
$$ 15100770 14484171 13950369 13180713 12540625 11976358 11237708 10607359 10023212 9466532
3143I466532n27107n29848m26911m32226m26239m28498k62109j84543j72131j42137
$$ 9466532 8939425 8409577 7982666 7550440 7124201 6695703 6433594 6249051 6076920 5934783
3133E934783j79050k25261j88131j53429k98329r9022j98843k12914o4394l375
$$ 5934783 5755733 5530472 5342341 5188912 4890583 4791561 4592718 4379804 4315410 4312035
3123D312035n6746j17894j00706j73595j40400j06579r7432j61533j34190j27527
$$ 4312035 4255289 4137395 4036689 3863094 3722694 3616115 3518683 3357150 3222960 3095433
3113C095433j71178k31322j40243m8526k9598p7722J9225j5854q7151j21455l6448
$$ 3095433 2924255 2692933 2552690 2504164 2474566 2396844 2416069 2400215 2313064 2191609 2155161
3102B155161J3689j37727j2091J39369j629j51192q7211m1134j38199L1978Q6451
$$ 2155161 2168850 2031123 2019032 2158401 2156772 2005580 1918369 1877235 1739036 1771014 1857465
3091A857465j14959l0521P2443q7277o9933P9444l6093m9170j44197j65842N0239
$$ 1857465 1742506 1711985 1784428 1697151 1627218 1706662 1670569 1621399 1477202 1311360 1361599
3080A361599J2723o2170J3659j14518j29270j7515m0154o7678R3752J9904N0501
$$ 1361599 1374322 1312152 1325811 1211293 1082023 1064508 1024354 956676 1050428 1070332 1120833
3069A120833q9111k3450n5243k06842k6849J4667k9565L1134P7813j31686l0472
$$ 1120833 1031722 1008272 953029 746187 719338 734005 704440 735574 813387 681701 651229
3058F51229R6585J20029M5696l3405J15478l1539l9419n6956P2395p8016o6750
$$ 651229 747814 867843 913539 880134 995612 964073 924654 867698 940093 862077 795327
3047G95327j04644j26166p8985o4464N0975k7258k4108q386J22342n2258m7875
$$ 795327 690683 564517 485532 421068 472043 444785 420677 412291 534633 482375 434500
3036D34500m6851m2814k5467j08797P3941M921N3894L5906J4617N2947j72368
$$ 434500 387649 344835 319368 210571 284512 289433 343327 379233 393850 446797 274429
3025B74429o9047Q850l8559L2912o1289J02003J43555j29360m5564m3568r45j10231
$$ 274429 205382 214232 175673 208585 147296 249299 392854 263494 217930 174362 173417 63186
3013F3186K929J28553n5836j61541K9051O8215p945J2938J64663N127j17880m4802
$$ 63186 66115 194668 138832 -22709 6342 74557 66612 79550 244213 249340 131460 86658
3001H6658R5998j67679j18324J7079j5533K16698k3124J716J7822J15277N398
$$ 86658 182656 14977 -103347 -86268 -101801 114897 91773 93489 111311 226588 231986
2990B31986j35100j076J10376K6858l1528k7328M0291l8367n6905K5453J06892
$$ 231986 96886 95810 206186 233044 201516 174188 214479 176112 119207 144660 251552
2979B51552M6454m1158q9790j64186N8314M4756j5609l2865N0205P0584J0769
$$ 251552 298006 256848 167058 2872 61186 105942 90333 57468 107673 178257 189026
2968A89026J4778k1922o6444n9134M4613n6072k8716R3260L9681J39925J02628
$$ 189026 203804 181882 115438 56304 100917 44845 16129 109389 149070 288995 391623
2957C91623P2713j23857m2415Q7980L0511N36O7313M8281M230o6290k3284m7471
$$ 391623 464336 340479 298064 386044 416555 417091 484404 532685 536915 470625 447341 399870
2945C99870k5084J35948P7163J9029p4281m7566o363m1043LO5306j0653N8415
$$ 399870 374786 510734 587897 606926 532645 485079 478716 437673 437676 502982 492329 550744
2933E50744l0518R3030j8908j21116O779J12780J92192K36023J27363K1956K995
$$ 550744 520226 613256 594348 473232 480011 592791 784983 1021006 1148369 1170325 1173320
2922A173320J410j6588j96079r0383j54275q2399m1304K6494m0410j36818j58011
$$ 1173320 1174730 1158142 962063 871680 717405 635006 593702 620196 579786 442968 284957
2911B84957m7237M0793J40840p2170L1162K5634j8062M4487q6461l7876O375J00298
$$ 284957 237720 278513 419353 347183 378345 403979 385917 430404 343943 306067 312442 412740
2899D12740M7279P4000J5P8848J17614Q2498m4251M9410n5064n7300o3896P9693
$$ 412740 460019 534019 534034 612882 730496 812994 768743 818153 763089 705789 641893 721586
2887G21586j04803k08418q5211m0840j66143n0811M3434M1792M458j00811L8117
$$ 721586 616783 408365 323154 282314 116171 65360 108794 150586 155044 54233 92350
2876I2350L7953P1761n6732k0506L8568p9376k9908l9202O1909m65j972L8247
$$ 92350 130303 202064 145332 124826 163394 84018 54110 14908 76817 76352 74380 112627
2864A12627J3815N5940j07813m6663l3539R4444R4236l7162o6811L6805L273j23903
$$ 112627 126442 182382 74569 27906 -5633 88811 183047 145885 79074 115879 119152 -4751
2852d751L9726N6719j92816M078R4977n2838l7782j4462n5383k9620J23751k9464
$$ -4751 34975 91694 -101122 -97044 -2067 -54905 -92687 -107149 -162532 -192152 -68401 -97865
2840i7865l0429R8901k9855k5878p2190M3997J7768k71R2508n5233j54004R8984
$$ -97865 -128294 -29393 -59248 -85126 -157316 -113319 -95551 -95822 -3314 -58547 -212551 -113567
2828a13567J13915j22918j16001Q7007L4956k926n469o5019M9852j6757k085m3600
$$ -113567 348 -122570 -238571 -151564 -116608 -119534 -125003 -190022 -140170 -156927 -159012 -202612
2816b02612M407m6801r900J7768j2835J8991k2445k1277L8807K6446o1502k1537
$$ -202612 -198205 -245006 -254906 -237138 -249973 -230982 -253427 -274704 -235897 -209451 -270953 -292490
2804b92490p0402N534J66446L2966j08630k8685Q7998j05521K3120J21613q0259
$$ -292490 -362892 -357358 -190912 -157946 -266576 -295261 -207263 -312784 -289664 -168051 -248310
2793b48310L3208p1707l795J54623r8457K1952J64822N3387j27265K6932p1063
$$ -248310 -215102 -286809 -290604 -135981 -234438 -212486 -47664 5723 -121542 -94610 -165673
2782a65673K7042o4640k4947P6271n5902j09438M0257J69054j01378q431J95776
$$ -165673 -138631 -203271 -228218 -151947 -207849 -317287 -277030 -107976 -209354 -217785 -22009
2771b2009K6145r4843L3824l8253j168N8576j4572k561k0113q7598N1739Q0893
$$ -22009 4136 -90707 -56883 -95136 -96304 -37728 -52300 -54861 -74974 -162572 -110833 -29940
2759b9940j0109o6634o088l9039k3948l7939J91119o6628j10391k6086P5820P824
$$ -29940 -40049 -106683 -112771 -151810 -175758 -213697 -22578 -89206 -199597 -225683 -149863 -142039
2747a42039r9760J07403J33331q7543p7320L4693O6613j96070o5944J43354J9637
$$ -142039 -241799 -134396 -1065 -88608 -165928 -131235 -64622 -260692 -326636 -183282 -163645
2736a63645j4138l0660L0665N1081j10741P0949J07737o1155p8487j38404j5458
$$ -163645 -177783 -208443 -177778 -126697 -237438 -166489 -58752 -119907 -198394 -336798 -352256
2725c52256Q4919o8687P8337J61683n4447p0607q7974J06531o6823L0828n931
$$ -352256 -267337 -336024 -257687 -96004 -150451 -221058 -309032 -202501 -269324 -238496 -244427
2714b44427L5726j06620K5963J10311n9468n9832O4690J61559M8000o8494j12027
$$ -244427 -208701 -315321 -289358 -179047 -238515 -298347 -233657 -72098 -24098 -92592 -204619
2703b04619R0639l8225O357O3248r015j10796k1199J40091J9814j32088M2352
$$ -204619 -113980 -152205 -145848 -82600 -91615 -202411 -223610 -83519 -63705 -195793 -153441
2692a53441M5597P0898l2952M0597R7428j49299m7387J76770J13525j38425p86
$$ -153441 -107844 -36946 -69898 -29301 68127 -81172 -128559 48211 161736 23311 22525
2681B2525P795O910O4582J11496J99549R3601J29481J26648J44754r8629k55972
$$ 22525 30320 37230 101812 213308 412857 506458 635939 762587 907341 808712 552740
2670E52740o1429q2801j86684k04018J1751j7585j05196m5066Q7870l0874j29590
$$ 552740 491311 408510 221826 17808 29559 11974 -93222 -138288 -50418 -81292 -210882
2659b10882K1311N3926L4067l277j8863L9102L000L6667K4434M5579k49560q8890
$$ -210882 -189571 -135645 -101578 -104855 -123718 -84616 -81616 -44949 -20515 25064 -224496 -313386
2647c13386J02269r574J8509J43703N8762N5087p1675j77863L5323l45J2343O4327
$$ -313386 -211117 -220691 -202182 -58479 283 55370 -16305 -194168 -158845 -159190 -146847 -82520
2635h2520M3138n1691P2129j09223k1506J27495j5651k1186n649J32693j3103
$$ -82520 -39382 -91073 -18944 -128167 -149673 -22178 -37829 -59015 -64664 68029 54926
2624E4926n1079L299N8175Q237r474j22804L7953L3634L332m4975k899J28234
$$ 54926 3847 7146 65321 73558 64084 -58720 -20767 12867 16199 -28776 -31675 96559
2612I6559q160l3900P3271j04343r5490q1650J9883R9438m0620K2684m3617p2756
$$ 96559 88399 54499 127770 23427 -72063 -153713 -133830 -34392 -75012 -52328 -95945 -168701
2600a68701r4719O0596J56641K7783j470J96867n0247j71649r7465J36903P4405
$$ -168701 -263420 -202824 -46183 -18400 -19870 176997 126750 -44899 -142364 -5461 68944
2589F8944m1644k1687p5506J7625n7660k7285j04978J26902J09262N2002l8425
$$ 68944 27300 5613 -69893 -52268 -109928 -137213 -242191 -115289 -6027 45975 7550
2578G550n7430L6655J19481J3207L5037O7350m7591j48752j81494k6217P8688
$$ 7550 -49880 -13225 106256 119463 154500 221850 174259 25507 -155987 -182204 -103516
2567a03516l2752q7940K09828K8730L4695j87139j469J02230k4129j6977O1312
$$ -103516 -136268 -224208 -14380 14350 49045 -138094 -139563 -37333 -61462 -78439 -17127
2556a7127O4524K8410o0127j1147J45312J889j02073M8504K8944R6226J3628N394
$$ -17127 47397 75807 15680 4533 149845 151734 49661 98165 127109 223335 236963 242357
2544B42357k6977k0322j11616m0644R2723J1331j4854Q8071K7237J9446m8479
$$ 242357 215380 195058 83442 42798 135521 146852 131998 220069 247306 266752 218273
2533B18273K3545J66228L6021j53915n3955Q5489j0201k7303Q9197j1177o3104
$$ 218273 241818 408046 444067 290152 236197 321686 311485 284182 373379 362202 299098
2522B99098o6166J6666J777J32000K2568Q4788j4906K078L9781n3849J17559K2066
$$ 299098 232932 249598 251375 383375 405943 490731 475825 477903 517684 463835 581394 603460
2510F03460J19580P5693k269o1708o3825P0546R502k5708M7081R1646n2389r6432
$$ 603460 723040 798733 796464 734756 670931 741477 750979 725271 772352 863998 811609 715177
2498G15177N1540q818l1043N6727P3938q3854l0641R7460K4241O856K6360j7471
$$ 715177 766717 757899 726856 783583 857521 773667 743026 840486 864727 871583 897943 880472
2486H80472R7534l5215O1652J06491O3152J51357N3327J30816J20446J07640J9891
$$ 880472 978006 942791 1004443 1110934 1174086 1325443 1378770 1509586 1630032 1737672 1757563
2475A757563K3972j4532L6822q3383l9207L499l7617L6397j4973J62387j15362
$$ 1757563 1781535 1767003 1803825 1720442 1681235 1684734 1647117 1683514 1668541 1830928 1715566
2464A715566l1111N5507o843N7447J21601K5391J15283j2719J82577J69524M5881
$$ 1715566 1684455 1739962 1733119 1790566 1912167 1937558 2052841 2040122 2222699 2392223 2438104
2453B438104J36871K46167K12388M8972K17375R3534n7046J781l103Q2610j69872
$$ 2438104 2574975 2821142 3033530 3082502 3299877 3393411 3336365 3338146 3335043 3417653 3247781
2442C247781N1291J61429J63010K21040K49539N7087K45543M70260M90612L94481
$$ 3247781 3299072 3460501 3623511 3844551 4094090 4151177 4396720 4866980 5357592 5752073
2432E752073O81905M91617M96196N83747O37607K80708N81864Q77340J269033
$$ 5752073 6433978 6925595 7421791 8005538 8643145 8923853 9505717 10383057 11652090
2423A1652090J087199J253880J040643J455591J348984J544416K020758K871560
$$ 11652090 12739289 13993169 15033812 16489403 17838387 19382803 21403561 24275121
2415B4275121L323399M590281N741687R457283J6294011K9315110L6418539L2383244
$$ 24275121 27598520 32188801 37930488 47387771 63681782 92996892 129415431 161798675
2407A61798675J3735508l914138p367112k3178568l2555232k7971929k0088259
$$ 161798675 175534183 171620045 164252933 141074365 108519133 80547204 60458945
2400F0458945j3718802r302932o946095m701651l456449k093280j273598p39897
$$ 60458945 46740143 37437211 30491116 25789465 22333016 20239736 18966138 18226241
2392A8226241r10282j084246j301834j620045j791678j690701j535693r06861
$$ 18226241 17315959 16231713 14929879 13309834 11518156 9827455 8291762 7384901
2384G384901p78738n00971l29640k87431k46759k48522k14955k70062j31940k13273
$$ 7384901 6606163 6105192 5775552 5488121 5241362 4992840 4777885 4507823 4375883 4162610
2374D162610j43861j61802k40174j65853k9687l90856k86529j54399j16951r7177
$$ 4162610 4018749 3856947 3616773 3450920 3421233 3030377 2743848 2589449 2472498 2375321
2364B375321k66264j83786k4407K9423j61792L0838K0986j63854L3344J02371
$$ 2375321 2109057 1925271 1900864 1930287 1768495 1799333 1820319 1656465 1689809 1792180
2354A792180L4014j37320M5372K4854j04482n0576O7118j04259j60830j71814
$$ 1792180 1826194 1688874 1734246 1759100 1654618 1604042 1671160 1566901 1406071 1234257
2344A234257r4210j24192j25276j63039j50197K8076J0583K2520N6060l276j8642
$$ 1234257 1140047 1015855 890579 727540 577343 605419 616002 638522 694582 691306 672664
2333F72664K0274N1158m997m6633r8299O6530K7936L801r507p3263k09995q248
$$ 672664 692938 744096 739099 692466 594167 660697 688633 692434 682927 609664 399669 391421
2321C91421J71600P8404j23510K481o1970m7667j8808j12383p1179M3350l0436
$$ 391421 563021 641425 517915 520396 458426 410759 391951 279568 208389 251739 221303
2310B21303j98786l3630K4882n8717J71909O4843Q6329p496j04230J1548N6253
$$ 221303 22517 -11113 13769 -44948 126961 191804 278133 270637 166407 177955 234208
2299B34208M3147Q7924j4950l6932k0478m043n2699J42851l9984m7266Q2941N5132
$$ 234208 277355 365279 350329 313397 292919 288876 236177 379028 339044 291778 374719 429851
2287D29851j02231p0005m056j6682j08632Q2372o902J36777n3877j80357j3042
$$ 429851 327620 257615 253559 236877 128245 210617 203715 340492 286615 106258 93216
2276I3216K6682n0922J9102j6054O1816o5366m373q945K0249l5429N4761K205
$$ 93216 119898 68976 88078 72024 133840 68474 64101 55156 75405 39976 94737 96942
2264I6942j75321l5758j3328M4857k246M3403J10707P1758k7970J45178N5393
$$ 96942 -78379 -114137 -127465 -82608 -84854 -41451 69256 141014 113044 258222 313615
2253C13615k6834J2946j3386j08602j80538r134J29045j23307j4368M3840Q398
$$ 313615 286781 299727 286341 177739 -2799 -11933 117112 -6195 -20563 23277 31675
2242C1675p2436N437M2574N6624p5354j47830J23931o231n9761J33868R4615M3877
$$ 31675 -40761 -35324 7250 63874 -11480 -159310 -35379 -41610 -101371 32497 127112 170989
2230A70989j28254R6381j17955j01759M4456L766J9051n0896j02680J17767n663
$$ 170989 42735 139116 21161 -80598 -36142 -32376 -13325 -64221 -166901 -49134 -54797
2219e4797j24052k9811N6063M977k8152n1166q633R8200R8234l5410J07979o6213
$$ -54797 -178849 -208660 -152597 -147620 -175772 -226938 -235571 -137371 -39137 -74547 33432 -32781
2207c2781J3274m2620K9162j7781p1944Q5490r961j06348q9103N6683J732o5484
$$ -32781 -19507 -62127 -32965 -50746 -122690 -37200 -47161 -153509 -242612 -185929 -184197 -249681
2195b49681J0949J07888j6874L2454P9472n30N6988k261J2411l1092o5750r8227
$$ -249681 -238732 -130844 -147718 -115264 -35792 -36322 20666 18405 30816 -276 -66026 -164253
2183a64253N0273P224n388m8820Q439J29809M4857p0364O1179M4748q2272L2616
$$ -164253 -113980 -106756 -112144 -160964 -152525 -22716 22141 -48223 12956 57704 -24568 8048
2171H048l0904n0895K8657j17923Q0906M1279K0511J19289o3584l265k0705m8894
$$ 8048 -22856 -73751 -45094 -163017 -82111 -40832 -20321 98968 35384 32119 11414 -37480
2159c7480n2474J5894k6072M399J26624J17663J420q5829l1946n6983J1085P7596
$$ -37480 -89954 -74060 -100132 -95733 30891 148554 149974 64145 32199 -24784 -13699 63897
2147F3897p2780j7042J25893L15j25149J61823R6315J71774Q0428J72558O3955
$$ 63897 -8883 -25925 99968 100283 -24866 136957 233272 405046 485474 658032 721987
2136G21987p9645m3980j53766r9623j02596j88425o1563K4760r473q2185J4130
$$ 721987 642342 598362 444596 344973 242377 53952 -7611 17149 7676 -74509 -60379
2125f0379k766r1950K884R0526O2452j53703j44389J34111n1401j08351M9007
$$ -60379 -63145 -155095 -152211 -61685 767 -152936 -297325 -163214 -214615 -322966 -273959
2114b73959J13473L1630m9804P9323n3028o3974R7501J22001J37061l7528j37406
$$ -273959 -160486 -128856 -178660 -99337 -152365 -216339 -118838 3163 140224 102696 -34710
2103c4710j55023J12424r2762k3579O7290j63840r372J14005J04123J53001j05923
$$ -34710 -189733 -77309 -170071 -193650 -126360 -290200 -299572 -185567 -81444 71557 -34366
2092c4366j32227K3624o3254M9388J4483n5679J44565K3264r1825M50k170l0896
$$ -34366 -166593 -142969 -206223 -156835 -142352 -198031 -53466 -30202 -122027 -121577 -123747 -154643
2080a54643J8272K8949O6743n5015q8878J1434M88M4313j1857l5087p0561O324
$$ -154643 -136371 -107422 -40679 -95694 -184572 -173138 -172650 -128337 -140194 -175281 -245842 -239518
2068b39518P4457K8665n0556J00395n0017o8693k8648K9247J8811Q4676K2541
$$ -239518 -165061 -136396 -186952 -86557 -136574 -205267 -233915 -204668 -185857 -101181 -78640
2057g8640k6902k9733p8941l0516m2516J07835q889k1996M5325J29261j10915
$$ -78640 -105542 -135275 -214216 -244732 -287248 -179413 -188302 -210298 -164973 -35712 -146627
2046a46627j47091J40326J12977n9226j02283J3452O1066j5533m7306O8237L2256
$$ -146627 -293718 -153392 -40415 -99641 -201924 -188472 -127406 -142939 -190245 -122008 -89752
2035h9752J2281n4503R340k1309m138n8859l704N0101k1663n4529J21497j6754
$$ -89752 -77471 -131974 -122634 -143943 -148081 -206940 -210644 -160543 -182206 -236735 -115238 -131992
2023a31992J3440P636q0789P5291M0579l7196J2690K7612o0100O578K5984l4691
$$ -131992 -118552 -110916 -191705 -116414 -75835 -113031 -100341 -72729 -132829 -126251 -100267 -134958
2011a34958J3228J0488L1784j6885j37530J18725K3755r3386Q3258J44797j3866
$$ -134958 -121730 -111242 -79458 -96343 -233873 -115148 -91393 -184779 -101521 43276 29410
2000B9410j59460L0694r5414l2807L9326O0018m1998l8913k4013J1621Q5288Q4411
$$ 29410 -130050 -99356 -194770 -227577 -188251 -128233 -170231 -209144 -233157 -221536 -136248 -51837
1988e1837K8737r7783J00631J8768n2952M8706M1018j05458j57185o9824J36227
$$ -51837 -23100 -120883 -20252 -1484 -54436 -5730 35288 -70170 -227355 -297179 -160952
1977a60952n2221Q8439L4679o4740Q470O3727j5761Q1220R7001j32483j05445
$$ -160952 -213173 -124734 -90055 -154795 -146325 -82598 -98359 -17139 79862 -52621 -158066
1966a58066J27554j234r9681l6336P3435J05785o1093m2146o3221K6352k6383
$$ -158066 -30512 -31746 -131427 -167763 -94328 11457 -49636 -91782 -155003 -128651 -155034
1955a55034M9137Q0847q4480l1838N0069m3030O2885n917l1468J5716j49243m9057
$$ -155034 -105897 -25050 -109530 -141368 -91299 -134329 -71444 -77361 -108829 -93113 -242356 -291413
1943b91413J52928N211M1676l3772J12411n1491l3226J60306l5880q3273j16708
$$ -291413 -138485 -133274 -91598 -125370 -12959 -64450 -97676 62630 26750 -56523 -173231
1932a73231j0145k0816p481J19603m1511P322l8920l428Q0915m8314j6178r3085
$$ -173231 -183376 -204192 -211673 -92070 -133581 -126259 -165179 -168607 -87692 -136006 -152184 -245269
1920b45269J05318O1149p7261K4732j2056l5124j09382O2385M3189o2964J06896
$$ -245269 -139951 -78802 -156063 -131331 -143387 -178511 -287893 -225508 -182319 -245283 -138387
$$ [...]
##END NTUPLES=NMR SPECTRUM
##END=
