##TITLE=1H_CA-9424-31
 200.13MHz,CDCl3.
 8 sc
 
 18.2.2026
##JCAMPDX= 6.0         $$ Bruker NMR JCAMP-DX V2.0
##DATA TYPE= NMR SPECTRUM
##DATA CLASS= NTUPLES
##ORIGIN= UXNMR, Bruker Analytische Messtechnik GmbH
##OWNER= pz
$$ XWIN-NMR		Version 3.5
$$ Wed Feb 18 15:59:13 2026 Russian Standard Time (UT+4h)  she@DPX200
##.OBSERVE FREQUENCY= 200.1313
##.OBSERVE NUCLEUS= ^1H
##.ACQUISITION MODE= SIMULTANEOUS
##.ACQUISITION SCHEME= undefined
##.AVERAGES= 8
##.DIGITISER RES= 18
##SPECTROMETER/DATA SYSTEM= spect
##.PULSE SEQUENCE= zg30
##.SOLVENT NAME= D2O
##.SHIFT REFERENCE= (INTERNAL, D2O, 0, 15.402)
##AUDIT TRAIL= $$ (NUMBER, WHEN, WHO, WHERE, WHAT)
$$ ##TITLE= Audit trail, XWIN-NMR		Version 3.5
$$ ##JCAMPDX= 5.01
$$ ##ORIGIN= Bruker BioSpin GmbH
$$ ##OWNER= she
$$ F:/spectra/data/she/nmr/H-C/1/pdata/1/auditp.txt
$$ ##AUDIT TRAIL=  $$ (NUMBER, WHEN, WHO, WHERE, WHAT)
(   1,<2026-02-18 15:57:37.98 +0400>,<she>,<DPX200>,
      <created by zg, POWCHK disabled, PULCHK disabled
       configuration hash MD5:
       00 E9 B6 7A A2 85 ED C7 34 08 36 98 17 FE 4E 26
       data hash MD5: 16K
       0C 17 5E 42 21 AE FD 88 C6 DD 09 C0 6B 94 32 B5>)
(   2,<2026-02-18 15:57:40.17 +0400>,<she>,<DPX200>,
      <Start of raw data processing
       efp BC_mod = 2 LB = 0.25 FT_mod = 6 PKNL = 1 PHC0 = -3701.343 PHC1 = 10.39232 SI = 16K 
       data hash MD5: 16K
       33 CA C2 56 89 92 D4 8B B2 BA 27 65 A4 31 C9 70>)
(   3,<2026-02-18 15:58:05.45 +0400>,<she>,<DPX200>,
      <pk PHC0 = 0.4047648 PHC1 = 2 
       data hash MD5: 16K
       B8 8A E9 9F A5 9D A8 91 FF 27 81 25 AC 34 A4 AF>)
(   4,<2026-02-18 15:58:09.57 +0400>,<she>,<DPX200>,
      <abs ABSG = 5 
       data hash MD5: 16K
       60 67 A0 57 AF E3 CD 91 71 63 A6 6F 4E 5E E5 BA>)
$$ ##END=
$$ 
$$ hash MD5
$$ D1 B9 FC B2 2C 63 23 3D 47 34 80 89 F3 4B DF BD
##$RELAX= 
##$RELAX= 
##$RELAX= 
##$RELAX= 
##$RELAX= 
##$RELAX= 
$$ Bruker specific parameters
$$ --------------------------
##$DU= <F:/spectra>
##$EXPNO= 1
##$NAME= <H-C>
##$PROCNO= 1
##$TYPE= <nmr>
##$USER= <she>
##$AMP= (0..31)
100 100 100 100 100 100 100 100 100 100 100 100 100 100 100 100 100 100 
100 100 100 100 100 100 100 100 100 100 100 100 100 100 
##$AQSEQ= 0
##$AQ_mod= 1
##$AUNM= <au_zg>
##$AUTOPOS= <>
##$BF1= 200.13
##$BF2= 200.13
##$BF3= 200.13
##$BF4= 200.13
##$BF5= 200.13
##$BF6= 200.13
##$BF7= 200.13
##$BF8= 200.13
##$BYTORDA= 1
##$CFDGTYP= 0
##$CFRGTYP= 5
##$CHEMSTR= <none>
##$CNST= (0..31)
1 1 145 1 1 1 1 1 1 1 1 1 1 1 1 1 1 1 1 1 1 1 1 1 1 1 1 1 1 1 1 1 
##$CPDPRG= <>
##$CPDPRG1= <>
##$CPDPRG2= <>
##$CPDPRG3= <>
##$CPDPRG4= <mlev>
##$CPDPRG5= <mlev>
##$CPDPRG6= <mlev>
##$CPDPRG7= <mlev>
##$CPDPRG8= <mlev>
##$CPDPRGB= <>
##$CPDPRGT= <>
##$D= (0..31)
0 0.7 0 0 0 0 0 0 0 0 0 0.03 0 0 0 0 0 0 0 0 0 0 0 0 0 0 0 0 0 0 0 0 
##$DATE= 1771415857
##$DBL= (0..7)
120 120 120 120 120 120 120 120 
##$DBP= (0..7)
150 150 150 150 150 150 150 150 
##$DBP07= 0
##$DBPNAM0= <>
##$DBPNAM1= <>
##$DBPNAM2= <>
##$DBPNAM3= <>
##$DBPNAM4= <>
##$DBPNAM5= <>
$$ [...]
##$SUBNAM3= <"">
##$SUBNAM4= <"">
##$SUBNAM5= <"">
##$SUBNAM6= <"">
##$SUBNAM7= <"">
##$SUBNAM8= <"">
##$SUBNAM9= <"">
##$SW= 18.0517328524113
##$SWIBOX= (0..15)
0 0 2 0 0 0 0 0 0 0 0 0 0 0 0 0 
##$SW_h= 3612.71676300578
##$TD= 16384
##$TD0= 1
##$TE= 0
##$TE2= 300
##$TE3= 300
##$TEG= 300
##$TL= (0..7)
0 120 120 120 120 120 120 120 
##$TP= (0..7)
150 150 150 150 150 150 150 150 
##$TP07= 0
##$TPNAME0= <>
##$TPNAME1= <>
##$TPNAME2= <>
##$TPNAME3= <>
##$TPNAME4= <>
##$TPNAME5= <>
##$TPNAME6= <>
##$TPNAME7= <>
##$TPOAL= (0..7)
0.5 0.5 0.5 0.5 0.5 0.5 0.5 0.5 
##$TPOFFS= (0..7)
0 0 0 0 0 0 0 0 
##$TUNHIN= 0
##$TUNHOUT= 0
##$TUNXOUT= 0
##$USERA1= <user>
##$USERA2= <user>
##$USERA3= <user>
##$USERA4= <user>
##$USERA5= <user>
##$V9= 5
##$VALIST= <valist>
##$VCLIST= <CCCCCCCCCCCCCCC>
##$VD= 0
##$VDLIST= <DDDDDDDDDDDDDDD>
##$VPLIST= <PPPPPPPPPPPPPPP>
##$VTLIST= <TTTTTTTTTTTTTTT>
##$WBST= 1024
##$WBSW= 4
##$XGAIN= (0..3)
0 0 0 0 
##$XL= 0
##$YL= 0
##$YMAX_a= 780153
##$YMIN_a= -1024271
##$ZGOPTNS= <>
##$ZL1= 120
##$ZL2= 120
##$ZL3= 120
##$ZL4= 120
##$ABSF1= 15.39652
##$ABSF2= -2.655328
##$ABSG= 5
##$ABSL= 3
##$ALPHA= 0
##$AQORDER= 0
##$ASSFAC= 0
##$ASSFACI= 0
##$ASSFACX= 0
##$ASSWID= 0
##$AUNMP= <proc_1d>
##$AZFE= 0.1
##$AZFW= 0.1
##$BCFW= 0
##$BC_mod= 2
##$BYTORDP= 0
##$COROFFS= 0
##$CY= -3
##$DATMOD= 1
##$DC= 0
##$DFILT= <>
##$DTYPP= 0
##$F1P= 0
##$F2P= 0
##$FCOR= 1
##$FTSIZE= 16384
##$FT_mod= 6
##$GAMMA= 0
##$GB= 0
##$INTBC= 1
##$INTSCL= 3.241238e-09
##$ISEN= 128
##$LB= 0.25
##$LEV0= 0
##$LPBIN= 0
##$MAXI= 10000
##$MC2= 0
##$MEAN= 0
##$ME_mod= 0
##$MI= 1.114404
##$NCOEF= 0
##$NC_proc= -6
##$NLEV= 6
##$NOISF1= 3.799351
##$NOISF2= 2.8
##$NSP= 0
##$NTH_PI= 0
##$NZP= 0
##$OFFSET= 15.40203
##$PC= 1
##$PHC0= -3700.938
##$PHC1= 12.39232
##$PH_mod= 1
##$PKNL= yes
##$PPARMOD= 0
##$PSCAL= 0
##$PSIGN= 0
##$REVERSE= no
##$SF= 200.130023951069
##$SI= 16384
##$SIGF1= 3
##$SIGF2= 2
##$SINO= 0.751879
##$SIOLD= 32768
##$SREGLST= <19F.Aceton>
##$SSB= 0
##$STSI= 16384
##$STSR= 0
##$SW_p= 3612.71676300578
##$SYMM= 0
##$S_DEV= 0
##$TDeff= 16384
##$TDoff= 0
##$TI= <>
##$TILT= no
##$TM1= 0
##$TM2= 0
##$TOPLEV= 0
##$USERP1= <user>
##$USERP2= <user>
##$USERP3= <user>
##$USERP4= <user>
##$USERP5= <user>
##$WDW= 1
##$XDIM= 16384
##$YMAX_p= 521165813
##$YMIN_p= -1145553
$$ End of Bruker specific parameters
$$ ---------------------------------
##NTUPLES= NMR SPECTRUM
##VAR_NAME=  FREQUENCY,     SPECTRUM/REAL,   SPECTRUM/IMAG
##SYMBOL=    X,             R,               I
##VAR_TYPE=  INDEPENDENT,   DEPENDENT,       DEPENDENT
##VAR_FORM=  AFFN,          ASDF,            ASDF
##VAR_DIM=   16384,         16384,           16384
##UNITS=     HZ,            ARBITRARY UNITS, ARBITRARY UNITS
##FACTOR=    0.220516191357247, 1,           1
##FIRST=     3082.40863102391, 0,            0
##LAST=      -530.308131981867, 0,           0
##MIN=       -530.308131981867, -1145553,    0
##MAX=       3082.40863102391, 521165813,    0
$$ Real data points
##PAGE= N=1
##DATA TABLE= (X++(R..R)), XYDATA
$$ [...]
7707c27971k71396j24607J24831J46311m3924j11568P9408J34643M4564k12054
7697e61763N3166O0652P0006j375r8241r4033j39613j0075M2589m3993k1183J42558
7685f01305n9554J2521q2662Q5903k0594m384o8603j2861R52l1950j4341L7482
7673g59396J30687l0544J20587N8718p7317N9536O0950j15558P3745m3012k2010
7662e43614j07797n5887r6505L7217J51635L0586m9374K2120j5809m8009n1069
7651g26506L494j306l900P3328m0370r423r7564J11360J00159j9195K6317J0055
7639e73551p6906M6267K1358q888n4154k9313N1477L596j5908K545O0989L5376
7627e37112j9206O5359j8727p9821j23950q9774J09534r709O7811n4046o38o0654
$$ plain form
7707 -327971 -599367 -723974 -599143 -452832 -496756 -608324 -528916 -394273 -349709 -561763
7697 -561763 -508597 -447945 -377939 -379314 -477555 -571588 -711201 -721276 -678687 -722680 -743863 -601305
7685 -601305 -660859 -648338 -731000 -645097 -665691 -670075 -738678 -751539 -750587 -782537 -796878 -759396
7673 -759396 -628709 -659253 -538666 -479948 -557265 -497729 -436779 -552337 -478592 -521604 -543614
7662 -543614 -651411 -707298 -803803 -766586 -614951 -584365 -633739 -611619 -627428 -675437 -726506
7651 -726506 -723012 -724318 -728218 -654890 -695260 -704683 -802247 -690887 -590728 -609923 -583606 -573551
7639 -573551 -650457 -604190 -582832 -591720 -645874 -675187 -623710 -620114 -636022 -633477 -572488 -537112
7627 -537112 -556318 -490959 -509686 -589507 -713457 -803231 -693697 -703406 -635595 -689641 -690279 -750933
7615g50933m3614Q9928O9091j65323J9691R8214K4612J77521p8120j60101o0699
7604g79733K36186m1883L5064l1693r4384J54439K096j09448L4158j1552p7141
7593f83891l0868M8709L747p757j12025Q430J04249O4262k7275n8940L2955J2734
7581f45670r4491J4164j335P6336n089J6562n2576l96K3565K0374n6080j183K4375
7568f81444p5031Q5808j4311m4236j0361O6348K3027l0695L2287J15532M0991
7557d92085k3473j21505k1222Q1421o0041M156p551k6467l6194N2302K5096j04199
7545g29762o1970m3827K35943n6712o3418l9392n465l3385j23896M8703J17355
7534g55826L4489J07693p8334q1707p7570N6903R4903K3929O3820o9155p764j07843
$$ plain form
7615 -750933 -794547 -704619 -635528 -800851 -781160 -682946 -658334 -480813 -558933 -719034 -779733
7604 -779733 -543547 -585430 -550366 -582059 -676443 -522004 -519908 -629356 -595198 -606750 -683891
7593 -683891 -714759 -666050 -662303 -670060 -782085 -773655 -669406 -605144 -632419 -691359 -658404 -645670
7581 -645670 -740161 -725997 -727332 -650996 -656085 -639523 -692099 -692495 -668930 -648556 -704636 -705819 -681444
7568 -681444 -756475 -670667 -684978 -729214 -739575 -673227 -650200 -680895 -648608 -533076 -492085
7557 -492085 -515558 -637063 -658285 -576864 -636905 -632749 -640300 -666767 -702961 -650659 -625563 -729762
7545 -729762 -791732 -835559 -599616 -656328 -719746 -759138 -764603 -797988 -921884 -873181 -755826
7534 -755826 -721337 -613644 -691978 -773685 -851255 -794352 -699449 -675520 -611700 -680855 -688619 -796462
7522g96462P2658J8690J27087N0570k19603q7944J31414R1367P1630L6459r7774
7511f01908j94242j17536K47446Q9152k9708k470M5896l2945m4887P8363M4192
7500e18647j53248L6313j0837q0805J999R3150k5432Q5221p9187j01270R315J59322
7488e84106n5575o1428p5859J50908l707n2665J01096l7166m8692n1272J41799
7477e76667n6476k6643M9867j9903k5211K9929J72036q3930j10428R5239p8493
7466f30680k3086K4020L2993N7705j18174j5604J50029m8886q0490n4187L1623
7455f74737o4906J4676N1934N9389L9892m8794q8851m8035J63894Q600p7693J9502
7443f45129J5728L9929k42658O3430O2666n0133P6161J70378q8588N4120p4504
$$ plain form
7522 -796462 -723804 -705114 -578027 -527457 -747060 -835004 -703590 -612223 -540593 -504134 -601908
7511 -601908 -796150 -913686 -666240 -577088 -606796 -609266 -563370 -596315 -641202 -562839 -518647
7500 -518647 -671895 -635582 -646419 -727224 -725225 -632075 -657507 -572286 -651473 -752743 -743428 -584106
7488 -584106 -639681 -701109 -776968 -626060 -629767 -682432 -581336 -618502 -667194 -718466 -576667
7477 -576667 -633143 -659786 -609919 -629822 -655033 -625104 -453068 -536998 -647426 -552187 -630680
7466 -630680 -653766 -629746 -596753 -539048 -657222 -672826 -522797 -571683 -652173 -706360 -674737
7455 -674737 -739643 -724967 -673033 -613644 -573752 -622546 -711397 -759432 -595538 -586938 -664631 -645129
7443 -645129 -629401 -589472 -832130 -768700 -706034 -756167 -680006 -509628 -598216 -544096 -618600
7432f18600m6203N8261m2495j43700M3939k5419j556j1012J6008r318O0027J6884
7420g03184l1324K2430P3959M0814o6362k9470J34593m8460q385J11165p0250
7409e74474m3505j49669k8043M2095J73428L8315j30772K6453j61444r449O2100
7398g54965j07949J31701J00416m7447o7590P1134m2226J5424m4972l0776q3593
7387h60843j5314R3377p8662N3061p0340J6487J68614m8855k8049j1892j6644
7376g99060N8937m3806n2684J3054j5759N8254n06J01742j6734j24451r590J30964
7364f99639n6788p1664Q8214J6975m6051n1001l5212J29843n195M9271k0786q8566
7352g90599J8347l3800q1430J00373Q7682M5671o1229l5125K0316L0508J8275
$$ plain form
7432 -618600 -664803 -606542 -649037 -792737 -748798 -774217 -775773 -786785 -770777 -780095 -720068 -703184
7420 -703184 -734508 -712078 -638119 -597305 -663667 -693137 -558544 -607004 -615389 -504224 -574474
7409 -574474 -617979 -767648 -795691 -753596 -580168 -541853 -672625 -646172 -807616 -817065 -754965
7398 -754965 -862914 -731213 -630797 -678244 -745834 -674700 -716926 -701502 -746474 -777250 -860843
7387 -860843 -876157 -782780 -861442 -808381 -878721 -862234 -693620 -742475 -770524 -782416 -799060
7376 -799060 -740123 -783929 -836613 -823559 -839318 -781064 -781570 -679828 -696562 -821013 -830603 -699639
7364 -699639 -756427 -828091 -739877 -722902 -768953 -819954 -855166 -725323 -730518 -681247 -702033 -790599
7352 -790599 -772252 -806052 -887482 -787109 -699427 -653756 -714985 -750110 -729794 -699286 -681011
7341f81011j22574l307K032K7540J09094n0023N0917K906M1680o1554n5425r7100
7329h36825J27522M696L3677L8065j1473m5134p3423k2348l733K5838M3913K2661
7317f96564j01436k463l3871L4046j25933J03437k6205R7620k9602N2234R5505
7306f33232k6294o9732l1945o4539K5999P8450J1323k6690m2560l001K2790j11072
7294h70503R6575J22022J8262p9151j55208M2005O2379j4812J0532J5780o0156
7283h12275q875O9826k2809R7389P293Q20J1368k3674l2399o0850L2307O3997
7271f77882j6958l4775q4904J14334K2486j20316J17872q5841k8854j2281O9868
7260g37251O5891j00012j00653J29401n2765m6420p1420Q0218N9260N981q716
$$ plain form
7341 -681011 -803585 -806892 -804860 -777320 -668226 -718249 -667332 -664426 -622746 -684300 -739725 -836825
7329 -836825 -709303 -704607 -670930 -632865 -644338 -689472 -762895 -785243 -788976 -763138 -719225 -696564
7317 -696564 -798000 -800463 -834334 -800288 -926221 -822784 -848989 -751369 -780971 -728737 -633232
7306 -633232 -659526 -729258 -761203 -825742 -799743 -721293 -709970 -736660 -779220 -782221 -759431 -870503
7294 -870503 -773928 -651906 -633644 -712795 -868003 -825998 -763619 -778431 -767899 -752119 -812275
7283 -812275 -821150 -751324 -774133 -676744 -669451 -668631 -657263 -680937 -713336 -774186 -741879 -677882
7271 -677882 -694840 -729615 -814519 -700185 -677699 -798015 -680143 -765984 -794838 -807119 -737251
7260 -737251 -671360 -771372 -872025 -742624 -795389 -841809 -913229 -833011 -773751 -767770 -776486
7249g76486J18869p7798r0362L7536N9303Q6967p3076m9800P7149l4061n6684
7238g78443M8172j01808J5121J5741q2242m2087Q3603J55907j29P2377k6885k5666
7226f66339P0309j00101j70596k5203R8044j2016J1951k1701n2453J44887O3555
7215f59663r6978Q8665j6597K3781q0913n7616L7447j43826j0382P4545j8853
7204h60390Q0768L4536O1865j06568p5974P4741k8588j26498K4487J37246P2127
7193g12248k8226k2148r2839j3842K34164j4968j65387J7833O3951J61155K1408
7182e51147n7219o7801o34K9625m9048P2285o1151l4889O8478Q8290r0008j3776
7170f66995N0714Q1531M1626j33505j04677n5615M7965J9823L9874q8694n2229
$$ plain form
7249 -776486 -657617 -735415 -825777 -788241 -728938 -641971 -715047 -764847 -687698 -721759 -778443
7238 -778443 -730271 -832079 -816958 -801217 -883459 -925546 -841943 -686036 -686165 -613788 -640673 -666339
7226 -666339 -596030 -696131 -866727 -891930 -793886 -805902 -793951 -815652 -868105 -723218 -659663
7215 -659663 -756641 -667976 -684573 -660792 -741705 -799321 -761874 -905700 -916082 -841537 -860390
7204 -860390 -779622 -745086 -683221 -789789 -865763 -791022 -819610 -946108 -921621 -784375 -712248
7193 -712248 -740474 -762622 -855461 -869303 -635139 -650107 -815494 -797661 -733710 -572555 -551147
7182 -551147 -608366 -676167 -676801 -647176 -696224 -623939 -685090 -719979 -651501 -563211 -653219 -666995
7170 -666995 -616281 -534750 -493124 -626629 -731306 -786921 -738956 -719133 -679259 -767953 -820182
7159h20182J49056O1296J14265M1745M2593P1859Q3741J29513l6808r9453p8486
7148c40861K3322q0913n2956j56523r5993L3707o1714o4971P4984L0408J7217
7137f74293N0212K8679j72709r5894P2460Q8936k9115O4811J7222j31316J2252
7126g68755J5251l9008m9363m4441j55311J20278J57487J0381p1394M6582q8894
7115h67187O0717k089o6475N215J5431N7184j5605m5253P6824q9827j11072Q6204
7103h95933P7251J35040j6228K290M495L0416j01863K1047N5317l1871K063o8136
7091g86112k21498p696K37569n7525J5139j3320k6457Q3859L6342j0685k8886
7080g79270J29163K9586j73143K1182O5444l8725k8941M5052j43477O8304Q8226
$$ plain form
7159 -820182 -671126 -609830 -495565 -453820 -411227 -339368 -255627 -126114 -162922 -262375 -340861
7148 -340861 -317539 -398452 -451408 -607931 -703924 -670217 -731931 -796902 -721918 -691510 -674293
7137 -674293 -624081 -595402 -768111 -864005 -791545 -702609 -731724 -666913 -649691 -781007 -768755
7126 -768755 -753504 -792512 -841875 -886316 -1041627 -921349 -763862 -753481 -824875 -778293 -867187
7115 -867187 -806470 -808559 -875034 -869819 -854388 -797204 -812809 -858062 -781238 -871065 -982137 -895933
7103 -895933 -818682 -683642 -699870 -697580 -693085 -662669 -764532 -743485 -688168 -720039 -717976 -786112
7091 -786112 -1007610 -1015306 -777737 -835262 -820123 -833443 -859900 -776041 -739699 -750384 -779270
7080 -779270 -650107 -620521 -793664 -772482 -707038 -745763 -774704 -729652 -873129 -804825 -716599
7069g16599j50919q078r2090j4128L7431J43182J10468q1567q792n39k2728o0809
7057h65168j5785O2390m9498k6071O1092o1376L7576R8722k6117j22122j1067
7046i17424J33290p1834P2222r9869K3486J8719r1988O0328l7290M969j1661N2844
7034h64208M4635o4510N762j3867j7144K6557o9940m9141O7244R8915M6046p7864
7022h67515M3532J00892j5368o1847O5673M7788j57884P2363j18641J25581p0868
7011h36294O4495N5432k8804j23255K1918K2623L4461J29805n5000o8187j37801
7000i20607J51905m5944r9901Q298m9422l539l4361L1560K4287N6221J660m7458
6988i27301K23871j01414j17553Q3647j7056o709n2417J4943R0196q9754J9887
$$ plain form
7069 -716599 -867518 -875596 -967686 -981814 -944383 -801201 -690733 -772300 -781092 -781631 -804359 -865168
7057 -865168 -880953 -818563 -868061 -894132 -833040 -894416 -856840 -758118 -784235 -906357 -917424
7046 -917424 -784134 -855968 -783746 -883615 -860129 -841410 -933398 -873070 -910360 -905391 -917052 -864208
7034 -864208 -819573 -884083 -878321 -892188 -909332 -882775 -952715 -1001856 -934612 -835697 -789651 -867515
7022 -867515 -823983 -723091 -738459 -800306 -734633 -686845 -844729 -772366 -891007 -765426 -836294
7011 -836294 -771799 -716367 -745171 -868426 -846508 -823885 -789424 -659619 -714619 -782806 -920607
7000 -920607 -768702 -814646 -914547 -906249 -955671 -959210 -993571 -962011 -937724 -881503 -879843 -927301
6988 -927301 -703430 -804844 -922397 -838750 -855806 -862515 -914932 -899989 -809793 -899547 -879660
6977h79660n6363J50949J02839k08502j648K1114p6684K1277r2681J45504N3604
6966h20251k1790N4128j68434J0975J51588P6390m7400r6971q2368o1072J01139
6955i04066l3008M816j09337M4950Q9869l6564p1613O0098j5995m9773J02939
6944i17684J25961N3092m3884q8953K0691O3097K4518k3412j09224J6676P602
6933h71520J56534r437k30775N7810M6274q2379r6608j1719J47184J7569N5922
6922h21145J4197L279o3313l6861J8070k7458o7628M9895J74129M6875m2010j48843
6910i00813k0539J0890O98L4305j32842N5278j2053P11R0443m1750l9993M4668
6898i10997N157K5975L3226L1844l3516j01569j166j46255J21415N8437P9907
$$ plain form
6977 -879660 -936023 -785074 -682235 -890737 -892385 -871271 -947955 -926678 -1019359 -873855 -820251
6966 -820251 -842041 -787913 -956347 -945372 -793784 -717394 -764794 -861765 -944133 -1005205 -904066
6955 -904066 -937074 -932258 -1041595 -996645 -906776 -943340 -1014953 -954855 -970850 -1020623 -917684
6944 -917684 -791723 -738631 -782515 -871468 -850777 -787680 -763162 -786574 -895798 -879122 -871520
6933 -871520 -714986 -724423 -955198 -897388 -851114 -933493 -1030101 -1041820 -894636 -877067 -821145
6922 -821145 -806948 -803669 -866982 -903843 -885773 -913231 -980859 -930964 -756835 -709960 -751970 -900813
6910 -900813 -921352 -910462 -909764 -875459 -1008301 -953023 -965076 -964365 -873922 -915672 -955665 -910997
6898 -910997 -905840 -879865 -846639 -814795 -848311 -949880 -951046 -1097301 -975886 -917449 -837542
6887h37542j1241o4741p3378L2642J41567j03010l0215L8842K6209q4810R3479
6876h72198M119n4428j50698P6518J09256M7575Q063R1325r7954J5423j05828
6865i28827k4977k5708J6619O667o2459O713L8284m4798m4602q2465M0890P6338
6853a028325Q1282J32249j02314J8223n7063L5404P0945j8855k2811J8809J7901
6842h54555J6395j9847n9266R19L8644K5773K8947k394l4604N3048N6019r0845
6830h41766P018j30420J10237j9250r5312R7339J09195l0735L4063q0293j48846
6819i88770P4565M0874j46464L7809M8515J4455n7041r0040N1690P657M5012P5540
6807h86198O2909j6354m7206j25768O9174J1800J9638M8446k8155R2490r4759
$$ plain form
6887 -837542 -848783 -913524 -986902 -954260 -812693 -915703 -945918 -907076 -880867 -965677 -872198
6876 -872198 -868079 -922507 -1073205 -996687 -887431 -839856 -831793 -740468 -838422 -822999 -928827
6865 -928827 -953804 -979512 -962893 -956226 -1018685 -1011972 -973688 -1018486 -1063088 -1145553 -1104663 -1028325
6853 -1028325 -947043 -814794 -917108 -898885 -955948 -920544 -849599 -868454 -891265 -872456 -854555
6842 -854555 -838160 -858007 -917273 -916354 -877710 -851937 -822990 -825384 -859988 -806940 -750921 -841766
6830 -841766 -834748 -965168 -854931 -874181 -969493 -872154 -762959 -793694 -759631 -839924 -988770
6819 -988770 -914205 -873331 -1019795 -981986 -933471 -919016 -976057 -1066097 -1014407 -1006750 -961738 -886198
6807 -886198 -823289 -839643 -886849 -1012617 -943443 -931643 -912005 -863559 -891714 -799224 -893983
6796h93983J4100k4320M5825k7470M1659L5384j63227l8754R8332j5357L4010
6785h93801l7082l4654J23668o9759k1880J04391k1423m7870j05856n9176P6191
6774i87251J27912L3577m0891q1525r4287q801J07128L9441o016J47386q4403
6763h47730P0228N2083l566q4640o4486j79100J3971J49719L0481R896L5416k373
6751h20101R4223m6422j79080j9948Q9412J20022j01163L2592J06404k8399j07520
6740h59980O4781J7074L1622l1779J3986J8957m5463q996k7272J5834r0608M3293
6728h58551J25749J6045j7932m7510p2786j2811K4604p1347R778J03095r3015
6717h94681l8428p1443R9738J58438K0212j60775m1300O9474O4079l139Q7396
$$ plain form
6796 -893983 -879883 -904203 -858378 -885848 -844189 -808805 -972032 -1010786 -912454 -927811 -893801
6785 -893801 -930883 -965537 -841869 -911628 -933508 -829117 -850540 -898410 -1004266 -1063442 -987251
6774 -987251 -859339 -825762 -866653 -948178 -1042465 -1051266 -944138 -904697 -910713 -763327 -847730
6763 -847730 -777502 -725419 -728985 -813625 -878111 -1057211 -1043240 -893521 -863040 -853144 -817728 -820101
6751 -820101 -725878 -772300 -951380 -971328 -881916 -761894 -863057 -830465 -724061 -752460 -859980
6740 -859980 -795199 -778125 -746503 -778282 -764296 -745339 -790802 -799798 -827070 -811236 -901844 -858551
6728 -858551 -732802 -716757 -734689 -782199 -854985 -867796 -843192 -914539 -904761 -801666 -894681
6717 -894681 -933109 -1004552 -904814 -746376 -726164 -886939 -928239 -858765 -794686 -797825 -710429
6706g10429m1974l1333l3375K3147R0173k9014j58370K6534J26575L1707j13932
6695h20291o9780j0909J43404J51162q0784j920p1541P7608j9530j22787M1013
6684g84355M6943K6191m8905m4980J09820m3891J32288k6606m526P5790p0536
6673f32767O9872j23993k1612N2863o0921k4980l1834K4628l3407J91297j15872
6662g06726j4614N2536K1918j08335o3398R2200J40016q7633j4445p7557j22220
6651h88258M5518P7195J15109N3368o7963r3846P9071k7387m2199K6837R8037
6640f24518k5558j7717J23216m0683J7584M5577j03n5997m5066P6311k4933M0419
6628e31468q6076j13578l7480R7651P0670J36654J07448r172r4430p725J69147
$$ plain form
6706 -710429 -752403 -783736 -817111 -793964 -703791 -732805 -891175 -864641 -738066 -706359 -820291
6695 -820291 -890071 -900980 -757576 -606414 -687198 -689118 -760659 -683051 -702581 -825368 -784355
6684 -784355 -737412 -711221 -760126 -805106 -695286 -739177 -606889 -633495 -638021 -562231 -632767
6673 -632767 -562895 -686888 -708500 -655637 -716558 -741538 -773372 -748744 -782151 -590854 -706726
6662 -706726 -721340 -668804 -646886 -755221 -818619 -726419 -586403 -674036 -688481 -766038 -888258
6651 -888258 -842740 -765545 -650436 -597068 -665031 -758877 -679806 -707193 -749392 -722555 -624518
6640 -624518 -650076 -667793 -544577 -585260 -567676 -522099 -522202 -578199 -623265 -546954 -571887 -531468
6628 -531468 -617544 -731122 -768602 -670951 -600281 -463627 -356179 -365351 -459781 -467506 -298359
6617b98359Q6459J2493L5930q2983j22971J2559O5902k9477P8586L1692k8317
6606b38486J05949q4538K8788P8655K5739k28970m4344l7152K5226n3540p8329
6595e01002r8849O7068J05771j21732M6777k855O6669J070N5492K7570o5086j16234
6583e35341K8492K1128L4389M9793l2661j24058N6555j064N7106J4480l0211K3069
6571d38323J80738R9316r0224k4212K834o7209n7087O502m2781K8913J32183n1001
6559c20351K0375N3734M8800r7935j6557O4408J70698L292N105J32331J3197J41184
6547B18281R5299L1670m0902m0850Q1437R76m3025l775M285o1883n9767k4450
6535A57296N1398J00817l4240q5363R973n6325n8574M8307q1471p5573m5473n1645
$$ plain form
6617 -298359 -211900 -199407 -163477 -246460 -369431 -356872 -290970 -320447 -241861 -210169 -238486
6606 -238486 -132537 -217075 -188287 -109632 -83893 -312863 -357207 -394359 -369133 -422673 -501002
6595 -501002 -599851 -532783 -427012 -548744 -501967 -504822 -438153 -437083 -381591 -354021 -419107 -535341
6583 -535341 -506849 -485721 -451332 -401539 -434200 -558258 -501703 -502767 -445661 -431181 -461392 -438323
6571 -438323 -257585 -158269 -248493 -272705 -269871 -337080 -394167 -387665 -430446 -401533 -269350 -320351
6559 -320351 -299976 -246242 -197442 -295377 -311934 -247526 -76828 -73536 -68431 63900 77097 218281
6547 218281 313580 345250 304348 263498 344935 345911 302886 299111 303396 241513 181746 157296
6535 157296 208694 309511 275271 189908 199881 143556 84982 133289 51818 -23755 -69228 -120873
6523a20873q2401o2064m7930j1603L2169J23887M1171l5860K5148M384M9245M1318
6511d3409k8670L5995n1780L6454J0415N6963l330M874p1835j35233j02346J479
6499b90423J89647j3504O3004Q8346p2858J1266n0388p1556M2833n6149R8345
6488f1437N5285n8258M823Q9267N3216j13895l8757L3677R571J5703Q3688j44105
6476g1222K358Q6943J7145P2372l9372o4429P715O0395K0522L1517N6383j88661
6464h334Q0082R6359o3081L5471J21853p8377n3058J20611j6727k3249Q9798O8471
6452C69819m371j0592J40478P438j72321p4461O6851J52884J00013L3118p3811
6441E35045j14959Q4468J35046J11650j31455j20778J53556L208k6952J27236
$$ plain form
6523 -120873 -203274 -265338 -313268 -324871 -292702 -168815 -127644 -163504 -138356 -133972 -84727 -43409
6511 -43409 -72079 -36084 -87864 -51410 -40995 15968 12638 17512 -54323 -189556 -291902 -290423
6499 -290423 -100776 -114280 -51276 37070 -35788 -24522 -74910 -146466 -103633 -159782 -61437
6488 -61437 -6152 -64410 -59587 29680 82896 -30999 -69756 -36079 -26508 -10805 72883 -71222
6476 -71222 -68864 18079 35224 107596 68224 3795 11510 71905 92427 123944 180327 -8334
6464 -8334 71748 168107 105026 140497 262350 183973 130915 251526 234799 211550 301348 369819
6452 369819 365448 354856 495334 502772 330451 255990 322841 475725 575738 608856 535045
6441 535045 420086 504554 639600 751250 619795 499017 652573 655781 628829 756065
6431G56065m9846j2552L0076l1445K9569N1616L7775m5074Q4318P3966N0861l5575
6419I39754k2500Q120J1545O568p1158k1450J08496J22803J12867O1049k7089
6408A229005O7895p6189k1327K7043J728N1744O7525O7995O1398N8848Q5079N3763
6396A674507N0771J50738Q875J0395J20435J80671R1915J27210N0550J33114J90540
6385B789721J30195N993J07225L2516N0063J02494L4265j17962Q1618N0109j825
6374C264412K26191J5877J6029K8408J07680J68487R1837J77543J17733m841J67050
6363D376406J44902J32275J24711J29726J79100Q8970M3399m6226J21916N3023
6353E348202K7468J49604K43035J78974J80911J80389K39003J35891J92021J36705
$$ plain form
6431 756065 706219 693667 723743 692298 721867 773483 811258 766184 850502 924468 975329 939754
6419 939754 917254 925374 936919 943487 872329 850879 959375 1082178 1195045 1256094 1229005
6408 1229005 1296900 1220711 1199384 1226427 1228155 1279899 1347424 1415419 1476817 1535665 1620744 1674507
6396 1674507 1725278 1876016 1884891 1895286 2015721 2196392 2288307 2415517 2466067 2599181 2789721
6385 2789721 2919916 2925909 3033134 3065650 3115713 3218207 3252472 3134510 3216128 3266237 3264412
6374 3264412 3490603 3506480 3522509 3550917 3658597 3827084 3918921 4096464 4214197 4209356 4376406
6363 4376406 4521308 4653583 4778294 4908020 5087120 5176090 5219489 5173263 5295179 5348202
6353 5348202 5375670 5525274 5768309 5947283 6128194 6308583 6547586 6683477 6875498 7012203
6343G012203K85902K65328K73341L16312J28778L47931M57030N72520N06945M67486
6333A0633776N12526N43277M36542M94839O10577P74248J038140Q64848J054218
6324A6962991J247690J426171J765612K170289K363885K620045K955738L521463
6316C5033884M531683N411027O583288P756937Q869902Q817976P313210L755957
6308H8073864m38274m104718o431644o668740n453587l472095j191172R02644
6300F1216278K947142M842429O254009O903490N741041K736651j835747o116765
6292H2688528r105063r963079r169684p621354n997035m638280l569416k738134
6284B9886483k078054j828726j445988j039758q56639o87185n20281m52974l66946
$$ plain form
6343 7012203 7298105 7563433 7836774 8153086 8281864 8629795 9086825 9659345 10166290 10633776
6333 10633776 11146302 11689579 12126121 12620960 13231537 14005785 15043925 15908773 16962991
6324 16962991 18210681 19636852 21402464 23572753 25936638 28556683 31512421 35033884
6316 35033884 39565567 44976594 51559882 59316819 68186721 77004697 84317907 88073864
6308 88073864 87635590 83530872 77099228 70430488 64976901 61504806 60313634 61216278
6300 61216278 64163420 69005849 75259858 82163348 87904389 90641040 88805293 82688528
6292 82688528 73583465 63620386 54450702 46829348 40832313 36194033 32624617 29886483
6284 29886483 27808429 25979703 24533715 23493957 22637318 21950133 21429852 20976878 20609932
6275B0609932j74873k25093j11782j48348M7710K22319K64631L27896K45359M90589
6265B1548340O21522O28731O58891Q35813P83925P87937Q20284J038248J184912
6256B8908603J214254J300850J942302K137370K392082K636904L240198L861783
6248D7634346M405968N100167O218969P459630R109531J1029951J3499055J5690627
6240A20148244J6297014J4366305R162709J728345n838940j0636860j2315568
6233A32911249j0780745p484147l683005j2112L426542O979368R840552J1414174
6225A42611876J0335394O176064r67366q817101j4619291j7233253j6939016j4678188
6217H5869119j2065310r575521p457531n885138m683601l946281l291305k733192
$$ plain form
6275 20609932 20435059 20209966 20098184 19949836 19997546 20219865 20484496 20812392 21057751 21548340
6265 21548340 22169862 22798593 23457484 24293297 25077222 25865159 26685443 27723691 28908603
6256 28908603 30122857 31423707 33366009 35503379 37895461 40532365 43772563 47634346
6248 47634346 52040314 57140481 63359450 70819080 79928611 90958562 104457617 120148244
6240 120148244 136445258 150811563 159974272 161702617 155863677 145226817 132911249
6233 132911249 122130504 114646357 110963352 110951240 114377782 121357150 131197702 142611876
6225 142611876 152947270 159123334 158155968 149338867 134719576 117486323 100547307 85869119
6217 85869119 73803809 64228288 56770757 50885619 46202018 42255737 38964432 36231240
6209C6231240k184376j712576j496831j408997j337516j311915j159364j030829
6201B4588836q41823r61102q31867n79128o62696o06691o31323m76888l77277
6192A8620041m42579l06707m90584l37001k62144l67293l54574k67816k65943
6183A5525400k89120k83958j60972k51366k27930j88783k32856j90419j90216
6174A3509780k64775j41909k08942j48430j93399j97245j44272n9675l3693o0767
6164A2056673k16377k24669j26925k15120l00652j84940j89654K6092j2599j10312
6154A0501517j34693p4869Q6318o797k7852p5859Q2870J23913o5939m3580J26714
6143A0491743J07170k0837K1598J18248L2822Q2682J02584J17290Q0313O7667
$$ plain form
6209 36231240 34046864 32334288 30837457 29428460 28090944 26779029 25619665 24588836
6201 24588836 23747013 22785911 21954044 21374916 20712220 20105529 19474206 18997318 18620041
6192 18620041 18177462 17870755 17380171 17043170 16781026 16413733 16059159 15791343 15525400
6183 15525400 15236280 14952322 14791350 14539984 14312054 14123271 13890415 13699996 13509780
6174 13509780 13245005 13103096 12894154 12745724 12552325 12355080 12210808 12151133 12117440 12056673
6164 12056673 11840296 11615627 11488702 11273582 10972930 10787990 10598336 10624428 10611829 10501517
6154 10501517 10366824 10291955 10378273 10371476 10343624 10267765 10350635 10474548 10408609 10365029 10491743
6143 10491743 10598913 10578076 10599674 10717922 10750744 10833426 10936010 11053300 11133613 11201280
6133A1201280K64778J70870K09517K87293L41899K38642L55244L32464M47105
6124A3849092L63247L08530L78823J34548J77911J5480R7608n0688J23853N3840
6114A5452244K80669K85964J89842K15918L81918L28722L91341L38858K32920
6105A8098396N51745N22168O46956N68843N36096O94702Q85961J059272J114746
6096B4678885J112039J179007J327387J312932J365880J680880J752684K099587
6088C6509281K524222K826412L305517L737379M112706M783734N480537O788613
6080G0068401P928597R419240J1431153J3337816J4823272J4420900J0799672
6073A52229051M261358m158143j1118854j4718648j4939876j2959060j0298763
$$ plain form
6133 11201280 11466058 11636928 11846445 12133738 12475637 12714279 13069523 13401987 13849092
6124 13849092 14212339 14520869 14899692 15034240 15212151 15227631 15325239 15274551 15398404 15452244
6114 15452244 15732913 16018877 16208719 16424637 16806555 17135277 17526618 17865476 18098396
6105 18098396 18650141 19172309 19819265 20388108 20924204 21618906 22504867 23564139 24678885
6096 24678885 25790924 26969931 28297318 29610250 30976130 32657010 34409694 36509281
6088 36509281 39033503 41859915 45165432 48902811 53015517 57799251 63279788 70068401
6080 70068401 77996998 87416238 98847391 112185207 127008479 141429379 152229051
6073 152229051 156490409 152332266 141213412 126494764 111554888 98595828 88297065
6066H8297065p087838m798667k572927j189275P2420J386336K762156M264113
6058H1133383N765034P807439J0008899J2388924J4408255J4879740J2127360
6051A58519034N932201k699130j1195662j6380605j7847423j6391434j3696165
6044H6240816j0811994q334935o445439n155568m047994l439980k825278k176737
6036D3002891j699345j408793r84611p78427p60881n00771k71233j37308n7988
6027C6403534J37465J51483K69931J73659N94133O00054P04631J134247J367447
6018D1536584J941413K175220K680702L082219L454514L874191L971043L968525
6010F6684411L785906L600168L796163M314136N360902O491107P136185O314102
$$ plain form
6066 88297065 81209227 76410560 73837633 72648358 72720778 74107114 76869270 81133383
6058 81133383 86898417 94705856 104714755 117103679 131511934 146391674 158519034
6051 158519034 164451235 161752105 150556443 134175838 116328415 99936981 86240816
6044 86240816 75428822 67093887 60648448 55492880 51444886 48004906 45179628 43002891
6036 43002891 41303546 39894753 38910142 38131715 37370834 36870063 36598830 36461522 36403534
6027 36403534 36540999 36692482 36962413 37136072 37730205 38330259 39034890 40169137 41536584
6018 41536584 43477997 45653217 48333919 51416138 54870652 58744843 62715886 66684411
6010 66684411 70470317 74070485 77866648 82180784 87541686 94032793 101168978 107483080
6002A07483080L322141j012862n242486p910213q521423p516215n785836m278253
5994G0537933k756939j556109o30567J46282Q19781K006156L036193M087921N593356
5985H1284007P106042Q746197J0657337J1672855J0801568P601281K062051l986491
5977A35944847q815761j1541481j2010754j1205636r761278q381128o828593n736385
5969F1663831m682568l732311l007110k341325k040950j487667j038586p91254
5961D2542060m30696j71850j13882p1921k17079m55045q00418j126049j474760
5952C7680360j633893j685160j771923j564749j481016j370840j262793j028288
5944B5881698r75837r01184n12456m48772l84296k34383p7803J40783O0205j2975
$$ plain form
6002 107483080 110805221 109792359 104549873 96639660 88118237 80602022 74816186 70537933
5994 70537933 67780994 66224885 65594318 65740600 66560381 68566537 71602730 75690651 81284007
5985 81284007 88390049 97136246 107793583 119466438 130268006 137869287 139931338 135944847
5977 135944847 127129086 115587605 103576851 92371215 82609937 74228809 67400216 61663831
5969 61663831 56981263 53248952 50241842 47900517 45859567 44371900 43333314 42542060
5961 42542060 42111364 41939514 41825632 41753711 41536632 41081587 40281169 39155120 37680360
5952 37680360 36046467 34361307 32589384 31024635 29543619 28172779 26909986 25881698
5944 25881698 24905861 24004677 23492221 23043449 22659153 22424770 22346967 22487750 22547955 22534980
5934B2534980o3557q8893j67652m0300l4013k22101k91511k73355j89337j24382
5924B1039879m09476n18737n54250p31780o27953n86776m81379l30336j69969
5915A6629223p595l3398J18312j71737k79407m49700o72017p29928p32423o03848
5905A3067482o42153o57608o32487n85949m30131m22831k08212k09549l03627
5896H974935k00526j32409m1949o3908J70537K1062q9839j08091k0801j36410
5886H372601l44691j81982j62219p0180j15212j28593m3298J60050K27013R5828
5876G809317J78258r000j21412k02331k61332j58950k24972l03477k17669r9817
5866F388615r5363m5006j64380j60566j26764l14742k49443m36666l19629l01913
$$ plain form
5934 22534980 22471423 22382530 22214878 22174578 22140565 21918464 21626953 21353598 21164261 21039879
5924 21039879 20630403 20111666 19557416 18825636 18197683 17610907 17129528 16799192 16629223
5915 16629223 16621628 16588230 16706542 16534805 16255398 15805698 15133681 14403753 13671330 13067482
5905 13067482 12425329 11767721 11135234 10549285 10119154 9696323 9488111 9278562 8974935
5896 8974935 8774409 8642000 8600051 8536143 8706680 8727742 8637903 8529812 8509011 8372601
5886 8372601 8027910 7845928 7683709 7613529 7498317 7369724 7326426 7486476 7713489 7809317
5876 7809317 7987575 7978575 7857163 7654832 7393500 7234550 7009578 6706101 6488432 6388615
5866 6388615 6293252 6248246 6083866 5923300 5796536 5481794 5232351 4795685 4476056 4174143
5856D174143j48010l11012l78752j21924k43030j94889n9192q8275j60956q2638
5846B385465k28365n2403K0204p506j6609j47706j01604M8731R1947j71219p9064
5835A741871o0071P7192l6357J8894j41448r7188J9764m4743j18094p2323Q9829
5824A377326n4020j16143K9906J3644m5134l9735l6640O87J9057J19328j30476
5813A137800j68027l2915q2146o9519K4031j26803j3512o7593O9419k8313o9759
5802E72663J12o2382m4740K09081k801n7949j28296j4579M6683k7311k2985r6340
5790C71156M6562q5821n978R1068K6409r7447m426M9780J1074m8249N5522M8348
5778D57998m3928k9526m2895o2635J53421q5496p0752J29928J58189j66913q489
$$ plain form
5856 4174143 4026133 3715121 3336369 3214445 2971415 2776526 2717334 2629059 2468103 2385465
5846 2385465 2157100 2104697 2124901 2117395 2100786 1953080 1851476 1900207 1992154 1820935 1741871
5835 1741871 1681800 1758992 1722635 1741529 1600081 1502893 1522657 1477914 1359820 1287497 1377326
5824 1377326 1323306 1207163 1237069 1250713 1205579 1165844 1129204 1129891 1148948 1268276 1137800
5813 1137800 969773 936858 854712 785193 809224 682421 668909 601316 670735 642422 572663
5802 572663 572775 510393 465653 674734 671933 613984 485688 471109 517792 490481 467496 371156
5790 371156 417718 331897 325919 416987 443396 345949 341523 391303 402377 354128 409650 457998
5778 457998 414070 384544 341649 279014 432435 346939 276187 406115 564304 397391 388902
5767C88902P4131J5425l7354R4382K28497j07466n2395N8679m5034P1788k2280
5756F67275o5327j29395j56701r0314O3067j6492k9678Q6316N0538q5371K0309
5745C14227K4112M3577J02222j20168R9397J84527L148n7017Q6009o0790q0148
5734E39096r3011m4179j23413p8033p2800N5427L476r6952p2158j0165M2309r7322
5722d7725J84568j14406j58661J88159k733O999j34395l8137R6005J15488n1614
5711D3548n4824K4594N0844r7962J07052l2859o6839k7948J34082j55002J08075
5700C2761M0333n6091J13432k4887J19593L0037M2533p0992L7412M9531m8810
5689B64852m4219R9039O191O2126n3234p5680J2087q696j03717R9629M8556m5923
$$ plain form
5767 388902 463033 478458 441104 535486 763983 656517 604122 662801 617767 689555 667275
5756 667275 601948 472553 315852 225538 288605 272113 242435 328751 379289 293918 314227
5745 314227 338339 381916 484138 363970 463367 647894 651042 594025 680034 619244 539096
5734 539096 446085 401906 278493 200460 127660 183087 186563 89611 17453 7288 49597 -47725
5722 -47725 136843 22437 -136224 51935 49202 56201 -78194 -116331 -20326 95162 43548
5711 43548 -11276 13318 64162 -33800 73252 40393 -26446 -54394 79688 -75314 32761
5700 32761 73094 17003 130435 105548 225141 255178 297711 226719 264131 313662 264852
5689 264852 220633 319672 325863 387989 334755 259075 271162 262466 158749 258378 306934 261011
5677B61011J28204J29118q4674L4875J572l8092O916J1848P3297O5073j2994N0193
5665F26347J11255r0313o631O6516m0750r8302P7729j67132r3250j9329j17436
5654B48704J71806J25019L2393O5948P3115k9290O1164m6619N0870J00182P4505
5643I27797l409n2711n5314m0829p0304k74622J3868l1280m545j107l2889j69970
5631B04685j5335J84426l6330m8955J4012R8486l4322j66042j2699Q9316O9931
5620C47173J18946j08291k595J06103j760J2077o065k9882l9897p2638p6060R131
5608B56242q3232O3862k1323p0810N253Q7920O6180j04338j11379k3435K2919
5597H7859n9950j5399j7511k5499Q5613j27309j18887P1075O039k5997M8504l7174
$$ plain form
5677 261011 389215 518333 433659 468534 470106 432014 438930 450778 524075 589148 576154 626347
5665 626347 737602 647289 640658 707174 666424 568122 645851 478719 385469 366140 248704
5654 248704 420510 545529 577922 643870 716985 687695 748859 702240 753110 853292 927797
5643 927797 924388 871677 816363 775534 705230 430608 444476 413196 408651 407544 374655 204685
5631 204685 189350 373776 337446 288491 302503 400989 366667 200625 187926 277242 347173
5620 347173 466119 357828 355233 461336 459576 471653 465588 435706 395809 323171 247111 256242
5608 256242 173010 236872 215549 144739 149992 237912 304092 199754 88375 64940 87859
5597 87859 27909 12510 -5001 -30500 55113 -72196 -191083 -120008 -113969 -139966 -91462 -128636
5585a28636j0777R629M4962N8045j75854K3336J03333J64294p950L4848Q2691
5574A97921o1690k0275Q6285o5297r5832j62484r498q4565J44541j9912r0222
5563a81028L0203q2837l2415m6297J00018n697K4181j26511R3004L8351j4852
5552b03880O8776j58973l3291J03446j4614o0726J057m1230J02798P730m9343
5541b78250O0908O7856m8882n1176k6324p5725L7408l80L7704J05847l9907R6735
5529a14186J2795o5806M6617o9378q7182J18122Q6924k1362L2303k1547n6149
5518a38849l3402J73376P0072k3091J9238K2319j74247J39770J99059l5517k0899
5507A97829j0476j28330P055J0837J4643M9482J9991p4119m8759K0680j4910P062
$$ plain form
5585 -128636 -139413 -129784 -84822 -26777 -202631 -179295 -75962 88332 80382 115230 197921
5574 197921 136231 115956 202241 136944 41112 -121372 -130870 -215435 -70894 -90806 -181028
5563 -181028 -150825 -233662 -266077 -312374 -212356 -218053 -193872 -320383 -227379 -189028 -203880
5552 -203880 -135104 -294077 -327368 -223922 -238536 -299262 -298205 -339435 -236637 -228907 -278250
5541 -278250 -217342 -149486 -198368 -249544 -275868 -351593 -314185 -314565 -276861 -171014 -210921 -114186
5529 -114186 -101391 -167197 -120580 -189958 -277140 -159018 -72094 -93456 -61153 -82700 -138849
5518 -138849 -172251 1125 71197 48106 67344 89663 -84584 55186 254245 218728 197829
5507 197829 187353 59023 66078 76915 91558 141040 161031 86912 38153 58833 43923 50985
5495E0985m4319L1110q9290q7818N2090K08808j16480R9337q2099k10064J54247
5484c3493J79403P0536q3267o7449M1203j00719l0060R3564J1554l7435M3143
5473H6980q7655J44505J4193p2254M3494M432o2961j52557J10732J49831J5426
5462A94166p5179k9563J8477M7300j23833L624J4613J64891j54858j10093k5801
5451g6256M2361Q279J4056n1527J01570J1403M4538M7244N0077j05451j09973
5440b3679R8040O9835j11601k9980N1165J5146j23680Q5372P445o3507J19873
5429I4429J6597J0125m5467J57658R2240j95020p0403J89512r617m0785Q392l5135
5417A72526Q6221j6466R5768m349J12721R065n8363K3607O4198Q1518J06468J26944
$$ plain form
5495 50985 6666 37776 -51514 -139332 -87242 121566 5086 104423 22324 -187740 -33493
5484 -33493 145910 216446 133179 65730 106933 6214 -23846 69718 81272 43837 86980
5473 86980 -675 143830 158023 85769 129263 133695 70734 -81823 28909 178740 194166
5462 194166 118987 89424 107901 155201 31368 34992 49605 214496 59638 -50455 -76256
5451 -76256 -33895 -25616 -11560 -63087 38483 49886 94424 141668 191745 86294 -23679
5440 -23679 74361 144196 32595 2615 53780 68926 -54754 30618 38063 -25444 94429
5429 94429 111026 121151 75684 233342 325582 130562 60159 249671 240054 199269 207661 172526
5417 172526 258747 242281 338049 333700 446421 455486 397123 420730 484928 566446 672914 799858
5405G99858j83730O5700p7019O9741J12671k5384m4900n453K6299J33825k0241
5394H51367P1092L105O0326J27800o5903l8350k0594J07354m1765j45308J92118
5383A101242M4752J14189J7556J20693K5139N504J51114j45645m4421j0573J11114
5372A490664R0950J17190Q8539n1892n8264J936K34161M5365n0514M3106L5550
5361A986791r3901J32496J7682P8913O5171Q7311O5448J13906M7472n8765m716
5350B437808J64378J41120k6257J95653O4629n9197Q7262O5446M6533K2117J27503
5339C266995J95186J95123J06223l512M9729Q0528J13936P7331J97117J97734
5329D476390R2908R3435M8266J54873J22586L32681J64073J4070K11025J53824
$$ plain form
5405 799858 616128 681828 604809 674550 787221 761837 716937 711484 737783 871608 851367
5394 851367 922459 925564 985890 1113690 1047787 1009437 988843 1096197 1054432 909124 1101242
5383 1101242 1145994 1260183 1277739 1398432 1423571 1429075 1580189 1434544 1390123 1379550 1490664
5372 1490664 1581614 1698804 1787343 1735451 1677187 1679123 1913284 1958649 1908135 1951241 1986791
5361 1986791 1892890 2025386 2043068 2121981 2187152 2274463 2339911 2453817 2501289 2442524 2437808
5350 2437808 2602186 2743306 2717049 2912702 2977331 2918134 3005396 3070842 3117375 3139492 3266995
5339 3266995 3462181 3657304 3763527 3760015 3809744 3890272 4004208 4081539 4278656 4476390
5329 4476390 4569298 4662733 4710999 4865872 4988458 5321139 5485212 5499282 5710307 5864131
5319E864131K06160J60216P0385J75626J56078K56938M19289K05071K24586J92034
5309G930514J86752L07676L15124J35740M06781M69504L25464K50908M63925N30282
5299A1322670N70653N51562M67962N31234P33644Q09470P96809Q62789R89978
5290A7636771J039392J332452J416912J784752K103325K413730K869983L334113
5282C3931430L832052M345392M123645L147678J695279j5507n11789o2751Q95043
5273E1380472J894037L432755M578620N814107P122459P652465P348537N742700
5265I4966152L948805K512527J488058J006539Q81721N52394O09788J323592J936266
5256A09225842K051744K009377K239950K879042K828266K721142L226065L558543
$$ plain form
5319 5864131 6070291 6230507 6300892 6476518 6632596 6889534 7308823 7513894 7738480 7930514
5309 7930514 8117266 8424942 8740066 8875806 9282587 9752091 10077555 10328463 10792388 11322670
5299 11322670 11893323 12444885 12912847 13444081 14177725 14987195 15784004 16646793 17636771
5290 17636771 18676163 20008615 21425527 23210279 25313604 27727334 30597317 33931430
5282 33931430 37763482 42108874 46232519 49380197 51075476 51059969 50548180 50485429 51380472
5273 51380472 53274509 56707264 61285884 67099991 74222450 81874915 89223452 94966152
5265 94966152 98914957 101427484 102915542 103922081 104803802 105356196 105965984 107289576 109225842
5256 109225842 111277586 113286963 115526913 118405955 121234221 123955363 127181428 130739971
5248A30739971L106350K290466J010590q82805k867174l937394l905511l372731
5240A22181762k722827j831145j938804k737245k609965k300578k387555k416800
5232A03236843j983724r13072n13391p65134r29025j413400k940912m996454o704436
5223H2077295p776945p928160o840703n291678l717293k334015j307815j22876
5215D6757810O49635O44901j82171j808862l560008m303914m359187l869120l386344
5206B6582740k636622k152554j644567j388093j175410r89837j080606p60995
5198A4754056m78978o01036n78972o19369m65528l62166l91860l66941m72028
5189A0417178k76762l10793l60855l61168k72289j21452j15665m35055l49392
$$ plain form
5248 130739971 133846321 136136787 137147377 136264572 133397398 129460004 125554493 122181762
5240 122181762 119458935 117627790 115688986 112951741 110341776 108041198 105653643 103236843
5232 103236843 101253119 100340047 99826656 99061522 98132497 96719097 93778185 88781731 82077295
5223 82077295 74300350 66372190 59531487 54239809 50522516 48188501 46880686 46757810
5215 46757810 47407445 48052346 47870175 46061313 42501305 38197391 33838204 29969084 26582740
5206 26582740 23946118 21793564 20148997 18760904 17585494 16595657 15515051 14754056
5198 14754056 14275078 13674042 13095070 12475701 12010173 11648007 11256147 10889206 10417178
5189 10417178 10140416 9829623 9468768 9107600 8835311 8713859 8598194 8163139 7813747
5180G813747k23877j15550j70996k10955q2361q0556j66760j12188j39226j84485
5170F326793r6737k0082j10036j83714j7602J842J3738n2205p0759q8240q4825
5159E618173r3569r2677k9834k1085q8820n0162P9343J04025m4460J19994J3671
5148E514599K5949l2993p3665n0838O8362n938O1591M6129J04077J38049L46779
5137F142101K61062K02103K98569M34327L39676M11797M52697M28249K66662J40846
5127I378089p2350k46677m55513m37481m36741k637l8774N5261K51096J81369
5117H175642N96115N18530M62700M64119K21077q2691m32432n39731m09865o72817
5107H300647m02815k17871j50680j00077j32281k06546q2625Q97r2078j20011
$$ plain form
5180 7813747 7589870 7474320 7303324 7092369 7010008 6929452 6762692 6650504 6511278 6326793
5170 6326793 6230056 6209974 6099938 5916224 5898622 5900464 5914202 5861997 5791238 5702998 5618173
5159 5618173 5524604 5431927 5402093 5381008 5292188 5242026 5321369 5425394 5380934 5500928 5514599
5148 5514599 5540548 5507555 5433890 5383052 5451414 5445476 5507067 5553196 5657273 5795322 6142101
5137 6142101 6403163 6605266 6903835 7338162 7677838 8089635 8542332 8970581 9237243 9378089
5127 9378089 9305739 9059062 8603549 8166068 7729327 7726690 7687916 7743177 7994273 8175642
5117 8175642 8771757 9290287 9752987 10217106 10438183 10355492 9923060 9383329 8973464 8300647
5107 8300647 7897832 7679961 7529281 7429204 7296923 7090377 7007752 7008649 6916571 6796560
5097F796560n1327n1045N3922M913Q223J8160L28919K25715J04974K12305J99420
5086G850739K25823M51337M78428N74494O71644P61524R02500R00735Q23986Q00094
5076A4441304N00036k38278n88519p87819p69381n92028m23164j85609j21014
5067A1235528L843L16637O51432O79060P18104M67708K66947k88881o05875j077414
5057A2367089j048759r64551p46988p12853n12731k58585k69194k75668l60417
5048G217343p6105r7933k44540j80291j35125L5737k2202j67733j43746J6367
5038F201772j59720p5165J1460m8464R3851o6517J317q7771j641R1038j5688P6982
5026F021454n6403P733r2028N6490R2754n6894J64079Q7232P0289j5529P1483
$$ plain form
5097 6796560 6745233 6694188 6748110 6753023 6761246 6779406 7108325 7334040 7439014 7651319 7850739
5086 7850739 8076562 8527899 9006327 9580821 10252465 11013989 11916489 12817224 13641210 14441304
5076 14441304 14941340 14703062 14114543 13326724 12557343 11965315 11542151 11356542 11235528
5067 11235528 11239371 11556008 12207440 12886500 13604604 14072312 14339259 14050378 13444503 12367089
5057 12367089 11318330 10353779 9606791 8893938 8381207 8122622 7853428 7577760 7217343
5048 7217343 7141238 7043305 6798765 6618474 6483349 6519086 6496884 6329151 6185405 6201772
5038 6201772 6042052 5966887 5978347 5929883 6023734 5957217 5958534 5870763 5869122 5960160 5944472 6021454
5026 6021454 5965051 5972784 5880756 5937246 6030000 5973106 6137185 6224417 6294706 6279177 6350660
5015F350660J27923R3611J67223n0135m046J29100j16977J18098K07901L0652
5005G054010J15851Q9826J16079R0397L202J82775O6307J44320Q0105J68483Q6408
4994H197763J9791J05621J37864J36839J73030O8797J06429J85180J15096K03473
4984I449883J91420J46357K62298J85618K66714K66868L74258K34128L70504K67077
4974A2015125L44263L26692K87742M84345N84631O15726P73508R05815R69276
4965A7307123J093795Q59532O05261L04469k46345n88875o46253n05121l92552
4956A7791034l29818q2945K7024L229L5100K18132M48881K86403M51041L72013
4946A9220094N68437P84918P22993Q21123Q34774J099550J020887J183933J132864
$$ plain form
5015 6350660 6478583 6572194 6739417 6689282 6685236 6814336 6697359 6815457 7023358 7054010
5005 7054010 7169861 7259687 7375766 7466163 7469365 7652140 7718447 7862767 7942872 8111355 8197763
4994 8197763 8217554 8323175 8461039 8597878 8770908 8839705 8946134 9131314 9246410 9449883
4984 9449883 9641303 9787660 10049958 10235576 10502290 10769158 11143416 11377544 11748048 12015125
4974 12015125 12359388 12686080 12973822 13458167 14042798 14658524 15432032 16337847 17307123
4965 17307123 18400918 19260450 19865711 20170180 19923835 19334960 18688707 18183586 17791034
4956 17791034 17461216 17378271 17405295 17408524 17443624 17661756 18110637 18397040 18848081 19220094
4946 19220094 19788531 20573449 21296442 22117565 22952339 24051889 25072776 26256709 27389573
4937B7389573O89506J83209j72495m38632m52789m23396m23831j73452j30657
4928B6047036J48729L57816L94211L58808N43226O63635N35748O60514O13797
4919C0323520P84444Q62092R68565Q33315R25859J012121J289424J185537J089034
4910C9273911P67448N07225M52871O47574P37109Q00733R63220J058663J249873
4901D6458627J290029J661337J640712J818418K044108K335519K508135K906196
4893F2663081L184248L448968M160948M865888N619696O490291P823585R485172
4885A07741877J1403647J3410282J5191243J5749017J2889409O383762k698184
4878A80071053r839047j2059057j0632672p616700m539404j058480J473322L829018
$$ plain form
4937 27389573 28079079 28262288 28089793 27651161 27198372 26774976 26351145 26177693 26047036
4928 26047036 26195765 26553581 26947792 27306600 27849826 28513461 29049209 29709723 30323520
4919 30323520 31107964 31970056 32938621 33771936 34697795 35709916 36999340 38184877 39273911
4910 39273911 40041359 40548584 41001455 41649029 42386138 43186871 44150091 45208754 46458627
4901 46458627 47748656 49409993 51050705 52869123 54913231 57248750 59756885 62663081
4893 62663081 65847329 69296297 73457245 78323133 83942829 90433120 98256705 107741877
4885 107741877 119145524 132555806 147747049 163496066 176385475 182769237 180071053
4878 180071053 170232006 158172949 147540277 139923577 135384173 134325693 135799015 139628033
4870A39628033O062998Q698498J1560005J4754624J8494310K2258823K4573097
4863B46030388K4304004K0996137J5209843R166851L356164l611544j1035871
4856C04415972j5114874j4042895j0103165n610978j330394J764459L657321M844376
4848B68479822N696878O839807Q327399J0239488J2461439J3793149J2791670
4841C38629652P914294p64369j0062188j5099966j4751308j1541116o967081k353141
4833B85004777J797066N584821Q487327J0966324J3088169J4999208J7167103
4826C57094795J8695725J9926227K0615461J9569648J6874242J3016374Q364960
4819D74157432L565160p99968n178388q983488j2268384j4734844j6162431j6609286
$$ plain form
4870 139628033 145691031 154389529 165949534 180704158 199198468 221457291 246030388
4863 246030388 270334392 291330529 306540372 315707223 319063387 315451843 304415972
4856 304415972 289301098 275258203 265155038 259544060 258213666 259978125 263635446 268479822
4848 268479822 274176700 281016507 289343906 299583394 312044833 325837982 338629652
4841 338629652 346543946 345779577 335717389 320617423 305866115 294324999 287357918 285004777
4833 285004777 286801843 292386664 300873991 311840315 324928484 339927692 357094795
4826 357094795 375790520 395716747 416332208 435901856 452776098 465792472 474157432
4819 474157432 477722592 476922624 471744236 462760748 450492364 435757520 419595089 402985803
4811D02985803j5271789j2866069r773370o609933l729015j475544N32441J786396
4803C55578920L145052M860986O560048R078961J1887934J5033815J7484936J9418029
4795D43048681J9992664J9007514J6280537J2283452P744841K808124j895013
4788E19270800o357519j0495071j4846624j8865744k1601703k2643388k1992102
4781D02468649k0379861j8286243j6416984j4640099j2936536j1123842r498531
4774B99186553p630545n930574m277636k831931j343693n18966K20566J31879
4766B77005653m41821r44861j925778k631600l622790n090274o720673q659990
4758B46967866j0608997j2007085j2544605j2355617j1996286j1092832j0458520
$$ plain form
4811 402985803 387714014 374847945 365074575 358464642 354735627 353260083 353792524 355578920
4803 355578920 358723972 363584958 370145006 379223967 391111901 406145716 423630652 443048681
4795 443048681 463041345 482048859 498329396 510612848 518357689 521165813 519270800
4788 519270800 512913281 502418210 487571586 468705842 447104139 424460751 402468649
4781 402468649 382088788 363802545 347385561 332745462 319808926 308685084 299186553
4774 299186553 291556008 285625434 281347798 278515867 277172174 276653208 276873774 277005653
4766 277005653 276563832 275618971 273693193 271061593 267438803 262348529 255627856 246967866
4758 246967866 236358869 224351784 211807179 199451562 187455276 176362444 165903924
4751A65903924r800088r145323q297539p743022p224783o372293n468721m957992
4743A06894163m445581l950851l509647l198942k882280k572790k312304j906731
4735H2115037j749156j571301j582331j293566j337001j391060j361353j439937
4727G0389332j274429j284210j381926j438450j337909j383604j546592j431999
4719E9310213j407141j378989j208136j048009r56266o78986o89788o33414m09412
4710E0900072m12352n19600m50911m71982n90733n31540p71209o90816r48961
4701D5511968q21100n62262n43206m78843l51760m30004m24112m20386o60072
4692D0820223o82862n67291p57347p95843p96607q13640o66827m98293m24228
$$ plain form
4751 165903924 156103836 146958513 138660974 130917952 123693169 117320876 111852155 106894163
4743 106894163 102448582 98497731 94988084 91789142 88906862 86334072 84021768 82115037
4735 82115037 80365881 78794580 77212249 75918683 74581682 73190622 71829269 70389332
4727 70389332 69114903 67830693 66448767 65010317 63672408 62288804 60742212 59310213
4719 59310213 57903072 56524083 55315947 54267938 53311672 52632686 51942898 51309484 50900072
4710 50900072 50487720 49968120 49517209 49045227 48454494 47922954 47151745 46460929 45511968
4701 45511968 44690868 44128606 43585400 43106557 42754797 42324793 41900681 41480295 40820223
4692 40820223 40137361 39570070 38812723 38016880 37220273 36406633 35739806 35241513 34817285
4683C4817285m05523m94815k73034k34956l67151k36060m75655o21026p33591
4674C0975474p15130m56102l70768r4500j09272j07952o1008r3774j48663o3501
4664B8754804j41444k81346k74638l96826n13069m29318m22788l53076j84646
4655B5757653l03885j42105k21041l16609l17949n36907m45577m58050n93184
4646B2422346n37963m19335k84243k56253j00722l9658j2267P10J4328j70641
4636B0616302k2393J83914J23488l4972J83464J17132L7528O6171K43682L38536
4626B1852852L4599J71662K34509K35143L76259M55321P73371J068457J033411
4617B6235584J080464J170227O75414L15012l73142p42493n67641k46299j03529
$$ plain form
4683 34817285 34411762 33916947 33643913 33408957 33041806 32805746 32330091 31709065 30975474
4674 30975474 30260344 29804242 29433474 29338974 29229702 29121750 29060742 28966968 28818305 28754804
4664 28754804 28613360 28332014 28057376 27660550 27147481 26718163 26295375 25942299 25757653
4655 25757653 25453768 25311663 25090622 24774013 24456064 23919157 23473580 23015530 22422346
4646 22422346 21884383 21465048 21180805 20924552 20823830 20784172 20771905 20772615 20786943 20616302
4636 20616302 20593909 20777823 20901311 20866339 21049803 21166935 21204463 21270634 21514316 21852852
4626 21852852 21887451 22059113 22293622 22528765 22905024 23360345 24133716 25202173 26235584
4617 26235584 27316048 28486275 29161689 29476701 29103559 28361066 27793425 27547126 27443597
4608B7443597J16926N59292P07729P48709Q99296J114084J347971J629854J869219
4599C6436677K192298K711670K775252K796322K926210K910521K847523K652370
4591E8248843K885820L431288M469384N939244P836484J0269550J3260675J5950982
4583A22292270J7160032J5358336R662466J182631o596670j0324002r525154o143996
4575A33065913j695696K721048P016228J0323999J1957947J0003844M678006k952975
4567A75118314r542953j1437306r217412m703639N34241N227766P634502O624670
4559A60238183J667737n394642j0900658j2509928j0957216p631059l395117O47895
4551A11765195M453139P164728P799090N175708r46830q536037j4112097j5650953
$$ plain form
4608 27443597 27560523 28119815 28827544 29576253 30475549 31589633 32937604 34567458 36436677
4599 36436677 38628975 41340645 44115897 46912219 49838429 52748950 55596473 58248843
4591 58248843 61134663 64565951 69035335 74974579 82811063 93080613 106341288 122292270
4583 122292270 139452302 154810638 164473104 165655735 159059065 148735063 139209909 133065913
4575 133065913 131370217 134091265 141107493 151431492 163389439 173393283 178071289 175118314
4567 175118314 165575361 154138055 144920643 140217004 140751245 145979011 153613513 160238183
4559 160238183 161905920 156511278 145610620 133100692 122143476 114512417 111117300 111765195
4551 111765195 116218334 123383062 131182152 136357860 135411030 126874993 112762896 97111943
4543I7111943j4354330j2079256r577633p369332n784497m558758l663538k785715
4535C6938884k333349k008625j642137j490028j363714j155972j044112j004322
4527B4896625j004197r31201q75213p47616p79763o70610o10469o68089l96120
4518A8213347m35939n77299l57109n23726l35005l25249l87853k93625k37112
4509A4740430k44100k05182j48215j20729k01265k62869k15246j51910k10974
4500A2979940k12808j76533j00108k61645q5529p0475l31494j95742k62365k81088
4490A1002153j91548j82245k06694j11995j32366j21499q2073K8008n0112j75710
4480I775919l4582L8064j86505j64007p773j66902j39684j38549k35222k02626
$$ plain form
4543 97111943 82757613 70678357 61100724 53731392 47946895 43388137 39724599 36938884
4535 36938884 34605535 32596910 30954773 29464745 28101031 26945059 25900947 24896625
4527 24896625 23892428 22961227 22086014 21338398 20558635 19888025 19277556 18609467 18213347
4518 18213347 17777408 17200109 16843000 16319274 15984269 15659020 15271167 14977542 14740430
4509 14740430 14496330 14291148 14142933 14022204 13820939 13558070 13342824 13190914 12979940
4500 12979940 12767132 12590599 12490491 12228846 12143317 12072842 11741348 11545606 11283241 11002153
4490 11002153 10810605 10628360 10421666 10309671 10177305 10055806 9973733 10001741 9951629 9775919
4480 9775919 9741337 9779401 9592896 9428889 9421116 9254214 9114530 8975981 8740759 8538133
4470H538133j33789j0578J1994m5300k23798q660o9648R88J41533M1546O5601
4459H308022j02637k44371j40520j82145r4509r4416k08848k14767j57324K4626
4449F893111j70398j28018l7168m2777P8294P1245J1665o9721P6704N5195P4290
4438F812422j10653P2164M2801q3553o8676J7014k00140k50430o1506m4855j39056
4427E985532o2728M180r5129j2764n1433j13538J8940Q8508k1196r9302n1007
4416E590063l1711r7323m9051j03820J36512m4465Q9074K8370j04758J09795P985
4405E530671p369l3530J2616O9107K4596q129O656N1794M5858Q2719J35194r9461
4393E810722r4027n3924o7377m2914j13081R2432J51567Q401L4127j01466P3001
$$ plain form
4470 8538133 8404344 8393766 8405760 8360460 8136662 8128002 8058354 8059342 8200875 8242421 8308022
4459 8308022 8205385 7961014 7820494 7638349 7543840 7449424 7240576 7025809 6868485 6893111
4449 6893111 6722713 6594695 6557527 6514750 6593044 6664289 6675954 6606233 6682937 6738132 6812422
4438 6812422 6701769 6773933 6816734 6733181 6664505 6681519 6481379 6230949 6169443 6124588 5985532
4427 5985532 5922804 5926984 5831855 5819091 5767658 5654120 5673060 5761568 5740372 5641070 5590063
4416 5590063 5558352 5461029 5411978 5308158 5444670 5400205 5489279 5517649 5412891 5522686 5530671
4405 5530671 5523302 5489772 5502388 5571495 5596091 5587962 5594618 5646412 5692270 5774989 5910183 5810722
4393 5810722 5716695 5662771 5595394 5552480 5439399 5531831 5683398 5691799 5725926 5624460 5697461
4382E697461J6090L4261q2635j18732J39860j56742M9449M8244K15167k7883L5418
4371E849958J50531L9474j9439J5145L0427m3438M7130J9213q0963k0819J8751
4360F005970o3207P5848N2593J16813j706Q4102P3969Q5014R5741m0268P8819
4349F563688R3377J44692L4242K4477M7997Q1542K41078P4761N2128K31356J43696
4338G733034J94425K95760L38193L69341M34149M86482N55372P58408R70758J132763
4328A3268685J045739P79505K73307q1440m08516m54149n28905n03232L2915K60909
4318A3684818L63892N92543Q66992P05088M08624j96283o20545o38382m65390
4309A4701357k38999J76018L90155N73487N06684M11981O6771k73007n91156o60687
$$ plain form
4382 5697461 5713551 5747812 5665177 5546445 5686305 5529563 5579012 5627256 5842423 5814540 5849958
4371 5849958 6000489 6039963 6020524 6035669 6066096 6022658 6069788 6089001 6008038 5987219 6005970
4360 6005970 5942763 6018611 6071204 6188017 6186311 6270413 6344382 6429396 6525137 6484869 6563688
4349 6563688 6657065 6801757 6835999 6860476 6908473 6990015 7231093 7305854 7357982 7589338 7733034
4338 7733034 7927459 8223219 8561412 8930753 9364902 9851384 10406756 11165164 12135922 13268685
4328 13268685 14314424 15093929 15367236 15285796 14877280 14423131 13894226 13390994 13423909 13684818
4318 13684818 14048710 14641253 15508245 16213333 16621957 16425674 15805129 15166747 14701357
4309 14701357 14462358 14638376 15028531 15602018 16108702 16520683 16587454 16314447 15723291 15062604
4299A5062604l00101p6674P0051K33154O47937R08204R49258P03702L44654n1056
4289A8491733j31351J74356K60237L74665O26442Q22174R21191N48369K68286
4280B2356102l46022p02794r51615r01975q24980m52081m56347k47101K5771K23197
4270A7722155N49553P15897O69916O98519P76161O37637K19407l88675q67184
4261B0733386j051777j211774j296223r72072q38076n81295m94771l57259l62950
4252A3567189k78937j42854j45553k7748l4206n1615L7665o7809M2306P7946M8525
4241A3024909J12217P7991j7067J86223L27348R3886K25112J57197O4657P9014
4231A4331487K27648L08658J79065K60114K37135K42564L24532K25787K62306
$$ plain form
4299 15062604 14762503 14685829 14755880 14989034 15636971 16545175 17494433 18198135 18542789 18491733
4289 18491733 18360382 18534738 18794975 19169640 19796082 20618256 21539447 22087816 22356102
4280 22356102 22010080 21307286 20355671 19453696 18628716 18176635 17720288 17473187 17498958 17722155
4270 17722155 18271708 18987605 19657521 20356040 21132201 21769838 21989245 21600570 20733386
4261 20733386 19681609 18469835 17173612 16201540 15363464 14782169 14287398 13930139 13567189
4252 13567189 13288252 13145398 12999845 12972097 12937891 12886276 12923941 12856132 12898438 12976384 13024909
4241 13024909 13137126 13215117 13198050 13384273 13711621 13805507 14030619 14187816 14252473 14331487
4231 14331487 14559135 14867793 15046858 15306972 15544107 15786671 16111203 16336990 16599296
4222A6599296M07990K85068K87273L50190M46317M34357L44783M57570M92545
4213B0105389M38219M82299O42129N92075O08465P07862Q59476O91799Q84488
4204B6012201R47733R77580J094181J231754J350950J456405J560232J688215
4196C6319251J923784K099666K332484K159153K385753K352797K164638K061632
4188E3799158J822807J715287J566621J321461J409897J256726J225746J400794
4180F5518497J871064K154715K618223L209918L630038M009566M265983M007794
4172I1285798L645989L056501K615151K538918K276429K156862K227909K374896
4164A12178453K151901K054293K302191K375379K564082K847029K851248L221291
$$ plain form
4222 16599296 17007286 17292354 17579627 17929817 18376134 18810491 19155274 19612844 20105389
4213 20105389 20543608 21025907 21668036 22260111 22868576 23576438 24435914 25127713 26012201
4204 26012201 26959934 27937514 29031695 30263449 31614399 33070804 34631036 36319251
4196 36319251 38243035 40342701 42675185 44834338 47220091 49572888 51737526 53799158
4188 53799158 55621965 57337252 58903873 60225334 61635231 62891957 64117703 65518497
4180 65518497 67389561 69544276 72162499 75372417 79002455 83012021 87278004 91285798
4172 91285798 94931787 97988288 100603439 103142357 105418786 107575648 109803557 112178453
4164 112178453 114330354 116384647 118686838 121062217 123626299 126473328 129324576 132545867
4156A32545867K970688K613523K486235K781824L356622M005272N330618O481833
4148A62572482P147504P141856O165327M490220K374217J316315J195129J329672
4140A93732722J812585K316885K497885K240922K064681J883269J676653J414760
4132B09640362J267664J229415Q38296M98588M34538N11565R74965J847847K758219
4123B20001459M390422O122855P570311Q737447R039976Q529128P517739O332076
4115B78241413N539094N341379N565571N706318N047317M035956L034125K255370
4107C14766543J737172J298350J35368o04703j144215j054299m85556L55273J388860
4098C16392793K510954L735840M319457M565582M271730L407532K108881P81658
$$ plain form
4156 132545867 135516555 138130078 140616313 143398137 146754759 150760031 156090649 162572482
4148 162572482 169719986 176861842 183027169 187517389 189891606 191207921 192403050 193732722
4140 193732722 195545307 197862192 200360077 202600999 204665680 206548949 208225602 209640362
4132 209640362 210908026 212137441 212975737 213474325 213908863 214420428 215395393 217243240 220001459
4123 220001459 224391881 230514736 238085047 246822494 255862470 264391598 271909337 278241413
4115 278241413 283780507 289121886 294687457 300393775 305441092 309477048 312511173 314766543
4107 314766543 316503715 317802065 317937433 317332730 316188515 315134216 314648660 315003933 316392793
4098 316392793 318903747 322639587 326959044 331524626 335796356 339203888 341312769 342094427
4090C42094427m79942j478825j706962j305196m05641N91808J423200J858825
4082C40591694J985740J291528M51625o48049j728753k198877k224205j899578
4074C35621125k114283k575531l350326l934563m305328m115983l977865m811438
4066C06435808o359332q167051r039599q787461q004746o669046m887255l446904
4058B51074414k046819q89955o21613p46260j170646j630662k308001k794693
4050B38865765l155726l664137l934522m175525m302073l788155l363392k583558
4042B09898677j753207j089512j191037k024029l669025n486396o873083p402082
4034A80410306o877993n916699m821559l698903k984261k861794k932363l123330
$$ plain form
4090 342094427 341614485 340135660 338428698 337123502 336717861 337309669 338732869 340591694
4082 340591694 342577434 343868962 344320587 343672538 341943785 339744908 337520703 335621125
4074 335621125 333506842 330931311 327580985 323646422 319341094 315225111 311247246 306435808
4066 306435808 300076476 291909425 282869826 274082365 266077619 259408573 254521318 251074414
4058 251074414 249027595 248137640 247516027 246769767 245599121 243968459 241660458 238865765
4050 238865765 235710039 232045902 228111380 223935855 219633782 215845627 212482235 209898677
4042 209898677 208145470 207055958 205864921 203840892 200171867 194685471 187812388 180410306
4034 180410306 173532313 167615614 162794055 159095152 156110891 153249097 150316734 147193404
4026A47193404l447100l696363l667858l521938l279418l102192k649348k618287
4018A21210900k415519k181313k413926k312593k417011k809715l143251l528661
4010I9988911l817630m147656m010050l693126l384861k781280k516509k343276
4002G3294523k018593j782481j691838j746820j753661j806870j736882j829384
3994E8927994j918058k079932k258703k202931k241247k186914k250480j985204
3986D1804525j740061j573266j515861j412214j388840j126728j119637j123767
3978C0804151r21860j064764r62193q21803r43146q21264p19205o83528n73623
3969B3292765n98307o13841n51343n89609n32079m49977m67875m94511l82011
$$ plain form
4026 147193404 143746304 140049941 136382083 132860145 129580727 126478535 123829187 121210900
4018 121210900 118795381 116614068 114200142 111887549 109470538 106660823 103517572 99988911
4010 99988911 96171281 92023625 88013575 84320449 80935588 78154308 75637799 73294523
4002 73294523 71275930 69493449 67801611 66054791 64301130 62494260 60757378 58927994
3994 58927994 57009936 54930004 52671301 50468370 48227123 46040209 43789729 41804525
3986 41804525 40064464 38491198 36975337 35563123 34174283 33047555 31927918 30804151
3978 30804151 29882291 28817527 27855334 27033531 26090385 25269121 24549916 23866388 23292765
3969 23292765 22694458 22080617 21529274 20939665 20407586 19957609 19489734 18995223 18613212
3960A8613212k94663m60944l27296l16321l93979m04080j57356l51468l29149
3951A5577956l42523j93633k27127k22841l35486m11076l75203j60694j08824
3942A3200549j44045k72031k44454j95016o6668k25983k14683k64663j78950k52919
3932A1141137j95123q4946j63906l9287j40135j89097j50958l1717j93324j13389
3922I839255k80408j92415o7685J12188q7998j85968k14292q2026j04133j40140
3912H596378q5737m3622j31748j81356j38538q3536L0660N402j92261j33488j10166
3901G531988Q9909j95239j15202k4259q1313q0309N7262r196j14351j1445j39430
3890F908415q9352P7115N2502j36614j10118J6200Q816r3460o4852J9040R2257
$$ plain form
3960 18613212 18318549 17857605 17530309 17213988 16820009 16415929 16258573 15907105 15577956
3951 15577956 15235433 15041800 14814673 14591832 14256346 13845270 13470067 13309373 13200549
3942 13200549 13056504 12784473 12540019 12345003 12278335 12052352 11837669 11573006 11394056 11141137
3932 11141137 10946014 10861068 10697162 10657875 10517740 10328643 10177685 10145968 9952644 9839255
3922 9839255 9558847 9366432 9298747 9410935 9322937 9136969 8922677 8840651 8736518 8596378
3912 8596378 8510641 8467019 8335271 8153915 8015377 7931841 7962501 7967903 7775642 7642154 7531988
3901 7531988 7621897 7426658 7311456 7287197 7205884 7125575 7182837 7173641 7059290 7047845 6908415
3890 6908415 6819063 6896178 6948680 6812066 6701948 6718148 6726964 6633504 6568652 6587692 6679949
3879F679949j04366o0881k41088Q5239K9953K0314J01375r2031j65995Q695J46811
3868F407975n0111L9494R5729J55070J9965L0361J59065N7510p9657M030m7551
3857F791880m212P8721p0495Q3K2145J49592J12367J19959k6160O8693J28174
3846G370747K19071K96922K63614L15184K85239L54872N19576N72905O80179O22800
3836A1501109N90861P04922R20824P63092N69307N32015k9640k86072o38078r27279
3826A3701061q13153r24391r57966p46404o48830n16791n20763n83448k50244
3817G739071j97058l22843k20266j20598q4870k39331j94568J17388l2041q9646
3807F355238o9070p9661K1724j12023j46528k40267j09945j07070j06813j25993
$$ plain form
3879 6679949 6575583 6514702 6273614 6358853 6388806 6409120 6510495 6418464 6252469 6261164 6407975
3868 6407975 6357864 6397358 6493087 6648157 6668122 6698483 6857548 6915058 6835401 6839431 6791880
3857 6791880 6787668 6866389 6795894 6795977 6818122 6967714 7080081 7200040 7173880 7242573 7370747
3846 7370747 7589818 7886740 8150354 8465538 8750777 9105649 9625225 10198130 10878309 11501109
3836 11501109 12091970 12796892 13717716 14480808 15050115 15582130 15552490 15266418 14628340 13701061
3826 13701061 12887908 11963517 11005551 10259147 9610317 9093526 8572763 7989315 7739071
3817 7739071 7542013 7219170 6998904 6878306 6793436 6554105 6359537 6476925 6444884 6355238
3807 6355238 6286168 6206507 6228231 6116208 5969680 5729413 5619468 5512398 5405585 5279592
3797E279592p4921l8345Q8059j7819p7583n8971R8875J06854m2253O0517k0000
3786E304005j04453o1550j31008j6405j02065N30o1711k08741J8428k6351j00172
3775D510507r2119j20436j52390k6665R216r615q7088N5808k2826j2995r9949
3764C951448n8296J14651j1352m4053L756m2958n7927j26098r0341q5577j16328
3753C436925Q9703J12680j3230m3139O6702l3618k21582l8075l8978r5327P3086
3742C295147P3859j6725k8045N6125p3254l684j26097J085j8404q8681j18217
3731B953109j1956k394J57114p6386p0099J4118r2901M7445j2209j21387j17848
3720B666606j7134Q4539J02262l4703m7808R1681j16461n1806Q3733k4278N9827
$$ plain form
3797 5279592 5204671 5166326 5254385 5236566 5158983 5100012 5198887 5305741 5263488 5324005 5304005
3786 5304005 5199552 5138002 5006994 4990589 4888524 4889054 4827343 4618602 4637030 4610679 4510507
3775 4510507 4418388 4297952 4145562 4118897 4128113 4118498 4031410 4087218 4064392 4051397 3951448
3764 3951448 3893152 4007803 3996451 3952398 3956154 3913196 3855269 3729171 3638830 3553253 3436925
3753 3436925 3526628 3639308 3626078 3582939 3649641 3616023 3394441 3356366 3317388 3222061 3295147
3742 3295147 3369006 3352281 3324236 3380361 3307107 3303423 3177326 3178411 3160007 3071326 2953109
3731 2953109 2941153 2938759 3095873 3019487 2949388 2963506 2870605 2918050 2905841 2784454 2666606
3720 2666606 2649472 2734011 2836273 2801570 2753762 2845443 2728982 2677176 2760909 2736631 2796458
3709B796458j3965n7744j73505N715J46850R1993P5636N1029q3073L6482L9528
3698B915404j34378o888J66606P649O8889m7507n361o121J12559M2304j35463
3687B977693J4716P9322Q6463J07698l3154O2108J35731o7464r1534J41992J17781
3676C531352m8658n2610O5189m6338J61067J39020o5615O5756J35771J0259J05587
3665D000780K07464J03850J5980q8504L5373K01161J13230M9202R2934J68445
3655D899915J89807M6805R8292L46407J17384O0243R4653O7223J75061R8324J88198
3644F382312J91404J93564P5379K37544L58207R6068J79697K43367J39576K32329
3634H329447M33113J74133L13482L09007M15625L59217M49914L56202L78647L04717
$$ plain form
3709 2796458 2782493 2724749 2551244 2556959 2703809 2795802 2871438 2922467 2839394 2875876 2915404
3698 2915404 2781026 2774138 2940744 2948393 3017282 2969775 2964414 2958293 3070852 3113156 2977693
3687 2977693 2992409 3071731 3158194 3265892 3232738 3294846 3430577 3363113 3271579 3413571 3531352
3676 3531352 3482694 3430084 3495273 3448935 3610002 3749022 3683407 3749163 3884934 3895193 4000780
3665 4000780 4208244 4312094 4328074 4239570 4274943 4476104 4589334 4638536 4731470 4899915
3655 4899915 5089722 5136527 5234819 5581226 5698610 5758853 5853506 5920729 6095790 6194114 6382312
3644 6382312 6573716 6767280 6842659 7080203 7438410 7534478 7714175 7957542 8097118 8329447
3634 8329447 8762560 8936693 9250175 9559182 9974807 10334024 10783938 11140140 11518787 11823504
3624A1823504J33418K40010L75995K26327N5312J38125J29686K88182J77111J05077
3614A3692747K07259J07530J36810L19827K54654L90686M63709M79675M04537
3605A6457434N38020O72921O66710O94881Q30156P33937P83422R03928P99529
3596B3080938Q74754P38460P12217O85684N39911P98784P82096Q63732N23664
3587B9600240O44032M97821P89041N42105N21774N87350O29999Q59160R28716
3578C5600238R84703J233484J362179J493037J364024J660528J870538J746493
3570D7315224J568652J614541J585445J687860J690236J838578K094326K204929
3562F1599791K522873K990701L558104M034671M746789N332631N747552O241359
$$ plain form
3624 11823504 11956922 12196932 12572927 12799254 12854566 12992691 13122377 13410559 13587670 13692747
3614 13692747 13900006 14007536 14144346 14464173 14718827 15109513 15573222 16052897 16457434
3605 16457434 16995454 17668375 18335085 19029966 19860122 20594059 21377481 22281409 23080938
3596 23080938 23955692 24694152 25406369 26092053 26631964 27430748 28212844 29076576 29600240
3587 29600240 30244272 30742093 31531134 32073239 32595013 33182363 33812362 34671522 35600238
3578 35600238 36584941 37818425 39180604 40673641 42037665 43698193 45568731 47315224
3570 47315224 48883876 50498417 52083862 53771722 55461958 57300536 59394862 61599791
3562 61599791 64122664 67113365 70671469 74706140 79452929 84785560 90533112 96774471
3554I6774471O228949O166490N841491N146945M307117K813618J328207l85974
3546A28221314j958168l362899m567887n371213n615285n538874n198106m740097
3538I1868785m241740l966661l734638l682897l504344l677084l576852l273854
3530F2210715l328557l411048l138701l014700k797481k752989k698387k453868
3522C8614984k275122k134464j994813j823491j454876j660729j365454j217935
3514B4688100j047780r27727q43583q65271o67505o45490q66193n95203o48355
3505A7580993p10174o82570n71465o24090n22396m97275m91946l47836n63711
3496A2569530l29004k97647m63308m24480k68987k28682n38818l55175j82174
$$ plain form
3554 96774471 103003420 109169910 115011401 120158346 124465463 127279081 128607288 128221314
3546 128221314 126263146 122900247 118332360 112961147 107345862 101806988 96608882 91868785
3538 91868785 87627045 83660384 79925746 76242849 72738505 69061421 65484569 62210715
3530 62210715 58882158 55471110 52332409 49317709 46520228 43767239 41068852 38614984
3522 38614984 36339862 34205398 32210585 30387094 28932218 27271489 25906035 24688100
3514 24688100 23640320 22712593 21869010 21003739 20336234 19690744 18824551 18229348 17580993
3505 17580993 16870819 16188249 15616784 14992694 14470298 13973023 13481077 13133241 12569530
3496 12569530 12240526 11942879 11479571 11055091 10786104 10557422 10018604 9663429 9481255
3487I481255k90133k17676k74078k40483k88747j24027l58314l72692k31019j00333
3477F983753l05411k64228n0175k03873j79149j60204j70824o990m3826l05298
3467E293775j92833j67706j78955m0483l4297j45052m1280k07245k1294j2446
3457D252184q2486k2095j05455j70362j02532r8792m7191j14023j5249r5603n1277
3446C347119J42164q7972k9913J1135r1609q9473j50291N7405q6601p956L0408
3435C044416p6761j58569o3468k5192J20284p4092j97921l5950J31222j929j16947
3424B545093J6747j19923m2677n5704l5520j98949l7361Q5522O924O7981j9305
3413B212828j9361j46606Q416p9993j89927J18906Q0748m3140j8926j8701j32327
$$ plain form
3487 9481255 9191122 8973446 8699368 8458885 8170138 8046111 7687797 7315105 7084086 6983753
3477 6983753 6678342 6414114 6363939 6160066 5980917 5820713 5649889 5642899 5599073 5293775
3467 5293775 5100942 4933236 4754281 4713798 4679501 4534449 4493169 4285924 4264630 4252184
3457 4252184 4169698 4147603 4042148 3871786 3769254 3670462 3623271 3509248 3493999 3398396 3347119
3446 3347119 3489283 3401311 3371398 3382533 3290924 3201451 3051160 3108565 3021964 3014008 3044416
3435 3044416 2967655 2809086 2745618 2720426 2840710 2766618 2568697 2532747 2663969 2662040 2545093
3424 2545093 2561840 2441917 2399240 2343536 2308016 2109067 2071706 2157228 2164152 2232133 2212828
3413 2212828 2193467 2046861 2055277 1975284 1785357 1904263 1985011 1941871 1922945 1904244 1771917
3402A771917K231j0708o5100K04293j7452j15703J36025j9501j06083J00650m1237
3391A839332j42982j74264J1591J19872P8228M0667r1601o4986J4773q829O3765
3380A685566O0617q5661R0036L7559q3262q3171l4195N1634J01382K9015L4643
3369A804163p4021o6525n4535n1127J1906K2885K1106l1623q8882P1419P403Q5017
3357A657186K806l3423m3985N70J82073R727k394k821M1878l9686L617M0809m9493
3344A766864J1809j29285J28399O5379M8304K6884l3852j8052l1042Q4697P1916
3333A992021Q3046n9057K9414Q082q1912L4324J72892n1245J2754J05607M0985
3322B286911o074q8804J2702J36930O9596N7359j04853J63619J94693P6152r7382
$$ plain form
3402 1771917 1774148 1763440 1698340 1902633 1885181 1769478 1905503 1886002 1779919 1880569 1839332
3391 1839332 1696350 1522086 1533677 1653549 1731777 1772444 1680843 1615857 1630630 1621801 1685566
3380 1685566 1746183 1660522 1750558 1788117 1704855 1621684 1587489 1639123 1740505 1769520 1804163
3369 1804163 1730142 1663617 1609082 1557955 1569861 1592746 1613852 1582229 1493347 1564766 1572169 1657186
3357 1657186 1659992 1626569 1582584 1583154 1765227 1774954 1772560 1769739 1811617 1771931 1775548 1816357 1766864
3344 1766864 1778673 1649388 1777787 1843166 1891470 1918354 1884502 1866450 1835408 1920105 1992021
3333 1992021 2075067 2016010 2045424 2053506 1971594 2005918 2178810 2127565 2140319 2245926 2286911
3322 2286911 2280837 2192033 2204735 2341665 2411261 2468620 2363767 2527386 2722079 2798231 2700849
3311B700849k4101R8449k4501q644j4485J7332L4369N4092K27326O9191J96482
3300C326359J94637N6372K5480J02900J12597j7162J12744J27657Q4665M6252
3290D172501O3101J56286K30965Q4487K4112Q5922L7453R3518J73827J17234J2613
3279E252019J64347J84082K29743Q4932N7856J03491J99317K42669J97721K09115
3269F925292K33136K10228J54882J93223J85727K60556K11079L66063J35780M03979
3259I279945M25400M23304L85374M35515M62575M92165M92322P06311P11376O77903
3249A4492190P43916Q78600Q68734J106185R85959J232011J376246J453105J682332
3240B4819278J826879K003526K303858K392422K427176K502403K403433K332901
$$ plain form
3311 2700849 2676748 2775197 2750696 2742052 2727567 2744899 2779268 2833360 3060686 3129877 3326359
3300 3326359 3520996 3577368 3602848 3705748 3818345 3801183 3913927 4041584 4126249 4172501
3290 4172501 4235602 4391888 4622853 4707340 4731452 4817374 4854827 4948345 5122172 5239406 5252019
3279 5252019 5416366 5600448 5830191 5915123 5972979 6076470 6275787 6518456 6716177 6925292
3269 6925292 7158428 7368656 7523538 7716761 7902488 8163044 8374123 8740186 8875966 9279945
3259 9279945 9705345 10128649 10514023 10949538 11412113 11904278 12396600 13102911 13814287 14492190
3249 14492190 15236106 16114706 16983440 18089625 19075584 20307595 21683841 23136946 24819278
3240 24819278 26646157 28649683 30953541 33345963 35773139 38275542 40678975 43011876
3232D3011876J928283J294950P00250L15394j24680j63558r7620J1365M4274q197
3222D6912337p3433J81852J06747J65247K66628N99918Q90068Q91686J006341
3213E0947391J287613J625283J976869K712979L319882M311921N662008O907099
3205G8751045P880577P831218N730419J112055m392704q026110q846429q590842
3197G1449229p517786o177883m902684l767024k984012k493891k183886j667912
3189C9754151j538112j171854q96746p18219l97797l00789r7821P7946K40127
3180C4950886L13427N19784Q20418R96906J240294J136423R23016N23158k04769
3171D1219543r45298j772936k274058k662794k814718k544449k311705k124671
$$ plain form
3232 43011876 44940159 46235109 46935359 47250753 47126073 46962515 46864895 46876260 46920534 46912337
3222 46912337 46838904 47020756 47127503 47292750 47559378 48159296 49049364 49941050 50947391
3213 50947391 52235004 53860287 55837156 58550135 61870017 66181938 71843946 78751045
3205 78751045 86631622 94462840 100193259 101305314 96912610 88886500 80040071 71449229
3197 71449229 63931443 57753560 52850876 49083852 46099840 43605949 41422063 39754151
3189 39754151 38216039 37044185 36147439 35429220 35031423 34730634 34632813 34710759 34950886
3180 34950886 35264313 35784097 36604515 37601421 38841715 39978138 40901154 41424312 41219543
3171 41219543 40274245 38501309 36227251 33564457 30749739 28205290 25893585 23768914
3163B3768914j789069j720785j427434j041719r73582j012020q82359r08118q95813
3154A3118015p72637n82687n28389p02827o05658n42084l64914l23133l64889
3145H330797k76451k94752l63646n33870k23535j06127l58181m04002o4264q3867
3135E622102j83840l27305k25640k2679j22691j12868j60868j46946k8079j04537
3125D186649j10185j00389j21409k44271j37084j02028p5521j34861r9039M237
3115C066099j23197m1589m2426j67935j14249j8997P996q687P874k02169p4917
3104B287803J37090j6856j64455r1071O650j15053O9377J2205j03174j17415r0542
3093A814559l328P7282k4060j12967j83346K7284M7545K161Q237n1102k5780K689
$$ plain form
3163 23768914 21979845 20259060 18831626 17789907 16816325 15804305 14921946 14013828 13118015
3154 13118015 12345378 11762691 11234302 10531475 9925817 9383733 9018819 8695686 8330797
3145 8330797 8054346 7759594 7395948 6862078 6638543 6532416 6174235 5770233 5705969 5622102
3135 5622102 5438262 5110957 4885317 4862638 4739947 4627079 4466211 4319265 4291186 4186649
3125 4186649 4076464 3976075 3854666 3610395 3473311 3371283 3295762 3160901 3061862 3066099
3115 3066099 2942902 2901313 2858887 2690952 2576703 2557706 2565702 2557015 2564889 2362720 2287803
3104 2287803 2424893 2408037 2243582 2152511 2159161 2044108 2113485 2125690 2022516 1905101 1814559
3093 1814559 1811231 1888513 1864453 1751486 1568140 1595424 1642969 1645130 1653367 1602265 1576485 1579174
3081A579174j14770k01162p607L2686N0523j1602q565m1856l9971o7564j67412
3070A001874p253Q4503J56508j60084o0854K05089R68r8274r9472m5440O0007
3059A037572j23332P5866p1175r6748J18527L620o7146j20098M5334K9684q2416
3048G49688j7978L8019m2760n8789k0302R2024J09018Q6283k04317m2377r5683
3037E92826J8265J59754N1314n7265j18634p1695j02164Q9336k5409P7835o5225
3026E48938M8878l6542M4922j4620k3800P8876j03953n8754K4050L2215m2784
3015D97426o7116J24033O17n290r1336p8446N7125L8939l1662q9838k6211m2035
3003B86206K9452Q9778j01972J01986o9341j33426P0510l7782k0420J1470K5101
$$ plain form
3081 1579174 1464404 1263242 1255635 1288321 1338844 1327242 1318677 1276821 1236850 1169286 1001874
3070 1001874 994621 1079124 1235632 1075548 1014694 1219783 1220751 1122477 1023005 977565 1037572
3059 1037572 914240 990106 918931 822183 940710 944330 877184 757086 802420 832104 749688
3048 749688 731710 769729 726969 668180 647878 739902 848920 935203 730886 688509 592826
3037 592826 611091 770845 822159 764894 646260 574565 472401 561737 536328 614163 548938
3026 548938 597816 561274 606196 591576 567776 646652 542699 483945 507995 540210 497426
3015 497426 430310 554343 554960 549670 458334 379888 437013 475952 444290 354452 328241 286206
3003 286206 315658 405436 303464 405450 336109 202683 273193 235411 214991 226461 251562
2992B51562M5718p7388n4976M1755l060p7485J4874R9547j4886Q8513m294K2125
2980C32005p4743j00803K5739j4989j42393O0111j543O6672R686N8863j4918O4589
2968B68276j2243k9329j07786J08486K0981j37087J14594R3660j86966j19096
2958A3490J58092J15906j11390K7493J1186M4823O0088m2479J50893j34216o8331
2947B25555P1157k1414N301R1572j10126o3764O9419R6476j11788n7383j6821
2936A78184Q186l8618J01285j45575O7447P9603Q808Q1433J12283K8745n4882
2925D26899j30582j9785J59743Q3986N1811r6387M9538j1579p4752n394K5640
2914D59138j75243j6406J1547j2474j11287j06634N6626J4480m0737O9202r6006
$$ plain form
2992 251562 297280 219892 164916 206671 203611 126126 141000 240547 225661 314174 309880 332005
2980 332005 257262 156459 182198 167209 24816 84927 83384 150056 159742 218605 203687 268276
2968 268276 256033 226704 118918 227404 248385 111298 225892 319552 132586 13490
2958 13490 171582 287488 176098 203591 214777 259600 319688 277209 428102 293886 225555
2947 225555 296712 275298 280599 372171 262045 198281 267700 364176 252388 195005 178184
2936 178184 186370 147752 249037 103462 170909 250512 259320 340753 453036 481781 426899
2925 426899 296317 276532 436275 520261 572072 475685 525223 513644 438892 433498 459138
2914 459138 283895 267489 279036 266562 155275 48641 105267 119747 79010 148212 52206
2903E2206n6937P8029Q4270p4296J06878L8162j02128j11845Q0463J15054n1756
2892A58100N2465j05584k6893P0407M227r3117m0247O2574k8493J33357q5069
2881A01727J4743k9388J5442j14533J3147J51627q7495p7811n0345O1016J7379
2870A5509m149j97601Q6183J8268p9863R8957K3678J8516l0356j1002q9390L4999
2858a16251J03155k5452k1129J6579L8546L7039l2487J00720k4201j47808l5114
2847a06403n9669J741n0735k0834J51756J07753n9107q854l6053j23669k1673
2836b25747Q9560N330R3322j7271o9795N6477q7936K0042m1223j2710L9440k6802
2824a77313k500N8470P2643j11938l3154j5958J89922m9561q0558L044j8564Q3438
$$ plain form
2903 52206 -4731 73298 157568 83272 190150 228312 126184 14339 94802 209856 158100
2892 158100 210565 104981 78088 148495 152722 59605 19358 81932 53439 186796 101727
2881 101727 116470 87082 102524 -12009 1138 152765 65270 -12541 -62886 -1870 15509
2870 15509 11360 -186241 -100058 -81790 -161653 -62696 -39018 -20502 -50858 -61860 -151250 -116251
2858 -116251 -13096 -38548 -59677 -43098 -4552 32487 0 100720 76519 -71289 -106403
2847 -106403 -166072 -164331 -215066 -235900 -84144 23609 -35498 -44352 -80405 -204074 -225747
2836 -225747 -136187 -130857 -37535 -54806 -124601 -68124 -156060 -136018 -177241 -189951 -150511 -177313
2824 -177313 -179813 -121343 -48700 -160638 -193792 -209750 -19828 -69389 -149947 -146903 -165467 -82029
2812h2029P0688k2240J06329k9304q9543q1524j70922P1892P2729p4643Q1236
2801a47331J9226J8649j34273K3610L5260m2274m7082J12697J8426n5616Q307
2790a90401J30165o3387q6511J09238j0542j09155L481L3273L6001K6643J3609
2779a07586J58905J4389r2964k4749l0277p3474j2141Q8649l6144N6542P5659
2768A6809j96235n4604k4124j2688j2783J3097N8479J63081k1282k3121M0759
2757e2612j15772m1039n7931Q9250o0107j11636R7891K1271J38901K1472r0744
2746a61056j09941n2311J03469L4853J6478l9448k3503J0103N5468J09849N9380
2735C341q1015L9339j2723m7800m4884p4481P9010J23096q9638j31356J73416
$$ plain form
2812 -82029 -11341 -33581 72748 43444 -46099 -127623 -298545 -226653 -153924 -228567 -147331
2801 -147331 -128105 -109456 -243729 -220119 -184859 -227133 -274215 -161518 -143092 -198708 -190401
2790 -190401 -60236 -123623 -210134 -100896 -111438 -220593 -217112 -183839 -147838 -121195 -107586
2779 -107586 51319 65708 -27256 -52005 -82282 -155756 -167897 -79248 -115392 -58850 16809
2768 16809 -179426 -234030 -258154 -270842 -283625 -270528 -212049 -48968 -70250 -93371 -52612
2757 -52612 -168384 -209423 -267354 -178104 -238211 -349847 -251956 -230685 -91784 -70312 -161056
2746 -161056 -270997 -323308 -219839 -184986 -168508 -207956 -231459 -221356 -165888 -56039 3341
2735 3341 -77674 -38335 -51058 -98858 -143742 -218223 -139213 -16117 -105755 -237111 -63695
2724f3695l698k0519n9819l9038n0210J91961K8374r1003q4776P0917j11844j04670
2712c38020L2754L1994J59601m9290j13337o043l1443O8010J17641K1852k6618
2701a32899n3058m9848M8995L3886J06323j12894m758P1782K4779q7000k7978
2690a82670r1438M9920M8998P228L9254M888n6621j08360P1810P3146J01123Q1529
2678C8807O6818r0086m7232O3437J55598O2583n8384m2514o1108l3469J41744
2667A96194r381o3008l1867j00199L3692l3719j41235L6495n6185m603R9917m0967
2655a14866J05534J177l1775k654N7792J9205j47234K6458j118p2329r3475P6298
2643a76987P7501M7283q5603r1181J34076P5599n3333l8998J7354o1588j8806
$$ plain form
2724 -63695 -67393 -87912 -147731 -186769 -236979 -45018 -16644 -107647 -192423 -121506 -233350 -338020
2712 -338020 -305266 -273272 -113671 -162961 -276298 -282341 -313784 -245774 -128133 -106281 -132899
2701 -132899 -185957 -235805 -186810 -152924 -46601 -159495 -164253 -92471 -67692 -154692 -182670
2690 -182670 -274108 -224188 -175190 -167962 -128708 -123820 -180441 -288801 -216991 -143845 -42722 38807
2678 38807 105625 15539 -31693 31744 187342 249925 191541 149027 87919 54450 196194
2667 196194 186813 123805 91938 -8261 25431 -8288 -149523 -113028 -169213 -173816 -73899 -114866
2655 -114866 -9332 -8155 -39930 -42584 15208 34413 -112821 -86363 -87481 -159810 -253285 -176987
2643 -176987 -99486 -52203 -137806 -228987 -94911 -19312 -72645 -111643 -94289 -155877 -174683
2632a74683L5249N1673p4207m1343p1668J17234n9734n9559k4246J25042l3781
2621b10023p5967K14788p23K21J9312p7205p8534P6917O6R7994q4675q652o8133
2608a94614O1524n4450j09275J3841J02398q5407J71602K1003j38613K3901J00357
2597h7733m9306Q4071M260j81835M9789n4877O633J79765M4234P3418k15059o3304
2585b09944K0212L1487P678m987L3667M248p9155O5043j8729j49995J66141l6872
2573a71206R3117l0120m9018k8895n3425K24416J12198j04209j33112n2159K4996
2562a67417P2024j0296r9990J4861j2941M1334M627K30219J5255j52984l0252
2551i5560K6448N5090r6217O8361M4348l0343p0564L8918M7943N4565J80555p1262
$$ plain form
2632 -174683 -139434 -87761 -161968 -203311 -274979 -157745 -217479 -277038 -301284 -176242 -210023
2621 -210023 -285990 -71202 -71925 -71704 -52392 -129597 -208131 -131214 -131148 -33154 -117829 -126481 -194614
2608 -194614 -133090 -187540 -296815 -282974 -180576 -265983 -94381 -73378 -211991 -188090 -87733
2597 -87733 -137039 -52968 -48708 -230543 -180754 -235631 -228998 -49233 -4999 68419 -146640 -209944
2585 -209944 -189732 -158245 -150567 -155554 -121887 -117639 -196794 -131751 -150480 -300475 -134334 -171206
2573 -171206 -78089 -108209 -157227 -186122 -239547 -15131 97067 -7142 -140254 -192413 -167417
2562 -167417 -95393 -105689 -205679 -190818 -203759 -162425 -157798 72421 87676 -65308 -95560
2551 -95560 -69112 -14022 -110239 -41878 2470 -27873 -98437 -59519 -11576 42989 223544 152282
2539A52282r8153j5037L1337j28453J44793N323j14885p662p5026P5295k6571
2528e6757j6536l9298q1110m1618J19361j5633j01421q399J09790J55771L5965
2517F0115j43880O4263J12740Q43o5899K9922P7028j4027L2318k7734l6643m0665
2505D8381k92J32312K2489l3404j3956j61458J48384q7700k3662J27867J24506
2494B83467Q5337p1039r4115N2354J29754j1643O5785k3411o6104R7318k2739
2483D24964p119l6000n1118j75572J53366j7682P7954Q5218R5390n3736j14876
2472C80789J15512L8102l2733Q2898q708p7681k4633l1507l0575P8478J24483
2461F14425J14169N0324K6765k2078R8052O3035K7124q4719J58859K5626j0704
$$ plain form
2539 152282 54129 39092 70429 -58024 86769 92092 -22793 -30455 -105481 -30186 -56757
2528 -56757 -73293 -112591 -193701 -235319 -115958 -131591 -233012 -241411 -131621 24150 60115
2517 60115 -83765 -19502 93238 94081 28182 58104 135132 121105 153423 125689 89046 48381
2505 48381 48089 180401 202890 169486 155530 -5928 142456 54756 31094 158961 283467
2494 283467 368804 297765 203650 256004 385758 374115 439900 416489 350385 447703 424964
2483 424964 417845 381845 330727 155155 308521 290839 368793 454011 549401 495665 380789
2472 380789 496301 534403 501670 584568 575860 498179 473546 442039 411464 489942 614425
2461 614425 728594 778918 805683 783605 881657 944692 971816 887097 1045956 1071582 1060878
2450A060878J12627l2934J94186K7953L9322l2583P5482L5879K6067Q1440K33844
2439A822161J04611K4653J75091K07644k7257N3089J24930J94872K67213K53503
2429C200510K42118K82523K88043J78928K70870L33393L46722O34403O51708P01506
2419G130724O88792M62213O02546P29502J072004J424990J714004K162948K759637
2410A8747360L602124M776711O548986P939694Q106996N803276P881p459778r397863
2401C8675387p984903o618887m896461l526009k574292j934440j287410r96767
2393H856218q01857n25482l42453l86418l57062n35722n61824m74030m56434m08444
2383D006492l27088j49981l34023j78169k20578k42836o6117j72691j30997j12506
$$ plain form
2450 1060878 1173505 1140571 1334757 1362710 1402032 1369449 1444931 1480810 1506877 1588317 1822161
2439 1822161 1926772 1951425 2126516 2334160 2306903 2359992 2484922 2679794 2947007 3200510
2429 3200510 3442628 3725151 4013194 4192122 4462992 4796385 5143107 5777510 6429218 7130724
2419 7130724 7819516 8281729 8884275 9613777 10685781 12110771 13824775 15987723 18747360
2410 18747360 22349484 27126195 33675181 41614875 49721871 55525147 55533028 48073250 38675387
2401 38675387 30690484 24071597 19175136 15649127 13074835 11140395 9852985 8856218
2393 8856218 8054361 7528879 7186426 6800008 6442946 5907224 5345400 4871370 4414936 4006492
2383 4006492 3679404 3529423 3195400 3017231 2796653 2553817 2487700 2315009 2184012 2071506
2373B071506o7360j65208p9706O5282j05124j26714p9508J108r7576j41427N433
2362A280706K4752q2313m0130K715m0333m8664R407j68287p3033J28718J6134
2351A009672j08235r3631M7985j66043r3846J76116j04199j9426n51L4631J12170
2340G94643n2172o5199j04924j06536n302N0550O6518q2812j5557r0477k57489
2329A31243J8625J50562J04080m9504O256p3910j5021o2054L498o6094R7143P820
2317B52644m1991K033l4000K4100J32215r5959J0818n482p7757m282K6713N3297
2305B42349P0630R1603q9447l0700L9905J5216q8585r7833k6439q3501Q674J3304
2293F5176O2350Q4166o7036p7081j1672o9125J8248P0773j9135Q6479j04892m0836
$$ plain form
2373 2071506 2004146 1838938 1759232 1824514 1719390 1592676 1513168 1514276 1416700 1275273 1280706
2362 1280706 1305458 1223145 1183015 1185730 1145397 1096733 1106140 937853 864820 993538 1009672
2351 1009672 901437 807806 855791 689748 595902 772018 667819 648393 647842 682473 794643
2340 794643 742471 677272 572348 465812 460510 511060 577578 494766 479209 388732 131243
2329 131243 149868 300430 404510 355006 361262 287352 272331 210277 213775 147681 244824 252644
2317 252644 210653 212686 178686 202786 335001 239042 249860 244378 166621 162339 189052 242349
2305 242349 312979 404582 315135 284435 324340 339556 250971 153138 126699 43198 51872 65176
2293 65176 127526 211692 144656 67575 55903 -13222 5026 75799 56664 143143 38251 -2585
2281b585L0452m2521J02256Q2327j5923o3910o4513q6399J66391j47677K6867
2270a5235J4285J17648p2547j24832J13176l4076k4844j21866J27621n263j7983
2259d3916k4375Q0532M6176n2612l7643K4178k7248l6063Q1431m2386m037P9568
2247D3605n066j06856J49590M912k31223l1124K9801j03702J45026p9624m1706
2236b26367J72807M4498o9007k0101J03349j32918J18134q1208n9533J50840n4920
2225e4426K5216m746r7599o0807Q713o74P7481J06483K8694O797j28381R004O748
2212g7497L6028n7237p8212Q328J06265M1522R2429j20770n4357r2407l8920K6574
2200b08254R6420l2930q250J1853k91077J6225J56979J76099r0339l7213N6925
$$ plain form
2281 -2585 27867 -14654 87602 169929 154006 90096 25583 -60816 105575 -42102 -15235
2270 -15235 -950 116698 44151 -80681 32495 -1581 -26425 -148291 -20670 -25933 -43916
2259 -43916 -68291 12241 58417 5805 -31838 -7660 -34908 -70971 10460 -31926 -35963 43605
2247 43605 38539 -68317 81273 86185 -145038 -176162 -146361 -250063 -105037 -184661 -226367
2236 -226367 -53560 -9062 -78069 -98170 5179 -127739 -9605 -90813 -150346 494 -54426
2225 -54426 -29210 -33956 -131555 -192362 -183649 -184323 -106842 -359 28335 35132 -93249 -84245 -77497
2212 -77497 -41469 -98706 -176918 -168590 -62325 -20803 71626 -49144 -103501 -195908 -234828 -208254
2200 -208254 -111834 -144764 -153014 -141161 -432238 -416013 -259034 -82935 -173274 -210487 -153562
2189a53562j7839Q4971O1062J8758n039j4556p6692j5849m4581q5027o9986O2424
2177b55916Q3388J0745J23961l0571j96015P3758M1391K6030K2900o8457j0693
2166a79479N5436l8112j4684l1785j41000M1213R8837L835r329J75528N6863l8448
2154b1125j60500j42837k4322l91J90180L0173L0118j35295o1442J30604P477
2143a57360l8550R2175j6957n3291J83111r276J01733P1639o7585j10470o3113
2132f7944O5594k0188P5800j64006K1701j14769j42693K17234Q5473L1651r9957
2121a12104Q5502l676m9704p2184m2898M7597O8243K7304J1062K7048n573p7844
2109i7227j47713j6206j1533P252N5323N3325J8730O7668p0359P88l8091m4033
$$ plain form
2189 -153562 -171401 -86430 -25368 -6610 -11649 -26205 -102897 -118746 -163327 -248354 -318340 -255916
2177 -255916 -172528 -161783 -37822 -68393 -264408 -190650 -149259 -123229 -100329 -168786 -179479
2166 -179479 -124043 -162155 -176839 -208624 -349624 -308411 -209574 -205739 -215068 -39540 17323 -21125
2154 -21125 -181625 -324462 -348784 -349175 -158995 -128822 -98704 -233999 -295441 -164837 -157360
2143 -157360 -195910 -103735 -120692 -173983 9128 -148 101585 173224 105639 -4831 -67944
2132 -67944 -2350 -22538 53262 -110744 -89043 -203812 -346505 -129271 -43798 -12147 -112104
2121 -112104 -26602 -30278 -79982 -152166 -195064 -147467 -79224 -51920 -40858 -13810 -19383 -97227
2109 -97227 -244940 -261146 -272679 -265427 -210104 -156779 -138049 -70381 -140740 -139952 -178043 -222076
2097b22076n2430N0244P0599m0773M6963j34304j6829J12632p550j39887O5592
2086b67819Q8407M6773j22588O716r8774J39150P6492n1687N0084N8802n3781
2075a28225n8068k8063j08250J25962J6688n2047o5170O3512K1332p3065J23599
2064a61795K933J9188j16411O2559O723p8372J37029r9263j30332K57733K10908
2053A10900j90700j9714r8555K2826K34036j17997j84933r2639R7662J70999m083
2042g2198j72596m2286L1884O1592L2295o8801l068L7332q6467P1681O8625n5046
2030a97053J38960p4599r5852o2496j3596J10048o8582p2844J3132k6068J48066
2019b00884m9912M3542K0822l1755J03820j8445K5125P8025o1756o9804r2758
$$ plain form
2097 -222076 -274506 -224262 -153663 -194436 -147473 -281777 -298606 -185974 -193524 -333411 -267819
2086 -267819 -179412 -132639 -255227 -248511 -347285 -208135 -131643 -183330 -133246 -74444 -128225
2075 -128225 -186293 -214356 -322606 -196644 -179956 -232003 -297173 -233661 -212329 -285394 -161795
2064 -161795 -158862 -139674 -256085 -193526 -186803 -265175 -128146 -227409 -357741 -100008 110900
2053 110900 -79800 -99514 -198069 -175243 58793 -59204 -244137 -336776 -239114 -68115 -72198
2042 -72198 -244794 -287080 -255196 -193604 -161309 -230110 -233178 -195846 -282313 -210632 -142007 -197053
2030 -197053 -58093 -132692 -228544 -291040 -304636 -194588 -263170 -336014 -322882 -348950 -200884
2019 -200884 -250796 -207254 -186432 -218187 -114367 -132812 -107687 -29662 -91418 -161222 -253980
2008b53980Q1424O3951l9060k302N9061o5129p980J59720j3981q51m3693j5874
1996g8694n3873o1859n4480L1810J19044j08227r370j0692J8743j32997J01207
1985b39388J75330J3863j23638l5425K00619j07338K1391j14544l8101L6567L2067
1974a78597m5280p9320J8437M7468L6514p8467M076J27523l1870O2562J50007
1963C3053n8117n9082j43658o6909P27N1177M168O8205Q0478r0323O810N5819
1951a17652M2095n0307j32983O0088J25064l7220p7514K0858j8608k2203M9813
1940a58569o1627o3989K996n1375J29964j03545Q5649K6962k5880K4107K2583
1929a72724R78j00847j1589K2843Q4524M3010K6094j07601r702L5009N8818q7362
$$ plain form
2008 -253980 -172556 -108605 -147665 -149967 -90906 -156035 -164015 -4295 -18276 -19127 -62820 -78694
1996 -78694 -132567 -194426 -248906 -217096 -98052 -206279 -215649 -226341 -207598 -340595 -239388
1985 -239388 -64058 -50195 -173833 -209258 -8639 -115977 -94586 -209130 -247231 -210664 -178597
1974 -178597 -223877 -303197 -284760 -237292 -200778 -279245 -275169 -147646 -179516 -116954 33053
1963 33053 -25064 -84146 -227804 -294713 -293986 -242809 -238641 -170436 -89958 -180281 -173471 -117652
1951 -117652 -75557 -125864 -258847 -198759 -73695 -110915 -188429 -167571 -186179 -208382 -158569
1940 -158569 -220196 -284185 -281189 -332564 -202600 -306145 -220496 -193534 -219414 -195307 -172724
1929 -172724 -171746 -272593 -284182 -261339 -176815 -133805 -107711 -215312 -225014 -190005 -131187 -218549
$$ [...]
##END NTUPLES=NMR SPECTRUM
##END=
