##TITLE=1H_CA-9424-2
 200.13MHz,CDCl3.
 8 sc
 
 17.2.2026
##JCAMPDX= 6.0         $$ Bruker NMR JCAMP-DX V2.0
##DATA TYPE= NMR SPECTRUM
##DATA CLASS= NTUPLES
##ORIGIN= UXNMR, Bruker Analytische Messtechnik GmbH
##OWNER= pz
$$ XWIN-NMR		Version 3.5
$$ Tue Feb 17 15:30:40 2026 Russian Standard Time (UT+4h)  she@DPX200
##.OBSERVE FREQUENCY= 200.1313
##.OBSERVE NUCLEUS= ^1H
##.ACQUISITION MODE= SIMULTANEOUS
##.ACQUISITION SCHEME= undefined
##.AVERAGES= 8
##.DIGITISER RES= 18
##SPECTROMETER/DATA SYSTEM= spect
##.PULSE SEQUENCE= zg30
##.SOLVENT NAME= D2O
##.SHIFT REFERENCE= (INTERNAL, D2O, 0, 15.3965)
##AUDIT TRAIL= $$ (NUMBER, WHEN, WHO, WHERE, WHAT)
$$ ##TITLE= Audit trail, XWIN-NMR		Version 3.5
$$ ##JCAMPDX= 5.01
$$ ##ORIGIN= Bruker BioSpin GmbH
$$ ##OWNER= she
$$ F:/spectra/data/she/nmr/H-C/1/pdata/1/auditp.txt
$$ ##AUDIT TRAIL=  $$ (NUMBER, WHEN, WHO, WHERE, WHAT)
(   1,<2026-02-17 15:28:41.95 +0400>,<she>,<DPX200>,
      <created by zg, POWCHK disabled, PULCHK disabled
       configuration hash MD5:
       00 E9 B6 7A A2 85 ED C7 34 08 36 98 17 FE 4E 26
       data hash MD5: 16K
       AA 9E 1C 5E 17 E2 9D 0B 66 24 0D B4 9E A1 54 1A>)
(   2,<2026-02-17 15:28:45.00 +0400>,<she>,<DPX200>,
      <Start of raw data processing
       efp BC_mod = 2 LB = 0.25 FT_mod = 6 PKNL = 1 PHC0 = -3702.879 PHC1 = 11.99232 SI = 16K 
       data hash MD5: 16K
       E0 62 5F 3D 2E 59 EF C2 4F C6 3B 32 71 F7 6B 28>)
(   3,<2026-02-17 15:29:09.51 +0400>,<she>,<DPX200>,
      <pk PHC0 = 1.535592 PHC1 = -1.6 
       data hash MD5: 16K
       D5 04 58 E9 6F 59 86 AA 1D 58 CF 30 05 8E D9 A2>)
(   4,<2026-02-17 15:29:15.40 +0400>,<she>,<DPX200>,
      <abs ABSG = 5 
       data hash MD5: 16K
       C1 FB 71 8B 14 51 0E A0 BF 98 2F FB 6A 29 22 8A>)
$$ ##END=
$$ 
$$ hash MD5
$$ C0 B5 0F EF 25 D6 07 86 3C 83 73 9D E3 67 67 60
##$RELAX= 
##$RELAX= 
##$RELAX= 
##$RELAX= 
##$RELAX= 
##$RELAX= 
$$ Bruker specific parameters
$$ --------------------------
##$DU= <F:/spectra>
##$EXPNO= 1
##$NAME= <H-C>
##$PROCNO= 1
##$TYPE= <nmr>
##$USER= <she>
##$AMP= (0..31)
100 100 100 100 100 100 100 100 100 100 100 100 100 100 100 100 100 100 
100 100 100 100 100 100 100 100 100 100 100 100 100 100 
##$AQSEQ= 0
##$AQ_mod= 1
##$AUNM= <au_zg>
##$AUTOPOS= <>
##$BF1= 200.13
##$BF2= 200.13
##$BF3= 200.13
##$BF4= 200.13
##$BF5= 200.13
##$BF6= 200.13
##$BF7= 200.13
##$BF8= 200.13
##$BYTORDA= 1
##$CFDGTYP= 0
##$CFRGTYP= 5
##$CHEMSTR= <none>
##$CNST= (0..31)
1 1 145 1 1 1 1 1 1 1 1 1 1 1 1 1 1 1 1 1 1 1 1 1 1 1 1 1 1 1 1 1 
##$CPDPRG= <>
##$CPDPRG1= <>
##$CPDPRG2= <>
##$CPDPRG3= <>
##$CPDPRG4= <mlev>
##$CPDPRG5= <mlev>
##$CPDPRG6= <mlev>
##$CPDPRG7= <mlev>
##$CPDPRG8= <mlev>
##$CPDPRGB= <>
##$CPDPRGT= <>
##$D= (0..31)
0 0.7 0 0 0 0 0 0 0 0 0 0.03 0 0 0 0 0 0 0 0 0 0 0 0 0 0 0 0 0 0 0 0 
##$DATE= 1771327721
##$DBL= (0..7)
120 120 120 120 120 120 120 120 
##$DBP= (0..7)
150 150 150 150 150 150 150 150 
##$DBP07= 0
##$DBPNAM0= <>
##$DBPNAM1= <>
##$DBPNAM2= <>
##$DBPNAM3= <>
##$DBPNAM4= <>
##$DBPNAM5= <>
$$ [...]
##$SUBNAM3= <"">
##$SUBNAM4= <"">
##$SUBNAM5= <"">
##$SUBNAM6= <"">
##$SUBNAM7= <"">
##$SUBNAM8= <"">
##$SUBNAM9= <"">
##$SW= 18.0517328524113
##$SWIBOX= (0..15)
0 0 2 0 0 0 0 0 0 0 0 0 0 0 0 0 
##$SW_h= 3612.71676300578
##$TD= 16384
##$TD0= 1
##$TE= 0
##$TE2= 300
##$TE3= 300
##$TEG= 300
##$TL= (0..7)
0 120 120 120 120 120 120 120 
##$TP= (0..7)
150 150 150 150 150 150 150 150 
##$TP07= 0
##$TPNAME0= <>
##$TPNAME1= <>
##$TPNAME2= <>
##$TPNAME3= <>
##$TPNAME4= <>
##$TPNAME5= <>
##$TPNAME6= <>
##$TPNAME7= <>
##$TPOAL= (0..7)
0.5 0.5 0.5 0.5 0.5 0.5 0.5 0.5 
##$TPOFFS= (0..7)
0 0 0 0 0 0 0 0 
##$TUNHIN= 0
##$TUNHOUT= 0
##$TUNXOUT= 0
##$USERA1= <user>
##$USERA2= <user>
##$USERA3= <user>
##$USERA4= <user>
##$USERA5= <user>
##$V9= 5
##$VALIST= <valist>
##$VCLIST= <CCCCCCCCCCCCCCC>
##$VD= 0
##$VDLIST= <DDDDDDDDDDDDDDD>
##$VPLIST= <PPPPPPPPPPPPPPP>
##$VTLIST= <TTTTTTTTTTTTTTT>
##$WBST= 1024
##$WBSW= 4
##$XGAIN= (0..3)
0 0 0 0 
##$XL= 0
##$YL= 0
##$YMAX_a= 821761
##$YMIN_a= -1050966
##$ZGOPTNS= <>
##$ZL1= 120
##$ZL2= 120
##$ZL3= 120
##$ZL4= 120
##$ABSF1= 15.40863
##$ABSF2= -2.643217
##$ABSG= 5
##$ABSL= 3
##$ALPHA= 0
##$AQORDER= 0
##$ASSFAC= 0
##$ASSFACI= 0
##$ASSFACX= 0
##$ASSWID= 0
##$AUNMP= <proc_1d>
##$AZFE= 0.1
##$AZFW= 0.1
##$BCFW= 0
##$BC_mod= 2
##$BYTORDP= 0
##$COROFFS= 0
##$CY= -3
##$DATMOD= 1
##$DC= 0
##$DFILT= <>
##$DTYPP= 0
##$F1P= 0
##$F2P= 0
##$FCOR= 1
##$FTSIZE= 16384
##$FT_mod= 6
##$GAMMA= 0
##$GB= 0
##$INTBC= 1
##$INTSCL= 3.241238e-09
##$ISEN= 128
##$LB= 0.25
##$LEV0= 0
##$LPBIN= 0
##$MAXI= 10000
##$MC2= 0
##$MEAN= 0
##$ME_mod= 0
##$MI= 1.114404
##$NCOEF= 0
##$NC_proc= -5
##$NLEV= 6
##$NOISF1= 3.799351
##$NOISF2= 2.8
##$NSP= 0
##$NTH_PI= 0
##$NZP= 0
##$OFFSET= 15.39652
##$PC= 1
##$PHC0= -3701.343
##$PHC1= 10.39232
##$PH_mod= 1
##$PKNL= yes
##$PPARMOD= 0
##$PSCAL= 0
##$PSIGN= 0
##$REVERSE= no
##$SF= 200.130025052896
##$SI= 16384
##$SIGF1= 3
##$SIGF2= 2
##$SINO= 0.751879
##$SIOLD= 32768
##$SREGLST= <19F.Aceton>
##$SSB= 0
##$STSI= 16384
##$STSR= 0
##$SW_p= 3612.71676300578
##$SYMM= 0
##$S_DEV= 0
##$TDeff= 16384
##$TDoff= 0
##$TI= <>
##$TILT= no
##$TM1= 0
##$TM2= 0
##$TOPLEV= 0
##$USERP1= <user>
##$USERP2= <user>
##$USERP3= <user>
##$USERP4= <user>
##$USERP5= <user>
##$WDW= 1
##$XDIM= 16384
##$YMAX_p= 312963039
##$YMIN_p= -636770
$$ End of Bruker specific parameters
$$ ---------------------------------
##NTUPLES= NMR SPECTRUM
##VAR_NAME=  FREQUENCY,     SPECTRUM/REAL,   SPECTRUM/IMAG
##SYMBOL=    X,             R,               I
##VAR_TYPE=  INDEPENDENT,   DEPENDENT,       DEPENDENT
##VAR_FORM=  AFFN,          ASDF,            ASDF
##VAR_DIM=   16384,         16384,           16384
##UNITS=     HZ,            ARBITRARY UNITS, ARBITRARY UNITS
##FACTOR=    0.220516191357247, 1,           1
##FIRST=     3081.30586547327, 0,            0
##LAST=      -531.410897532509, 0,           0
##MIN=       -531.410897532509, -636770,     0
##MAX=       3081.30586547327, 312963039,    0
$$ Real data points
##PAGE= N=1
##DATA TABLE= (X++(R..R)), XYDATA
$$ [...]
$$ plain form
7834 -216524 -203791 -273805 -306455 -289728 -327313 -326061 -331537 -274269 -245308 -275857 -326903 -294395
7822 -294395 -355564 -301549 -220345 -226275 -285539 -279063 -302420 -274209 -291349 -290439 -311192 -254483
7810 -254483 -272730 -353860 -390952 -362865 -356036 -241376 29934 -107634 -144919 -201428 -270018
7799 -270018 -258384 -227785 -270126 -290624 -316675 -299110 -257351 -288591 -319783 -298009 -287769 -291638
7787 -291638 -326120 -291799 -277052 -285357 -298394 -324904 -339859 -330834 -331842 -252048 -316900 -307637
7775 -307637 -300461 -268389 -332930 -299789 -280450 -271123 -306506 -371070 -324736 -268179 -260952 -323782
7763 -323782 -351578 -293063 -256357 -304613 -345491 -351773 -347366 -351687 -296296 -336439 -307462 -322194
7751 -322194 -345034 -329882 -319240 -375531 -367474 -326411 -302494 -341780 -422726 -420141 -370197 -375581
$$ packed form
7834b16524J2733p0014l2650J6727l7585J252n476N7268K8961l0549n1046L2508
7822b94395o1169N4015Q1204n930n9264O476k3357K8211j7140R10k0753N6709
7810b54483j8247q1130l7092K8087O829J14660K71310j37568l7285n6509o8590
7799b70018J1634L0599m2341k0498k6051J7565M1759l1240l1192K1774J0240l869
7787b91638l4482L4321J4747q305j3037k6510j4955R025j008P9794o4852R263
7775c07637P176L2072o4541L3141J9339R327l5383o4564M6334N6557P227o2830
7763c23782k7796N8515L6706m8256m0878o282M407m321N5391m0143K8977j4732
7751c22194k2840J5152J0642n6291Q057M1063K3917l9286q0946K585M9944n384
$$ plain form
7739 -375581 -375352 -350691 -367158 -344635 -353462 -326221 -307853 -281892 -253726 -348316 -409207 -427189
7727 -427189 -372464 -295345 -327873 -323276 -354690 -352123 -357675 -351814 -316888 -378850 -398091 -399649 -377839
7714 -377839 -364214 -377416 -333751 -303699 -402823 -440166 -436229 -418824 -334925 -312929 -240462 -275999
7702 -275999 -301269 -296917 -295322 -324190 -321427 -304903 -281572 -330066 -299586 -266584 -295980 -278499
7690 -278499 -304063 -276420 -333586 -301095 -304012 -324508 -311456 -345671 -400725 -485102 -417583 -425555
7678 -425555 -441528 -405030 -360422 -313394 -381866 -352873 -334949 -361370 -311047 -307168 -326370 -316864
7666 -316864 -365711 -338233 -375766 -418846 -410185 -395515 -350880 -371622 -407987 -351797 -347690 -361741
7654 -361741 -368468 -367206 -326252 -275514 -251003 -290536 -320421 -382950 -423229 -368299 -347095 -362428
$$ packed form
7739c75581K29K4661j6467K2523q827K7241J8368K5961K8166r4590o0891j7982
7727d27189N4725P7119l2528M597l1414K567n552N861L4926o1962j9241j558K1810
7714c77839J3625j3202M3665L0052r9124l7343L937J7405Q3899K1996P2467l5537
7702b75999k5270M352J595k8868K763J6524K3331m8494L0480L3002k9396J7481
7690b78499k5564K7643n7166L2491k917k0496J3052l4215n5054q4377O7519p972
7678d25555j5973L6498M4608M7028o8472K8993J7924k6421N0323L879j9202R506
7666c16864m8847K7478l7533m3080Q661J4670M4635k0742l6365N6190M107j4051
7654c61741o727J262M0954N0738K4511l9533k9885o2529m0279N4930K1204j5333
$$ plain form
7642 -362428 -360677 -341909 -372378 -387882 -402001 -390430 -405009 -383649 -368149 -385964 -488221 -499847
7630 -499847 -469192 -419923 -356747 -393066 -396134 -350551 -316194 -390077 -414826 -323702 -297489 -316668
7618 -316668 -352099 -342370 -397097 -433768 -365047 -346586 -370481 -411290 -429165 -423592 -456116 -422921
7606 -422921 -417121 -390969 -369690 -427193 -429419 -392265 -377587 -379660 -398350 -395247 -386117 -435927 -397409
7593 -397409 -354050 -383071 -376301 -395170 -431825 -454927 -489933 -460736 -471577 -408732 -422472 -417197
7581 -417197 -383941 -432089 -436101 -423643 -376759 -380765 -433465 -448010 -397259 -381216 -360276 -397083
7569 -397083 -411947 -362987 -377710 -366711 -407149 -417750 -394995 -377056 -396820 -317277 -333719 -409224
7557 -409224 -439389 -399968 -381289 -366871 -386573 -391136 -438652 -456207 -390812 -397598 -376274 -349494
$$ packed form
7642c62428J751J8768l0469j5504j4119J1571j4579K1360J5500j7815j02257j1626
7630d99847L0655M9269O3176l6319l068M5583L4357p3883k4749R1124K6213j9179
7618c16668l5431R729n4727l6671O8721J8461k3895m0809j7875N573l2524L3195
7606d22921N800K6152K1279n7503k226L7154J4678k073j8690L103R130m9810L8518
7593c97409M3359k9021O770j8869l6655k3102l5006K9197j0841O2845j3740N275
7581d17197L3256m8148m012J2458M6884m006n2700j4545N0751J6043K0940l6807
7569c97083j4864M8960j4723J0999m0438j0601K2755J7939j9764P9543j6442p5505
7557d09224l0165L9421J8679J4418j9702m563m7516j7555O5395o786K1324K6780
$$ plain form
7545 -349494 -452486 -487525 -506277 -466797 -460595 -434548 -358310 -309606 -324811 -375898 -410471 -393863
7533 -393863 -392081 -434842 -443726 -445557 -463431 -427559 -363956 -395897 -438950 -426396 -399001 -439756
7521 -439756 -420140 -408065 -469422 -444055 -423204 -455487 -448774 -416780 -355087 -390988 -434082 -418613
7509 -418613 -403943 -449299 -391339 -371646 -278682 -250897 -325319 -331048 -321994 -353800 -307001 -340797
7497 -340797 -305230 -303855 -341552 -355032 -314665 -353814 -359889 -361077 -383239 -346767 -346280 -401887 -367586
7484 -367586 -358749 -359706 -336328 -336764 -271143 -329728 -316781 -321772 -338011 -349076 -363563 -373981 -352228
7471 -352228 -380557 -381469 -288548 -230125 -280350 -320295 -338025 -375679 -353394 -292546 -239478 -243351
7459 -243351 -301827 -348924 -397897 -340627 -320630 -327538 -367254 -328531 -252601 -283705 -310243 -317243
$$ packed form
7545c49494j02992l5039j8752L9480O202K6047P6238M8704j5205n1087l4573J6608
7533c93863J782m2761q884j831j7874L5872O3603l1941m3053J2554K7395m0755
7521d39756J9616J2075o1357K5367K0851l2283O713L1994O1693l5901m3094J5469
7509d18613J4670m5356N7960J9693R2964K7785p4422n729R054l1806M6799l3796
7497c40797L5567J375l7697j3480M0367l9149o075j188k2162L6472M87n5607L4301
7484c67586Q837r57K3378m36O5621n8585J2947m991j6239j1065j4487j0418K1753
7471c52228k8329r12R2921N8423n0225l9945j7730l7654K2285O0848N3068l873
7459b43351n8476m7097m8973N7270J9997o908l9716L8723P5930l1104k6538p000
$$ plain form
7447 -317243 -331515 -368615 -357387 -331211 -346679 -328942 -314885 -342795 -339007 -374715 -359296 -387793
7435 -387793 -294467 -252399 -315770 -358360 -349422 -322983 -336246 -303590 -333628 -357638 -336790 -370745
7423 -370745 -444280 -403013 -377019 -457322 -481338 -432455 -452046 -394154 -448682 -435282 -416319 -364755
7411 -364755 -290778 -318104 -394769 -411754 -394188 -390351 -442813 -437245 -419899 -432232 -391801 -419410
7399 -419410 -477883 -519531 -459680 -411023 -426087 -461788 -498069 -461010 -379788 -423381 -458103 -412835
7387 -412835 -424534 -410566 -446979 -471396 -493696 -532456 -441933 -427986 -418520 -365896 -437663 -513030
7375 -513030 -502605 -431637 -422944 -437293 -461347 -519796 -497515 -455264 -462419 -475343 -396055 -395585
7363 -395585 -481041 -435333 -460609 -439166 -406327 -486388 -459277 -467135 -448748 -446568 -394440 -420868
$$ packed form
7447c17243j4272l7100J1228K6176j5468J7737J4057k7910L788l5708J5419k8497
7435c87793R3326M2068o3371m2590Q938K6439j3263L2656l0038k4010K0848l3955
7423c70745p3535M1267K5994q0303k4016M8883j9591N7892n4528J3400J8963N1564
7411c64755P3977k7326p6665j6985J7566L837n2462N568J7346j2333M0431k7609
7399d19410n8473m1648N9851M8657j5064l5701l6281L7059Q1222m3593l4722M5268
7387d12835j1699J3968l6413k4417k2300l8760R0523J3947R466N2624p1767p5367
7375e13030J0425P0968Q693j4349k4054n8449K2281M2251p155j2924P9288M70
7363c95585q5456M5708k5276K1443L2839q0061K7111p858J8387K180N2128k6428
$$ plain form
7351 -420868 -452049 -467095 -479952 -513370 -498852 -509185 -463847 -443890 -396187 -452686 -464366 -441418
7339 -441418 -401614 -452393 -511487 -429408 -461983 -506702 -502208 -423491 -395791 -422790 -423950 -449418
7327 -449418 -476631 -505549 -484779 -447943 -453526 -462155 -448123 -419662 -430584 -392338 -449552 -500659
7315 -500659 -551021 -503846 -529046 -540948 -521796 -518585 -492955 -465872 -458569 -483072 -492903 -469082
7303 -469082 -470071 -471834 -452237 -461503 -483656 -476489 -498515 -542695 -538134 -443534 -459713 -481089 -481979
7290 -481979 -494091 -512588 -500412 -423173 -422400 -438981 -413924 -417064 -440039 -443028 -462483 -399129
7278 -399129 -462281 -498131 -504748 -456163 -441515 -454445 -448704 -509882 -505617 -468945 -462774 -515908
7266 -515908 -494278 -461543 -509054 -490724 -484675 -497859 -498686 -490186 -476462 -435357 -405888 -392531
$$ packed form
7351d20868l1181j5046j2857l3418J4518j0333M5338J9957M7703n6499j1680K2948
7339d41418L9804n0779n9094Q2079l2575m4719M494P8717K7700k6999j160k5468
7327d49418k7213k8918K0770L6836n583q629J4032K8461j0922L8246n7214n1107
7315e00659n0362M7175k5200j1902J9152L211K5630K7083P303k4503r831K3821
7303d69082r89j763J9597r266k2153P167k2026m4180M561R4600j6179k1376q90
7290d81979j2112j8497J2176P7239P73j6581K5057l140k2975k989j9455O3354
7278c99129o3152l5850o617M8585J4648j2930N741o1178M265L6672O171n3134
7266e15908K1630L2735m7511J8330O049j3184q27Q500J3724M1105K9469J3357
$$ plain form
7254 -392531 -424813 -396985 -378504 -488241 -466738 -558001 -569861 -530569 -529667 -524153 -538358 -516967
7242 -516967 -494617 -475663 -513425 -471671 -470731 -495966 -472508 -478577 -509352 -552307 -499775 -445670
7230 -445670 -478651 -484116 -435624 -435593 -415291 -419893 -435329 -534742 -495788 -464399 -509838 -535590 -533604
7217 -533604 -478482 -531590 -469375 -469476 -518263 -468319 -458083 -484876 -541828 -494081 -503483 -549988
7205 -549988 -545762 -493747 -468784 -416967 -441340 -503701 -491012 -448205 -426051 -495623 -444835 -441480
7193 -441480 -473038 -461189 -426692 -469024 -496355 -487694 -462042 -483627 -490295 -452893 -371508 -378934
7181 -378934 -396849 -408114 -431528 -371505 -409503 -478695 -467234 -449064 -492396 -473030 -470011 -493673
7169 -493673 -495733 -514953 -487376 -488913 -435607 -421536 -412934 -405779 -401381 -463895 -502178 -421932 -356232
$$ packed form
7254c92531l2282K7828J8481j09737K1503r1263j1860L9292R02N514j4205K1391
7242e16967K2350J8954l7762M1754R40k5235K3458o069l0775m2955N2532N4105
7230d45670l2981n465M8492L1K0302m602j5436r9413L8954L1389m5439k5752J986
7217e33604N5122n3108O2215j01m8787M9944J0236k6793n6952M7747r402m6505
7205e49988M226N2015K4963N1817k4373o2361J2689M2807K2154o9572N0788L355
7193d41480l1558J1849L4497m2332k7331Q661K5652k1585o668L7402Q1385p426
7181c78934j7915j1265k3414O0023l7998o9192J1461J8170m3332J9366L019k3662
7169d93673k060j9220K7577j537N3306J4071Q602P155M398o2514l8283Q0246O5700
$$ plain form
7156 -356232 -323810 -300746 -270570 -184394 -45489 -2019 73302 -16197 -165289 -293922 -328353
7145 -328353 -377602 -437183 -391494 -417735 -416487 -465138 -414643 -453878 -448646 -420016 -470928 -464839
7133 -464839 -478629 -462880 -477944 -468152 -459545 -481933 -504114 -476830 -477953 -444970 -454312 -489634
7121 -489634 -488845 -514289 -502428 -534978 -511964 -537945 -574929 -542441 -556103 -501937 -440455 -446219
7109 -446219 -470313 -473766 -453145 -462391 -502193 -482325 -443158 -478666 -489273 -447272 -474774 -457989
7097 -457989 -468364 -441197 -482224 -578368 -517401 -543677 -577459 -569853 -572790 -584435 -522598 -454134
7085 -454134 -426120 -473341 -533496 -532460 -527491 -476630 -473059 -500280 -537183 -506500 -409192 -464302
7073 -464302 -487979 -446078 -514758 -550201 -556660 -533919 -479452 -472434 -521700 -530527 -501420 -563004
$$ packed form
7156c56232L2422K3064L0176Q6176J38905M3470P5321q9499j49092j28633l4431
7145c28353m9249n9581M5689k6241J248m8651N0495l9235N232K8630n0912O089
7133d64839j3790J5749j5064R792Q607k2388k2181K7284j123L2983r342l5322
7121d89634P89k5444J1861l2550K3014k5981l6984L2488j3662N4166O1482n764
7109d46219k4094l453K0621r246l9802J9868L9167l5508j0607M2001k7502J6785
7097d57989j0375K7167m1027r6144O0967k6276l3782P606k937j1645O1837O8464
7085d54134K8014m7221o0155J036M969N0861L571k7221l6903L0683R7308n5110
7073d64302k3677M1901o8680l5443o459K2741N4467P018m9266q827K9107o1584
$$ plain form
7061 -563004 -510191 -482507 -506600 -524683 -559625 -512286 -472606 -501562 -509542 -512706 -497767 -459221
7049 -459221 -461675 -503536 -483952 -526301 -566227 -518950 -512553 -567681 -491714 -438860 -473034 -515002
7037 -515002 -531961 -533452 -459794 -526831 -573091 -555627 -511086 -440666 -447142 -499125 -521275 -436044
7025 -436044 -451358 -437399 -412076 -348364 -388336 -374845 -436462 -517920 -553025 -565042 -595189 -533646
7013 -533646 -479459 -411744 -491926 -535844 -575864 -563150 -570457 -580398 -520531 -477356 -484014 -501459
7001 -501459 -558809 -493607 -393066 -463747 -508559 -546439 -486564 -463988 -459217 -492593 -582027 -557774
6989 -557774 -518348 -506072 -516065 -525545 -549036 -565571 -541640 -507419 -558336 -478078 -447970 -473803
6977 -473803 -453946 -462180 -507143 -473179 -516011 -522460 -487802 -504586 -539179 -517280 -492540 -596919
$$ packed form
7061e63004N2813K7684k4093j8083l4942M7339L9680k8956p980l164J4939L8546
7049d59221k454m1861J9584m2349l9926M7277O397n5128P5967N2854l4174m1968
7037e15002j6959j491P3658o7037m6260J7464M4541P0420o476n1983k2150Q5231
7025d36044j5314J3959K5323O3712l9972J3491o1617q1458l5105j2017l0147O1543
7013e33646N4187O7715q0182m3918m0020J2714p307r941N9867M3175o658j7445
7001e01459n7350O5202J00541p0681m4812l7880N9875K2576M771l3376q9434K4253
6989e57774L9426J2276r993r480k3491j6535K3931L4221n0917Q0258L0108k5833
6977d73803J9857q234m4963L3964m2832o449L4658j6784l4593K1899K4740j04379
$$ plain form
6965 -596919 -574763 -541968 -512184 -542668 -482090 -424533 -417152 -529471 -555323 -598212 -547517 -544571
6953 -544571 -541523 -546401 -539304 -449265 -466249 -480481 -545356 -584546 -524351 -512178 -468386 -479204
6941 -479204 -475058 -490141 -604930 -605542 -488986 -539652 -529718 -526625 -510083 -500821 -500586 -498212 -508019
6928 -508019 -495851 -468208 -493802 -518888 -543627 -570448 -532969 -509940 -502502 -496464 -525639 -550244
6916 -550244 -561820 -488464 -479958 -518584 -494793 -464377 -510360 -486699 -447002 -506308 -543882 -555853
6904 -555853 -487753 -461498 -504048 -507439 -571288 -559759 -537232 -579154 -591366 -563698 -477152 -486033
6892 -486033 -423535 -461312 -491133 -377355 -377724 -442578 -508479 -468579 -455764 -519124 -459179 -486445
6880 -486445 -475151 -492940 -516998 -508493 -510092 -519225 -509205 -513182 -487385 -506388 -432268 -466886
$$ packed form
6965e96919K2156L2795K9784l0484O0578N7557P381j12319k5852m2889N0695K946
6953e44571L048m878P097R0039j6984j4232o4875l9190O0195J2173M3792j0818
6941d79204M146j5083j14789o12J16556n0666R934L093J6542R262K35K374r807
6928e08019J2168K7643k5594k5086k4739k6821L7479K3029P438O038k9175k4605
6916e50244j1576P3356Q506l8626K3791L0416m5983K3661L9697n9306l7574j1971
6904e55853O8100K6255m2550l391o3849J1529K2527m1922j2212K7668Q6546q881
6892d86033O2498l7777k9821J13778l69o4854o5901L9900J2815o3360N9945k7266
6880d86445J1294j7789k4058Q505j599r133J0020l977K5797j9003P4120l4618
$$ plain form
6868 -466886 -486958 -537044 -555905 -485803 -443329 -467603 -528299 -496228 -522551 -519645 -502965 -544448
6856 -544448 -493167 -464740 -482191 -464304 -437718 -479621 -473299 -461568 -469546 -458463 -496504 -502170
6844 -502170 -520366 -488014 -515101 -533657 -533123 -493672 -509160 -526388 -524453 -541503 -539429 -548551 -552871
6831 -552871 -539453 -548257 -606542 -553721 -575066 -522160 -495351 -456322 -481500 -533222 -484289 -463119
6819 -463119 -455055 -509511 -566861 -484360 -459471 -469595 -450656 -446984 -461668 -529255 -511149 -548120
6807 -548120 -546534 -515769 -399508 -460084 -570148 -557362 -501499 -519593 -446511 -433518 -409527
6796 -409527 -450099 -524666 -490438 -417170 -420837 -433112 -445976 -510893 -474443 -492082 -516573 -475694
6784 -475694 -533774 -562482 -550423 -543783 -506127 -525801 -515289 -470712 -502539 -541825 -522733 -521117
$$ packed form
6868d66886k0072n0086j8861P0102M2474k4274o0696L2071k6323K906J6680m1483
6856e44448N1281K8427j7451J7887K6586m1903O322J1731p978J1083l8041n666
6844e02170j8196L2352k7087j8556N34L9451j5488j7228J935j7050K074r122m320
6831e52871J3418q804n8285N2821k1345N2906K6809L9029k5178n1722M8933K1170
6819d63119Q064n4456n7350Q2501K4889j0124J8939L672j4684o7587J8106l6971
6807e48120J586L0765J16261o0576j10064J2786N5863j8094P3082J2993K3991
6796d09527m0572p4567L4228P3268l667j2275j2864o4917L6450j7639k4491M0879
6784d75694n8080k8708J2059O640L7656j9674J0512M4577l1827l9286J9092J616
$$ plain form
6772 -521117 -493577 -475059 -484682 -516022 -514962 -491699 -432238 -446013 -542562 -576239 -531594 -537672
6760 -537672 -518049 -499019 -459849 -510978 -541668 -538960 -515047 -557848 -573471 -568692 -534541 -520063
6748 -520063 -557495 -591919 -520514 -507167 -517018 -459615 -487625 -467944 -429536 -442887 -468455 -466117
6736 -466117 -468961 -498099 -520397 -467589 -489716 -561168 -636770 -559853 -471157 -501396 -463323 -426993
6724 -426993 -393481 -476314 -477643 -476978 -487907 -491746 -505893 -472119 -518425 -480616 -505574 -565927
6712 -565927 -563712 -467774 -476636 -511767 -544769 -562676 -569640 -509962 -549520 -511213 -479677 -523364
6700 -523364 -540418 -522566 -463141 -429845 -438407 -443905 -479856 -527519 -452537 -491773 -485419 -453955
6688 -453955 -478718 -440863 -444911 -545735 -567676 -516463 -500115 -443143 -401875 -413871 -466241 -493504
$$ packed form
6772e21117K7540J8518r623l1340J060K3263N9461j3775r6549l3677M4645o078
6760e37672J9623J9030L9170n1129l0690K708K3913m2801j5623M779L4151J4478
6748e20063l7432l4424P1405J3347r851N7403k8010J9681L8408j3351k5568K338
6736d66117k844k9138k2298N2808k2127p1452p5602P6917Q8696l0239L8073L6330
6724d26993L3512q2833j329O65j0929l839j4147L3774m6306L7809k4958o0353
6712e65927K215R5938q862l5131l3002j7907o964N9678l9558L8307L1536m3687
6700e23364j7054J7852N9425L3296q562n498l5951m7663P4982l9236O354L1464
6688d53955k4763L7855m048j00824k1941N1213J6348N6972M1268j1996n2370k7263
$$ plain form
6676 -493504 -470249 -435638 -391542 -355543 -372449 -388740 -402562 -397796 -421425 -451309 -461852 -475392
6664 -475392 -436891 -519533 -467711 -410712 -431294 -326555 -317505 -380684 -347235 -406449 -412526 -409009
6652 -409009 -492933 -430672 -429488 -406901 -370442 -416380 -447180 -444968 -469103 -508420 -522384 -468811
6640 -468811 -406235 -412165 -421816 -403639 -436755 -454606 -420735 -404034 -371535 -370914 -397105 -371608
6628 -371608 -400992 -401856 -327242 -302668 -210671 -238781 -299880 -198522 -190745 -182369 -220821 -196690
6616 -196690 -174720 -121186 -105418 -154606 -166021 -195638 -186639 -204124 -152901 -121464 -125881 -145839
6604 -145839 -95383 -72604 -23533 -41275 -86357 -44096 10295 -34664 -58899 -62430 -86984 -130751
6592 -130751 -170448 -200872 -212184 -179161 -163483 -149548 -177424 -136227 -125034 -118010 -102199 -135571
$$ packed form
6676d93504K3255L4611M4096L5999j6906j6291j3822M766k3629k9884j0543j3540
6664d75392L8501q2642N1822N6999k0582J04739R050o3179L3449n9214o077L517
6652d09009q3924O2261J184K2587L6459m5938l0800K212k4135l9317j3964N3573
6640d68811O2576n930r651J8177l3116j7851L3871J6701L2499O21k6191K5497
6628c71608k9384q64P4614K4574R1997k8110o1099J01358P777Q376l8452K4131
6616a96690K1970N3534J5768m9188j1415k9617Q999j7485N1223L1437m417j9958
6604a45839N0456K2779M9071j7742m5082M2261N4391m4959k4235l531k4554m3767
6592a30751l9697l0424j1312L3023J5678J3935k7876M1197J1193P024J5811l3372
$$ plain form
6580 -135571 -111672 -120099 -119165 -106013 -117000 -78976 -96999 -147859 -155814 -125401 -157442 -137356
6568 -137356 -45978 37412 13815 -82323 -72643 -131725 -136751 -122447 -88432 -79141 -133907 -118355
6556 -118355 -68060 -86860 -27745 -72680 -79582 -20405 -78686 -117318 -55489 39343 107921 161931
6544 161931 171499 199036 149646 206977 147492 42114 38146 32007 53578 44311 57247 83099
6532 83099 123921 88499 135701 184311 103667 73219 75191 23161 -18827 13187 676 -49046
6520 -49046 -95095 -39771 -35554 -27771 -83881 -169880 -154191 -191411 -182373 -161418 -132499 -148592
6508 -148592 -217619 -195134 -144534 -188680 -119311 -158201 -193557 -151198 -82233 -55351 -111265 -132140
6496 -132140 -145968 -160522 -160364 -128899 -107861 -140267 -123624 -131313 -92080 -132036 -194121 -240717
$$ packed form
6580a35571K3899q427R34J3152j0987L8024j8023n0860p955L0413l2041K0086
6568a37356R1378Q3390k3597r6138R680n9082n026J4304L4015R291n4766J5552
6556a18355N0295j8800N9115m4935o902N9177n8281l8632O1829R4832O8578N4010
6544A61931R568K7537m9390N7331n9485j05378l968o139K1571r267J2936K5852
6532H3099M0822l5422M7202M8610q0644l0448J972n2030m1988L2014j2511m9722
6520d9046m6049N5324M217P783n6110q5999J5689l7220R038K0955K8919j6093
6508a48592o9027K2485N0600m4146O9369l8890l5356M2359O8965K6882n5914k0875
6496a32140j3828j4554J58L1465K1038l2406J6643p689L9233l9956o2085m6596
$$ plain form
6484 -240717 -222537 -181088 -164720 -145234 -200345 -202724 -197669 -170571 -129429 -91174 -105487 -58436
6472 -58436 -75630 -74245 -79465 -32407 -21936 -18012 -61717 -31042 -22845 -38204 -75919 -30573 20503
6459 20503 82990 152169 165887 70626 84652 144072 144547 168556 160530 148881 158056 174690 198817
6446 198817 194389 182545 123825 113664 169232 187941 202304 186540 187356 138457 113034 109928
6434 109928 148236 147796 149181 219249 198498 199598 193452 157352 152066 177759 215993 187991 246796
6421 246796 278846 268478 341297 308072 336090 340980 317890 316468 286974 300395 299881 314271
6409 314271 280227 278409 331654 347747 381395 379046 465587 496347 502837 511307 540497 547214 526809
6396 526809 627565 657692 635630 700169 827300 836625 845178 833759 889822 906226 1063681
$$ packed form
6484b40717J8180M1449J6368J9486n5111k379N055K7098M1142L8255j4313M7051
6472e8436j7194J385n220M7058J0471L924m3705L0675Q197j5359l7715M5346N1076
6459B0503O2487O9179J3718r5261J4026N9420M75K4009q026j1649R175J6634K4127
6446A98817m428j1844n8720j0161N5568J8709J4363j5764Q16m8899k5423l106
6434A09928L8308m40J385P0068k0751J100o146l6100n286K5693L8234k8002N8805
6421B46796L2050j0368P2819l3225K8018M890k3090j422k9494J3421n14J4390
6409C14271l4044j818N3245J6093L3648k349Q6541L0760O490Q470K9190O717k0405
6396E26809J00756L0127k2062O4539J27131R325Q553j1419N6063J6404J57455
$$ plain form
6385 1063681 1156844 1170186 1273421 1371414 1437425 1513912 1574490 1609875 1597263 1543898 1407170
6374 1407170 1401787 1453777 1417097 1444835 1473262 1496124 1483659 1514140 1657499 1694927 1722025
6363 1722025 1710046 1784434 1800931 1867393 1940928 1951465 2034645 2124100 2112542 2207831 2166790
6352 2166790 2121049 2201396 2214314 2214064 2233623 2330997 2370938 2465259 2512516 2602701 2752027 2841068
6340 2841068 2915041 2993966 3108934 3228220 3378371 3502614 3657401 3830816 3969904 4166541
6330 4166541 4430654 4711976 5012519 5328737 5601801 5974218 6402131 6915767 7526803 8077729
6320 8077729 8823179 9686578 10772794 12105531 13596224 15351419 17600511 20341177 23821655
6311 23821655 28461157 34324652 41000417 47275865 51683885 52864149 50763476 46531388
$$ packed form
6385A063681R3163J3342J03235R7993O6011P6487O0578L5385j2612n3365j36728
6374A407170n383N1990l6680K7738K8427K2862j2465L0481J43359L7428K7098
6363A722025j1979P4388J6497O6462P3535J0537Q3180Q9455j1558R5289m1041
6352B166790m5741Q0347J2918k50J9559R7374L9941R4321M7257R0185J49326Q9041
6340B841068P3973P8925J14968J19286J50151J24243J54787J73415J39088J96637
6330D166541K64113K81322L00543L16218K73064L72417M27913N13636O11036N50926
6320H077729P45450Q63399J086216J332737J490693J755195K249092K740666L480478
6311B3821655M639502N863495O675765O275448M408020J180264k100673m232088
$$ plain form
6303 46531388 41603091 37117556 33774991 31762866 31229330 32158477 34715695 38930903
6295 38930903 44413678 49911955 53799958 54543657 51709474 46176348 39531211 33092209
6287 33092209 27561312 23109664 19703571 17168252 15295503 13781296 12552776 11633813
6279 11633813 10927160 10343363 9848457 9463430 9233562 9048974 8939974 8906514 8895405 8807820
6269 8807820 8850299 8890604 8909165 8934896 9033922 9216955 9473899 9647687 9919265 10205509
6259 10205509 10573407 10874771 11306365 11791069 12330915 13069759 13793659 14613991 15496602
6250 15496602 16639017 17989707 19553266 21323983 23434225 25951208 28991158 32631264
6242 32631264 37172883 43022855 50767924 60747449 72499746 84335591 93587009 97753271
$$ packed form
6303D6531388m928297m485535l342565k012125n33536R29147K557218M215208
6295C8930903N482775N498277L888003P43699k834183n533126o645137o439002
6287C3092209n530897m451648l406093k535319j872749j514207j228520r18963
6279A1633813p06653n83797m94906l85027k29868j84588j09000l3460j1109q7585
6269H807820M2479M0305J8561K5731R9026J83033K56944J73788K71578K86244
6259A0205509L67898L01364M31594M84704N39846P38844P23900Q20332Q82611
6250A5496602J142415J350690J563559J770717K110242K516983L039950L640106
6242C2631264M541619N849972P745069R979525J1752297J1835845R251418M166262
$$ plain form
6234 97753271 95925019 89431500 80748963 72304820 65492371 60947369 58924115 59527933
6226 59527933 62916654 69138040 77731345 87002098 94435764 97346706 94368561 86365803
6218 86365803 75464734 64063810 53871486 45385654 38719281 33506682 29540957 26365251
6210 26365251 23855145 21750311 19947218 18489001 17317109 16354854 15654137 14998724 14420630
6201 14420630 13944727 13510405 13058783 12651878 12307255 11947289 11513769 11141576 10909719
6192 10909719 10747911 10581011 10322842 10102424 9973192 9811965 9608293 9423661 9354787 9242387
6182 9242387 9072871 8991217 8913396 8806882 8711996 8619831 8527454 8383698 8204646 8047018
6172 8047018 7924830 7764543 7609639 7451112 7360918 7254675 7179209 7031901 6965493 6923843
$$ packed form
6234I7753271j828252o493519q682537q444143o812449m545002k023254O03818
6226E9527933L388721O221386Q593305R270753P433666K910942k978145q002758
6218H6365803j0901069j1400924j0192324q485832o666373n212599l965725l175706
6210B6365251k510106k104834j803093j458217j171892r62255p00717o55413n78094
6201A4420630m75903m34322m51622m06905l44623l59966m33520l72193k31857
6192A0909719j61808j66900k58169k20418j29232j61227k03672j84632o8874j12400
6182I242387j69516q1654p7821j06514r4886r2165r2377j43756j79052j57628
6172H047018j22188j60287j54904j58527r0194j06243p5466j47308o6408m1650
$$ plain form
6162 6923843 6790722 6662447 6554979 6488136 6409080 6281610 6113753 6020129 5854024 5753302
6152 5753302 5699239 5628964 5581828 5573336 5520591 5536076 5517489 5525399 5486501 5447870 5496731 5464500
6140 5464500 5355596 5367999 5347024 5283257 5223747 5215400 5201839 5261571 5218188 5235553 5283382
6129 5283382 5413752 5613650 5769193 5942464 6145238 6344723 6619134 6752142 6766334 6860007
6119 6860007 6858686 6784894 6736258 6771837 6831648 6805087 6747621 6794228 6811595 6876081 6941404 7012939
6107 7012939 7140054 7289491 7495037 7690459 7948791 8126291 8359197 8661416 9081652 9452824
6097 9452824 9845679 10325902 10752204 11278447 11780199 12300227 12882854 13554540 14302166 15004885
6087 15004885 15872487 16867200 18049897 19370991 20817754 22443581 24341427 26580222
$$ packed form
6162F923843j33121j28275j07468o6843p9056j27470j67857r3624j66105j00722
6152E753302n4063p0275m7136q492n2745J5485j8587P910l8898l8631M8861l2231
6140E464500j08904J2403k0975o3767n9510q347j3561N9732m3383J7365M7829
6129E283382J30370J99898J55543J73271K02774J99485K74411J33008J4192R3673
6119F860007j321p3792m8636L5579N9811k6561n7466M6607J7367O4486O5323P1535
6107G012939J27115J49437K05546J95422K58332J77500K32906L02219M20236L71172
6097I452824L92855M80223M26302N26243N01752N20028N82627O71686P47626P02719
6087A5004885Q67602R94713J182697J321094J446763J625827J897846K238795
$$ plain form
6079 26580222 29206377 32457212 36434018 41442235 47793074 56009440 66183333 77540041
6071 77540041 87934761 94577748 95197914 89824750 80464774 69928329 60216237 52093883
6063 52093883 45933782 41605243 38766871 37155720 36574277 36801949 37736868 39477083 42091413
6054 42091413 45813239 50927607 57946530 67199476 78300448 89437725 97626879 99971106
6046 99971106 95479529 85854253 74054937 62520627 52588025 44682718 38570639 33955411
6038 33955411 30470527 27708561 25512799 23695540 22224571 21000258 20075274 19404155
6030 19404155 19024762 18803988 18678711 18498525 18484544 18465489 18377557 18349763 18452403 18613360
6020 18613360 18948155 19439256 20097787 20994528 22036949 23262651 24764020 26502726 28549165
$$ packed form
6079B6580222K626155L250835L976806N008217O350839Q216366J0173893J1356708
6071G7540041J0394720O642987O20166n373164r359976j0536445r712092q122354
6063E2093883o160101m328539k838372j611151n81443K27672R34919J740215K614330
6054D2091413L721826N114368P018923R252946J1100972J1137277Q189154K344227
6046I9971106m491577r625276j1799316j1534310r932602p905307o112079m615228
6038C3955411l484884k761966k195762j817259j470969j224313r24984o71119
6030A9404155l79393k20774j25277j80186j3981j9055q7932k7794J02640J60957
6020A8613360L34795M91101O58531Q96741J042421J225702J501369J738706K046439
$$ plain form
6011 28549165 30954183 33600729 36427238 39218071 41881912 44103671 46073931 48080551
6003 48080551 50735353 54424610 59371219 64746624 68872574 69995105 67624791 62629016
5995 62629016 56387746 50411909 45416686 41599770 38862093 37119214 36141660 35868097
5987 35868097 36354706 37479239 39226089 41629247 44943664 49208900 54597889 61626506
5979 61626506 70286359 79570756 87736236 92550857 92716188 88363844 81286235 73066372
5971 73066372 64898623 57428294 50933980 45468718 40940155 37185480 34123076 31655661
5963 31655661 29738207 28276774 27161825 26456319 26145940 26126473 26440112 26912140 27436042
5954 27436042 27820340 28010706 27810153 27213290 26202961 24922233 23467412 21882086 20302237
$$ packed form
6011B8549165K405018K646546K826509K790833K663841K221759J970260K006620
6003D8080551K654802L689257M946609N375405M125950J122531k370314m995775
5995F2629016o241270n975837m995223l816916k737677j742879r77554k73563
5987C5868097M86609J124533J746850K403158L314417M265236N388989P028617
5979F1626506Q659853R284397Q165480M814621J65331m352344p077609q219863
5971G3066372q167749p470329o494314n465262m528563l754675l062404k467415
5963C1655661j917454j461433j114949p05506l10379j9467L13639M72028N23902
5954B7436042L84298J90366k00553n96863j010329j280728j454821j585326j579849
$$ plain form
5945 20302237 18837482 17651187 16567020 15695544 14942800 14447119 14074421 13745678 13506608
5936 13506608 13343308 13290426 13199150 13038284 12845961 12656415 12479484 12305985 12133059 11937166
5926 11937166 11762277 11565701 11391258 11131376 10824146 10367427 10029844 9667286 9290038
5917 9290038 9095021 9005860 8923558 8915825 9074612 9311973 9591041 9896215 10123688 10120149 9802125
5906 9802125 9302548 8687205 8053718 7429891 6884563 6430486 6052262 5658923 5405842 5176349
5896 5176349 5034876 4909695 4826554 4785737 4757180 4831660 4893374 5006470 5149603 5293233
5886 5293233 5373589 5366891 5284656 5171487 5024506 4906080 4801688 4768299 4778669 4776456 4702110
5875 4702110 4666235 4482951 4320894 4207876 4028332 3807476 3629208 3540298 3507790 3475504
$$ packed form
5945B0302237j464755j186295j084167q71476p52744m95681l72698l28743k39070
5936A3506608j63300n2882r1276j60866j92323j89546j76931j73499j72926j95893
5926A1937166j74889j96576j74443k59882l07230m56719l37583l62558l77248
5917I290038j95017q9161q2302p733J58787K37361K79068L05174K27473l539l18024
5906I802125m99577o15343o33487o23827n45328m54077l78224l93339k53081k29493
5896E176349j41473j25181q3141m0817k8557P4480O1714J13096J43133J43630
5886E293233Q0356o698q2235j13169j46981j18426j04392l3389J0370k213p4346
5875D702110l5875j83284j62057j13018j79544k20856j78268q8910l2508l2286
$$ plain form
5865 3475504 3403473 3366795 3276573 3126282 2953552 2765281 2583800 2384854 2226409 2072242
5855 2072242 1898649 1852819 1702076 1592133 1534175 1443456 1326021 1289279 1263445 1241328 1169615
5844 1169615 1163672 1089389 1048024 1025475 951798 910616 944866 969168 953774 951419 885335 833136
5832 833136 766570 727751 711949 759930 728101 702551 680324 694785 659225 670241 629548 645295
5820 645295 594184 531315 538298 488857 434293 431727 430743 433311 466876 448528 425385 375149 388219
5807 388219 398357 441337 519566 509182 482161 508770 463007 397067 348984 343297 322501 300902
5795 300902 312325 303575 282109 226951 222034 289298 295854 305157 267831 243766 211511 190505
5783 190505 165114 106482 161805 195315 200726 185561 179346 168516 172282 75298 141260 211449
$$ packed form
5865C475504p2031l6678r0222j50291j72730j88271j81481j98946j58445j54167
5855B072242j73593m5830j50743j09943n7958r0719j17435l6742k5834k2117p1713
5844A169615n943p4283m1365k2549p3677m1182L4250K4302j5394k355o6084n2199
5832H33136o6566l8819j5802M7981l1829k5550k2227J4461l5560J1016m0693J5747
5820F45295n1111o2869O983m9441n4564k566r84K568L3565j8348k3143n0236J3070
5807C88219J0138M2980P8229j0384k7021K6609m5763o5940m8083n687k0796k1599
5795C00902J1423q750k1466n5158m917O7264O556R303l7326k4065l2255k1006
5783A90505k5391n8632N5323L3510N411j5165o215j0830L766r6984O5962P0189
$$ plain form
5771 211449 185874 150749 189687 229824 273539 228397 214479 253495 333514 286243 314591 363563
5759 363563 374354 436703 427651 429372 422913 430919 446751 348006 310461 313879 309536 208413 155829
5746 155829 262821 293364 269473 245301 245635 254255 327058 347275 378892 384157 395180 400300
5734 400300 451269 484187 518557 380764 359586 315382 248378 179977 116634 166973 158590 156118
5722 156118 122344 132345 124905 127149 144651 121446 140217 121491 95782 82460 51074 64893
5710 64893 125093 87455 64044 116669 167106 130076 98481 108163 116508 127302 113764 116972
5698 116972 140709 120247 120439 116643 150525 163095 118146 146784 114625 190030 272233 278543
5686 278543 282407 260733 249592 202454 310249 295571 328243 313762 284427 325911 301410 297146
$$ packed form
5771B11449k5575l5125L8938M0137M3715m5142j3918L9016Q0019m7271K8348M8972
5759C63563J0791O2349r052J721o459Q006J5832r8745l7545L418m343j01123n2584
5746A55829J06992L0543k3891k4172L34Q620P2803K0217L1617N265J1023N120
5734D00300N0969L2918L4370j37793k1178m4204o7004o8401o3343N0339q383k472
5722A56118l3774J0001p440K244J7502k3205J8771j8726k5709j3322l1386J3819
5710F4893O0200l7638k3411N2625N0437l7030l1595R682Q345J0794j3538L208
5698A16972K3737k0462J92l796L3882J2570m4949K8638l2159P5405Q2203O310
5686B78543L864k1674j1141m7138J07795j4678L2672j4481k9335M1484k4501m264
$$ plain form
5674 297146 287331 317803 323206 339957 325017 304506 269781 331048 388521 436500 478856 511644
5662 511644 559731 519694 501469 528592 559563 497711 494143 556851 459169 481257 499903 545634
5650 545634 566515 627303 683969 670049 676050 689807 766782 780340 798861 861087 857002 781856
5638 781856 647518 564705 573051 484942 510433 531444 504540 473227 457525 419617 404375 288460
5626 288460 348249 475740 436191 488804 542450 603280 619236 687351 800407 851273 893176
5615 893176 896616 880958 783049 653516 623027 552661 521642 539355 509227 513540 560292 626738
5603 626738 640012 619355 585132 615833 682708 785997 932641 997080 1039725 989004 895947
5592 895947 783683 593517 490456 407804 311654 262047 208478 237254 335256 281905 201758
$$ packed form
5674B97146r815L0472N403J6751j4940k0511l4725O1267N7473M7979M2356L2788
5662E11644M8087m0037j8225K7123L0971o1852l568O2708r7682K2088J8646M5731
5650E45634K0881O0788N6666j3920O001J3757P6975J3558J8521O2226m085p5146
5638G81856j34338q2813Q346q8109K5491K1011k6904l1313j5702l7908j5242j15915
5626B88460N9789J27491l9549N2613N3646O0830J5956O8115J13056N0866M1903
5615H93176L440j5658r7909j29533l0489p0366l1019J7713l0128M313M6752O6446
5603F26738J3274k0657l4223L0701O6875J03289J46644O4439M2645n0721r3057
5592H95947j12264j90166j03061q2652r6150m9607n3569K8776R8002n3351q0147
$$ plain form
5581 201758 195495 182612 223898 288526 320295 359754 446546 476330 607769 668782 655716 717045
5569 717045 689149 593909 539720 443559 301746 149511 128003 107352 106753 38417 -68904
5558 -68904 -69147 -97658 -131799 -59200 -73657 -59835 -75445 -56997 -75221 -63885 -38818 -62059
5546 -62059 -91414 -46264 61009 19660 -68620 -51674 -53 -82991 -97020 -43273 -827 -35897
5534 -35897 -80527 -82105 -11494 36627 18151 13642 71555 56823 60193 118584 68893 83163
5522 83163 84494 82461 176602 199017 203729 215973 265595 268207 204402 169945 179652 236202 295863
5509 295863 268300 230535 262468 317652 296197 234709 254724 209178 227873 256904 263836 269485
5497 269485 171601 191079 244118 187242 164104 218972 233705 146367 84883 90950 138376 141781
$$ packed form
5581B01758o263j2883M1286O4628L1769L9459Q6792K9784J31439O1013j3066O1329
5569G17045k7896r5240n4189r6161j41813j52235k1508k0651n99o8336j07321
5558f8904k43k8511l4141P2599j4457J3822j5610J8448j8224J1336K5067k3241
5546f2059k9355M5150J07273m1349q8280J6946N1621q2938j4029N3747M2446l5070
5534c5897m4630j578P0611M8121j8476m509N7913j4732L370N8391m9691J4270
5522H3163J331k033R4141K2415M712J2244M9622K612o3805l4457R707N6550N9661
5509B95863k7563l7765L1933N5184k1455o1488K0015m5546J8695K9031O932N649
5497B69485r7884J9478N3039n6876k3138N4868J4733q7338o1484O067M7426L405
$$ plain form
5485 141781 122356 162420 120339 139256 192773 195218 190175 288790 297061 238776 196159 154027
5473 154027 178861 185315 181224 172882 230404 221002 173777 149875 203429 144138 129526 110982
5461 110982 21873 70232 79447 118675 93106 75833 36640 59322 116548 100743 120144 111421
5449 111421 136978 186773 133150 196487 186939 160626 114754 164346 142882 129404 115701 114373
5437 114373 93249 172544 176273 113514 93970 100922 146942 99596 69538 66842 50054 5122
5425 5122 46738 134542 150881 100767 130981 71777 76044 103544 54470 -20832 85952 136660
5413 136660 162758 181304 188421 185761 166259 169830 179787 161395 217659 249608 229214 239191 231220
5400 231220 252281 151067 204159 284000 232531 261115 243541 293520 272860 283283 311419
$$ packed form
5485A41781j9425M0064m2081J8917N3517K445n043R8615Q271n8285m2617m2132
5473A54027K4834O454m091q342N7522r402m7225k3902N3554n9291j4612j8544
5461A10982q9109M8359R215L9228k5569j7273l9193K2682N7226j5805J9401q723
5449A11421K5557M9795n3623O3337r548k6313m5872M9592k1464j3478j3703j328
5437A14373k1124P9295L729o2759j9544O952M6020m7346l0058k696j6788m4932
5425E122M1616Q7804J6339n0114L0214n9204M267K7500m9074p5302J06784N0708
5413A36660K6098J8546P117k660j9502L571R957j8392N6264L1949k0394R977p971
5400B31220K1061j01214N3092P9841n1469K8584j7574M9979k0660J0423K8136
$$ plain form
5389 311419 286670 264196 308067 353163 312563 388102 394842 400734 368844 375167 434531 417657
5377 417657 501526 518631 591332 601900 581541 599065 603034 536606 511995 546469 584900 629144
5365 629144 637195 666210 715011 785472 822594 816945 837772 812906 868957 993858 1023812 1066163
5353 1066163 1050284 1118880 1106498 1076126 1109227 1166649 1170112 1206553 1256049 1259404 1299000 1384277
5341 1384277 1458246 1493780 1464892 1475494 1503490 1556745 1632535 1693273 1758500 1760981 1852103 1847374
5329 1847374 1842238 1974557 1985598 2008688 2123883 2182516 2211064 2289175 2329671 2426309 2444159
5318 2444159 2525899 2563105 2626020 2712660 2788789 2912015 2999665 3038855 3043179 3251551 3351781
5307 3351781 3443310 3565479 3681373 3808033 3900826 4021255 4149944 4299467 4484462 4649628
$$ packed form
5389C11419k4749k2474M3871M5096m0600P5539O740N892l1890O323N9364j6874
5377D17657Q3869J7105P2701J0568k0359J7524L969o6428k4611L4474L8431M4244
5365F29144Q051K9015M8801P0461L7122n649K0827k4866N6051J24901K9954M2351
5353A066163j5879O8596j2382l0372L3101N7422L463L6441M9496L355L9596Q5277
5341A384277P3969L5534k8888J0602K7996N3255P5790O0738O5227K481R1122m729
5329A847374n136J32319J1041K3090J15195N8633K8548P8111M0496R6638J7850
5318B444159Q1740L7206O2915Q6640P6129J23226Q7650L9190M324K08372J00230
5307C351781R1529J22169J15894J26660R2793J20429J28689J49523J84995J65166
$$ plain form
5297 4649628 4924142 5152475 5401733 5667074 5981455 6224565 6539575 6893352 7277504 7744526
5287 7744526 8379817 9047902 9881896 10858259 12027696 13507781 15380877 17740766 20569799
5278 20569799 23461889 25804520 26930672 26803458 26109785 25449073 25204294 25627007 26868800
5269 26868800 29016060 32379261 36868052 42064465 47130558 51315189 54035544 55693406
5261 55693406 56588429 57145195 57401433 57340138 57323573 57880882 58955551 60124564 61321231
5252 61321231 62680888 64237663 65770329 67344997 69306487 71801504 74425903 76596425
5244 76596425 77825111 77722556 76244377 73715084 70926194 68583274 66958970 65857542
5236 65857542 64761060 63328536 61841666 60411631 58712592 57036810 55867477 55358467
$$ packed form
5297D649628K74514K28333K49258K65341L14381K43110L15010L53777L84152M67022
5287G744526O35291O68085Q33994R76363J169437J480085J873096K359889K829033
5278B0569799K892090K342631J126152j27214o93673o60712k44779M22713J241793
5269B6868800K147260L363201M488791N196413N066093M184631K720355J657862
5261E5693406Q95023N56766K56238o1295j6565N57309J074669J169013J196667
5252F1321231J359657J556775J532666J574668J961490K495017K624399K170522
5244G6596425J228686j02555j478179k529293k788890k342920j624304j101428
5236F5857542j096482j432524j486870j430035j699039j675782j169333n09010
$$ plain form
5228 55358467 55127755 55085068 55219312 55271027 54431997 52008121 48012819 42999653 37759915
5219 37759915 33078319 29317034 26510464 24694823 23817549 23893744 24776449 25967211 26592082
5210 26592082 25997016 24056985 21375068 18592783 16103580 13979437 12284714 10835962
5202 10835962 9811942 8970723 8365738 7790374 7321798 6917827 6534977 6205650 5996343
5193 5996343 5744588 5458967 5292233 5117228 4955632 4713938 4500168 4345364 4196433 4135709
5183 4135709 4055496 3893504 3774506 3608634 3606212 3510905 3390256 3292864 3209994 3126889 3110521
5172 3110521 3086085 2963165 2959383 2900752 2768086 2682034 2654095 2634689 2527548 2489798 2539773
5161 2539773 2484637 2438877 2416232 2291661 2282144 2267913 2277577 2259811 2200926 2196542 2220755 2207926
$$ packed form
5228E5358467k30712m2687J34244N1715q39030k423876l995302n013166n239738
5219C7759915m681596l761285k806570j815641q77274P6195Q82705J190762O24871
5210B6592082n95066j940031k681917k782285k489203k124143j694723j448752
5202A0835962j024020q41219o04985n75364m68576m03971l82850l29327k09307
5193E996343k51755k85621j66734j75005j61596k41694k13770j54804j48931o0724
5183D135709q0213j61992j18998j65872k422r5307j20649r7392q2870q3105j6368
5172C110521k4436j22920l782n8631j32666q6052k7939j9406j07141l7750M9975
5161B539773n5136m5760k2645j24571r517j4231R664j7766n8885m384K4213j2829
$$ plain form
5149 2207926 2225313 2268154 2275977 2299158 2291937 2222139 2236648 2309427 2432007 2400369 2448851 2588459
5137 2588459 2692126 2851535 2954869 3095577 3298259 3564585 3921858 4249391 4547261 4740682
5127 4740682 4754880 4556574 4284751 4003800 3800863 3679547 3622055 3563992 3610335 3760382
5117 3760382 3941083 4181381 4589059 4963379 5284846 5390447 5211714 4933900 4563664 4242783
5107 4242783 3991397 3760845 3573382 3484610 3356764 3211841 3078202 3063419 3029833 2935125
5097 2935125 2890924 2904645 2927227 2978770 3014340 3034475 3126117 3190869 3234269 3395379 3539517
5086 3539517 3656125 3894955 4061488 4287305 4640919 4931631 5429932 5994874 6641443 7314049
5076 7314049 7686113 7792880 7562668 7125877 6590078 6094283 5772496 5495484 5331790 5345148
$$ packed form
5149B207926J7387M2841P823K3181p221o9798J4509P2779J22580l1638M8482J39608
5137B588459J03667J59409J03334J40708K02682K66326L57273L27533K97870J93421
5127D740682J4198j98306k71823k80951k02937j21316n7492n8063M6343J50047
5117C760382J80701K40298M07678L74320L21467J05601j78733k77814l70236l20881
5107D242783k51386k30552j87463q8772j27846j44923j33639j4783l3586r4708
5097B935125m4201J3721K2582N1543L5570K0135R1642O4752M3400J61110J44138
5086C539517J16608K38830J66533K25817L53614K90712M98301N64942O46569O72606
5076G314049L72064J06767k30212m36791n35799m95795l21787k77012j63694J3358
$$ plain form
5066 5345148 5386320 5581565 5978015 6500186 6982767 7391008 7574856 7362345 6854448 6242994
5056 6242994 5630061 5072415 4588943 4222835 4045663 3904721 3802742 3604590 3533594 3444074
5046 3444074 3334819 3245127 3263475 3227984 3125380 3038484 3012384 3013431 2920452 2891959 2904130
5035 2904130 2851073 2771315 2825762 2877072 2802054 2748748 2836180 2900127 2985228 3042075 3027327
5024 3027327 3059878 2981329 2983748 3066724 3081079 3096345 3125500 3124636 3172716 3259568 3258472 3263074
5012 3263074 3281069 3273559 3298389 3348631 3393934 3505592 3492037 3538104 3597082 3596387 3676628 3697175
5000 3697175 3809594 3809822 3886473 3924802 3957423 3997972 3910730 3954278 4026716 4039365 4170562
4989 4170562 4213748 4317326 4459052 4579050 4661770 4769646 4900339 5056549 5186272 5310649
$$ packed form
5066E345148M1172J95245L96450N22171M82581M08241J83848k12511n07897o11454
5056F242994o12933n57646m83472l66108j77172j40942j01979j98152p0996q9520
5046C444074j09255q9692J8348l5491j02604q6896k6100J047r2979k8493J2171
5035B904130n3057p9758N4447N1310p5018n3306Q7432O3947Q5101N6847j4748
5024C027327L2551p8549K419Q2976J4355J5266K9155q64M8080Q6852j096M602
5012C263074J7995p510K4830N0242M5303J11658j3555M6067N8978o95Q0241K0547
5000C697175J12419K28P6651L8329L2621M0549q7242M3548P2438J2649J31197
4989D170562M3186J03578J41726J19998Q2720J07876J30693J56210J29723J24377
$$ plain form
4979 5310649 5453036 5582325 5723498 5791467 5964578 6074855 6177589 6222307 6418550 6685065
4969 6685065 7036234 7549459 8229470 8821243 9363830 9807550 10062622 9906195 9602597 9277539
4959 9277539 8917272 8635655 8414077 8229785 8045965 7938771 7927498 7973654 8055337 8179740
4949 8179740 8361337 8582778 8803733 9152315 9527382 9893389 10358619 10950110 11639363 12320356
4939 12320356 12983613 13434319 13626221 13505642 13169681 12792546 12411955 12135886 11962091
4930 11962091 11817587 11885006 11994147 12026010 12181038 12278496 12462191 12623099 12911285 13152016
4920 13152016 13399102 13705474 14029024 14402804 14784439 15331642 15977227 16553960 17031209
4911 17031209 17455998 17715459 17812744 17906445 18096800 18381472 18718061 19175057 19634087 20105557
$$ packed form
4979E310649J42387J29289J41173O7969J73111J10277J02734M4718J96243K66515
4969F685065L51169N13225O80011N91773N42587M43720K55072j56427l03598l25058
4959I277539l60267k81617k21578j84292j83820j07194j1273M6156Q1683J24403
4949H179740J81597K21441K20955L48582L75067L66007M65230N91491O89253O80993
4939A2320356O63257M50706J91902j20579l35961l77135l80591k76069j73795
4930A1962091j44504O7419J09141L1863J55028R7458J83695J60908K88186K40731
4920A3152016K47086L06372L23550L73780L81635N47203O45585N76733M77249
4911A7031209M24789K59461R7285R3701J90355K84672L36589M56996M59030M71470
$$ plain form
4901 20105557 20727200 21409153 22183487 22996736 23904169 24881205 25844113 26933015 28277149
4892 28277149 29783135 31461536 33374024 35705464 38384001 41483822 45125311 49416282
4884 49416282 54673524 61520937 70872166 82624159 94571561 102703993 104170924 99035978
4876 99035978 90545764 82035778 74923641 69841489 66993768 66020293 66816439 69213211
4868 69213211 73052592 78528006 85865951 95743866 108899596 125190119 142803547 159154265
4860 159154265 172413639 182284424 188508831 189587609 184336649 174271553 163481486 154770343
4852 154770343 148681817 145061363 143368400 142971505 143521258 144970056 147227444 150343634
4844 150343634 154853344 161408194 170389005 181128497 190451048 194416203 191235609 182780368
$$ packed form
4901B0105557O21643O81953P74334Q13249R07433R77036R62908J088902J344134
4892B8277149J505986J678401J912488K331440K678537L099821L641489M290971
4884D9416282N257242O847413R351229J1751993J1947402Q132432J466931n134946
4876I9035978q490214q509986p112137n082152k847721r73475P96146K396772
4868F9213211L839381N475414P337945R877915J3155730J6290523J7613428J6350718
4860A59154265J3259374R870785O224407J078778n250960j0065096j0790067q711143
4852A54770343o088526l620454j692963l96895N49753J448798K257388L116190
4844A50343634M509710O554850Q980811J0739492R322551L965155l180594q455241
$$ plain form
4836 182780368 173172088 165194295 159979885 157996511 159050073 162830941 168771450 176573015
4828 176573015 186077623 197401748 210282825 224305047 238810214 252413513 263930047
4821 263930047 272525353 277576604 279082970 277168372 272041495 264137193 253925454 242086509
4813 242086509 229836833 218272265 208449636 200760711 195434102 192182513 190538527 190269294
4805 190269294 191052725 192755502 195471984 199556629 205317597 213223383 223468369 235946456
4797 235946456 250245942 265422803 280130847 293077354 303131241 309828533 312963039
4790 312963039 312698049 308806662 301330198 290494805 277052635 262294844 247414026 233311727
4782 233311727 220524537 209003071 198726244 189590217 181624518 174862574 169313544 164992054
$$ packed form
4836A82780368r608280p977793n214410j983374J053562L780868N940509P801565
4828A76573015R504608J1324125J2881077J4022222J4505167J3603299J1516534
4821B63930047Q595306N051251J506366j914598n126877p904302j0211739j1838945
4813B42086509j2249676j1564568r822629p688925n326609l251589j643986k69233
4805A90269294P83431J702777K716482M084645N760968P905786J0244986J2478087
4797B35946456J4299486J5176861J4708044J2946507J0053887O697292L134506
4790C12963039k64990l891387p476464j0835393j3442170j4757791j4880818j4102299
4782B33311727j2787190j1521466j0276827r136027p965699o761944n549030m321490
$$ plain form
4774 164992054 161787648 159694964 158708987 158539237 158944639 159528228 159920893 160027868 159725400
4765 159725400 159039971 157929224 156158948 153398472 149211865 143579535 136796342 129318830
4757 129318830 121656548 114167464 107081934 100399356 94179386 88351778 82841430 77779744
4749 77779744 73231189 69057400 65410180 62103522 59224393 56697287 54456268 52570782
4741 52570782 50861813 49438821 48123530 47052347 46166871 45392983 44646824 43938747 43375226
4732 43375226 42766283 42126621 41376330 40654242 39834417 39021485 38222489 37437607 36552682
4723 36552682 35542357 34490603 33457405 32399254 31411283 30589451 29798669 29120516 28613308
4714 28613308 28189869 27952595 27836367 27669619 27522324 27379637 27183550 26917966 26666270
$$ packed form
4774A64992054l204406k092684r85977j69750M05402N83589L92665J06975l02468
4765A59725400o85429j110747j770276k760476m186607n632330o783193p477512
4757A29318830p662282p489084p085530o682578o219970n827608n510348n061686
4749G7779744m548555m173789l647220l306658k879129k527106k241019j885486
4741E2570782j708969j422992j315291j071183q85476p73888p46159p08077n63521
4732D3375226o08943o39662p50291p22088q19825q12932p98996p84882q84925
4723C6552682j010325j051754j033198j058151r87971q21832p90782o78153n07208
4714B8613308m23439k37274j16228j66748j47295j42687j96087k65584k51696
$$ plain form
4705 26666270 26241371 25763037 25164569 24572570 23990320 23545314 23176019 22884602 22578900
4696 22578900 22188559 21787620 21341650 20914734 20512559 20132163 19774441 19394609 18918122
4687 18918122 18472950 18144411 17848959 17552492 17276267 17059151 16842336 16689339 16612877 16435220
4677 16435220 16103428 15760571 15315017 14899303 14579918 14389686 14321062 14329752 14418995 14471974
4667 14471974 14617695 14690565 14699472 14645725 14552398 14394450 14218820 13929048 13669607 13415688
4657 13415688 13232581 13051466 12832708 12624636 12446654 12267707 12054135 11738344 11429795
4648 11429795 11051877 10737896 10449665 10154854 9979000 9866832 9717079 9678495 9673741 9564428
4638 9564428 9466970 9520805 9588442 9609029 9617317 9655423 9697231 9807875 9810247 9775393 9742238 9654309
$$ packed form
4705B6666270m24899m78334n98468n91999n82250m45006l69295k91417l05702
4696B2578900l90341m00939m45970m26916m02175l80396l57722l79832m76487
4687A8918122m45172l28539k95452k96467k76225k17116k16815j52997p6462j77657
4677A6435220l31792l42857m45554m15714l19385j90232o8624Q690Q9243N2979
4667A4471974J45721P2870Q907n3747r3327j57948j75630k89772k59441k53919
4657A3415688j83107j81115k18758k08072j77982j78947k13572l15791l08549
4648A1429795l77918l13981k88231k94811j75854j12168j49753l8584m754j09313
4638I564428r7458N3835O7637K0587Q288L8106M1808J10644K372l4854l3155q7929
$$ plain form
4626 9654309 9677212 9671241 9720608 9841855 10029704 10284490 10573497 11006939 11527032 12266251
4616 12266251 12967096 13328141 13315241 12960213 12555087 12076054 11771073 11575568 11499595 11553221
4606 11553221 11794103 12108047 12447763 12871544 13505244 14267419 15242699 16378997 17680358
4597 17680358 19127771 20558318 21944480 23355397 24663311 25799560 26890000 28207318
4589 28207318 30076416 32666295 36299263 41300455 48206707 57644694 69735757 82694874
4581 82694874 93012738 97399079 94886795 87915435 80049501 73597767 69606891 68480757
4573 68480757 70582733 76346165 85138141 94927557 101957765 103264539 98546381 90440719
4565 90440719 82364412 76549936 74358260 76421982 82146109 89242760 93968718 93446172
$$ packed form
4626I654309K2903n971M9367J21247J87849K54786K89007M33442N20093P39219
4616A2266251P00845L61045j2900l55028m05126m79033l04981j95505p5973N3626
4606A1553221K40882L13944L39716M23781O33700P62175R75280J136298J301361
4597A7680358J447413J430547J386162J410917J307914J136249J090440J317318
4589B8207318J869098K589879L632968N001192O906252R437987J2091063J2959117
4581H2694874J0317864M386341k512284o971360p865934o451734l990876j126134
4573F8480757K101976N763432Q791976R789416P030208J306774m718158q105662
4565I0440719q076307n814476k191676K063722N724127P096651M725958n22546
$$ plain form
4557 93446172 87704408 79072303 70444301 63500871 59056209 57479385 59018555 63842267
4549 63842267 71113201 78272287 81719300 79460124 71934166 61698394 51514170 42662132
4541 42662132 35457468 29877628 25713194 22624500 20381820 18605157 17214568 15994011
4533 15994011 14979161 14170122 13467841 12870115 12327115 11837383 11430223 11071641 10760931
4524 10760931 10442006 10095090 9749802 9391164 9137626 8868241 8601316 8369109 8209409
4515 8209409 8070668 7901709 7836663 7696827 7604385 7522601 7398207 7367202 7284974 7242460 7240593
4504 7240593 7137137 7058130 6971391 6934130 6837485 6781157 6694530 6583048 6447981 6354339 6261621
4493 6261621 6120641 5992458 5934407 5849394 5779001 5694375 5565627 5446298 5384603 5331964 5285752
$$ packed form
4557I3446172n741764q632105q628002o943430m444662j576824J539170M823712
4549F3842267P270934P159086L447013k259176p525958j0235772j0184224q852038
4541D2662132p204664n579840m164434l088694k242680j776663j390589j220557
4533A5994011j014850q09039p02281n97726n43000m89732m07160l58582l10710
4524A0760931l18925l46916l45288l58638k53538k69385k66925k32207j59700
4515H209409j38741j68959o5046j39836r2442q1784j24394l1005q2228m2514j867
4504G240593j03456p9007q6739l7261r6645n6328q6627j11482j35067r3642r2718
4493F261621j40980j28183n8051q5013p0393q4626j28748j19329o1695n2639m6212
$$ plain form
4482 5285752 5187592 5130228 5082342 5049262 5081752 5068437 5034346 4959228 4886337 4750284 4593804
4471 4593804 4412159 4343342 4329342 4228738 4164842 4175966 4137350 4088759 4024103 4059711 4030907
4460 4030907 4051853 4094059 4111951 4071932 4057988 4033639 3983223 3964977 3938981 3796354 3688062
4449 3688062 3683048 3587439 3557434 3649642 3608692 3592809 3639181 3649138 3709909 3824510 3993079
4438 3993079 4195639 4321776 4358041 4189232 3938782 3693872 3546806 3381750 3247145 3247497
4428 3247497 3164142 3116537 3179783 3176456 3087887 3064786 3050220 3022607 2967830 2889641 2842192 2789899
4416 2789899 2767314 2830702 2718882 2769064 2795392 2781436 2748064 2725185 2806067 2794397 2739761
4405 2739761 2773583 2743286 2777167 2844809 2869851 2896738 2916950 2965471 2986578 3022237 2999732
$$ packed form
4482E285752r8160n7364m7886l3080L2490j3315l4091p5118p2891j36053j56480
4471D593804j81645o8817j4000j00604o3896J1124l8616m8591o4656L5608k8804
4460D030907K0946M2206J7892m0019j3944k4349n0416j8246k5996j42627j08292
4449C688062n014r5609l0005R2208m0950j5883M6372R957O0771J14601J68569
4438C993079K02560J26137L6265j68809k50450k44910j47066j65056j34605L52
4428C247497q3355m7605O3246l327q8569k3101j4566k7613n4777p8189m7449n2293
4416B789899k2585O3388j11820N0182K6328j3956l3372k2879Q0882j1670n4636
4405B739761L3822l0297L3881O7642K5042K6887K0212M8521K1107L5659k2505
$$ plain form
4394 2999732 3013538 2956921 2947112 2934073 2938470 2918564 2891637 2891235 2854905 2837216 2779157 2842566
4382 2842566 2891937 2911277 2938282 2973961 2976461 3025012 3049329 3106168 3157820 3151082 3136906 3173176
4370 3173176 3196168 3208109 3209492 3199590 3166417 3184963 3205750 3165710 3251779 3274446 3318550 3329171
4358 3329171 3341437 3361725 3391861 3421963 3491802 3587905 3646925 3696624 3738774 3797359 3868247
4347 3868247 4033056 4114168 4190150 4239533 4340729 4419411 4522093 4636878 4763616 4922891
4337 4922891 5063125 5269497 5529884 5858171 6286793 6785127 7510002 8535408 9682161
4328 9682161 10699334 11269030 11333142 10973957 10489145 9999142 9677165 9556738 9647301 9953527
4318 9953527 10555504 11306537 12139906 12942791 13470374 13626448 13663885 13743485 13900334 14172695
$$ packed form
4394B999732J3806n6617r809j3039M397j9906k6927m02l6330j7689n8059O3409
4382B842566M9371J9340K7005L5679K500M8551K4317N6839N1652o738j4176L6270
4370C173176K2992J1941J383r902l3173J8546K0787m0040Q6069K2667M4104J0621
4358C329171J2266K0288L0136L0102O9839R6103N9020M9699M2150N8585P0888
4347C868247J64809Q1112P5982M9383J01196P8682J02682J14785J26738J59275
4337D922891J40234K06372K60387L28287M28622M98334P24875J025406J146753
4328I682161J017173N69696O4112l59185m84812m90003l21977j20427R0563L06226
4318I953527O01977P51033Q33369Q02885N27583J56074L7437P9600J56849K72361
$$ plain form
4308 14172695 14656389 15261468 15921212 16471145 16749891 16668847 16305979 15802836 15251106 14866240
4298 14866240 14551494 14418415 14516869 14736506 15136626 15552029 15694938 15421891 14860511 14140552
4288 14140552 13299424 12489576 11756435 11014191 10371007 9762473 9255679 8817608 8323512
4279 8323512 7929759 7586301 7269029 7074575 6839361 6632941 6472088 6326707 6200718 6107436
4269 6107436 6058115 5963395 5828856 5727457 5678623 5684634 5618372 5569381 5484880 5451033 5458857
4258 5458857 5444803 5422885 5390515 5434415 5468344 5436813 5453086 5584915 5603867 5591272 5677409
4247 5677409 5764716 5770287 5805240 5882103 5936119 5999872 6111410 6177557 6180671 6216156 6299621 6356904
4235 6356904 6429695 6470585 6564358 6678123 6811449 6852261 6981466 7099655 7202673 7328262
$$ packed form
4308A4172695M83694O05079O59744N49933K78746q1044l62868n03143n51730l84866
4298A4866240l14746j33079R8454K19637M00120M15403J42909k73047n61380p19959
4288A4140552q41128q09848p33141p42244o43184o08534n06794m38071m94096
4279H323512l93753l43458l17272j94454k35214k06420j60853j45381j25989r3282
4269F107436m9321r4720j34539j01399m8834O011o6262m8991q4501l3847P824
4258E458857j4054k1918l2370M3900L3929l1531J6273J31829J8952j2595Q6137
4247E677409Q7307N571L4953P6863N4016O3753J11538O6147L114L5485Q3465N7283
4235F356904P2791M0890R3773J13765J33326M0812J29205J18189J03018J25589
$$ plain form
4225 7328262 7420270 7605625 7806673 7943713 8126597 8267276 8453657 8611897 8759036 8981024
4215 8981024 9150653 9379094 9649656 9918887 10161042 10441710 10765182 11199817 11597159 12042364
4205 12042364 12572709 13130438 13754669 14473076 15235484 16018693 16983917 18034557 19192262
4196 19192262 20429846 21797785 23172212 24421959 25646423 26722850 27663607 28637378
4188 28637378 29399601 30142427 30762269 31386381 32100912 32805363 33735390 34889269 36323033
4179 36323033 38091911 40235983 42706044 45115044 47331075 49313323 51003889 52462500
4171 52462500 53830229 55100419 56294236 57535222 58725173 59903110 61044522 62189090
4163 62189090 63475811 64795713 66412727 68262605 69951873 71536864 72910491 74166873
$$ packed form
4225G328262R2008J85355K01048J37040J82884J40679J86381J58240J47139K21988
4215H981024J69629K28441K70562K69231K42155K80668L23472M34635L97342M45205
4205A2042364N30345N57729O24231P18407P62408P83209R65224J050640J157705
4196A9192262J237584J367939J374427J249747J224464J076427R40757R73771
4188B8637378P62223P42826O19842O24112P14531P04451R30027J153879J433764
4179C6323033J768878K144072K470061K409000K216031J982248J690566J458611
4171E2462500J367729J270190J193817J240986J189951J177937J141412J144568
4163F2189090J286721J319902J617014J849878J689268J584991J373627J256382
$$ plain form
4155 74166873 75493943 77274832 79621902 82856634 86996968 91724973 96395651 100107786
4147 100107786 102503886 103581362 104051370 104437131 105106580 106186677 107410127 108803834
4139 108803834 110104567 111277571 112290349 113168765 113939457 114656006 115255589 115672312 115758815
4130 115758815 115665930 115628858 115830040 116604436 118272146 120950032 124653121 129512561 135127181
4121 135127181 141024956 146480297 151003175 154709420 158121969 161630340 165331328 168883072
4113 168883072 171937009 174261395 176009974 177481761 178618592 179313456 179214584 178534840 177600432
4104 177600432 176715076 176265713 176452805 177399619 179166996 181688021 184708183 187753124 190591265
4095 190591265 192786203 194308292 194902277 194688678 193993753 193218528 192865469 193122405 193999232
$$ packed form
4155G4166873J327070J780889K347070L234732M140334M728005M670678L712135
4147A00107786K396100J077476M70008L85761O69449J080097J223450J393707
4139A08803834J300733J173004J012778Q78416P70692P16549N99583M16723Q6503
4130A15758815r2885l7072K01182P74396J667710K677886L703089M859440N614620
4121A35127181N897775N455341M522878L706245L412549L508371L700988L551744
4113A68883072L053937K324386J748579J471787J136831O94864r8872o79744r34408
4104A77600432q85356m49363J87092R46814J767377K521025L020162L044941K838141
4095A90591265K194938J522089N93985k13599o94925p75225l53059K56936Q76827
$$ plain form
4086 193999232 195456200 197066761 198536154 199539863 199706756 198988002 197637239 196266536
4078 196266536 195035677 194134864 193195001 191662772 189403528 186860447 184596864 182693156
4070 182693156 180583945 177437196 172933188 167504338 161784166 156407715 151819949 148221491
4062 148221491 145730307 144272313 143678040 143359741 143211458 142868678 142097493 140997577 139420595
4053 139420595 137563208 135462860 133054380 130325882 127577299 124831926 122429657 120537021
4045 120537021 119320366 118864391 118720107 118456439 117372038 114761931 110897081 106308853
4037 106308853 101865686 97919135 94610289 92045195 90112782 88529888 87090129 85461442
4029 85461442 83546643 81444906 79250529 77117210 75035985 73165560 71498455 69939687
$$ packed form
4086A93999232J456968J610561J469393J003709J66893p18754j350763j370703
4078A96266536j230859r00813r39863j532229k259244k543081k263583j903708
4070A82693156k109211l146749m504008n428850n720172n376451m587766l598458
4062A48221491k491184j457994n94273l18299j48283l42780p71185j099916j576982
4053A39420595j857387k100348k408480k728498k748583k745373k402269j892636
4045A20537021j216655m55975j44284k63668j084401k610107l864850m588228
4037A06308853m443167l946551l308846k565094j932413j582894j439759j628687
4029H5461442j914799k101737k194377k133319k081225j870425j667105j558768
$$ plain form
4021 69939687 68573998 67265892 65919815 64641500 63358655 61972331 60419788 58541749
4013 58541749 56359540 53964663 51453409 49029999 46807163 44946467 43419239 42048646
4005 42048646 40809159 39827797 38835963 37776373 36715051 35618355 34557127 33568825 32525658
3996 32525658 31340088 30068849 28812097 27503840 26172110 24833163 23642869 22544701
3988 22544701 21426509 20430475 19601141 18833151 18103502 17379859 16741049 16100322 15558389
3979 15558389 15017643 14459082 13929746 13448865 13050463 12602681 12153722 11737784 11442771
3970 11442771 11153214 10804743 10470336 10191020 9931949 9692345 9552285 9295609 9071755
3961 9071755 8867297 8640664 8492620 8255810 8071806 7928400 7788267 7595804 7402703 7231438
$$ packed form
4021F9939687j365689j308106j346077j278315j282845j386324j552543j878039
4013E8541749k182209k394877k511254k423410k222836j860696j527228j370593
4005D2048646j239487r81362r91834j059590j061322j096696j061228r88302j043167
3996C2525658j185570j271239j256752j308257j331730j338947j190294j098168
3988B2544701j118192r96034q29334p67990p29649p23643o38810o40727n41933
3979A5558389n40746n58561n29336m80881l98402m47782m48959m15938k95013
3970A1442771k89557l48471l34407k79316k59071k39604j40060k56676k23854
3961I071755k04458k26633j48044k36810j84004j43406j40133j92463j93101j71265
$$ plain form
3951 7231438 7104429 7028133 6886454 6710135 6586109 6446053 6313408 6162140 6099590 6029487
3941 6029487 5959309 5862148 5721420 5620531 5550788 5485717 5407803 5285518 5150979 5054544 4935217
3930 4935217 4916192 4826681 4735773 4655882 4603102 4572272 4511494 4467041 4367309 4291809 4223393
3919 4223393 4176661 4130149 4059860 3991819 3929131 3816684 3787878 3765729 3725657 3744553 3734840
3908 3734840 3672594 3644433 3588708 3557576 3560410 3479341 3418389 3414658 3377542 3392114 3360138 3371631
3896 3371631 3382294 3383880 3374607 3356412 3344187 3319705 3283133 3260413 3238424 3199173 3251972 3229779
3884 3229779 3230693 3286028 3249227 3229535 3230150 3218023 3198328 3117430 3113006 3138490 3176138 3220832
3872 3220832 3303495 3319247 3334975 3305949 3388261 3475307 3498121 3537526 3636327 3659354 3694113
$$ packed form
3951G231438j27009p6296j41679j76319j24026j40056j32645j51268o2550p0103
3941F029487p0178r7161j40728j00889o9743o5071p7914j22285j34539r6435j19327
3930D935217j9025q9511r0908p9891n2780l0830o0778m4453r9732p5500o8416
3919D223393m6732m6512p0289o8041o2688j12447k8806k2149m0072J8896r713
3908C734840o2246k8161n5725l1132K834q1069o0952l731l7116J4572l1976J1493
3896C371631J0663J586r273j8195j2225k4482l6572k2720k1989l9251N2799k2193
3884C229779R14N5335l6801j9692O15j2127j9695q0898m424K5484L7648M4694
3872C220832Q2663J5752J5728k9026Q2312Q7046K2814L9405R8801K3027L4759
$$ plain form
3861 3694113 3721202 3751821 3719126 3717337 3793759 3891898 3963948 3901975 3948241 3991548 4055071 4111220
3849 4111220 4082304 4094360 4136741 4171357 4158189 4186611 4308637 4309340 4289906 4264307 4245250 4296595
3837 4296595 4278394 4269870 4284529 4196575 4186886 4225643 4154838 4099293 4101169 4048996 3988214 3960285
3825 3960285 3921057 3822734 3807788 3774413 3764850 3775052 3758008 3776231 3779690 3695881 3684857 3724642
3813 3724642 3664849 3582093 3494258 3484176 3381813 3214653 3186718 3124102 3078063 3059201 3053489
3802 3053489 3008345 2960012 2989160 2971240 2961914 2981792 2994861 2956252 3005813 2993098 3026514 2966035
3790 2966035 2797190 2748658 2709420 2620064 2564855 2543089 2481574 2454791 2389633 2289902 2275462
3779 2275462 2307527 2267778 2160721 2113940 2035239 1968811 1974564 2028587 2045784 2001173 1987659
$$ packed form
3861C694113K7089L0619l2695j789P6422R8139P2050o1973M6266M3307O3523N6149
3849D111220k8916J2056M2381L4616j3168K8422J22026P03j9434k5599j9057N1345
3837D296595j8201q524J4659q7954r689L8757p0805n5545J876n2173o0782k7929
3825C960285l9228r8323j4946l3375r563J0202j7044J8223L459q3809j1024L9785
3813C724642n9793q2756q7835j0082j02363j67160k7935o2616m6039j8862n712
3802C053489m5144m8333K9148j7920r326J9878J3069l8609M9561j2715L3416o0479
3790B966035j68845m8532l9238q9356n5209k1766o1515k6783o5158r9731j4440
3779B275462L2065l9749j07057m6781p8701o6428N753N4023J7197m4611j3514
$$ plain form
3768 1987659 1968024 1933013 1911804 1908012 1903415 1887829 1863094 1892777 1863959 1862692 1770397 1731395
3756 1731395 1766379 1776734 1753895 1685874 1653383 1638519 1591333 1606924 1617086 1578222 1611140
3745 1611140 1553940 1541840 1566015 1513242 1446195 1436149 1370662 1392098 1467072 1447415 1424521
3734 1424521 1345393 1335122 1243889 1233546 1220412 1156272 1185888 1218583 1188141 1116604 1132393
3723 1132393 1107734 1059381 1092702 1034338 1000122 1046137 1057743 1081855 1002971 1048064 1050756 989645
3711 989645 973385 948605 959458 865522 863502 884596 907093 912391 941239 868815 842161 881942
3699 881942 875322 865205 824347 797507 849321 860406 848731 852038 907751 879368 802361 821776
3687 821776 760741 783431 826514 822298 823805 796982 766876 790105 788997 830764 765281 768942
$$ packed form
3768A987659j9635l5011k1209l792m597j5586k4735K9683k8818j267r2295l9002
3756A731395L4984J0355k2839o8021l2491j4864m7186J5591J0162l8864L2918
3745A611140n7200j2100K4175n2773o7047j0046o5487K1436P4974j9657k2894
3734A424521p9128j0271r1233j0343j3134o4140K9616L2695l0442p1537J5789
3723A132393k4659m8353L3321n8364l4216M6015J1606K4112p8884M5093K692o1111
3711I89645j6260k4780J0853r3936k020K1094K2497N298K8848p2424k6654L9781
3699H81942o620j0117m0858k6840N1814J1085j1675L307N5713k8383p7007J9415
3687H21776o1035K2690M3083m216J507k6823l0106K3229j108M1767o5483L661
$$ plain form
3675 768942 836563 810817 791890 796846 785679 786652 767249 747306 775292 807950 854712 954856
3663 954856 864691 861649 848855 870690 903516 836399 810265 798951 806688 802914 849995 905932
3651 905932 910290 937107 960367 933952 929819 965342 936781 963259 972720 943888 996329 1060186
3639 1060186 1101213 1056052 1097382 1174245 1154883 1116172 1179394 1199382 1304310 1316441 1351482
3628 1351482 1357814 1347096 1356176 1345641 1337210 1384012 1423590 1394288 1382262 1351859 1380649 1411650
3616 1411650 1440309 1508179 1509359 1546210 1561266 1570742 1573443 1611837 1721962 1828104 1891909 1933986
3604 1933986 2013819 2051530 2131055 2152553 2231337 2250774 2278035 2452820 2509198 2540328 2573995
3593 2573995 2577680 2651364 2690322 2794779 2835640 2814647 2858982 2945521 2961809 3067949 3118930
$$ packed form
3675G68942O7621k5746j8927M956j1167R73j9403j9943K7986L2658M6762J00144
3663I54856r0165l042j2794K1835L2826o7117k6134j1314P737l774M7081N5937
3651I05932M358K6817K3260k6415m133L5523k8561K6478R461k8832N2441O3857
3639A060186M1027m5161M1330P6863j9362l8711O3222J9988J04928J2131L5041
3628A351482O332j0718R080j0535q431M6802L9578k9302j2026l0403K8790L1001
3616A411650K8659O7870J180L6851J5056R476K701L8394J10125J06142O3805M2077
3604A933986P9833L7711P9525K1498P8784J9437K7261J74785N6378L1130L3667
3593B573995L685P3684L8958J04457M0861k0993M4335Q6539J6288J06140N0981
$$ plain form
3582 3118930 3186323 3240714 3263472 3387659 3566599 3685824 3803408 3929861 4147081 4363624
3572 4363624 4408490 4525450 4576514 4762121 4942654 5125019 5397914 5619912 5939353 6296951
3562 6296951 6729121 7281762 7819859 8403977 8953285 9570156 10014621 10507745 10951122 11276906
3552 11276906 11461896 11483306 11364906 11142665 10802603 10342168 9841981 9232363 8769886 8293083
3542 8293083 7798727 7381019 6952764 6582155 6165385 5774746 5467882 5167144 4895680 4625058
3532 4625058 4401299 4148430 3933619 3732163 3468890 3255749 3146161 2893618 2765158 2559556
3522 2559556 2456143 2369898 2271202 2151451 2049054 2009903 1943229 1936959 1831180 1772975 1742797
3511 1742797 1653701 1569841 1529455 1467512 1443074 1373695 1342941 1302285 1323434 1232762 1128989
$$ packed form
3582C118930O7393N4391K2758J24187J78940J19225J17584J26453K17220K16543
3572D363624M4866J16960N1064J85607J80533J82365K72895K21998L19441L57598
3562F296951M32170N52641N38097N84118N49308O16871M44465M93124M43377L25784
3552A1276906J84990K1410j18400k22241l40062m60435n00187o09618m62477m76803
3542H293083m94356m17708m28255l70609m16770l90639l06864l00738k71464k70622
3532D625058k23759k52869k14811k01456k63273k13141j09588k52543j28460k05602
3522B559556j03413q6245r8696j19751j02397l9151o6674o270j05779n8205l0178
3511A742797q9096q3860m0386o1943k4438o9379l0754m0656K1149r0672j03773
$$ plain form
3500 1128989 1149035 1168457 1090563 1009400 1048436 1003320 992682 930955 883724 912225 891842
3489 891842 849395 812518 801100 796345 724797 769287 767035 715405 662269 646625 611057 640399
3477 640399 654578 613180 661059 599839 540758 544462 509752 520819 562290 578910 546091 519603
3465 519603 469061 473101 530030 485331 456964 382514 360578 389109 443523 356581 353389 382141
3453 382141 299007 252121 351892 302332 290601 287607 343484 295772 259740 246471 233755 262459
3441 262459 230867 233438 195596 276159 305534 279406 289230 234964 235374 316839 265351 266086 298639
3428 298639 215323 218691 215583 218749 244210 269965 204712 161455 212436 238869 232891 271594
3416 271594 248082 187356 196649 197134 196804 190512 196625 170477 175347 192964 207428 149423 84555
$$ packed form
3500A128989K0046J9422p7894q1163L9036m5116j0638o1727m7231K8501k0383
3489H91842m2447l6877j1418m755p1548M4490k252n1630n3136j5644l5568K9342
3477F40399J4179m1398M7879o1220n9081L704l4710J1067M1471J6620l2819k6488
3465E19603n0542M040N6929m4699k8367p4450k1936K8531N4414q6942l192K8752
3453C82141q3134m6886R9771m9560j1731k994N5877m7712l6032j3269j2716K8704
3441B62459l1592K571l7842Q0563K9375k6128R824n4266M10Q1465n1488P35L2553
3428B98639q3316L368l108L166K5461K5755o5253m3257N0981K6433n978L8703
3416B71594k3512o0726R293M85l30o292O113k6148M870J7617J4464n8005o4868
$$ plain form
3403 84555 87711 132384 129765 175633 216780 217543 159839 135161 114570 93373 100578 179595 201121
3390 201121 191812 131535 86056 135185 165411 197540 156284 91445 116686 125550 118633 167194
3378 167194 167887 164346 159288 134521 142514 168469 185933 167509 218163 240053 211212 204107 200323
3365 200323 184187 187339 134064 96859 71475 115002 123119 131898 133233 105927 116512 136560
3353 136560 98578 83630 146475 156007 154302 126033 102371 134293 165419 157564 139634 176143
3341 176143 259246 258484 270116 257620 241244 276179 278787 337904 310350 282083 297472 305047
3329 305047 325668 288025 281704 282449 266707 293349 322304 323340 298117 307699 309260 284998 279788
3316 279788 319414 298374 295092 259909 331120 421430 458069 437043 362086 351980 347731 357856
$$ packed form
3403H4555L156M4673k619M5868M1147P63n7704k4678k0591k1197P205P9017K1526
3390B01121r309o0277m5479M9129L0226L2129m1256o4839K5241Q864o917M8561
3378A67194O93l541n058k4767P993K5955J7464j8424N0654K1890k8841p105l784
3365B00323j6136L152n3275l7205k5384M3527Q117Q779J335k7306J0585K0048
3353A36560l7982j4948O2845R532j705k8269k3662L1922L1126p855j7930L6509
3341A76143Q3103p62J1632j2496j6376L4935K608N9117k7554k8267J5389P575
3329C05047K0621l7643o321P45j5742K6642K8955J036k5223R582J561k4262n210
3316B79788L9626k1040l282l5183P1211R0310L6639k1026p4957j0106m249J0125
$$ plain form
3304 357856 376133 375918 373601 465528 472852 501603 497262 456076 469164 493034 560468 627760 576910
3291 576910 623580 646650 743567 821949 830992 764145 774269 823810 819843 749134 721921 713255
3279 713255 691805 731291 735785 734276 749650 742210 713992 768664 777142 822103 846238 802445
3267 802445 805136 788201 817216 757021 690164 811840 859914 917375 1056677 1088004 1141049
3256 1141049 1188286 1267069 1333935 1433071 1538724 1622322 1739974 1829680 1872961 1922197 2033142
3245 2033142 2134140 2275905 2414727 2594982 2780536 3009045 3201743 3378137 3547692 3613451
3235 3613451 3688801 3680900 3648336 3625814 3586281 3534531 3544673 3515212 3554192 3635189 3653875 3654812
3223 3654812 3709345 3730112 3787914 3908910 3977367 4100812 4247151 4353688 4521456 4759731
$$ packed form
3304C57856J8277k15k317R1927P324K8751m341m1186J3088K3870O7434O7292n0850
3291E76910M6670K3070R6917P8382R043o6847J0124M9541l967p0709k7213q666
3279G13255k1450L9486M494j509J5374p440k8218N4672Q478M4961K4135m3793
3267H02445K691j6935K9015o0195o6857J21676M8074N7461J39302L1327N3045
3256A141049M7237P8783O6866R9136J05653Q3598J17652Q9706M3281M9236J10945
3245B033142J00998J41765J38822J80255J85554K28509J92698J76394J69555O5759
3235C613451P5350p901l2564k2522l9533n1750J0142k9461L8980Q0997J8686R37
3223C654812N4533K0767N7802J20996O8457J23445J46339J06537J67768K38275
$$ plain form
3213 4759731 5056394 5441613 6017544 6737264 7446772 8110006 8288565 7901817 7201552 6407126
3203 6407126 5584572 4901990 4384408 4004440 3702526 3368865 3197293 3059032 2948123 2898933
3193 2898933 2801677 2684019 2689555 2673407 2614809 2673331 2737762 2804313 2783106 2828649 2867004
3182 2867004 3004213 3112515 3165509 3283710 3354940 3315567 3246906 3064624 2854315 2628049
3172 2628049 2380035 2136562 1974253 1857523 1653937 1504609 1441515 1338918 1265485 1222351
3162 1222351 1136015 1061252 1022404 938571 911332 809656 843825 773347 690448 666913 615842
3151 615842 522487 504699 530625 482187 434173 364809 390018 375535 370538 328358 334300 300276
3139 300276 283944 239730 273167 277942 287448 231034 157503 174497 167054 186548 135209 123518
$$ packed form
3213D759731K96663L85219N75931P19720P09508O63234J78559l86748p00265p94426
3203F407126q22554o82582n17582l79968l01914l33661j71572j38261j10909m9190
3193B898933r7256j17658N536j6148n8598N8522O4431O6551k1207M5543L8355
3182B867004J37209J08302N2994J18201P1230l9373o8661j82282k10309k26266
3172B628049k48014k43473j62309j16730k03586j49328o3094j02597p3433m3134
3162A222351q6336p4763l8848q3833k7239j01676L4169p0478q2899k3535n1071
3151F15842r3355j7788K5926m8438m8014o9364K5209j4483m997m2180N942l4024
3139C00276j6332m4214L3437M775R506n6414p3531J6994p443J9494n1339j1691
$$ plain form
3127 123518 161286 164210 154199 108532 126376 183314 176385 129826 123573 63691 89049 99341
3115 99341 101966 152766 121383 100472 115817 195802 176248 102338 67991 4381 -11620 1353
3103 1353 16264 -52885 -51078 16243 48673 50320 99165 58819 4897 12377 -44174 -32896 16057
3090 16057 34182 -57314 -96943 -57425 -78355 -81774 -137098 -96079 -42602 -39578 -67537 -141202
3078 -141202 -148503 -119987 -84981 -92212 -107188 -139535 -82760 -10078 -76005 -126989 -108369 -99806
3066 -99806 -92847 -158052 -139440 -151798 -84076 -52237 -84596 -134089 -85720 -20123 -96918 -100012
3054 -100012 -81994 -100844 -91183 -28828 -51405 -135248 -132827 -69683 -146916 -169165 -122874 -103592
3042 -103592 -97802 -165136 -190167 -205094 -272446 -205328 -152996 -153429 -165845 -142741 -115723 -135599
$$ packed form
3127A23518L7768K924j0011m5667J7844N6938o929m6559o253n9882K5358J0292
3115I9341K625N0800l1383k0911J5345P9985j9554p3910l4347o3610j6001J2973
3103A353J4911o9149J807O7321L2430J647M8845m0346n3922P480n6551J1278M8953
3090A6057J8125r1496l9629L9518k0930l419n5324M1019N3477L024k7959p3665
3078a41202p301K8516L5006p231j4976l2347N6775P2682o5927n0984J8620Q563
3066i9806O959o5205J8612j2358O7722L1839l2359m9493M8369O5597p6795l094
3054a00012J8018j8850R661O2355k2577q3843K421O3144p7233k2249M6291J9282
3042a03592N790o7334k5031j4927o7352O7118N2332m33j2416K3104K7018j9876
$$ plain form
3030 -135599 -193379 -200022 -188614 -228635 -126056 -45041 -34427 -89045 -158525 -100677 -171926 -133609
3018 -133609 -124877 -123446 -123184 -163836 -116804 -106743 -125141 -75697 -70008 -59709 -106153 -167696 -152874
3005 -152874 -168888 -167270 -206585 -180840 -94745 -122262 -204486 -192699 -190604 -198978 -173792 -167364
2993 -167364 -186935 -166332 -176940 -205618 -249294 -250675 -172973 -123362 -153578 -162193 -194518 -199050
2981 -199050 -112034 -130631 -152018 -145462 -173509 -148523 -161136 -103904 -167098 -166103 -191905 -177623
2969 -177623 -156709 -207235 -246598 -209739 -115316 -153292 -181875 -157182 -118204 -63522 -66585 -133595
2957 -133595 -114158 -101765 -107465 -106315 -99738 -91293 -62044 -79630 -47696 -87666 -65155 -8772
2945 -8772 -9232 -57699 -125088 -129918 -127333 -104265 -106686 -76257 -41744 -63784 -94666 -63639 -37650
$$ packed form
3030a35599n7780o643J1408m0021J02579Q1015J0614n4618o9480N7848p1249L8317
3018a33609Q732J431K62m0652M7032J0061j8398M9444N689J0299m6444o1543J4822
3005a52874j6014J618l9315K5745Q6095k7517q2224J1787K095q374K5186O428
2993a67364j9571K0603j0608k8678m3676j381P7702M9611l0216q615l2325m532
2981a99050Q7016j8597k1387O556k8047K4986j2613N7232o3194R95k5802J4282
2969a77623K0914n0526l9363L6859R4423l7976k8583K4693L8978N4682l063o7010
2957a33595J9437J2393n700J150O577Q445K9249j7586L1934l9970K2511N6383
2945h772m60m8467o7389m830K585K3068k421L0429L4513k2040l0882L1027K5989
$$ plain form
2932 -37650 -27085 -80699 -72428 -88993 -29267 21235 -15955 -9129 -505 7301 53480 55351 12672
2919 12672 -57657 -61724 22603 -22720 -567 27116 39873 14714 22183 20760 3971 -45371
2907 -45371 5387 265 -11733 -23733 -6006 -14755 -20424 -26252 -79447 1928 -11287 -3617 -30513
2894 -30513 -63534 -26777 33662 15843 36816 455 -6957 56322 34697 34026 -32307 -62307
2882 -62307 18855 44279 -38248 -62459 -32202 -5144 -38395 -76124 14047 -50910 -115022 -153501
2870 -153501 -143676 -109193 -61696 -77449 -97440 -166295 -149463 -170528 -160249 -130072 -134072 -128367
2858 -128367 -188224 -111156 -86204 -80592 -97570 -102151 -137355 -139491 -126897 -145970 -152006 -191068
2846 -191068 -138883 -153327 -223332 -212608 -135553 -155046 -147948 -150376 -126238 -90334 -177690 -143324
$$ packed form
2932c7650J0565n3614Q271j6565N9726N0502l7190O826Q624P806M6179J871m2679
2919A2672p0329m067Q4327m5323K2153K7683J2757k5159P469j423j6789m9342
2907d5371N0758n122j1998j2000J7727q749n669n828n3195Q1375j3215P670k6896
2894c0513l3021L6757O0439j7819K0973l6361p412O3279k1625o71o6333l0000
2882f2307Q1162K5424q2527k4211L0257K7058l3251l7729R0171o4957o4112l8479
2870a53501R825L4483M7497j5753j9991o8855J6832k1065J0279L0177m000N705
2858a28367n9857P7068K4952N612j6978m581l5204k136J2594j9073o036l9062
2846a91068N2185j4444p0005J0724P7055j9493P098k428K4138L5904q7356L4366
$$ plain form
2834 -143324 -98665 -133285 -218706 -163980 -89791 -131001 -89920 -72833 -91319 -196258 -244045
2823 -244045 -159438 -194585 -196414 -205937 -234974 -246931 -191283 -176839 -160438 -154559 -102640 -65951
2811 -65951 -133601 -224294 -229815 -181285 -124847 -152888 -146567 -125253 -153859 -177222 -157242 -226675
2799 -226675 -207226 -119918 -101562 -154972 -142488 -133026 -166741 -154722 -135909 -201838 -202143 -174989
2787 -174989 -190392 -184170 -147837 -109419 -176416 -235210 -171198 -131287 -217568 -178978 -213696 -215679
2775 -215679 -188822 -168962 -136086 -188115 -257589 -237483 -187841 -155919 -97089 -138710 -139113 -120207
2763 -120207 -104433 -128864 -161876 -133600 -214688 -179053 -144563 -228675 -204240 -174443 -167355 -200372
2751 -200372 -235517 -156468 -225195 -238026 -236044 -334888 -304976 -231630 -190192 -249077 -259531 -201933
$$ packed form
2834a43324M4659l4620q5421N4726P4189m1210M1081J7087j8486j04939m7787
2823b44045Q4607l5147j829r523k9037j1957N5648J4444J6401N879N1919L6689
2811f5951o7650r0693n521M8530N6438k8041O321K1314k8606k3363J9980o9433
2799b26675J9449Q7308J8356n3410J2484R462l3715J2019J8813o5929l05K7154
2787a74989j5403O222L6333L8418o6997n8794O4012L9911q6281L8590l4718j983
2775b15679K6857J9860L2876n2029o9474K0106M9642L1922N8830m1621m03J8906
2763a20207J5774k4431l3012K8276q1088L5635L4490q4112K4435K9797P088l3017
2751b00372l5145P9049o8727j2831J982r8844K9912P3346M1438n8885j0454N7598
$$ plain form
2739 -201933 -235943 -246868 -192917 -176346 -186326 -226894 -178095 -188835 -166091 -226925 -264617 -160899
2727 -160899 -119746 -120411 -172254 -171941 -189089 -175685 -229676 -209641 -130213 -147469 -130969 -233793
2715 -233793 -294470 -215113 -185000 -103217 -124148 -178544 -174638 -153065 -197830 -241594 -213671 -144046
2703 -144046 -170423 -210076 -199232 -235486 -223359 -182990 -128433 -148603 -241955 -248597 -199818 -229365
2691 -229365 -238940 -105555 -116384 -136730 -126127 -134241 -129457 -78988 -121977 -103721 -55860 -37187
2679 -37187 -78510 2258 55542 59004 23958 -118 1190 -73435 -137296 -148889 -79986 -160553
2667 -160553 -180390 -225691 -191027 -123685 -128888 -131641 -109021 -100954 -110833 -108347 -138169 -207451 -194590
2654 -194590 -178989 -212540 -172706 -130138 -176336 -126663 -154399 -122022 -70392 -157927 -106627 -189571
$$ packed form
2739b01933l4010j0925N3951J6571r980m0568M8799j0740K2744o0834l7692J03718
2727a60899M1153o65n1843L13j7148J3404n3991K0035P9428j7256J6500j02824
2715b33793o0677P9357L0113Q1783k0931n4396L906K1573m4765m3764K7923O9625
2703a44046k6377l9653J0844l6254J2127M0369N4557k0170r3352o642M8779k9547
2691b29365r575J33385j0829k0346J0603q114M784N0469m2989J8256M7861J8673
2679c7187m1323Q0768N3284L462l5046k4076J308p4625o3861j1593O8903q0567
2667a60553j9837m5301L4664O7342n203k753K2620Q067r879K486k9822o9282J2861
2654a94590J5601l3551L9834M2568m6198M9673k7736L2377N1630q7535N1300q2944
$$ plain form
2642 -189571 -137271 -30258 -73016 -170461 -177543 -127188 -147519 -124261 -147097 -138251 -124156 -108686
2630 -108686 -182594 -193181 -174082 -194703 -170504 -182824 -166900 -131296 -124938 -144789 -141491 -159917
2618 -159917 -110127 -95694 -106097 -189594 -161686 -100012 -132652 -134089 -119840 -92751 -130830 -148667
2606 -148667 -228098 -187335 -155000 -176501 -112954 -87953 -118808 -116956 -101920 -159691 -133113 -109818
2594 -109818 -144700 -129657 -124876 -92497 -167236 -161216 -146174 -132036 -67967 -58477 -103396 -116521
2582 -116521 -34628 -72593 -164397 -103395 -104060 -116251 -112732 -91622 -149164 -190131 -145274 -157929
2570 -157929 -81451 -40567 -52255 -103618 -87410 -23872 -78990 -77489 -112911 -133485 -86465 -43421
2558 -43421 -67787 -65800 -86009 -139322 -77272 -70189 -151570 -133895 -82093 -30210 -30884 -23450 -77209
$$ packed form
2642a89571N2300J07013m2758r7445p082N0355k0331K3258k2836Q846J4095J5470
2630a08686p3908j0587J9099k0621K4199j2320J5924L5604O358j9851L298j8426
2618a59917M9790J4433j0403q3497K7908O1674l2640j437J4249K7089l8079j7837
2606a48667p9431M0763L2335k1501O3547K5001l0855J852J5036n7771K6578K3295
2594a09818l4882J5043M781L2379p4739O020J5042J4138O4069R490m4919j3125
2582a16521Q1893l7965r1804O1002o65j2191L519K1110n7542m0967M4857j2655
2570a57929P6478M0884j1688n1363J6208O3538n5118J501l5422k0574M7020M3044
2558d3421k4366J987k0209n3313O2050P083q1381J7675N1802N1883o74P434n3759
$$ plain form
2545 -77209 -133833 -91607 -77653 -97635 -99211 -85678 -38645 -84575 -143208 -128146 -95287 -89743
2533 -89743 -105979 -106561 -80416 -137308 -113549 -98800 -54299 -77641 -73393 -34823 -97559 -53475
2521 -53475 -25126 62218 23058 -22650 19697 56488 54793 -72250 -51250 -68434 -47445 -40533
2509 -40533 45764 31338 -44591 45257 68656 40273 8496 64038 44077 68021 112397 163146
2497 163146 78732 57659 46602 69383 108721 141388 113403 115296 66146 34736 16369 150010
2485 150010 126248 102483 132830 201219 232653 218909 203061 188267 116629 174031 258306 188355
2473 188355 205274 282487 230604 169659 117747 154403 239686 246086 319688 257560 305110 350673
2461 350673 341610 313900 365398 400439 421262 460475 448981 461991 461958 512155 545022 652641
$$ packed form
2545g7209n6624M2226J3954j9982j576J3533M7033m5930n8633J5062L2859N544
2533h9743j6236n82K6145n6892K3759J4749M4501k3342M248L8570o2736M4084
2521e3475K8349Q7344l9160m5708M2347L6791j695j27043K1000j7184K0989O912
2509d0533Q6297j4426p5929Q9848K3399k8383l1777N5542j9961K3944M4376N0749
2497A63146q4414k1073j1057K2781L9338L2667k7985J893m9150l1410j8367J33641
2485A50010k3762k3765L0347O8389L1434j3744j5848j4794p1638N7402Q4275o9951
2473A88355J6919P7213n1883o0945n1912L6656Q5283O400P3602o2128M7550M5563
2461C50673r063k7710N1498L5041K0823L9213j1494J3010l3N0197L2867J07619
$$ plain form
2449 652641 686486 708317 754321 786460 799293 878786 958340 992098 1033336 1120062 1232868
2438 1232868 1347903 1397199 1468659 1581541 1718401 1881487 2108206 2281538 2462825 2733967
2428 2733967 3043701 3496159 3982340 4363325 4656251 4893799 5237663 5687177 6393655 7269353
2418 7269353 8562915 10242657 12398650 15154365 19436314 26031333 34791582 42404677
2410 42404677 45034406 41263643 33425512 26301166 20230823 15400186 11782990 9233727
2402 9233727 7419920 6283415 5468250 4906024 4531098 4344875 4098175 3848800 3537877
2393 3537877 3140735 2786206 2543068 2279005 2077220 1931679 1792356 1682069 1534147 1387349
2383 1387349 1358370 1265735 1155114 1064805 1049902 993577 942896 889155 856103 792405 761131
$$ packed form
2449F52641L3845K1831M6004L2139J2833P9493P9554L3758M1238Q6726J12806
2438A232868J15035M9296P1460J12882J36860J63086K26719J73332J81287K71142
2428B733967L09734M52458M86181L80985K92926K37548L43864M49514P06478Q75698
2418G269353J293562J679742K155993K755715M281949O595019Q760249P613095
2410D2404677K629729l770763p838131p124346o070343m830637l617196k549263
2402I233727j813807j136505q15165n62226l74926j86223k46700k49375l10923
2393C537877l97142l54529k43138k64063k01785j45541j39323j10287j47922j46798
2383A387349k8979r2635j10621r0309j4903n6325n0681n3741l3052o3698l1274
$$ plain form
2372 761131 703405 725258 776187 770134 774539 666617 642602 576258 563118 491796 476679 448111
2360 448111 480540 457715 408090 425660 442023 419875 389170 390705 424302 426349 433161 366399
2348 366399 363007 369571 295672 307820 300910 263181 271462 233145 188061 180391 169504 90065 174453
2335 174453 145713 109875 115615 132813 129186 121350 163448 87376 3960 87559 92522 93634 78966
2322 78966 46098 58635 62600 38487 58543 85860 56343 80862 89473 33531 20502 34180
2310 34180 81739 70557 38160 34763 -16844 46466 25839 -34001 -9465 45927 -46531 -35453
2298 -35453 4921 13629 30049 90274 27437 7287 -56073 -108962 -76514 -68705 -40436 -53302
2286 -53302 -123168 -86351 -4806 -63181 -19990 -22506 -45688 -53457 -11934 -25336 -75730 -45510
$$ packed form
2372G61131n7726K1853N0929o053M405j07922k4015o6344j3140p1322j5117k8568
2360D48111L2429k2825m9625J7570J6363k2148l0705J535L3597K047O812o6762
2348C66399l392O564p3899J2148o910l7729Q281l8317m5084p670j0887p9439Q4388
2335A74453k8740l5838N740J7198l627p836M2098p6072q3416Q3599M963J112j4668
2322G8966l2868J2537L965k4113K0056K7317k9517K4519Q611n5942j3029J3678
2310C4180M7559j1182l2397l397n1607O3310k0627n9840K4536N5392r2458J1078
2298c5453M0374Q708J6420O0225o2837k0150o3360n2889L2448P809K8269j2866
2286e3302o9866L6817Q1545n8375M3191k516k3182p769M1523j3402n0394L0220
$$ plain form
2274 -45510 -19123 -53412 -25612 -25561 36726 28117 -68121 -119541 -63151 -9161 -62211 -51254 -7836
2261 -7836 -80534 -101085 -106451 -138492 -109634 -39214 -29920 -64974 -59241 -75981 -169509 -182784 -147416
2248 -147416 -109917 -110448 -85397 -54738 -25314 -61050 -29443 -65895 -58288 -37720 -36958 -20045 -43703
2235 -43703 -23981 -47025 -75993 -23922 -39465 -43773 -78224 -13313 14694 -52486 -46390 -60570
2223 -60570 -79242 -99812 -114477 -175719 -105042 -105418 -105818 -132922 -146895 -113290 -96413 -120802 -126610
2210 -126610 -79906 -80418 -22511 -53785 -109131 -54468 -71484 -79671 -63577 -152184 -182290 -157420
2198 -157420 -166017 -97770 -111955 -77112 -136686 -154213 -87113 -90322 -87467 -134897 -105317 -77856
2186 -77856 -133347 -124230 -155823 -149567 -122432 -95708 -87858 -55071 -164947 -146880 -63918 -41949
$$ packed form
2274d5510K6387l4289K7800N1O2287q609r6238n1420N6390N3990n3050J0957M3418
2261g836p2698k0551n366l2041K8858P0420R294l5054N733j6740r3528j3275L5368
2248a47416L7499n31K5051L0659K9424l5736L1607l6452P607K0568P62J6913k3658
2235d3703J9722k3044k8968N2071j5543m308l4451O4911K8007o7180O096j4180
2223f0570j8672k0570j4665o1242P0677l76m00k7104j3973L3605J6877k4389n808
2210a26610M6704n12N7907l1274n5346N4663j7016q187J6094q8607l0106K4870
2198a57420q597O8247j4185L4843n9574j7527O7100l209K855m7430K9580K7461
2186g7856n5491R117l1593O256K7135K6724P850L2787j09876J8067Q2962K1969
$$ plain form
2174 -41949 -74845 -99272 -101096 -127361 -137223 -123124 -83437 -52349 -115277 -150767 -150747 -88688 -79342
2161 -79342 -118526 -37980 -64990 -172681 -77104 -57753 -30688 2331 -28747 -36186 -97762 -148821
2149 -148821 -73174 8958 -27369 -11827 2168 87384 76452 37624 82492 75714 67019 77526
2137 77526 31472 100186 82107 28912 -37404 -93134 -110838 -131022 -95652 -61782 -64950 -72287
2125 -72287 -51620 -141810 -137187 -144391 -156271 -158321 -122943 -97689 -97151 -52957 -40926 -71945 -147309
2112 -147309 -168448 -76254 -113249 -143225 -90105 -75127 -119127 -98069 -42038 -10685 -40148 -94045
2100 -94045 -114736 -85862 -133352 -141688 -96321 -160909 -134152 -135302 -105594 -95051 -38886 -71726
2088 -71726 -50409 -17579 -20959 -52632 -97254 -101086 -86140 -86831 -70980 -109119 -116818 -143536 -71787
$$ packed form
2174d1949l2896k4427j824k6265r862J4099L9687L1088o2928l5490K0O2059R346
2161g9342l9184Q0546k7010j07691R5577J9351K7065L3019l1078p439o1576n1059
2149a48821P5647Q2132l6327J5542J3995Q5216j0932l8828M4868o778q695J0507
2137G7526m6054O8714j8079n3195o6316n5730j7704k0184L5370L3870l168p337
2125g2287K0667r0190M623p204j1880k050L5378K5254N38M4194J2031l1019p5364
2112a47309k1139R2194l6995k9976N3120J4978m4000K1058N6031L1353k9463n3897
2100i4045k0691K8874m7490q336M5367o4588K6757j150K9708J0543N6165l2840
2088g1726K1317L2830l380l1673m4622l832J4946o91J5851l8139p699k6718P1749
$$ plain form
2075 -71787 -57032 -34283 -36320 -55475 -95093 -150066 -118798 -91699 -146906 -211144 -212621 -133273
2063 -133273 -84287 -99507 -103147 -115674 -88836 -49541 -125600 -182974 -190118 -130195 -170629 -135791
2051 -135791 -53257 -73093 -111576 -123461 -133946 -88169 -104519 -125175 -99209 -106813 -118648 -106008
2039 -106008 -56570 -24663 -66791 -127373 -105402 -132406 -151619 -163174 -142712 -135667 -127924 -132370
2027 -132370 -94984 -122782 -117709 -114167 -103497 -100205 -108870 -93810 -57697 -60041 -46604 -83354 -119741
2014 -119741 -106404 -100099 -68980 -102977 -95190 -107132 -119583 -84349 -69502 -57703 -57739 -4963 -48687
2001 -48687 -48428 -48676 -113989 -140996 -71204 -90273 -122895 -100551 -112214 -147584 -151342 -87519 -34575
1988 -34575 -149416 -118229 -83930 -92409 -96866 -77006 -88367 -69549 -19791 -40650 -75428 -16188
$$ packed form
2075g1787J4755K2749k037j9155l9618n4973L1268K7099n5207o4238j477P9348
2063a33273M8986j5220l640j2527K6838L9295p6059n7374p144N9923m0434L4838
2051a35791Q2534j9836l8483j1885j0485M5777j6350k0656K5966p604j1835J2640
2039a06008M9438L1907m2128o0582K1971k7004j9213j1555K0462P045P743m446
2027a32370L7386k7798N073L542J0670L292q665J5060L6113k344J3437l6750l6387
2014a19741J3337O305L1119l3997P787j1942j2451L5234J4847J1799l6N2776m3724
2001d8687K59k48o5313k7007O9792j9069l2622K2344j1663l5370l758O3823N2944
1988c4575j14841L1187L4299q479m457J9860j1361J8818M9758k0859l4778N9240
$$ plain form
1976 -16188 -44986 -110141 -78097 -102678 -103045 -50015 -38474 -76636 -31630 -75451 -139115 -141359
1964 -141359 -90413 -111223 -93093 -61064 -58425 -59218 -93946 -81198 -71889 -60796 -89522 -59190
1952 -59190 -49524 -93616 -100551 -124568 -86110 -62184 -116251 -134546 -82040 -12845 -39516 -51697
1940 -51697 -59754 -72779 -35084 -54971 12163 -61396 -75935 8405 4408 -50280 -44024 -47091 -55584
1927 -55584 -38679 -69603 -92861 -56879 12772 -39711 -83041 -71773 -98590 -80013 -4667 -22978
1915 -22978 -29892 -33037 -31739 10097 -68432 -59177 -75922 -118895 -158294 -104452 -97246 -91287 -74148
1902 -74148 -68671 -58878 -103916 -96999 -103636 -109244 -162583 -125397 -91405 -126643 -103922 -128202 -102177
1889 -102177 -21745 -101504 -130501 -168599 -87094 -32937 -53812 -35476 -56663 -74365 -85537 -78040
$$ packed form
1976a6188k8798o5155L2044k4581l67N3030J1541l8162M5006m3821o3664k244
1964a41359N0946k0810J8130L2029K639p93l4728J2748R309J1093k8726L0332
1952e9190R666m4092o935k4017L8458K3926n4067j8295N2506O9195k6671j2181
1940e1697q057j3025L7695j9887O7134p3559j4539Q4340l997n4688O256l067q493
1927e5584J6905l0924k3258L5982O9651n2483m3330J1268k6817J8577P5346j8311
1915b2978o914l145J298M1836p8529R255j6745m2973l9399N3842P206N959J7139
1902g4148N477R793m5038O917o637n608n3339L7186L3992l5238K2721k4280K6025
1889a02177Q0432p9759k8997l8098Q1505N4157k0875J8336k1187j7702j1172P497
$$ plain form
1877 -78040 -97150 -106558 -120823 -122791 -38913 -25927 -33642 -16210 -78110 -81371 -92471 -104839 -144678
1864 -144678 -132622 -67017 -96966 -62582 -65609 -59131 -28479 -41084 -89169 -97165 -57849 -87838
1852 -87838 -126631 -76404 38361 -57463 -127463 -93972 -92445 -108688 -99058 -133121 -121920 -86180
1840 -86180 -49278 -7968 -85857 -101505 -51048 -90955 -91477 -127400 -125235 -88386 -62077 -59691 -37352
1827 -37352 -82695 -70188 -74902 -47028 -35972 -80982 -50137 -126409 -115203 -78814 -50762 -49838
1815 -49838 -89793 -120481 -49452 -80189 -71291 -38394 796 -22833 -25383 18276 -75130 -103785
1803 -103785 -43979 -79405 -58177 -75326 -119647 -70576 -15107 -21528 -109640 -76108 3290 19109
1791 19109 -88376 -63874 35880 11908 -28923 -97956 -45141 -60094 -42131 -104157 -113745 -49812
$$ packed form
1877g8040j9110r408j4265j968Q3878J2986p715J7432o1900l261j1100j2368l9839
1864a44678J2056O5605k9949L4384l027O478L0652j2605m8085p996L9316k9989
1852h7838l8793N0227J14765r5824p0000L3491J527j6243R630l4063J1201L5740
1840h6180L6902M1310p7889j5648N0457l9907n22l5923K165L6849K6309K386K2339
1827c7352m5343J2507m714K7874J1056m5010L0845p6272J1206L6389K8052R24
1815d9838l9955l0688P1029l0737Q898L2897L9190k3629k550M3659r3406k8655
1803a03785N9806l5426K1228j7149m4321M9071N5469o421q8112L3532P9398J5819
1791A9109j07485K4502R9754k3972m0831o9033N2815j4953J7963o2026r588O3933
$$ plain form
1779 -49812 -43479 -61405 -79228 -54915 -65698 -131482 -112105 -72500 -61035 -81468 -90619 -46589
1767 -46589 -134122 -135248 -144949 -40458 -51203 -94223 38356 82204 10684 9852 55954 65489
1755 65489 10573 -645 -42661 -36766 -87285 -31773 -42298 -90714 -86912 -123613 -141868 -114830
1743 -114830 -91885 -140071 -102249 -76315 -53646 -62218 -95658 -104569 -120474 -95754 7804 9615
1731 9615 -31076 -66051 -17769 -43127 -17862 -19224 -59398 -100854 -102261 -101896 -34221 -35652 -95786
$$ packed form
1779d9812O333j7926j7823K4313j0783o5784J9377L9605J1465k0433r151M4030
1767d6589q7533j126r701J04491j0745m3020J32579M3848p1520q32M6102R535
1755F5489n4916j1218m2016N895n0519N5512j0525m8416L802l6701j8255K7038
1743a14830K2945m8186L7822K5934K2669q572l3440q911j5905K4720J03558J811
1731I615m0691l4975M8282k5358K5265j362m0174m1456j407L65O7675j431o0134
$$ [...]
##END NTUPLES=NMR SPECTRUM
##END=
