##TITLE=1H_CA-9424-1
 200.13MHz,CDCl3.
 8 sc
 
 17.2.2026
##JCAMPDX= 6.0         $$ Bruker NMR JCAMP-DX V2.0
##DATA TYPE= NMR SPECTRUM
##DATA CLASS= NTUPLES
##ORIGIN= UXNMR, Bruker Analytische Messtechnik GmbH
##OWNER= pz
$$ XWIN-NMR		Version 3.5
$$ Tue Feb 17 15:24:04 2026 Russian Standard Time (UT+4h)  she@DPX200
##.OBSERVE FREQUENCY= 200.1313
##.OBSERVE NUCLEUS= ^1H
##.ACQUISITION MODE= SIMULTANEOUS
##.ACQUISITION SCHEME= undefined
##.AVERAGES= 8
##.DIGITISER RES= 18
##SPECTROMETER/DATA SYSTEM= spect
##.PULSE SEQUENCE= zg30
##.SOLVENT NAME= D2O
##.SHIFT REFERENCE= (INTERNAL, D2O, 0, 15.4086)
##AUDIT TRAIL= $$ (NUMBER, WHEN, WHO, WHERE, WHAT)
$$ ##TITLE= Audit trail, XWIN-NMR		Version 3.5
$$ ##JCAMPDX= 5.01
$$ ##ORIGIN= Bruker BioSpin GmbH
$$ ##OWNER= she
$$ F:/spectra/data/she/nmr/H-C/1/pdata/1/auditp.txt
$$ ##AUDIT TRAIL=  $$ (NUMBER, WHEN, WHO, WHERE, WHAT)
(   1,<2026-02-17 15:22:19.87 +0400>,<she>,<DPX200>,
      <created by zg, POWCHK disabled, PULCHK disabled
       configuration hash MD5:
       00 E9 B6 7A A2 85 ED C7 34 08 36 98 17 FE 4E 26
       data hash MD5: 16K
       2B F5 CF 78 7F 49 23 C8 A1 FB 95 C4 50 80 50 29>)
(   2,<2026-02-17 15:22:26.95 +0400>,<she>,<DPX200>,
      <Start of raw data processing
       efp BC_mod = 2 LB = 0.25 FT_mod = 6 PKNL = 1 PHC0 = -3703.985 PHC1 = 9.792321 SI = 16K 
       data hash MD5: 16K
       7B 13 43 1B 26 0C 23 72 58 06 17 E2 38 2D CC D0>)
(   3,<2026-02-17 15:22:50.51 +0400>,<she>,<DPX200>,
      <pk PHC0 = 1.106467 PHC1 = 2.2 
       data hash MD5: 16K
       C1 A3 62 C2 77 9B EC 81 B9 8C 4B A4 D4 17 15 D9>)
(   4,<2026-02-17 15:22:56.28 +0400>,<she>,<DPX200>,
      <abs ABSG = 5 
       data hash MD5: 16K
       4B BB 7D 0D 20 BA DB 83 23 4A 94 46 00 EB 27 7C>)
(   5,<2026-02-17 15:23:35.15 +0400>,<she>,<DPX200>,
      <abs ABSG = 5 
       data hash MD5: 16K
       BD C9 FD 79 0A CD 85 3C E9 36 57 A1 15 63 99 34>)
$$ ##END=
$$ 
$$ hash MD5
$$ 82 26 C4 9D 9D A3 6A D6 5F 8B E0 AD 48 43 C1 19
##$RELAX= 
##$RELAX= 
##$RELAX= 
##$RELAX= 
##$RELAX= 
##$RELAX= 
$$ Bruker specific parameters
$$ --------------------------
##$DU= <F:/spectra>
##$EXPNO= 1
##$NAME= <H-C>
##$PROCNO= 1
##$TYPE= <nmr>
##$USER= <she>
##$AMP= (0..31)
100 100 100 100 100 100 100 100 100 100 100 100 100 100 100 100 100 100 
100 100 100 100 100 100 100 100 100 100 100 100 100 100 
##$AQSEQ= 0
##$AQ_mod= 1
##$AUNM= <au_zg>
##$AUTOPOS= <>
##$BF1= 200.13
##$BF2= 200.13
##$BF3= 200.13
##$BF4= 200.13
##$BF5= 200.13
##$BF6= 200.13
##$BF7= 200.13
##$BF8= 200.13
##$BYTORDA= 1
##$CFDGTYP= 0
##$CFRGTYP= 5
##$CHEMSTR= <none>
##$CNST= (0..31)
1 1 145 1 1 1 1 1 1 1 1 1 1 1 1 1 1 1 1 1 1 1 1 1 1 1 1 1 1 1 1 1 
##$CPDPRG= <>
##$CPDPRG1= <>
##$CPDPRG2= <>
##$CPDPRG3= <>
##$CPDPRG4= <mlev>
##$CPDPRG5= <mlev>
##$CPDPRG6= <mlev>
##$CPDPRG7= <mlev>
##$CPDPRG8= <mlev>
##$CPDPRGB= <>
##$CPDPRGT= <>
##$D= (0..31)
0 0.7 0 0 0 0 0 0 0 0 0 0.03 0 0 0 0 0 0 0 0 0 0 0 0 0 0 0 0 0 0 0 0 
##$DATE= 1771327339
##$DBL= (0..7)
$$ [...]
##$SUBNAM3= <"">
##$SUBNAM4= <"">
##$SUBNAM5= <"">
##$SUBNAM6= <"">
##$SUBNAM7= <"">
##$SUBNAM8= <"">
##$SUBNAM9= <"">
##$SW= 18.0517328524113
##$SWIBOX= (0..15)
0 0 2 0 0 0 0 0 0 0 0 0 0 0 0 0 
##$SW_h= 3612.71676300578
##$TD= 16384
##$TD0= 1
##$TE= 0
##$TE2= 300
##$TE3= 300
##$TEG= 300
##$TL= (0..7)
0 120 120 120 120 120 120 120 
##$TP= (0..7)
150 150 150 150 150 150 150 150 
##$TP07= 0
##$TPNAME0= <>
##$TPNAME1= <>
##$TPNAME2= <>
##$TPNAME3= <>
##$TPNAME4= <>
##$TPNAME5= <>
##$TPNAME6= <>
##$TPNAME7= <>
##$TPOAL= (0..7)
0.5 0.5 0.5 0.5 0.5 0.5 0.5 0.5 
##$TPOFFS= (0..7)
0 0 0 0 0 0 0 0 
##$TUNHIN= 0
##$TUNHOUT= 0
##$TUNXOUT= 0
##$USERA1= <user>
##$USERA2= <user>
##$USERA3= <user>
##$USERA4= <user>
##$USERA5= <user>
##$V9= 5
##$VALIST= <valist>
##$VCLIST= <CCCCCCCCCCCCCCC>
##$VD= 0
##$VDLIST= <DDDDDDDDDDDDDDD>
##$VPLIST= <PPPPPPPPPPPPPPP>
##$VTLIST= <TTTTTTTTTTTTTTT>
##$WBST= 1024
##$WBSW= 4
##$XGAIN= (0..3)
0 0 0 0 
##$XL= 0
##$YL= 0
##$YMAX_a= 713540
##$YMIN_a= -913207
##$ZGOPTNS= <>
##$ZL1= 120
##$ZL2= 120
##$ZL3= 120
##$ZL4= 120
##$ABSF1= 15.40864
##$ABSF2= -2.643208
##$ABSG= 5
##$ABSL= 3
##$ALPHA= 0
##$AQORDER= 0
##$ASSFAC= 0
##$ASSFACI= 0
##$ASSFACX= 0
##$ASSWID= 0
##$AUNMP= <proc_1d>
##$AZFE= 0.1
##$AZFW= 0.1
##$BCFW= 0
##$BC_mod= 2
##$BYTORDP= 0
##$COROFFS= 0
##$CY= -3
##$DATMOD= 1
##$DC= 0
##$DFILT= <>
##$DTYPP= 0
##$F1P= 0
##$F2P= 0
##$FCOR= 1
##$FTSIZE= 16384
##$FT_mod= 6
##$GAMMA= 0
##$GB= 0
##$INTBC= 1
##$INTSCL= 3.241238e-09
##$ISEN= 128
##$LB= 0.25
##$LEV0= 0
##$LPBIN= 0
##$MAXI= 10000
##$MC2= 0
##$MEAN= 0
##$ME_mod= 0
##$MI= 1.114404
##$NCOEF= 0
##$NC_proc= -6
##$NLEV= 6
##$NOISF1= 3.799351
##$NOISF2= 2.8
##$NSP= 0
##$NTH_PI= 0
##$NZP= 0
##$OFFSET= 15.40864
##$PC= 1
##$PHC0= -3702.879
##$PHC1= 11.99232
##$PH_mod= 1
##$PKNL= yes
##$PPARMOD= 0
##$PSCAL= 0
##$PSIGN= 0
##$REVERSE= no
##$SF= 200.13002262853
##$SI= 16384
##$SIGF1= 3
##$SIGF2= 2
##$SINO= 0.751879
##$SIOLD= 32768
##$SREGLST= <19F.Aceton>
##$SSB= 0
##$STSI= 16384
##$STSR= 0
##$SW_p= 3612.71676300578
##$SYMM= 0
##$S_DEV= 0
##$TDeff= 16384
##$TDoff= 0
##$TI= <>
##$TILT= no
##$TM1= 0
##$TM2= 0
##$TOPLEV= 0
##$USERP1= <user>
##$USERP2= <user>
##$USERP3= <user>
##$USERP4= <user>
##$USERP5= <user>
##$WDW= 1
##$XDIM= 16384
##$YMAX_p= 505676912
##$YMIN_p= -415701
$$ End of Bruker specific parameters
$$ ---------------------------------
##NTUPLES= NMR SPECTRUM
##VAR_NAME=  FREQUENCY,     SPECTRUM/REAL,   SPECTRUM/IMAG
##SYMBOL=    X,             R,               I
##VAR_TYPE=  INDEPENDENT,   DEPENDENT,       DEPENDENT
##VAR_FORM=  AFFN,          ASDF,            ASDF
##VAR_DIM=   16384,         16384,           16384
##UNITS=     HZ,            ARBITRARY UNITS, ARBITRARY UNITS
##FACTOR=    0.220516191357247, 1,           1
##FIRST=     3083.73145343027, 0,            0
##LAST=      -528.985309575508, 0,           0
##MIN=       -528.985309575508, -415701,     0
##MAX=       3083.73145343027, 505676912,    0
$$ Real data points
##PAGE= N=1
##DATA TABLE= (X++(R..R)), XYDATA
$$ [...]
7750D7818k40719j33391J63118m3232K3404p3721K9973P8236o6457J7640l6683
$$ 47818 -192901 -326292 -163174 -206406 -183002 -256723 -226750 -148514 -214971 -197331 -234014
7739b34014P3198K9826p9655P9209O1732j09716O8053J7109l1647l877O393r3083
$$ -234014 -160816 -130990 -210645 -131436 -69704 -179420 -111367 -94258 -125905 -129782 -123389 -216472
7727b16472l2635j0628J07149l7695M7075l3976J48210M3649j9510p4115r6442
$$ -216472 -249107 -259735 -152586 -190281 -143206 -177182 -28972 14677 -4833 -78948 -175390
7716a75390O5355l7308P5992r6806j21451J13461J33786j02407K3601l2067M8575
$$ -175390 -110035 -147343 -71351 -168157 -289608 -176147 -42361 -144768 -121167 -153234 -104659
7705a04659J1804q4510P4045N1536r4005j6428J15079K4033j06261J25370J21612
$$ -104659 -92855 -177365 -103320 -51784 -145789 -162217 -47138 -23105 -129366 -3996 117616
7694A17616q6964N0393j9319n7724n4874k7126L6146J9017J7948R551K987j96325
$$ 117616 30652 81045 61726 4002 -50872 -77998 -41852 -22835 -4887 4664 7651 -188674
7682a88674P2823M8453n2201M4398K0480k1761O416p7788L6692k1109j77607J43365
$$ -188674 -115851 -67398 -119599 -75201 -54721 -76482 -70066 -147854 -111162 -132271 -309878 -166513
7670a66513J17083l2668l7993J1111n9726j7052N8081l2058k8196o5749J4933
$$ -166513 -49430 -82098 -120091 -108980 -168706 -185758 -127677 -159735 -187931 -253680 -238747
7659b38747o982J52173J02735n9302M2124K3118r9073q4634k1457M0622J5310
$$ -238747 -245729 -93556 9179 -50123 -7999 15119 -83954 -168588 -190045 -149423 -134113
7648a34113q9285Q563k2132N3429J20045O7989k3229K5783q5194o7102l707J09765
$$ -134113 -223398 -214835 -236967 -183538 -63493 4496 -18733 7050 -78144 -145246 -148953 -39188
7636c9188J3405n6593j35353K390J130K1693M3338k4304o820J5524J00365j12057
$$ -39188 -25783 -82376 -217729 -215339 -214209 -192516 -149178 -173482 -180302 -164778 -64413 -176470
7624a76470j22089K7298P6638L1627K2258o1474J09975n2769N8832L1606Q5078
$$ -176470 -298559 -271261 -194623 -162996 -140738 -202212 -92237 -145006 -86174 -54568 30510
7613C0510P2963j46814k48446O1039J89382j24934P4418o4977M5234j2755n610
$$ 30510 103473 -43341 -291787 -230748 -41366 -166300 -91882 -156859 -111625 -124380 -129990
7602a29990r6519L2653N4289J9742J18317q4305j12159O8736o0571n7645j5547
$$ -129990 -226509 -193856 -139567 -119825 -1508 -85813 -197972 -129236 -189807 -247452 -262999
7591b62999N463J51540P7329q2566j7451O3359l3024j5907r5464N1219j42072
$$ -262999 -257536 -105996 -28667 -111233 -128684 -65325 -98349 -114256 -209720 -158501 -300573
7580c00573m8489R4861J65067k1244L8079m6530m1551L2532q714n0967k8784M9157
$$ -300573 -349062 -254201 -89134 -110378 -72299 -118829 -160380 -127848 -136562 -187529 -216313 -167156
7568a67156J36618p0157j3207O1133j51499R3162n2687o013J48059j12120l2252
$$ -167156 -30538 -100695 -113902 -52769 -204268 -111106 -163793 -169806 -21747 -133867 -166119
7557a66119R0453r3742k4523q6897R3839O9074P225m3945Q8986P4211j37606r8773
$$ -166119 -75666 -169408 -193931 -280828 -186989 -117915 -110690 -154635 -65649 8562 -129044 -227817
7545b27817J07351l7120k1149J63572o7046m3273j34302n9507J23261J01995L5355
$$ -227817 -120466 -157586 -178735 -15163 -82209 -125482 -259784 -319291 -196030 -94035 -58680
7534e8680q8853J1452J07786j3435j60604J0373Q7155M5395j08452L7354P1033
$$ -58680 -147533 -136081 -28295 -41730 -202334 -191961 -104806 -59411 -167863 -130509 -59476
7523e9476m8525L2607K6075m4737m1419m4667M4670o0269j43069J2455L1692J02334
$$ -59476 -108001 -75394 -49319 -94056 -135475 -180142 -135472 -195741 -338810 -326355 -294663 -192329
7511a92329M1167N0268M1311N9416q5915j04337L9776Q8081j6774q6570K5455
$$ -192329 -151162 -100894 -59583 -167 -86082 -190419 -150643 -62562 -79336 -165906 -140451
7500a40451j3780n0070R9953J2211p2852m8831R3134K3581L3742K4322k6270N0856
$$ -140451 -154231 -204301 -104348 -92137 -164989 -213820 -120686 -97105 -63363 -39041 -65311 -14455
7488a4455n9738p21p3868O1290J80781p8884l5954L4718j06879k5613P7814j9274
$$ -14455 -74193 -74914 -148782 -87492 93289 14405 -21549 13169 -93710 -119323 -41509 -60783
7476f0783J29636J2955p433l0902p8252j834o4443l0061K9949L4720r536N6961
$$ -60783 68853 81808 74375 43473 -34779 -36613 -101056 -131117 -101168 -66448 -75984 -19023
7464a9023N678o9203K9597J40482n9630p0074J20985m7614o9007o0326J4898N6058
$$ -19023 -13345 -82548 -52951 87531 27901 -42173 78812 31198 -37809 -98135 -83237 -27179
7452b7179l5714j1346L8306l1242p6830J126M9999J06594j7236K4228m645m3925
$$ -27179 -62893 -74239 -35933 -67175 -144005 -142879 -92880 13714 -3522 20706 16061 -27864
7440b7864N8730Q4867J71106l8740k72478K567J124j65886J40106J44118M7581
$$ -27864 30866 115733 286839 248099 -24379 -21812 -20688 -186574 -46468 97650 145231
7429A45231M9228j15450n3622n0444k9235J39142N41p5366q5766k8015N3811q9139
$$ 145231 194459 79009 25387 -25057 -54292 84850 85391 10025 -75741 -103756 -49945 -139084
7417a39084P9144R3502q7723o7264k5090K6454J3646o1166k0467p7308L0250J31556
$$ -139084 -59940 33562 -54161 -121425 -146515 -120061 -106415 -167581 -188048 -265356 -235106 -103550
7405a03550O6157P84n0910M747J4997j73107o2435J99777j2947j69743j29471
$$ -103550 -37393 -36609 -87519 -82772 -67775 -240882 -303317 -103540 -116487 -286230 -415701
7394d15701J07295J86637M3164r2102o3803j0854J33915k410m352N4176j43826
$$ -415701 -308406 -121769 -78605 -170707 -234510 -245364 -111449 -113859 -118211 -64035 -207861
7383b07861l6472J8989k92k8190l7685l799O2076r0944q744O4528p6240Q9089
$$ -207861 -244333 -225344 -225636 -253826 -291511 -295310 -233234 -324178 -332922 -268394 -344634 -255545
7371b55545O4060O768j3822l0998p1580j5731J24725j39041R3762Q7068P2498
$$ -255545 -191485 -184717 -198539 -229537 -301117 -316848 -192123 -331164 -237402 -150334 -77836
7360g7836q6283j09619Q9874n2323m0982J94539L3764N395j5840p3336l3190n5354
$$ -77836 -164119 -273738 -183864 -236187 -277169 -82630 -48866 -43471 -59311 -132647 -165837 -221191
7348b21191l197J33489J4003n0716n0966L4034j1366l3671N6348j56372O5897
$$ -221191 -224388 -90899 -76896 -127612 -178578 -144544 -155910 -189581 -133233 -289605 -223708
7337b23708K2591M6307j776n1841P8234N9813k8772j34256J738O1809L0986J9000
$$ -223708 -201117 -154810 -156586 -208427 -130193 -70380 -99152 -233408 -231670 -169861 -138875 -119875
7325a19875j29563j1435P8729j4906m7113P5599j2759j0419k2776J62371o9960
$$ -119875 -249438 -260873 -182144 -197050 -244163 -168564 -181323 -191742 -214518 -52147 -122107
7314a22107n3153o7951J01299O5422q0609n5135j3767J6842r5616J362Q1640K30475
$$ -122107 -175260 -243211 -141912 -76490 -157099 -212234 -226001 -209159 -304775 -303413 -221773 8702
7302H702l0448l7703n943j33302n302J0503N0860k0227M7998n781p6106r9179
$$ 8702 -21746 -59449 -65392 -198694 -203996 -193493 -142633 -162860 -114862 -120643 -196749 -295928
7290b95928J31858J67272q3897l1226o1753L1605L4801N4355j9574k2992p503
$$ -295928 -164070 3202 -80695 -111921 -173674 -142069 -107268 -52913 -72487 -95479 -102982
7279a02982o7946M8351J927Q688L3266j07192L5079j2270p840l8975K8757L6248
$$ -102982 -170928 -122577 -120650 -111962 -78696 -185888 -150809 -163079 -170919 -209894 -181137 -144889
7267a44889M2944o5412j04564L263P2572P2788p8567J8995K4723m0973q3448p162
$$ -144889 -101945 -167357 -271921 -268658 -196086 -123298 -201865 -182870 -158147 -199120 -282568 -289730
7255b89730R558J05804J5254P4658N1002j14059j6969P3448r751k11614Q5579
$$ -289730 -280172 -174368 -159114 -84456 -33454 -147513 -164482 -91034 -100785 -312399 -226820
7244b26820M7054L1483Q4264O4277j42583J8804j93016R4224J01290n5410O6130
$$ -226820 -179766 -148283 -64019 258 -142325 -123521 -316537 -222313 -121023 -176433 -110303
7233a10303j3135r271L123o3097O7941k2850L7267n243r2707J49360p2238L4415
$$ -110303 -123438 -132709 -129586 -192683 -124742 -147592 -110325 -115568 -208275 -58915 -131153 -96738
7221i6738o5536p052j73842J42449M0903J5783J02567l3762R9050n7958j08056
$$ -96738 -162274 -169326 -343168 -200719 -159816 -144033 -41466 -75228 23822 -34136 -142192
7210a42192P1453j60969R3706k9325n4987J6802K5239r4034M0427L156r1954J75198
$$ -142192 -70739 -231708 -138002 -167327 -222314 -205512 -180273 -274307 -233880 -230724 -322678 -147480
7198a47480K7609j20681J15860J42068j07993l7479q7165J08801l3100m39J02940
$$ -147480 -119871 -240552 -124692 17376 -90617 -128096 -215261 -106460 -139560 -139999 -37059
7187c7059M5853r0626m8327J9102R0165l8589j46747p1577P8065N0266R1340n6777
$$ -37059 8794 -81832 -130159 -111057 -20892 -59481 -206228 -277805 -199740 -149474 -58134 -114911
7175a14911p4852J04508J6076j49037M9963J28P3761J68397n891r7890m4194J57357
$$ -114911 -189763 -85255 -69179 -218216 -168253 -168125 -94364 74033 68142 -29748 -73942 83415
7163H3415L8867j40206o3298j24566O5346J27548l8303J82857J25580J65137K70511
$$ 83415 122282 -17924 -81222 -205788 -140442 -12894 -51197 131660 257240 422377 692888
7152F92888K18308K41895R5792j05707k19572k78578j20366p8001j29701j5517
$$ 692888 911196 1153091 1248883 1143176 923604 645026 524660 446659 316958 301441
7142C01441j19978k23277Q306j21749p6301J13628J7026M7233r331q328j1711
$$ 301441 181463 -41814 -33508 -155257 -231558 -117930 -100904 -53671 -63002 -71330 -83041
7131h3041l3769J53141J22773m7656j33741r0672l1503J71136o204n8872R640
$$ -83041 -116810 36331 159104 111448 -22293 -112965 -144468 26668 20464 -38408 -28768
7120b8768p0167l3764P320N4494P9224j42135o330J2662l8816j0106K155n0841
$$ -28768 -98935 -132699 -125379 -70885 8339 -133796 -140126 -127464 -166280 -176386 -174231 -225072
7108b25072K5747P1761q532Q4316J9825n256m4130N0840O0556n3786j15842Q339
$$ -225072 -199325 -127564 -136096 -51780 -31955 -37211 -81341 -30501 30055 -23731 -139573 -131234
7096a31234J7696J02267p3025K893k920N5966P330m6904l6607R3950K1849r3928
$$ -131234 -113538 -11271 -84296 -81403 -84323 -28357 -21027 -67931 -104538 -10588 11261 -82667
7084h2667J21407l5492n3259r0922l4421k140J69900n8839q6927L4067L601r9300
$$ -82667 38740 3248 -50011 -140933 -175354 -177494 -7594 -66433 -153360 -119293 -115692 -214992
7072b14992o1486j7762K8281O807j036j265K4378K1330j22876K7155J2414R9265
$$ -214992 -276478 -294240 -265959 -259152 -260188 -261453 -237075 -215745 -338621 -311466 -299052 -199787
7060a99787J87545o712n7577r8292O2693J38538j36606j12414J46225M5977j12208
$$ -199787 -12242 -18954 -76531 -174823 -112130 26408 -110198 -222612 -76387 -30410 -142618
7049a42618j2336j5009M4737o6648r7192N2166R739J88909J0135j25345o7953
$$ -142618 -154954 -169963 -125226 -191874 -289066 -236900 -227161 -38252 -28117 -153462 -221415
7038b21415r057M6370m8315Q3667J14377N5863l4400L3268j12672M4041j7884
$$ -221415 -230472 -184102 -232417 -148750 -34373 21490 -12910 20358 -92314 -48273 -66157
7027f6157k0314P4193O7225R060o395k4789J9966m2431o6774Q2695q5839O7776
$$ -66157 -86471 -12278 54947 64007 57612 32823 52789 10358 -56416 26279 -59560 8216
7015H216J703m8310n1031j74026j4010J99946q443l2109m0119j2969r266N059
$$ 8216 9919 -38391 -89422 -263448 -277458 -77512 -85955 -118064 -158183 -171152 -180418 -175359
7003a75359l4720k3785J68636k1041k4048P6041Q0144j06398j7730O6498M0996
$$ -175359 -210079 -233864 -65228 -86269 -110317 -34276 45868 -60530 -78260 -11762 29234
6992B9234k0186J7783O495j19929m9517m4264P669N6742J44791j8242l4245l5311
$$ 29234 9048 26831 33326 -86603 -136120 -180384 -172715 -115973 28818 10576 -23669 -58980
6980e8980p3959L8520Q4047L0700K2158m0091j55643K9257K8920n8488j5494J27279
$$ -58980 -132939 -94419 -10372 20328 42486 2395 -153248 -123991 -95071 -153559 -169053 -41774
6968d1774j57473O4721p0362M9272J21302l1028M1268r857P3833n8327l2592m7359
$$ -41774 -199247 -134526 -204888 -155616 -34314 -65342 -24074 -33931 39902 -18425 -51017 -98376
6956i8376l8871J3740O8882j6503k2783r205R5965j6414j20617k047N0376l03
$$ -98376 -137247 -123507 -54625 -71128 -93911 -103116 -7151 -23565 -144182 -146229 -95853 -96156
6944i6156n8778r1418K2730J64075m271p043N722o0971r224n082l2726Q4376K731
$$ -96156 -154934 -246352 -223622 -59547 -63818 -70861 -65139 -126110 -135334 -140416 -173142 -88766 -86035
6931h6035L1982J7165M1026k25123j360K849J41821R2222p3684J31054j77933
$$ -86035 -54053 -36888 4138 -220985 -222345 -219496 -77675 14547 -59137 71917 -106016
6920a06016L9559p8711l9511K1170N0937j35065M3520q503K9093J08353J2985
$$ -106016 -66457 -145168 -184679 -163509 -112572 -247637 -204117 -212620 -183527 -75174 -62189
6909f2189K1865j1525o877N767L5804l2431n0863k9753J1617J6841K1998M0582
$$ -62189 -40324 -51849 -58726 -52959 -17155 -49586 -100449 -130202 -118585 -101744 -79746 -39164
6897c9164q8604M7402K3465J2690R6919P3311k04144n3004l5233j5750J60830
$$ -39164 -127768 -80366 -56901 -44211 52708 126019 -78125 -131129 -166362 -182112 -21282
6886b1282K4967q9203j61644K248O6060P819k2166J1039M6465l9121Q3249O2Q67
$$ -21282 3685 -85518 -247162 -244914 -178854 -171035 -193201 -182162 -135697 -174818 -91569 -91507 -90640
6873i0640o6871M2815o2265k5596K6868J3883K7149N8886k5336q6584J11983R6231
$$ -90640 -157511 -114696 -176961 -202557 -175689 -161806 -134657 -75771 -101107 -187691 -75708 20523
6861B0523J18611j22800j20985M3032R4678j2354j11774n773k6286L5310J15062
$$ 20523 139134 16334 -104651 -61619 33059 20705 -91069 -96842 -123128 -87818 27244
6850B7244j22421O1066J23425q0446k07000K9980j8111J53401M4964j09781K7374
$$ 27244 -95177 -34111 89314 8868 -198132 -168152 -186263 -32862 12102 -97679 -70305
6839g0305P9723j22764r4695R2326j2563p9251N2487J02539L4951K385j10002
$$ -70305 9418 -113346 -208041 -115715 -128278 -207529 -155042 -52503 -17552 -15167 -125169
6828a25169N6586L0208r27J15938j36054O4365J7765j8101m7977L325O6968J0901
$$ -125169 -68583 -38375 -39302 76636 -59418 4947 22712 4611 -43366 -40041 26927 37828
6816C7828j17484p6213R2782L9239N015j1482j17934J54152j2932j38906Q5700
$$ 37828 -79656 -155869 -63087 -23848 -18833 -30315 -148249 5903 -7029 -145935 -60235
6805f0235o7206J3502Q7403p9581Q2188L3874l8899j27792o63O4012J0395O3961
$$ -60235 -127441 -113939 -26536 -106117 -23929 9945 -28954 -156746 -157409 -93397 -83002 -19041
6793a9041m6746N0729J2473l5453l9666j18285k3683L9065P2247l2451l496j3764
$$ -19041 -65787 -15058 -2585 -38038 -77704 -195989 -219672 -180607 -108360 -140811 -144307 -158071
6781a58071J5736R9441p2976L7327J16145k167j10888m323q2661p8286P0162J33528
$$ -158071 -142335 -42894 -115870 -78543 37602 35435 -75453 -79776 -162437 -240723 -170561 -37033
6769c7033r0432K988l1844P7858R6425m9820N4235q3254q4317J42073j7617j34905
$$ -37033 -127465 -124477 -156321 -78463 17962 -31858 22377 -60877 -145194 -3121 -20738 -155643
6757a55643j7439J07269Q1623L9667l3980o5160j21237K5270P0669j05936p8162
$$ -155643 -173082 -65813 15810 55477 21497 -43663 -164900 -139630 -68961 -174897 -253059
6746b53059R2271n3200L3597k0094k649J61786j7855L6628O3771j1586j36410
$$ -253059 -160788 -213988 -180391 -200485 -203134 -41348 -59203 -22575 41196 29610 -106800
6735a06800m3083j6330k8462R947O2984j9502J7126K43531j94855m7288O6090
$$ -106800 -149883 -166213 -194675 -184728 -121744 -141246 -124120 119411 -75444 -122732 -56642
6724e6642J37683M6570r7808P346r8124M4243l1213P6116R0274q0281J3295M258
$$ -56642 81041 127611 29803 37149 -60975 -16732 -47945 28171 118445 38164 51459 55717
6712E5717K704m29j59395L2993P4426R665J35j29852N5966J20255J71469J8244
$$ 55717 58421 57992 -101403 -68410 6016 15681 15816 -114036 -58070 62185 233654 251898
6700B51898l596j02592o5597n8754n7493R4319k5047k0019M0610j80152J97248
$$ 251898 248302 145710 80113 21359 -36134 58185 33138 13119 53729 -126423 70825
6689G0825J03059n5723m7358j1370O0298j02175J03135M5599N7387l2155P904
$$ 70825 173884 118161 70803 59433 119731 17556 120691 166290 223677 191522 199426
6678A99426p6379o7270j01984P297J43399k8099k2595N4333j8564n2531J4000
$$ 199426 123047 55777 -46207 -38910 104489 76390 53795 108128 89564 37033 51033
6667E1033O0091Q1739O0824j31079J16599n392p90L9662l0401N1415J6253l9527
$$ 51033 111124 192863 253687 122608 239207 233815 233025 272687 242286 293701 309954 270427
6655B70427o9964L168O7673l0351j66670R8786K1497o6549k5779J55148O6123
$$ 270427 200463 203631 271304 240953 74283 173069 194566 128017 102238 257386 323509
6644C23509K6625N7350o2533n322q5162o3045j08773Q5160p3419O0468J3492n9033
$$ 323509 350134 407484 344951 339629 254467 191422 82649 167809 94390 154858 168350 109317
6632A09317l1999K06010q7719M8000M2351r4929N8995l4718J04603O994O6102
$$ 109317 77318 283328 195609 243609 285960 191031 250026 215308 319911 326905 393007
6621C93007O5659J35729L1964p1896M6003P0270M0812K0787k1266j28856K2206
$$ 393007 458666 594395 626359 554463 600466 670736 711548 732335 711069 582213 604419
6610F04419J31384K1624j49494J5537N9880J31724J52815k8541j45398j36003
$$ 604419 735803 757427 607933 623470 683350 815074 967889 939348 793950 657947
6600F57947o9685O0997Q385n8341r6390j25778J7533R532P3776K6448J14153j7716
$$ 657947 588262 649259 657644 599303 502913 377135 394668 404200 477976 504424 618577 600861
6588F00861l8525K5545L0643N635J59389m3405K3611L6881L9063p8697j26003
$$ 600861 562336 587881 618524 624159 783548 740143 763754 800635 839698 761001 634998
6577F34998O219j82812J16441J18857n1487k0548O8748L9824K3959M3076n4376
$$ 634998 641217 458405 574846 693703 642216 621668 690416 730240 754199 797275 742899
6566G42899K0566o215N124j11239P615J03228p1421j16219J42835k3775q9343
$$ 742899 763465 757250 762374 651135 658750 761978 690557 574338 717173 693398 604055
6555F04055N4292J65698J1674P8912l4447O780J19666O8257J39305k6404R2998
$$ 604055 658347 824045 835719 914631 880184 886964 1006630 1074887 1214192 1187788 1280786
6544A280786K23072q7686j44984j30720m9100L4091j6933n4522J91482K1208r4785
$$ 1280786 1503858 1416172 1271188 1140468 1091368 1125459 1108526 1054004 1245486 1266694 1171909
6533A171909m6234N9280P7036O7271j01929j10269O0371P5218o7343k69249r0215
$$ 1171909 1125675 1184955 1261991 1329262 1227333 1117064 1177435 1252653 1185310 916061 825846
6522H25846j37032j6960L9518P7992j19944j8843Q0395K854o7847j2247p415O8242
$$ 825846 688814 671854 711372 789364 669420 650577 730972 733826 665979 653732 646317 714559
6510G14559L3134p837l8552m1789J958k2294L3276J14157J05675o5305p4472j02255
$$ 714559 747693 739856 701304 659515 661473 639179 672455 786612 892287 826982 752510 650255
6498F50255k922J35674n775K3663j01584P4432q4587J341M1743p1571L8131J13693
$$ 650255 647333 783007 777232 800895 699311 773743 689156 690497 732240 660669 698800 812493
6486H12493J5746j45265j185J86696j3285q2558J30405o8853L0969M7978m2803
$$ 812493 828239 682974 681789 868485 855200 772642 903047 834194 865163 913141 870338
6475H70338O8194k05988K00683K9073j15003O9136q0738J22136J30338l1547J06373
$$ 870338 938532 732544 933227 962300 847297 916433 835695 957831 1088169 1056622 1162995
6464A162995m339l6480j891k2073k0533N2160j5073L5285J18908j30607o5579
$$ 1162995 1158656 1122176 1120285 1098212 1077679 1129839 1114766 1150051 1268959 1138352 1072773
6453A072773R5997J01260j86375j05477J10414J01009R5839N3676k8231J9076
$$ 1072773 1168770 1270030 1083655 978178 1088592 1189601 1285440 1339116 1310885 1329961
6443A329961K4639R6438o7575M1520q3850J10789N0981M4889L4320j14665m6875
$$ 1329961 1354600 1451038 1383463 1424983 1341133 1451922 1502903 1547792 1582112 1467447 1420572
6432A420572m768m4356J25660M335N0696R9112l9912n383M5949j47773n2403J66977
$$ 1420572 1415804 1371448 1497108 1501443 1552139 1651251 1611339 1605956 1651905 1504132 1451729 1618706
6420A618706j0982O6957J07200K0142n1988J27226q9437j43527K19995L2732j09740
$$ 1618706 1607724 1674681 1781881 1802023 1750035 1877261 1787824 1644297 1864292 1897024 1787284
6409A787284m325J93443J61981j501k9634J097J23540K3672J52860M2774R6404
$$ 1787284 1782959 1976402 2138383 2136882 2107248 2108345 2231885 2255557 2408417 2451191 2547595
6398B547595N1761j6933J11039J4479k8045J26036J44894J67978M6066k4851J7431
$$ 2547595 2599356 2582423 2693462 2707941 2679896 2805932 2950826 3118804 3164870 3140019 3157450
6387C157450J41335J25382J72981J21306P0766j78Q5969Q3028j99247o6613L9740
$$ 3157450 3298785 3424167 3597148 3718454 3789220 3789042 3875011 3958039 3758792 3692179 3731919
6376C731919p5396l4026J02519J00065J30099J6387P2452J12342J6137P8121J76236
$$ 3731919 3656523 3622497 3725016 3825081 3955180 3971567 4044019 4156361 4172498 4250619 4426855
6365D426855L03673Q5550K04946K03240N6906k9853J33831J76088L2971j4759
$$ 4426855 4730528 4816078 5021024 5224264 5281170 5251317 5385148 5561236 5594207 5579448
6355E579448P966J75318j19766J46653K45549J29910J19972N5896J71600L9056
$$ 5579448 5587414 5762732 5642966 5789619 6035168 6165078 6285050 6340946 6512546 6551602
6345F551602R829J07109K37956J17384J30694J58376J62340J92661J97458L19429
$$ 6551602 6561431 6668540 6906496 7023880 7154574 7312950 7475290 7667951 7865409 8184838
6335H184838J87256L69971L23546M25485M33369N12447M99365M32808O33767O10108
$$ 8184838 8372094 8742065 9065611 9491096 9924465 10436912 10936277 11369085 12002852 12612960
6325A2612960O24279R18628R17896J094602J121140J440496J767845K089547K626253
$$ 12612960 13237239 14155867 15073763 16168365 17289505 18730001 20497846 22587393 25213646
6316B5213646L062089L908142N147217P068349R502985J1535733J2099348R882992
$$ 25213646 28275735 32183877 37331094 44399443 53902428 65438161 77537509 87420501
6308H7420501M808619j092682n972931q367047q523104o934591m866619k515813
$$ 87420501 92229120 91136438 85163507 76796460 68273356 61338765 56472146 53956333
6300E3956333r7359K764623N907612Q791883J0460196R001674M654166j358458
$$ 53956333 53858974 56623597 62531209 71323092 81783288 90784962 95439128 94080670
6292I4080670p131810j0475884j1264924j0408735q662205o677803n152697m046563
$$ 94080670 86948860 76472976 65208052 54799317 46137112 39459309 34306612 30260049
6284C0260049k906000k483932j851663j492757j060137q28411p63042n42539n26995
$$ 30260049 27354049 24870117 23018454 21525697 20465560 19637149 18874107 18331568 17804573
6275A7804573l09479k73284j78301j22888j02228J04732K30409K75253L02400
$$ 17804573 17495094 17221810 17043509 16920621 16818393 16923125 17153534 17428787 17731187
6266A7731187K95325M25223O45139N89849L71256N91935N94208O43507P97485
$$ 17731187 18026512 18451735 19096874 19686723 20057979 20649914 21244122 21887629 22685114
6257B2685114P78099Q48726Q24898J113255J360830J509519J775702K083912K482036
$$ 22685114 23463213 24311939 25136837 26250092 27610922 29120441 30896143 32980055 35462091
6248C5462091L027060L602886M227455N258680O555697Q621729J1855277J5939728
$$ 35462091 38489151 42092037 46319492 51578172 58133869 66755598 78610875 94550603
6240I4550603K0259791K2351742J9702966J2184400J311264q186936j4189723
$$ 94550603 114810394 137162136 156865102 169049502 170360766 162173830 147984107
6233A47984107j5800925j4057485j0354793o064725j833421L015027Q368598J3528146
$$ 147984107 132183182 118125697 107770904 101706179 99872758 102887785 111256383 124784529
6225A24784529J6933423J6335543J0388409M78288r681302j6953472j9886469
$$ 124784529 141717952 158053495 168441904 168920192 159238890 142285418 122398949
6218A22398949j9189285j6423412j3270400j0518560q127614o441839n103208
$$ 122398949 103209664 86786252 73515852 62997292 54869678 48427839 43324631
6211D3324631m228682l187428k596527k365050j849072j625603j411008j248954
$$ 43324631 39095949 35908521 33311994 30946944 29097872 27472269 26061261 24812307
6203B4812307j193317j128549q80829o44044n54910n89696m57592m19052m69026
$$ 24812307 23618990 22490441 21609612 20965568 20410658 19820962 19363370 18944318 18475292
6194A8475292k48626m29980m15506l77524k21632l75655l67048l36398m73020
$$ 18475292 18226666 17796686 17381180 17003656 16782024 16406369 16039321 15702923 15229903
6185A5229903k57436k73298l61563k21181k80430l12318j43181j95095q0280j95286
$$ 15229903 14972467 14699169 14337606 14116425 13835995 13523677 13380496 13185401 13105121 12909835
6175A2909835k60478o0660j47157j84185j01348k17652j26799r896k57405j82660
$$ 12909835 12649357 12588697 12441540 12257355 12156007 11938355 11811556 11801660 11544255 11361595
6165A1361595q7390J0125j47195k7343m6424l11093r1581k1976o3187r2884j20316
$$ 11361595 11274205 11284330 11137135 11109792 11063368 10752275 10660694 10638718 10575531 10482647 10362331
6154A0362331O908n0503p8860q9187J2133p6190j56122p3231n5368R499m5160
$$ 10362331 10369239 10318736 10239876 10150689 10162822 10086632 9930510 9857279 9801911 9811410 9766250
6143I766250P9415J60122j4809J3994J65531j1048q5105K5943Q9190J69409R4489
$$ 9766250 9845665 10005787 9990978 10004972 10170503 10159455 10074350 10100293 10189483 10358892 10453381
6132A0453381P4656K19009K84278K25250J64182K60795M35638L70475M02751M45448
$$ 10453381 10528037 10747046 11031324 11256574 11420756 11681551 12117189 12487664 12890415 13335863
6122A3335863M90940K75584K89616K78687L5233o3383k0237J46104J37058M6513
$$ 13335863 13826803 14102387 14392003 14670690 14705923 14642540 14622303 14768407 14905465 14951978
6112A4951978J70978K33612J44968J82998O2900K34376J65922L87177L24908L33227
$$ 14951978 15122956 15356568 15501536 15684534 15747434 15981810 16147732 16534909 16859817 17193044
6102A7193044M99829M50869N37610O64853Q75531J061127J099733J247816J494605
$$ 17193044 17692873 18143742 18681352 19346205 20221736 21282863 22382596 23630412 25125017
6093B5125017J395476J491559J661433J803123J682849J705921K331822K620479
$$ 25125017 26520493 28012052 29673485 31476608 33159457 34865378 37197200 39817679
6085C9817679L097349L957282M762475N739408P235826R240443J2344889J6313127
$$ 39817679 42915028 46872310 51634785 57374193 64610019 73850462 86195351 102508478
6077A02508478J9902262K1055688J7186588Q006159l406956j2754999j7752467
$$ 102508478 122410740 143466428 160653016 168659175 165252219 152497220 134744753
6070A34744753j8219337j6110768j2990539r666407p144845m948530l014046j649549
$$ 134744753 116525416 100414648 87424109 77757702 70612857 65664327 62650281 61000732
6062F1000732j45804J320574K708402M582068O863628J0131134J4730539J9469398
$$ 61000732 60854928 62175502 64883904 69465972 76329600 86460734 101191273 120660671
6054A20660671K2322708K0288037J1553906n44734j1419321j8123393k0181181
$$ 120660671 142983379 163271416 174825322 174280588 162861267 144737874 124556693
6047A24556693j8833119j5767697j2503623r923303q042181o545218n397170m167954
$$ 124556693 105723574 89955877 77452254 67528951 59486770 52941552 47544382 43376428
6039D3376428l544225k956103k097187j525039j194757j019296p17326k92755
$$ 43376428 39832203 36876100 34778913 33253874 32059117 31039821 30322495 30029740
6031C0029740p8017P8229L35486L77522N23285P55384P66089Q76676P39803O89728
$$ 30029740 29951723 30029952 30365438 30742960 31266245 32021629 32787718 33664394 34404197 35093925
6021C5093925Q92032J018792J262371J792464K036165K654166L433666M047373
$$ 35093925 35985957 37004749 38267120 40059584 42095749 44749915 48183581 52230954
6013E2230954M806737N081757M740511M272325L904416M425110N748911P843340
$$ 52230954 57037691 62119448 66859959 71132284 75036700 79461810 85210721 93054061
6005I3054061R933782R187866N417430q15904o639033r925793j0670297r403347
$$ 93054061 102987843 112175709 117593139 116777235 110138202 100212409 89542112 80138765
5997H0138765p255192n428074l797194k446240j396150m47962K80418J093423
$$ 80138765 72883573 67455499 63658305 61212065 59815915 59367953 59648371 60741794
5989F0741794K001443K953009M500349O549149R306969J2998547J6130259J6546428
$$ 60741794 62743237 65696246 70196595 76745744 86052713 99051260 115181519 131727947
5981A31727947J3180875O518821q59359o871629j0613836j1983393j2090696j1379240
$$ 131727947 144908822 151427643 150568284 143696655 133082819 121099426 109008730 97629490
5973I7629490j0444873r394340q149503o835965n865502m644295l668104k856873
$$ 97629490 87184617 77790277 69640774 62804809 56939307 52295012 48626908 45770035
5965D5770035k099609j576021j047951m20148P9229M20752O44364P11555O06363
$$ 45770035 43670426 42094405 41046454 40626306 40705535 41126287 41770651 42482206 43088569
5956D3088569K93043k64846r96900j525050k033494k186409k105815k207913k073084
$$ 43088569 43381612 43116766 42119866 40594816 38561322 36374913 34269098 32061185 29988101
5947B9988101j894843j487566j437347j355983j039172j045116q99490p11240
$$ 29988101 28093258 26605692 25168345 23812362 22773190 21728074 20828584 20117344
5939B0117344m44803k26258j08245j3310J76830J82442L75544K35787J56409M7899
$$ 20117344 19672541 19446283 19338038 19324728 19501558 19684000 20059544 20295331 20451740 20499639
5929B0499639J38007j0072j28922L5837j66723q7534k82229l28899n51148m57333
$$ 20499639 20637646 20627574 20498652 20534489 20367766 20280232 19998003 19669104 19117956 18660623
5919A8660623n81757n47327l39892j89798J16424P8229J65884P4513l71551m16195
$$ 18660623 18078866 17531539 17191647 17001849 17118273 17196502 17362386 17436899 17065348 16649153
5909A6649153o67410q68967q10897o96140p14812p26421n74594n38623o22235
$$ 16649153 15981743 15112776 14301879 13605739 12890927 12164506 11589912 11051289 10429054
5900A0429054m57310k59854l66478l32970l70411p3040Q662j16921K34435J63342
$$ 10429054 9971744 9711890 9345412 9012442 8642031 8568991 8577653 8460732 8695167 8858509
5890H858509M9321m108p6359j50228k75251k40041m66126l09627j76893k66182
$$ 8858509 8907830 8903722 8827363 8677135 8401884 8161843 7695717 7386090 7209197 6943015
5880F943015k08672r3772L2786K66391L46569J08960K09711J87146k28324k31940
$$ 6943015 6734343 6640571 6673357 6939748 7286317 7395277 7604988 7792134 7563810 7331870
5870G331870j63359l48669l30094k16425j81195j38931j8608L0144l0911l3532
$$ 7331870 7168511 6819842 6489748 6273323 6092128 5953197 5934589 5964733 5933822 5900290
5860E900290j37694p8636k32790l58785l81915k91771m33865l43702k47907j40052
$$ 5900290 5762596 5683960 5451170 5092385 4710470 4418699 3984834 3641132 3393225 3253173
5850C253173j87670j28427j40339j41333J0420r3723p9238k12678q2512L4425
$$ 3253173 3065503 2937076 2796737 2655404 2665824 2572101 2492863 2280185 2197673 2232098
5840B232098n7323K2639j8280p1366n2910j4169p2438l4914j2608L4796o2336
$$ 2232098 2174775 2197414 2179134 2107768 2054858 2040689 1968251 1933337 1920729 1955525 1893189
5829A893189p075j13810p7356m4893l4826O3176j92071M660p6654k2425K9808
$$ 1893189 1886114 1772304 1694948 1650055 1615229 1678405 1486334 1490994 1414340 1391915 1421723
5818A421723m3073K1959j6902l3095o4091K5961L4716R3986L417J5491J07151
$$ 1421723 1378650 1400609 1383707 1350612 1286521 1312482 1347198 1441184 1444601 1460092 1567243
5807A567243K584o8441j20897o4457L4923L9466J08600j9987j26505O1682p4704
$$ 1567243 1569827 1501386 1380489 1316032 1350955 1390421 1499021 1479034 1352529 1414211 1339507
5796A339507R096O7241J5843r2612p2943J48012j16287p0262R5149q8755j09316
$$ 1339507 1348603 1415844 1431687 1339075 1266132 1414144 1297857 1227595 1322744 1233989 1124673
5785A124673j275r1833O2550P8081j03171M9164j0800n0582L7173Q3674r4521
$$ 1124673 1123398 1031565 1094115 1172196 1069025 1118189 1107389 1056807 1093980 1177654 1083133
5774A083133k8662j5467J48737J55791o8487l0956O1209Q3344R969R3288N7474
$$ 1083133 1054471 1039004 1187741 1343532 1275045 1244089 1305298 1388642 1398611 1491899 1549373
5763A549373P5189J25930j35114n297j65057j0938n1250j26850Q0780j7665q7259
$$ 1549373 1624562 1750492 1615378 1610081 1445024 1434086 1382836 1255986 1336766 1319101 1231842
5752A231842L1384n2365m8793J08404l0179O0265R8835n94J00250m1498O0857
$$ 1231842 1263226 1210861 1162068 1270472 1240293 1300558 1399393 1398799 1499049 1457551 1518408
5741A518408J20275J37090j0816r0951N0122o8575q2411o1924q598j62849j00964
$$ 1518408 1638683 1775773 1764957 1674006 1724128 1655553 1573142 1511218 1502620 1339771 1238807
5730A238807K5578m6627j3668j15202p9051J7792O0939k5471j05526M953L2807
$$ 1238807 1264385 1217758 1204090 1088888 1009837 1027629 1088568 1063097 957571 962524 995331
5719I95331P0383L7496J3828p4143R6765j0653m2498M314K5683N124J0917p527
$$ 995331 1065714 1103210 1117038 1042895 1139660 1129007 1086509 1090823 1116506 1121630 1132547 1125020
5707A125020l6021J3890j35352K14165k1913j19092L2898q1540N3257n330J14658
$$ 1125020 1088999 1102889 967537 1181702 1159789 1040697 1073595 992055 1045312 1039982 1154640
5696A154640K7511k7480m4504J58822N7887O0174k8476j6944O385p9153O9631
$$ 1154640 1182151 1154671 1110167 1268989 1326876 1387050 1358574 1341630 1348015 1268862 1338493
5685A338493K0138r7198n3825P2905J884L9562k6429l7753J28926n9497J65943
$$ 1338493 1358631 1261433 1207608 1280513 1282397 1321959 1295530 1257777 1386703 1327206 1493149
5674A493149J19099j16348K769M8457Q9706J64441k8660Q0122J13812p8155j11097
$$ 1493149 1612248 1495900 1498669 1547126 1636832 1801273 1772613 1852735 1966547 1888392 1777295
5663A777295O0557K4471m1113j23850J1277L6036j21977O7482N088K4247j0138
$$ 1777295 1837852 1862323 1821210 1697360 1708637 1744673 1622696 1690178 1695266 1719513 1709375
5652A709375q5943o3275Q7053L2577J04436J29485l5360J54398K56344l8864P6409
$$ 1709375 1623432 1560157 1647210 1679787 1784223 1913708 1878348 2032746 2289090 2250226 2326635
5641B326635j34359j14561R5919K6215k72570j56258L4473r2166q3577O3736R2879
$$ 2326635 2192276 2077715 2173634 2199849 1927279 1771021 1805494 1713328 1629751 1693487 1786366
5630A786366q142M2617P6113k12617k37629J96849J49459o5750J36449O4889l2826
$$ 1786366 1778224 1820841 1896954 1684337 1446708 1643557 1793016 1727266 1863715 1928604 1895778
5619A895778J03035K23482J62654J49355K94851J95514Q7299l7131j94511k46935
$$ 1895778 1998813 2222295 2384949 2534304 2829155 3024669 3111968 3074837 2880326 2633391
5609B633391k38235j42707o1196j17444p9960J56792R6998K1803L06163K64099
$$ 2633391 2395156 2252449 2191253 2073809 1993849 2150641 2247639 2269442 2575605 2839704
5599B839704N8564J94518L1442j59300r0704j2135Q8463l913K0123k11349j98015
$$ 2839704 2898268 3092786 3124228 2964928 2874224 2862089 2950552 2946639 2966762 2755413 2557398
5588B557398k17139l11159j54191j65084q1744J01085j12066j23775J9135R4346
$$ 2557398 2340259 2029100 1874909 1709825 1628081 1729166 1617100 1493325 1512460 1606806
5578A606806j8061Q0265L39430K52285L37485K64448J0574P4119k36880k10252
$$ 1606806 1588745 1669010 2008440 2260725 2598210 2862658 2873232 2947351 2710471 2500219
5568B500219j93270k80686j92521l32054j40534j37567j15128q8999K1970N3128
$$ 2500219 2306949 2026263 1833742 1501688 1361154 1223587 1108459 1019460 1041430 1094558
5558A094558k25787p4358n874j5827j5352N7392R9385j10174Q5400M7372P4q4756
$$ 1094558 868771 794413 788539 772712 757360 814752 914137 803963 889363 936735 936809 852053
5546H52053O2277J63829R3980j51200k01526J00089J25983p7854j59132J15943
$$ 852053 914330 1078159 1172139 1020939 819413 919502 1045485 967631 808499 924442
5536I24442R5775Q10q8091K9264j98427J086O2126r3535J48085J3674N8689O3906
$$ 924442 1020217 1021027 932936 962200 763773 764859 826985 733450 881535 895209 953898 1017804
5524A017804R2447j7378N9094P1422o9367J95515N1131m2786r129J638K803p1605
$$ 1017804 1110251 1092873 1151967 1223389 1154022 1349537 1400668 1357882 1348753 1350391 1353194 1281589
5512A281589q7156j4953N8264J23170l7106Q6697O787l4050L23j45866K1665n4648
$$ 1281589 1194433 1179480 1237744 1360914 1323808 1410505 1417292 1383242 1383565 1237699 1259364 1204716
5500A204716k9925m2638J36322K0609l6426j73557p0176j7454o3k1664J0111N3401
$$ 1204716 1174791 1132153 1268475 1289084 1252658 1079101 1008925 991471 991408 969744 979855 1033256
5488A033256n267j202J18248O889m4979N6270K0082P3021m0633p2416Q8545j26638
$$ 1033256 1027989 1026787 1145035 1151924 1106945 1163215 1183297 1256318 1215685 1143269 1231814 1105176
5476A105176n6130K332P912N3990J0788p24j9853m4456N9437l189L2156r5309
$$ 1105176 1049046 1051378 1059290 1113280 1124068 1123344 1103491 1059035 1118472 1115283 1147439 1052130
5464A052130j38161Q7542L7040j7569k7227j3932J96640m4402j72277K9901j277
$$ 1052130 913969 1001511 1038551 1020982 993755 979823 1176463 1132061 959784 989685 988408
5453I88408p979P946J32788L215N4245K3811j1586N2469K5129p8107K6781o2481
$$ 988408 980429 988375 1121163 1124378 1178623 1202434 1190848 1243317 1268446 1190339 1217120 1154639
5441A154639j0656O0215q8845j0377O3357l3610K39694n4950j00227o0587j3625
$$ 1154639 1143983 1204198 1115353 1104976 1168333 1134723 1374417 1319467 1219240 1158653 1145028
5430A145028q4771J11332K1718j24982J63350J19435p9958R4227j916j19313K5465
$$ 1145028 1060257 1171589 1193307 1068325 1231675 1351110 1271152 1365379 1363463 1244150 1269615
5419A269615j1020l1824J27001J62745j18580j17897J40110M5482j667Q3866J54414
$$ 1269615 1258595 1226771 1353772 1516517 1397937 1280040 1420150 1465632 1463965 1547831 1702245
5408A702245k6438r2547k8017O0201J34476j4340l6547m0885J27403k0648n0995
$$ 1702245 1675807 1583260 1555243 1615444 1749920 1735580 1699033 1658148 1785551 1764903 1713908
5397A713908J0669J13040l6628Q7732J38126M4100n6457J0659J09163j08453j16650
$$ 1713908 1724577 1837617 1800989 1888721 2026847 2070947 2014490 2025149 2134312 2025859 1909209
5386A909209O2547J43737k9918K4838M3970P6188K0608k1484Q2218K177M4798
$$ 1909209 1971756 2115493 2085575 2110413 2154383 2230571 2251179 2229695 2311913 2314090 2358888
5375B358888M0499L9930J23690j24389P3219J05685P171M367O9368J11764N7462
$$ 2358888 2399387 2439317 2563007 2438618 2511837 2617522 2624693 2629060 2698428 2810192 2867654
5364B867654m6647O1729Q7267O3896K2497N3370J26319j24368k2671J07687j4795
$$ 2867654 2821007 2882736 2970003 3033899 3056396 3109766 3236085 3111717 3089046 3196733 3181938
5353C181938Q1093J22209M1726J56399j42944J47457J51364M6726N7859K7693
$$ 3181938 3263031 3385240 3426966 3583365 3440421 3587878 3739242 3785968 3843827 3871520
5343C871520M4734J11019J87192o9994n0643Q2750J13817J12995K2552P7622J73337
$$ 3871520 3916254 4027273 4214465 4144471 4093828 4176578 4290395 4403390 4425942 4503564 4676901
5332D676901J67058J01255M4365o9668J48520M821J57326J24094J33168K14969
$$ 4676901 4843959 4945214 4989579 4919911 5068431 5073252 5230578 5354672 5487840 5702809
5322E702809J42125K90070K23009O2089R5685J30556K04677L02358K48847O6715
$$ 5702809 5844934 6135004 6358013 6420102 6515787 6646343 6851020 7153378 7402225 7468940
5312G468940Q5647O2289K07440M12098K51181J16274L74694K65667J57753M27907
$$ 7468940 7554587 7616876 7824316 8236414 8487595 8603869 8978563 9244230 9401983 9829890
5302I829890L04334L30594J20990L67927L35512L16862M15239M34054N67432N61577
$$ 9829890 10134224 10464818 10585808 10953735 11289247 11606109 12021348 12455402 13022834 13584411
5292A3584411N75761N64530N04816O72264R37512J066737J225490J570146J768445
$$ 13584411 14160172 14724702 15229518 15901782 16839294 17906031 19131521 20701667 22470112
5283B2470112K344372L094083L943190N031426N545399M473547K107108J05079
$$ 22470112 24814484 27908567 31851757 36883183 42428582 46902129 49009237 49114316
5275D9114316j436011j568129r26018R2977J307608L050899N068374P423244R021361
$$ 49114316 47678305 46110176 45184158 45277135 46584743 49635642 54704016 62127260 71148621
5266G1148621Q944906P635496N486017L178239J918256J319615N08766k13396
$$ 71148621 80093527 87729023 93215040 96393279 98311535 99631150 100139916 99926520
5258I9926520k39233P30234J364936J343305J595797K268147K510109K424321
$$ 99926520 99687287 100417521 101782457 103125762 104721559 106989706 109499815 111924136
5250A11924136K812652L553859M410138M820063M259203K864294L06968k303622
$$ 111924136 114736788 118290647 122700785 127520848 131780051 134644345 134951313 132647691
5242A32647691m202912m937187m258020k914657k174710k413351k696999k424443
$$ 132647691 128444779 123507592 119249572 116334915 114160205 111746854 109049855 106625412
5234A06625412k373451k904160k819196j798866j063336n03751P5855Q30020K79549
$$ 106625412 104251961 101347801 98528605 96729739 95666403 95162652 95238507 96068527 96348076
5225I6348076j277855l605820o315047q532472r251191q545985p013222n232253
$$ 96348076 95070221 91464401 85149354 76616882 67365691 58819706 51806484 46574231
5217D6574231l584317j959398n6176J551688K330545J432471n67474k840517m582056
$$ 46574231 42989914 41030516 40974340 42526028 44856573 46289044 45721570 42881053 38298997
5208C8298997m927368m372487l880607l087950k410728j997232j494086j231768
$$ 38298997 33371629 28999142 25118535 22030585 19619857 17622625 16128539 14896771
5200A4896771j040248p75501o88188n52095o59392n90610l83895l68043l91604
$$ 14896771 13856523 13081022 12392834 11840739 11181347 10590737 10206842 9838799 9447195
5191I447195l35246k86513k76746l12421k95693j41814j54835j56805j40767j44554
$$ 9447195 9111949 8825436 8548690 8236269 7940576 7798762 7643927 7487122 7346355 7201801
5181G201801k60045k65936j70807L4559k09827j55265j83023k6774j06179n4037
$$ 7201801 6941756 6675820 6505013 6539572 6329745 6174480 5991457 5964683 5858504 5804467
5171E804467M206j95562q1002j60645k1753L0681r0007p1476j54005k6417j06947
$$ 5804467 5808673 5613111 5532109 5371464 5349711 5380392 5290385 5218909 5064904 5038487 4931540
5160D931540J1801m3893j15366Q5295j2889p9253j1654m8650J2109M9723L0589
$$ 4931540 4943341 4899448 4784082 4869377 4856488 4777235 4765581 4716931 4729040 4778763 4809352
5149D809352r2341J1812O6492r494j21189K00468M3262K5419n6232K0911J42679
$$ 4809352 4717011 4728823 4795315 4785821 4664632 4865100 4908362 4933781 4877549 4898460 5041139
5138E041139J41358J19477k2795J09972K46623L90757L52239L75263M70970O62315
$$ 5041139 5182497 5301974 5279179 5389151 5635774 6026531 6378770 6754033 7225003 7887318
5128G887318P90902N31118J88547l55598m39484n91699n36081j91671k38494M9362
$$ 7887318 8678220 9209338 9397885 9042287 8602803 8011104 7475023 7283352 7044858 7094220
5118G094220O4221J26252K43505L94754O39079P28506O36188J99761j44763m49575
$$ 7094220 7158441 7284693 7528198 7922952 8562031 9290537 9926725 10126486 9981723 9532148
5108I532148o44542n25509m36222m32738l90248j72141k09467r8984j42028j20348
$$ 9532148 8887606 8362097 7925875 7493137 7102889 6930748 6721281 6622297 6480269 6359921
5098F359921l6144k273j03917k26564J6210l1205J01423R0826R6312K04466P8714
$$ 6359921 6323777 6321504 6217587 5991023 6007233 5976028 6077451 6168277 6264589 6469055 6547769
5087F547769N0281M9927K37790K75093K89460M94880N20072M98912Q25190J029152
$$ 6547769 6598050 6647977 6885767 7160860 7450320 7945200 8465272 8964184 9789374 10818526
5077A0818526J200675J278584J098980L29348k36657o86197q07699q53960p91631
$$ 10818526 12019201 13297785 14396765 14726113 14489456 13803259 12995560 12141600 11349969
5068A1349969n99888k93054p2003M6718K58145M68631P33039J030766J072671
$$ 11349969 10750081 10457027 10385024 10431742 10689887 11158518 11891557 12922323 13994994
5059A3994994N19120j10036q02166j125641j181949j081323q31179n87211n72872
$$ 13994994 14514114 14404078 13601912 12476271 11294322 10212999 9381820 8794609 8221737
5050H221737l77908k75627j81639l1530j62327k4030j32502q9525N351j70844
$$ 8221737 7843829 7568202 7386563 7355033 7192706 7168676 7036174 6946649 6952000 6781156
5040F781156r5416j45870j58863o2277O468r5988q5196N8639Q4825l4211n439
$$ 6781156 6685740 6539870 6381007 6318730 6325198 6229210 6144014 6202653 6287478 6253267 6247828
5029F247828J14128J7927M4476K7114N2858j4632L3648M6945P2128J28291m5925
$$ 6247828 6361956 6379883 6424359 6451473 6504331 6489699 6523347 6570292 6642420 6770711 6724786
5018F724786j7040k521L7424J38467j22492J53238J27921J42946R5603O2013J15339
$$ 6724786 6707746 6705225 6742649 6881116 6758624 6911862 7039783 7182729 7278332 7340345 7455684
5007G455684J85540O9584Q8899J39833K4703J76239J49709P2598K06494K07729
$$ 7455684 7641224 7710808 7799707 7939540 7964243 8140482 8290191 8362789 8569283 8777012
4997H777012R2461K9319K3416J16148O4420J37696L8326K8218J38235J15512O0058
$$ 8777012 8869473 8898792 8922208 9038356 9102776 9240472 9278798 9307016 9445251 9560763 9620821
4986I620821K50653N9650L01899M01451L29391M35655K59862L71157L33709L11143
$$ 9620821 9871474 9931124 10233023 10634474 10963865 11399520 11659382 12030539 12364248 12675391
4976A2675391L51779K24042r5961j68190K36012O65R8321K90390L25657M32481
$$ 12675391 13027170 13251212 13155251 12987061 13223073 13223738 13322059 13612449 13938106 14370587
4966A4370587P44513J014206J308380J197745J174088R18541K40150k62101n02491
$$ 14370587 15115100 16129306 17437686 18635431 19809519 20728060 20968210 20706109 20203618
4957B0203618p22943o79267n78866l52678l86819j91296M4872j44308M9788P2571
$$ 20203618 19480675 18801408 18222542 17869864 17483045 17291749 17336621 17192313 17242101 17314672
4947A7314672J65117L27041J97804M43125P15900O44824P05198Q09432R41311
$$ 17314672 17479789 17806830 18004634 18447759 19163659 19808483 20513681 21323113 22264424
4938B2264424J257882J492507J232996Q87249K79294k37790n95169o51454o33938
$$ 22264424 23522306 25014813 26247809 27135058 27414352 27176562 26581393 25929939 25296001
4929B5296001k94535l78120k40011l7787O8103L17768M00988L02713M97122O07030
$$ 25296001 25001466 24623346 24383335 24345548 24413651 24731419 25132407 25435120 25932242 26539272
4919B6539272M34851N66685O36541N49203P23105P76487Q18207J065236J139407
$$ 26539272 26974123 27540808 28177349 28726552 29449657 30226144 31044351 32109587 33248994
4910C3248994Q88349Q34479P60610M98011K60641L19368M97191O41382Q14628
$$ 33248994 34137343 34971822 35732432 36230443 36491084 36810452 37307643 37949025 38763653
4901C8763653Q32045J104359J231250J252450J410692J597377J672190J723042
$$ 38763653 39595698 40700057 41931307 43183757 44594449 46191826 47864016 49587058
4893D9587058J815539K164086K354294K529187L075015L615268M539909N678253
$$ 49587058 51402597 53566683 55920977 58450164 61525179 65140447 69680356 75358609
4885G5358609P261845R486083J2673150J7232331K1725789K1992591J5063094
$$ 75358609 82620454 92106537 104779687 122012018 143737807 165730398 180793492
4878A80793492L237990p952216j4334459j5742596j3302572r687227o367417l282669
$$ 180793492 184031482 176079266 161744807 146002211 132699639 123012412 116644995 113362326
4870A13362326n92270J755033M246698P146900J0547697J5030554K1309958K7523481
$$ 113362326 112770056 114525089 118771787 125918687 136466384 151496938 172806896 200330377
4862B00330377L0358208K8002639K3381870J8558062J1871770J976336r436848
$$ 200330377 230688585 258691224 282073094 300631156 312502926 314479262 305042414
4855C05042414j8085332k0574775j7909747j2852833p034236j962544J494229
$$ 305042414 286957082 266382307 248472560 235619727 228585491 226622947 228117176
4848B28117176L602813M747067N550741O859831R222121J3145582J8344311K1608160
$$ 228117176 231719989 236467056 242017797 248877628 258099749 271245331 289589642 311197802
4840C11197802J8393393P585260n769409j5944691j9897344j8750139j4919507
$$ 311197802 329591195 337176455 331407046 315462355 295565011 276814872 261895365
4833B61895365r798969n159166j018206K869809O210093Q638953J0930156J3092928
$$ 261895365 252096396 246937230 245919024 248788833 254998926 263637879 274568035 287660963
4825B87660963J5217084J7865224K0297252K2059121K2616619K1021034J8219649
$$ 287660963 302878047 320743271 341040523 363099644 385716263 406737297 424956946
4818D24956946J3880633R293919M698475J44840m221650q473868j2195872j5079781
$$ 424956946 438837579 448131498 452829973 452974813 448753163 440279295 428083423 413003642
4810D13003642j6848991j7174412j6083074j4065471j0814931p297531m283678
$$ 413003642 396154651 378980239 362897165 348831694 338016763 330719232 326435554
4803C26435554j908190l54161P16045J658909K798394M602372P404052J0750238
$$ 326435554 324527364 324173203 324889248 326548157 329346551 333948923 341352975 352103213
4795C52103213J4256479J7703381K0535974K2001643K2030279J9970994J6164385
$$ 352103213 366359692 384063073 404599047 426600690 448630969 468601963 484766348
4788D84766348J1501019O785587K623958j368841n720885j0965072j6261537k0613419
$$ 484766348 496267367 503052954 505676912 504308071 498587186 487622114 471360577 450747158
4780D50747158k3151744k3577101k2414211k0424318j8403926j6622635j4836855
$$ 450747158 427595414 404018313 381604102 361179784 342775858 326153223 311316368
4773C11316368j3322026j1566296r718593p789169n771826l735546j669749K22977
$$ 311316368 297994342 286428046 276709453 268920284 263148458 259412912 257743163 257966140
4765B57966140J466939J926839J781484J211128M99345j45054m82925j880649
$$ 257966140 259433079 261359918 263141402 264352530 264851875 264706821 264223896 262343247
4757B62343247l764408o333240r334075j1609772j2952498j3567104j3164819
$$ 262343247 258578839 252245599 242911524 231301752 218349254 204782150 191617331
4750A91617331j2581239j1783146j0898607j0430070r629485q907382q292160
$$ 191617331 179036092 167252946 156354339 145924269 136294784 127387402 119095242
4743A19095242p279080o339659n587578m812745m122389l426043k868239k480964
$$ 119095242 111816162 105476503 99888925 95076180 90953791 87527748 84659509 82178545
4735H2178545k261168j957274j621270j523133j474495j196441j174978j224311
$$ 82178545 79917377 77960103 76338833 74815700 73341205 72144764 70969786 69745475
4727F9745475j321474j240765j396851j174794j337532j411471j333833j667214
$$ 69745475 68424001 67183236 65786385 64611591 63274059 61862588 60528755 58861541
4719E8861541j606094j777291j629616j320895j301448j252423j124499n92363
$$ 58861541 57255447 55478156 53848540 52527645 51226197 49973774 48849275 48256912
4711D8256912o93348m53669m04682k76362k67624m02307l77203m73771m98661
$$ 48256912 47563564 47109895 46705213 46428851 46161227 45758920 45381717 44907946 44409285
4702D4409285p04605q92767q14824q10455q59635n75435l87905m16231l03904
$$ 44409285 43704680 42811913 41997089 41186634 40326999 39751564 39363659 38947428 38643524
4693C8643524k53785n54212o98234n46148n58223q48581q02737p73971q47984
$$ 38643524 38389739 37835527 37137293 36591145 36032922 35184341 34381604 33607633 32759649
4684C2759649q12297o37830o05204n95159m74102l82000k77897k38751k08263
$$ 32759649 31947352 31309522 30704318 30109159 29635057 29253057 28975160 28736409 28528146
4675B8528146k37613o74810p04989p45948o92070m15521j81169j805J66962N2527
$$ 28528146 28290533 27615723 26910734 26164786 25472716 25057195 24876026 24874221 25041183 25093710
4665B5093710q185K44213K4829o8902k07564l16361m87854l56699l34596m92267
$$ 25093710 25085525 25329738 25354567 25285665 25078101 24761740 24273886 23917187 23582591 23090324
4655B3090324m29788m02451l32490l85325j06374l18736k05721k91291n76780
$$ 23090324 22660536 22258085 21925595 21540270 21433896 21115160 20909439 20618148 20041368
4646B0041368n23579m70433l41056m82492k94017j32328k84443n7437k00296q0925
$$ 20041368 19517789 19047356 18706300 18223808 17929791 17797463 17513020 17455583 17255287 17174362
4636A7174362L7356J44442k7146P1084J15499J58058J31440J00847J15405n3041
$$ 17174362 17211718 17356160 17329014 17400098 17515597 17673655 17805095 17905942 18021347 17968306
4626A7968306P1292R5175O9632K54263L39620K10092L60477L84144O01064Q07637
$$ 17968306 18039598 18134773 18204405 18458668 18798288 19008380 19368857 19753001 20354065 21161702
4616B1161702J235619J377776J126620O09927K9735m90008q08833o16559o31192
$$ 21161702 22397321 23775097 24901717 25511644 25541379 25051371 24242538 23625979 22994787
4607B2994787k70033m6601K2908L00047M54965Q35863R94497J142335J461982
$$ 22994787 22724754 22678153 22701061 23001108 23456073 24291936 25286433 26428768 27890750
4598B7890750J759555K182306K424185K396289K584779K490210K462425K261080
$$ 27890750 29650305 31832611 34256796 36653085 39237864 41728074 44190499 46451579
4590D6451579J878246K015029K420663L460486N175054P703053J1256252J6174134
$$ 46451579 48329825 50344854 52765517 56226003 61401057 69104110 80360362 96534496
4582I6534496K1431588K3415952J8814474Q268275l421138j1682136j3984040
$$ 96534496 117966084 141382036 160196510 168464785 165043647 153361511 139377471
4575A39377471j2298814p905707k306287L410311R923206J5490805J7357896J2761847
$$ 139377471 127078657 119172950 116866663 120276974 130200180 145690985 163048881 175810728
4567A75810728K847260p691591j4107935j4586499j0810500m301021L588879J0475362
$$ 175810728 178657988 170966397 156858462 142271963 131461463 127160442 130749321 141224683
4559A41224683J2668741Q457987m81270r410557j4931594j5391775j2660564q516905
$$ 141224683 153893424 162351411 161870141 152459584 137527990 122136215 109475651 100958746
4551A00958746l428326K364884Q221095J2932241J3008456O767328k850048j1952218
$$ 100958746 97530420 99895304 108116399 121048640 134057096 140824424 137974376 126022158
4543A26022158j6925772j7497761j5359890j2552242r821546p621008n784133
$$ 126022158 109096386 91598625 76238735 63686493 53864947 46243939 40459806
4536D0459806m549541l617135k728454k255719j720667j552909j202096r28610
$$ 40459806 35910265 32293130 29564676 27308957 25588290 24035381 22833285 21904675
4528B1904675p90427p60043p15566p71942p43229o06674o79095m15001n34299
$$ 21904675 21114248 20354205 19638639 18866697 18123468 17516794 16837699 16422698 15888399
4519A5888399j44732l21679n07525l88798l85449l68082k94569l80480l24601
$$ 15888399 15743667 15421988 14914463 14525665 14140216 13772134 13477565 13097085 12772484
4510A2772484j72254k10608k91163k42177q8426p4799p7897q0444N0711N53p4383
$$ 12772484 12600230 12389622 12098459 11856282 11767856 11693057 11615160 11534716 11585427 11585980 11511597
4499A1511597p3385m9610o9059m7800k8361r6791l4427j30387j26294r4416k03664
$$ 11511597 11438212 11388602 11319543 11271743 11243382 11146591 11112164 10981777 10855483 10761067 10557403
4488A0557403j81680q070j15236k30667n1626l6154l34357j76852J38734n3193
$$ 10557403 10375723 10367653 10252417 10021750 9970124 9933970 9599613 9422761 9561495 9508302
4478I508302l6852K2990l14022k47018K1221o7205m7430n3736k27223k02568k17017
$$ 9508302 9471450 9494440 9180418 8933400 8954621 8887416 8839986 8786250 8559027 8356459 8139442
4467H139442o0957p8326j12041p8901q2944P0363j9168k9006J30366J00402p3630
$$ 8139442 8078485 8000159 7888118 7809217 7726273 7796636 7777468 7748462 7878828 7979230 7905600
4456G905600k28243j80063k44185j80668j60443j59754j62262q9475j59085j13957
$$ 7905600 7677357 7497294 7253109 7072441 6911998 6752244 6589982 6500507 6341422 6227465
4446F227465k4071R467N663j02716J80924Q4318N0131N7900N4866l1907L6120
$$ 6227465 6203394 6212861 6218524 6115808 6296732 6381050 6431181 6489081 6543947 6512040 6548160
4435F548160o7581k6972J39858K39565J17894K4393j84751l79793k22724k47862
$$ 6548160 6480579 6453607 6593465 6833030 6950924 6975317 6790566 6410773 6188049 5940187
4425E940187k04740q9403q5347o7413P302j17812l5336K475j45508K0423n7827
$$ 5940187 5735447 5646044 5560697 5493284 5500586 5382774 5347438 5349913 5204405 5224828 5167001
4414E167001p0343J2481n7725j7996r1139o6166K3283q602q7073o9311J37544
$$ 5167001 5096658 5109139 5051414 5033418 4942279 4876113 4899396 4890794 4803721 4734410 4871954
4403D871954J13326j20698L5602M2142j16419K18075J42638m2408j4029l2704
$$ 4871954 4985280 4864582 4900184 4942326 4825907 5043982 5186620 5144212 5130183 5097479
4393E097479K26944J02348j17477J694J7669O14R6265o170j07612n320O181j92642
$$ 5097479 5324423 5426771 5309294 5310988 5328657 5329271 5425536 5419366 5311754 5306434 5312615 5119973
4381E119973j12237L0112o4409J49838J9317P1825K8666L5463L7483P1301K2092
$$ 5119973 5007736 5037848 4973439 5123277 5142594 5214419 5243085 5278548 5316031 5387332 5409424
4370E409424j317K30986J46216K8546M0203q4350Q3514J03922j06150J00850k3429
$$ 5409424 5408107 5639093 5785309 5813855 5854058 5769708 5853222 5957144 5850994 5951844 5928415
4359E928415j34063l654o5687J05386K07768J18075J00672l439P9373O71J067
$$ 5928415 5794352 5790698 5725011 5830397 6038165 6156240 6256912 6253473 6332846 6333517 6334584
4348F334584R8968J44831J88992K31404K12452J37108J82082K32926J09740j2533
$$ 6334584 6433552 6578383 6767375 6998779 7211231 7348339 7530421 7763347 7873087 7860554
4338G860554K08549N3130J72749K60504L63160N81424O75381R12927J516592K148819
$$ 7860554 8069103 8122233 8294982 8555486 8918646 9500070 10175451 11088378 12604970 14753789
4328A4753789K498232K223454J112292J134q45374j351229j757737j412161j041745
$$ 14753789 17252021 19475475 20587767 20588901 19743527 18392298 16634561 15222400 14180655
4319A4180655p81913m38700J97413N39517R08335J100334P73755O7333l90470
$$ 14180655 13398742 12960042 13157455 13696972 14605307 15705641 16479396 16546729 16156259
4310A6156259r25361q27451n56460k17290K00692O94042R57982R36646M63712
$$ 16156259 15230898 14403447 13846987 13629697 13830389 14524431 15482413 16419059 16882771
4301A6882771N1361m29642p27831p11712m61159j70462n3503K09426O63028J015632
$$ 16882771 16934132 16504490 15776659 15064947 14603788 14433326 14379823 14589249 15252277 16267909
4291A6267909Q43044N76225K4038o9589l59695k35789M5864M00766P44685J101867
$$ 16267909 17110953 17687178 17711216 17641627 17281932 17046143 17092007 17492773 18237458 19339325
4281A9339325J425436J396949J225391P58284K34424j41190o43242p84843r67242
$$ 19339325 20764761 22161710 23387101 24145385 24379809 24238619 23595377 22810534 21843292
4272B1843292q45692o64862n66393k87808J0890K40652M43853Q93524R77562R46688
$$ 21843292 20997600 20332738 19766345 19478537 19489427 19730079 20173932 21067456 22045018 22991706
4262B2991706Q65604M58200M0593m55694j011203j259740j316565j467329j147226
$$ 22991706 23857310 24315510 24356103 23900409 22889206 21629466 20312901 18845572 17698346
4253A7698346j072831q58410o80940o53654l74591l35688k47523r7942j19457
$$ 17698346 16625515 15767105 15086165 14432511 14057920 13722232 13474709 13376767 13257310
4244A3257310q1286j42960P5641O405j25327L7982L6179O7614P91Q3503J80548
$$ 13257310 13176024 13033064 13108705 13115110 12989783 13027765 13063944 13131558 13132349 13215852 13396400
4233A3396400l6387Q6982K03290L1957J70101J22150K44928K51797J09418R6909
$$ 13396400 13360013 13446995 13650285 13682242 13852343 13974493 14219421 14471218 14580636 14677545
4223A4677545J65172L09527K16227L19124K47378K97948L77650J41173J45256
$$ 14677545 14842717 15152244 15368471 15687595 15934973 16232921 16610571 16751744 16897000
4214A6897000K77299L90665L23807L79065L79968L38128M11703M62415N67078
$$ 16897000 17174299 17564964 17888771 18267836 18647804 18985932 19397635 19860050 20427128
4205B0427128N24472M99468O91517P18065P38866P68756Q05961R45692R90022
$$ 20427128 20951600 21451068 22142585 22860650 23599516 24368272 25174233 26119925 27109947
4196B7109947J110192J411388J516888J746795J906500K047980K278264K538395
$$ 27109947 28220139 29631527 31148415 32895210 34801710 36849690 39127954 41666349
4188D1666349K574315K467425K172859J893076J732491J500152J221989J054147
$$ 41666349 44240664 46708089 48880948 50774024 52506515 54006667 55228656 56282803
4180E6282803O86210O96204O83620Q51207J366307K047001K790171L525606M251007
$$ 56282803 56969013 57665217 58348837 59200044 60566351 62613352 65403523 68929129 73180136
4171G3180136M609174M429725L833748L116859K625371K471620K201473K238048
$$ 73180136 77789310 82219035 86052783 89169642 91795013 94266633 96468106 98706154
4163I8706154K089780K154705K122644J896056J911174J887632K139048K508129
$$ 98706154 100795934 102950639 105073283 106969339 108880513 110768145 112907193 115415322
4155A15415322K967233L091679K786786K196922J697195J633000K065007K983010
$$ 115415322 118382555 121474234 124261020 126457942 128155137 129788137 131853144 134836154
4147A34836154M540532O591876Q128819Q640160P785898N752162L088743J130681
$$ 134836154 139376686 145968562 154097381 162737541 170523439 176275601 179364344 180495025
4139A80495025M31709O84712J332432K121663K342926K138757K056209J846938
$$ 180495025 180926734 181611446 182943878 185065541 187408467 189547224 191603433 193450371
4131A93450371J605302J335566J291471J121470P95252Q7501m97786p93098p18793
$$ 193450371 195055673 196391239 197682710 198804180 199599432 199686933 199189147 198396049 197677256
4122A97677256J28575J151855L078522N117562P250746R088859R986050R654359
$$ 197677256 197805831 198957686 202036208 207153770 214404516 223493375 233479425 243133784
4114B43133784Q264910O760989N757989N443165N990127O232017N814235M699046
$$ 243133784 251398694 258159683 263917672 269360837 275350964 281582981 287397216 292096262
4106B92096262L659258K845320K385811J768814M09791r45698k082747k473148
$$ 292096262 295755520 298600840 300986651 302755465 303165256 302219558 300136811 297663663
4098B97663663k106491j234394j3273J662790L330352M931328O013437O347784
$$ 297663663 295557172 294322778 294309505 295972295 299302647 304233975 310247412 316595196
4090C16595196O002609M778361K759230L62094j608589k617488k522729j607978
$$ 316595196 322597805 327376166 330135396 330497490 328888901 326271413 323748684 322140706
4082C22140706k46839R67701J975529K590560K466393J885695N39219j211402
$$ 322140706 321893867 322861568 324837097 327427657 329894050 331779745 332318964 331107562
4074C31107562k181651k417714j890740j240113j443787k317896l628474m009954
$$ 331107562 328925911 326508197 324617457 323377344 321933557 319615661 315987187 311977233
4066C11977233l420706k657188k952143m533179p072760r085427r988954r947573
$$ 311977233 308556527 305899339 302947196 298414017 291341257 282255830 272266876 262319303
4058B62319303q934257p077989n006562l085076j367060k35452R978j35698p03567
$$ 262319303 253385046 246307057 241300495 238215419 236848359 236612907 236622885 236487187 235783620
4049B35783620j288919k082699k686985l341971l935267m263989m789275m767219
$$ 235783620 234494701 232412002 229725017 226383046 222447779 218183790 213394515 208627296
4041B08627296m224567l336828j867876l73139M90047J21040j570466m203839
$$ 208627296 204402729 201065901 199198025 198824886 199314933 199435973 197865507 193661668
4033A93661668o563978q054334q284038p342673o075247m693222l180169k402482
$$ 193661668 187097690 179043356 170759318 163416645 157341398 152648176 149468007 147065525
4025A47065525k179620k289204l056050l306248l650558l683945l514781l200162
$$ 147065525 144885905 142596701 139540651 136234403 132583845 128899900 125385119 122184957
4017A22184957k982098k623338k337253k215759j944836j978440j910359k040375
$$ 122184957 119202859 116579521 114242268 112026509 110081673 108103233 106192874 104152499
4009A04152499k510816l121717l711378m222884m510380m384120m038902l400983
$$ 104152499 101641683 98519966 94808588 90585704 86075324 81691204 77652302 74251319
4001G4251319k923022k231962j892173j818589j472665j514356j639031j531699
$$ 74251319 71328297 69096335 67204162 65385573 63912908 62398552 60759521 59227822
3993E9227822j644836j532519j716451j950290j912159k218362k364861k375830
$$ 59227822 57582986 56050467 54334016 52383726 50471567 48253205 45888344 43512514
3985D3512514k311567k049410j985295j968000j771756j408087j391877j183156
$$ 43512514 41200947 39151537 37166242 35198242 33426486 32018399 30626522 29443366
3977B9443366j009949j191545r90378r27467r70304q07163p83202q03398p98231
$$ 29443366 28433417 27241872 26251494 25324027 24353723 23546560 22763358 21959960 21161729
3968B1161729p71047o30236o07865o68594n54123n63947l19371m03579n65921
$$ 21161729 20390682 19760446 19152581 18483987 17929864 17365917 17046546 16642967 16077046
3959A6077046k21042m88683l77497k23394l86484m44696j93305l68179l12368
$$ 16077046 15856004 15367321 14989824 14766430 14379946 13935250 13741945 13373766 13061398
3950A3061398j78520k62001k97440k97054k78668k14112k57181j57020j78672
$$ 13061398 12882878 12620877 12323437 12026383 11747715 11533603 11276422 11119402 10940730
3941A0940730l08311k83237k77817q8061j03242j99072j68431o6962j41104j59124
$$ 10940730 10632419 10349182 10071365 9983304 9880062 9680990 9512559 9445597 9304493 9145369
3931I145369j48535r9485k58925j09583j61756p2407j79244j66540p2106j83487
$$ 9145369 8996834 8897349 8638424 8528841 8367085 8294678 8115434 7948894 7876788 7693301
3921G693301l330l2323r8494q0159j72601r1074j5388j58888m9487j34234j69448
$$ 7693301 7689971 7657648 7559154 7478995 7306394 7215320 7199932 7041044 6991557 6857323 6687875
3910F687875m0428k15483j77718J02408o9686m8839r96j10157K0701n4911j5144
$$ 6687875 6647447 6431964 6254246 6356654 6286968 6238129 6237133 6126976 6147677 6092766 6077622
3899F077622j02841j29882j10796o7866J6030J69529q5910n8102N9886r6948N476
$$ 6077622 5974781 5844899 5734103 5666237 5682267 5851796 5765886 5707784 5767670 5670722 5676198
3888E676198o9022M9620j82651j42884l2109R6324M0331j04321N7975m662j4436
$$ 5676198 5607176 5656796 5474145 5331261 5299152 5395476 5435807 5331486 5389461 5384799 5370363
3877E370363n2779n7613q9993p1939k0776l1443R8961P4812J24837o446N6238
$$ 5370363 5317584 5259971 5169978 5098039 5077263 5045820 5144781 5219593 5344430 5337984 5394222
3866E394222M7882q1322n9721J8517Q4065p6402K03844J50571J09085Q3535L3729
$$ 5394222 5442104 5360782 5301061 5319578 5403643 5327241 5531085 5681656 5790741 5874276 5908005
3855E908005m4621k0389J22706R1971K2725J45125M8254J42834R6266J05978J63549
$$ 5908005 5863384 5842995 5965701 6057672 6080397 6225522 6273776 6416610 6512876 6618854 6782403
3844F782403p8269K80172K79238O1150L05514L23863L59747L91506M20460N33671
$$ 6782403 6704134 6984306 7263544 7324694 7630208 7954071 8313818 8705324 9125784 9659455
3834I659455O53116P14992P73256R45540Q66851R10818P60913N73806K97465J26982
$$ 9659455 10312571 11027563 11800819 12746359 13613210 14524028 15284941 15858747 16156212 16283194
3824A6283194m73449o10960p07190q96519q51826q27456q34347q05807n68562
$$ 16283194 15809745 15198785 14491595 13595076 12743250 11915794 11081447 10275640 9707078
3815I707078m55757p55071l87268l49499k85664k04382l57302l53145j33194j4674
$$ 9707078 9251321 8496250 8108982 7759483 7473819 7269437 6912135 6558990 6425796 6411122
3805F411122j41130K1783l1883j02066K5211j02172k8639j59041j55026p2046
$$ 6411122 6269992 6291775 6259892 6157826 6183037 6080865 6052226 5893185 5738159 5666113
3795E666113k33949j83554j19967l4951j13763N9002j2290k6051J35865J25095
$$ 5666113 5432164 5248610 5128643 5093692 4979929 5038931 5026641 5000590 5136455 5261550
3785E261550L3630j13497n950N2923l3411N0975k2744k3898O528k78571k65156
$$ 5261550 5295180 5181683 5175733 5228656 5195245 5246220 5223476 5199578 5206106 4927535 4662379
3774D662379j14247j09071j10635j32516m8995j50160L4440j55862j39635n6056
$$ 4662379 4548132 4439061 4328426 4195910 4146915 3996755 4031195 3875333 3735698 3679642
3764C679642m9934j9411L0956O2965m3264M4957O6279L2068J3643k16848n5679
$$ 3679642 3629708 3610297 3641253 3704218 3660954 3705911 3772190 3804258 3817901 3601053 3545374
3753C545374j34736j0095l7011p277L9482K0116k418o8461K6762o0291j43286
$$ 3545374 3410638 3400543 3363532 3356255 3395737 3415853 3413435 3344974 3371736 3311445 3168159
3742C168159p3708J0542j8156q9737M8124r7398j5679M9180j28946m0985P5231
$$ 3168159 3094451 3104993 3086837 2997100 3045224 2947826 2932147 2981327 2852381 2811396 2886627
3731B886627J76717j68977j14173J6282j14138K9235K6085k4484k13572j8225
$$ 2886627 3063344 2894367 2780194 2796476 2682338 2711573 2737658 2713174 2499602 2481377
3721B481377O7967j022p8962j11176j08184J7434m8521Q224N3866q8198J01176
$$ 2481377 2549344 2548322 2469360 2358184 2250000 2267434 2218913 2227137 2281003 2192805 2293981
3710B293981k8647p2538o9232J20024N9319q5069j23680p3514R2291l9085k5218
$$ 2293981 2265334 2192796 2123564 2243588 2302907 2217838 2094158 2020644 2112935 2073850 2048632
3699B048632m2533J9460r6069j5040l0506N0792P6395j96566k1793M0165k1036
$$ 2048632 2006099 2025559 1929490 1914450 1883944 1934736 2011131 1814565 1792772 1832937 1811901
3688A811901m7971K04816j437j7053r9823R1426N4221k4368j08412Q0342J7219
$$ 1811901 1763930 1968746 1967309 1950256 1850433 1941859 1996080 1971712 1863300 1943642 1960861
3677A960861O5996O1811o0870j07992J6750p901p0167J9384n1026j7854R6055
$$ 1960861 2026857 2088668 2027798 1919806 1936556 1928655 1858488 1877872 1826846 1808992 1905047
3666A905047k7838j8356R9787p0714j26228O0423O4964J39007k9395Q0821J06549
$$ 1905047 1877209 1858853 1958640 1887926 1761698 1822121 1887085 2026092 1996697 2077518 2184067
3655B184067N1105N557o1664J1362r0321R1354n1959N0672P1130r8730j2880Q0846
$$ 2184067 2235172 2240729 2179065 2190427 2100106 2191460 2139501 2190173 2261303 2162573 2149693 2230539
3643B230539J6475O1821l9914J770J52437J84216m9928j12706j02469J24370P7609
$$ 2230539 2247014 2308835 2268921 2270691 2423128 2607344 2557416 2444710 2342241 2466611 2544220
3632B544220K3885J24248l057K3229R0529j9051J03132O4296J33255J60750M0817
$$ 2544220 2568105 2692353 2689296 2712525 2803054 2784003 2887135 2951431 3084686 3245436 3286253
3621C286253j9662J52579J40772J9836Q3565R7077k9543Q9629P570N2530J4487
$$ 3286253 3266591 3419170 3559942 3579778 3663343 3760420 3730877 3820506 3828076 3880606 3895093
3610C895093j41602K9394L2863R8280j4395J21697J30647R2431J17602K31812
$$ 3895093 3753491 3782885 3815748 3914028 3899633 4021330 4151977 4244408 4362010 4593822
3600D593822O0960J13313J50573J32866L03172K82344K9941J10470K67585J05509
$$ 4593822 4654782 4768095 4918668 5051534 5354706 5637050 5666991 5777461 6045046 6150555
3590F150555J19841J25024J81454J03399J69922K26292J79377J84922P9910J14853
$$ 6150555 6270396 6395420 6576874 6680273 6850195 7076487 7255864 7440786 7520696 7635549
3580G635549J65865l0550q673K04101J91593J06409J52591J98206K20736K73922
$$ 7635549 7801414 7770864 7762191 7966292 8157885 8264294 8416885 8615091 8835827 9109749
3570I109749L22847K25033M23659L99249L12643M21762L74607L00810M56703K96440
$$ 9109749 9432596 9657629 10081288 10480537 10793180 11214942 11589549 11890359 12347062 12643502
3560A2643502K65991M54121M12535O46518N42618O04245P49507Q98414J141486
$$ 12643502 12909493 13363614 13776149 14422667 14965285 15569530 16319037 17217451 18358937
3551A8358937J176518J540553J533974J492260J629508J566525J459626J137288
$$ 18358937 19535455 21076008 22609982 24102242 25731750 27298275 28757901 29895189
3543B9895189Q07959K34828O7116k51232n28175q55740j087588r35550j125208
$$ 29895189 30703148 30937976 31005092 30753860 30225685 29369945 28282357 27346807 26221599
3534B6221599j250826j456799j350106j385470j150893j072205j060392j020739
$$ 26221599 24970773 23513974 22163868 20778398 19627505 18555300 17494908 16474169
3526A6474169j048514p63451q11626q62339p19757p17357p89800n19906n76536
$$ 16474169 15425655 14662204 13850578 12988239 12268482 11551125 10761325 10241419 9664883
3517I664883n41726m84954m23540n60802m63328l80904k36045k64656k21692k31646
$$ 9664883 9123157 8638203 8214663 7653861 7190533 6809629 6573584 6308928 6087236 5855590
3507E855590j92876j63242j15574k18447k74698j61144l44460j91205n4447k15330
$$ 5855590 5662714 5499472 5383898 5165451 4890753 4729609 4385149 4193944 4139497 3924167
3497C924167j22395q1519k13131j6550J29681j47351j05181J28012j61354j80813
$$ 3924167 3801772 3720253 3507122 3490572 3620253 3472902 3367721 3495733 3334379 3153566
3487C153566j52266j7810k40855o3669J02964j7956q8839j50402n2593j09344
$$ 3153566 3001300 2983490 2742635 2678966 2781930 2763974 2675135 2524733 2472140 2362796
3477B362796p754k7868O9169j97539j22734J02002j47325q7170l906q5576j06408
$$ 2362796 2355042 2327174 2396343 2198804 2076070 2178072 2030747 1943577 1939671 1854095 1747687
3466A747687P6129j01237j14024J0441k6406k3546J22396P3759j33990Q095R5610
$$ 1747687 1823816 1722579 1608555 1618996 1592590 1569044 1691440 1765199 1631209 1639304 1734914
3455A734914j38017r5366n8609J55316j37570p2985Q3565q1446j02962R404n2166
$$ 1734914 1596897 1501531 1442922 1598238 1460668 1387683 1471248 1389802 1286840 1296244 1244078
3444A244078J05434j11925j52294J73364K25158j36627k40289j69614n0274J02210
$$ 1244078 1349512 1237587 1085293 1258657 1483815 1347188 1106899 937285 887011 989221
3434I89221N0934j7399l7670P708k5343m2012j6306n6832n0060J5385o0715r950
$$ 989221 1040155 1022756 985086 992794 967451 925439 909133 852301 802241 817626 756911 746961
3422G46961Q5234K0555k0009P2097m9218p2929m3936P8513p8753J35550l4816
$$ 746961 832195 852750 832741 904838 855620 782691 738755 817268 738515 874065 839249
3411H39249J17740j19747q2264m0785N4222K0945m9541K9715m7638M9640j4297
$$ 839249 956989 837242 754978 714193 768415 789360 739819 769534 721896 771536 757239
3400G57239j43491l7242J28850J27539J4836j36110K3892q294m4233j2611L9224
$$ 757239 613748 576506 705356 832895 847731 711621 735513 727219 682986 670375 709599
3389G09599p611J7206N7493n9757m994n2037J8238O8077j60838j9423L3164N7241
$$ 709599 701988 719194 776687 716930 711936 659899 678137 746214 585376 565953 599117 656358
3377F56358p2931N036J2616N2316N9197j6811n3473o6713m8632M4127K39919p478
$$ 656358 583427 588463 601079 653395 712592 695781 642308 575595 526963 571090 811009 803531
3365H03531L6661L3684M708P1251j9893o6830m7991j41737L6237L3396j3426k7874
$$ 803531 840192 873876 878584 949835 929942 863112 815121 673384 709621 743017 729591 701717
3353G01717P1389J5017q1614N7014r1353L9727M4704m3483O28L2307l9567M6104
$$ 701717 773106 788123 706509 763523 672170 711897 756601 713118 713746 746053 706486 752590
3341G52590O9268j76798n0523K8996K39272p7486p3823L02175n4670l3219j342
$$ 752590 821858 645060 594537 623533 862805 785319 711496 1013671 959001 925782 924440
3330I24440J00801J61521N3141m0076l633j06419j32237R1927N797k6800l0897
$$ 924440 1025241 1186762 1239903 1199827 1196194 1089775 957538 1049465 1055262 1028462 997565
3319I97565K9564r047O4453J889l8643P095k4499P6120L9229L990j404Q134O0297
$$ 997565 1027129 1018082 1082535 1084424 1045781 1052876 1028377 1104497 1143726 1147716 1146312 1154446 1214743
3306A214743N2688N122K5085P5654M6405k0341N6681j76213N1264J79897q2412
$$ 1214743 1267431 1272553 1297638 1373292 1419697 1399356 1456037 1279824 1331088 1510985 1428573
3295A428573r0109K4817N8423j8945M5280j6161J9546n9707O9095N7606L3087
$$ 1428573 1338464 1363281 1421704 1402759 1448039 1431878 1451424 1391717 1460812 1518418 1551505
3284A551505P7504m3843J13874q011O2990J15624J63582O2788J6278O3856L10737
$$ 1551505 1629009 1585166 1699040 1691029 1754019 1869643 2033225 2096013 2112291 2176147 2486884
3273B486884J37560k6642o6136l0466j0400r5030j04885K32K6803P6479J55632
$$ 2486884 2624444 2597802 2531666 2501200 2490800 2395770 2290885 2291117 2317920 2394399 2550031
3262B550031n567j6786L9097J10381j9647P4257J4938q6131m9134O8688L9675
$$ 2550031 2544464 2527678 2566775 2677156 2657509 2731766 2746704 2660573 2611439 2680127 2719802
3251B719802J31524K12443J6354K23189J50882J83110K76306K15989L30422L02788
$$ 2719802 2851326 3063769 3080123 3303312 3454194 3637304 3913610 4129599 4460021 4762809
3241D762809R6938L08776L40587O1484J72554K98017L26248L49838L23265L36981
$$ 4762809 4859747 5168523 5509110 5570594 5743148 6041165 6367413 6717251 7040516 7377497
3231G377497N18193N40896N96574N73149M09899M97573L10245j1549j7379k3447
$$ 7377497 7895690 8436586 9033160 9606309 10016208 10513781 10824026 10812477 10795098 10771651
3221A0771651m9862m2770m4834J5170n3275Q4148n6490N5958J61064N9258K00403
$$ 10771651 10721789 10679019 10634185 10649355 10596080 10680228 10623738 10679696 10840760 10900018 11100421
3210A1100421J72997K65746J97175K01165J59561K16049M47329N88665Q90960
$$ 11100421 11273418 11539164 11736339 11937504 12097065 12313114 12760443 13349108 14240068
3201A4240068J432481K049096K427488K173575J056167m02863j588078j945963
$$ 14240068 15672549 17721645 20149133 22322708 23378875 22976012 21387934 19441971
3193A9441971k186101k081176j606238j290041j067890q74659n94541o01687m30848
$$ 19441971 17255870 15174694 13568456 12278415 11210525 10335866 9741325 9139638 8708790
3184H708790m40838j74695j28790l26661k31787Q6363r2591P9594K43753P8961
$$ 8708790 8267952 8093257 7964467 7637806 7406019 7492382 7399791 7479385 7723138 7802099
3174G802099J64000N1830K20572L48346R7264L63591K51505J00212n2741m14421
$$ 7802099 7966099 8017929 8238501 8586847 8684111 9047702 9299207 9399419 9346678 8932257
3164H932257n84951n60989n32715n68762n93070p50353l47365l72458l72318k89251
$$ 8932257 8347306 7786317 7253602 6684840 6091770 5341417 4994052 4621594 4249276 3960025
3154C960025l01399k0928l44224p4837n3874j60713j90925k35037j07004J173
$$ 3960025 3658626 3637698 3293474 3218637 3164763 3004050 2813125 2578088 2471084 2472257
3144B472257j71932j57259l3122q6850k42470j15623n1521j05907q5578j19621
$$ 2472257 2300325 2143066 2109944 2023094 1780624 1665001 1613480 1507573 1421995 1302374
3134A302374j35564q483K361j13292j1648M8935J15762j35317j17809k5930J9466
$$ 1302374 1166810 1158327 1160688 1047396 1035748 1084683 1200445 1065128 947319 921389 940855
3123I40855P7315k45029l3969p530O8215M9429j58165J9665o1621k7825J28078
$$ 940855 1018170 773141 739172 731642 799857 849286 691121 710786 649165 621340 749418
3112G49418L4324j91832M5129m943N3683o9338p7025j67555J36026O0052j5836
$$ 749418 783742 591910 637039 632096 685779 616441 539416 371861 507887 567939 552103
3101E52103l6763L5222L450q0850O4898l6113j39104R9158l9239l6933O2054p7675
$$ 552103 515340 550562 554012 473162 538060 501947 362843 462001 422762 385829 447883 370208
3089C70208O4278j65420k4256L017O175P5429Q4480q8848n9660J65548r5556N908
$$ 370208 434486 269066 244810 247827 254002 329431 413911 325063 265403 430951 335395 341303
3077C41303n7080J05007m0444j43459Q1902P5641p0343m0672M6730J00163j75759
$$ 341303 284223 389230 348786 205327 287229 362870 292527 251855 298585 398748 222989
3066B22989p0012J2102r5079j450P103M9738O6935L8280o7410l0994j39593L1291
$$ 222989 152977 165079 70000 68550 75653 125391 192326 230606 163196 132202 -7391 23900
3054B3900R9631j14659N6253J14639Q3275J057m3473o7413m4468R3164r7503j08827
$$ 23900 123531 8872 65125 179764 263039 264096 220623 153210 108742 201906 104403 -4424
3042d424J03187M275j06916Q0929O6542Q0548l6301p5747R3905p7745m8454m3135
$$ -4424 98763 103038 -3878 77051 143593 224141 187840 112093 205998 128253 79799 36664
3030C6664m8565k6324k8113J2041m023L5649M060m0262Q5829N4051r5774P7188
$$ 36664 -11901 -38225 -66338 -54297 -58320 -22671 -18611 -58873 26956 81007 -14767 62421
3018F2421m1577o3857J56450L365j50918J32974o4370k9671M5199l2891q9355
$$ 62421 20844 -43013 113437 116802 -34116 98858 34488 4817 50016 17125 -72230
3007g2230K9746j2279j2117K4040l3157Q0774N5773q616Q1605j00609N0654K6266
$$ -72230 -42484 -54763 -66880 -42840 -75997 4777 60550 51934 133539 32930 83584 109850
2995A09850j2550L9637o5050j39320o8384J8709J10052J06719K6282j44777m9804
$$ 109850 97300 136937 71887 -67433 -135817 -117108 -7056 99663 125945 -18832 -68636
2984f8636N7820J57088m3028o0590P825N0705K612q0252J19396l5962M0372J4366
$$ -68636 -10816 146272 103244 42654 50479 101184 103796 23544 142940 106978 147350 161716
2972A61716K6411K3741r6802k6815J9110k5275m8402j22470R1488L9954o944N994
$$ 161716 188127 211868 115066 88251 107361 82086 33684 -88786 2702 42656 35712 41706
2960D1706R2894k7592m8814J10285m7186J4051K5993P9266Q2691j15156r1727
$$ 41706 134600 107008 58194 168479 121293 135344 161337 240603 323294 208138 116411
2949A16411o6068J25388L2334J43869o6475m5201L5453j5433J2711m8605j18j14180
$$ 116411 50343 175731 208065 351934 285459 240258 275711 260278 272989 224384 224266 110086
2937A10086J3467J50458K8033n4908J08075M6024j20405k5430N3633r3346O7248
$$ 110086 123553 274011 302044 247136 355211 401235 280830 255400 309033 215687 282935
2926B82935P0784m4973j5613r8150Q7619m896n1367l2504K9402K24586j0510j12213
$$ 282935 353719 308746 293133 194983 282602 277706 226339 193835 223237 447823 437313 325100
2914C25100K6007J79941q472N7179p1221m9193p9810r1210O3773M4015L3191L6987
$$ 325100 351107 531048 522576 579755 508534 459341 379531 288321 352094 396109 429300 466287
2902D66287P9017K6827o2170j73221k2553P5876R2334q6454p5847k1510R6337
$$ 466287 545304 572131 509961 336740 314187 390063 482397 395943 320096 298586 394923
2891C94923K8559j06029q0291J55339J51790j43916J3216j10873r1154j76313
$$ 394923 423482 317453 237162 392501 544291 400375 413591 302718 211564 35251
2881C5251L2801O6787J46591k1837J4625O7321M4998r5746p2717O2521k897R3281
$$ 35251 68052 134839 281430 259593 274218 341539 386537 290791 218074 280595 277698 370979
2869C70979j29550r5944j2498J70310M0691q2172k0257N8834k5295J27931k081
$$ 370979 241429 145485 132987 303297 343988 261816 241559 300393 275098 403029 400948
2858D00948J6358r9315o0199j23806O2200M8696j65414J11562q5059l5284l9081
$$ 400948 417306 317991 257792 133986 196186 244882 79468 191030 105971 70687 31606
2847C1606l4285J39104r378J31619j19264m0576n0577j0584M2826n1592p0133
$$ 31606 -2679 136425 127047 258666 139402 98826 48249 37665 80491 28899 -41234
2836d1234Q5425L843L2340o3033M098K4774l1286l2769n3854J44648P7154J6170
$$ -41234 44191 48034 80374 17341 21439 46213 14927 -17842 -71696 72952 150106 166276
2824A66276j17009J1660p5646k0998P2578O1256r1927P9616m978j6157k0013k9137
$$ 166276 49267 60927 -14719 -35717 36861 98117 6190 85806 80828 64671 44658 15521
2812A5521j20j30233l7504R2842N8227n2889j9766R5585m23p6134M4905N8407
$$ 15521 15401 -114832 -152336 -59494 -1267 -54156 -73922 21663 21240 -54894 -9989 48418
2800D8418m8499r906p0838L6259M1557o4856o3190K4840J6208K4819j1201j6369
$$ 48418 -81 -9987 -80825 -44566 -3009 -67865 -131055 -106215 -90007 -65188 -76389 -92758
2788i2758K6693n824J02469j20415J13002O0431r0395l9375J4933j5071M3388
$$ -92758 -66065 -71889 30580 -89835 23167 83598 -6797 -46172 -31239 -46310 -2922
2777b922K9701l8141j19297K3718r1114L5247J8040o8193J71438Q3022J2720j43158
$$ -2922 26779 -11362 -130659 -106941 -198055 -162808 -144768 -212961 -41523 41499 54219 -88939
2765h8939n124j9823N2703Q8907j18097j03L9106K6833R6965j49638J2004M7292
$$ -88939 -94063 -113886 -61183 27724 -90373 -90476 -51370 -24537 72428 -77210 -65206 -17914
2753a7914j410n6900J159p716J26075r3501N1035J37380k5578o7854j33703l6903
$$ -17914 -19324 -76224 -75065 -82781 43294 -50207 828 138208 112630 44776 -88927 -125830
2741a25830J8525j65N6263N377r4840o2843M2066P237J4959M7151K3098O9942
$$ -125830 -107305 -107470 -51207 -45830 -140670 -203513 -161447 -154210 -139251 -92100 -69002 940
2729I40J4517m6885r860j34660J20945R9648m7900m5702n5443m4190P4171J21479
$$ 940 15457 -31428 -41288 -175948 -55003 44645 -3255 -48957 -104400 -148590 -74419 47060
2717D7060m9100r0949o40m1840J16359j9905o7727M0367J1018J71746o7743m3907
$$ 47060 -2040 -92989 -93629 -135469 -19110 -39015 -106742 -66375 -55357 116389 48646 4739
2705D739J63043p1862j43827q1337o9986M4251J62169p213m2376n3974K4086J28670
$$ 4739 167782 95920 -47907 -129244 -199230 -154979 7190 -23 -42399 -96373 -72287 56383
2693E6383Q57k8658r8177L9732n6383R656R6661M6271j70013J7664J33018O7441
$$ 56383 57240 28582 -69595 -29863 -86246 -76590 20071 66342 -103671 -86007 47011 114452
2681A14452o6038l3984J18019q6221o4574J16382k2952N9617n392m6066q2549
$$ 114452 48414 14430 132449 46228 -18346 98036 75084 134701 129309 83243 694
2670F94Q1561J87884L7367k5347P920k2176K5660J40700J8893k17118j04413n8353
$$ 694 82255 270139 307506 282159 290079 267903 293563 434263 453156 236038 131625 73272
2658G3272p7579j7845o946J01770Q2561r7279m3069L861j5442p3417l8934p5627
$$ 73272 -4307 -22152 -29098 72672 155233 57954 14885 18746 3304 -70113 -109047 -184674
2646a84674j8222J90388P5840n2130j10965m5875m364J35695K6078r8126J39490
$$ -184674 -202896 -12508 63332 11202 -99763 -145638 -150002 -14307 11771 -86355 53135
2635E3135r0984k7492R830r218K3273k7455k1992p3189j9876J88580r2798n6015
$$ 53135 -37849 -65341 -55511 -64729 -41456 -68911 -90903 -164092 -183968 4612 -88186 -144201
2623a44201M4469O1637p6634R944J0364Q7581J13443Q6072j8613J2836j2727j76320
$$ -144201 -99732 -38095 -114729 -104785 -94421 -6840 106603 192675 174062 186898 174171 -2149
2611b149l0391J11436j12700m3982P5822K993m9106n7393J19565j2199Q9847r4354
$$ -2149 -32540 78896 -33804 -77786 -1964 1029 -48077 -105470 14095 1896 91743 -2611
2599b611M4648P419j78745m4178M1914o1745O1045N5268J08268M4247l9176m6329
$$ -2611 42037 49456 -129289 -173467 -131553 -193298 -132253 -76985 31283 75530 36354 -9975
2587i975M8621K1586O7132n7946q3817n8048J4027J0014m0523J28727K0326n6902
$$ -9975 38646 60232 127364 69418 -14399 -72447 -58420 -48406 -88929 39798 60124 3222
2575C222j7627j397J68378n7141j10295J48061Q9665j58514Q7362m2113j1666
$$ 3222 -14405 -15802 152576 95435 -14860 133201 222866 64352 151714 109601 97935
2564I7935O5429M4381R5810j31966j48176M7526K8601m708j2718J52207j3341
$$ 97935 163364 207745 303555 171589 23413 70939 99540 94832 82114 234321 220980
2553B20980k0431p7605r018j9274M5840K8401n4997M9108m7670l5106l3463O7486
$$ 220980 200549 122944 113926 94652 140492 168893 113896 163004 115334 80228 46765 114251
2541A14251O6211K1333K4073L2726p4358r1810m8511O0590J18283q936L683J07211
$$ 114251 180462 201795 225868 258594 184236 92426 43915 104505 222788 213852 217535 324746
2529C24746n8565m3338o0204K7322J6081R560k9946p0710R4906K8840k8024m1472
$$ 324746 266181 222843 162639 189961 206042 215602 185656 114946 209852 238692 210668 169196
2517A69196P8722J04792o9330J56846L1935l1174p7288m5268l3875m1664p5525
$$ 169196 247918 352710 283380 440226 472161 440987 363699 318431 284556 242892 167367
2506A67367q3632J03449K446L9613L4978J32593l164o7877K2403N5565q2779p7218
$$ 167367 83735 187184 189630 229243 264221 396814 393650 325773 348176 403741 320962 243744
2494B43744L1833M859J34083O770L3578O7217q3417J5747l9821N0133o3255J9733
$$ 243744 275577 280436 414519 421289 454867 522084 438667 454414 414593 464726 401471 421204
2482D21204J04351O1797L7902k5407L984N1022o8643o6968M3517J50060O0017
$$ 421204 525555 587352 625254 599847 603831 654853 586210 519242 562759 712819 772836
2471G72836o6041n6573p1571J67391q033P5199k31601J58926N0110m9139J7789
$$ 772836 706795 650222 578651 746042 738009 813208 581607 740533 790643 741504 759293
2460G59293n432L2045R7608J78622j2437J13073O5382n7589o2932j4773J55432
$$ 759293 753861 785906 883514 1062136 1049699 1162772 1228154 1170565 1107633 1092860 1248292
2449A248292N7851J3337l2309N6789J18233R1779n6223J10568K42871J41357Q279
$$ 1248292 1306143 1319480 1287171 1343960 1462193 1553972 1497749 1608317 1851188 1992545 2000824
2438B000824J45080L3181L0738K2958N6875K4115m53P7854J13318J44490K5579
$$ 2000824 2145904 2179085 2209823 2232781 2289656 2313771 2313318 2391172 2504490 2648980 2674559
2427B674559J51218J07721J25923L69333L55929J01062M38416L22936O84403P10808
$$ 2674559 2825777 2933498 3059421 3428754 3784683 3885745 4324161 4647097 5331500 6042308
2417F042308O74114P46379Q10021P46758M57619L84908L58547O91496J049450
$$ 6042308 6716422 7462801 8272822 9019580 9477199 9862107 10220654 10912150 11961600
2408A1961600J314006J915526K797052L497715N206926Q363490J3644178J8654466
$$ 11961600 13275606 15191132 17988184 21485899 26692825 35056315 48700493 67354959
2400F7354959J6854263N819447n613530j3345288j4997160j2212172j0256793
$$ 67354959 84209222 90028669 84415139 71069851 56072691 43860519 33603726
2393C3603726p179586n423644m092077l022210k186432j575261r71879n48376
$$ 33603726 26424140 21000496 16908419 13886209 11699777 10124516 9152637 8604261
2385H604261m48459l83181n54606p35541p28243p36915m74953m01187k63988k25027
$$ 8604261 8155802 7772621 7218015 6482474 5754231 5017316 4542363 4141176 3877188 3652161
2375C652161k76068j7952j40001j5124j69706o9243q8581j03737k11053k48286
$$ 3652161 3376093 3358141 3218140 3203016 3033310 2964067 2875486 2771749 2560696 2312410
2365B312410k63634j52654j57277j74250L3715J29652l6725j65675p7959j73432
$$ 2312410 2048776 1896122 1738845 1564595 1598310 1727962 1691237 1525562 1447603 1274171
2355A274171j9191J5252O4664j6772l3329r1854j35318M4232j39927j53991J65592
$$ 1274171 1254980 1270232 1334896 1318124 1284795 1192941 1057623 1101855 961928 807937 973529
2344I73529R466l8156j7566Q0776j31048j49733J09041l9470m9482Q4795J32868
$$ 973529 982995 944839 927273 1008049 877001 727268 836309 796839 747357 832152 965020
2333I65020k04879j05296J37152j65182j51097m1296R9475O6517p1653J0014l2088
$$ 965020 760141 654845 791997 626815 475718 434422 533897 600414 528761 538775 506687
2322E06687j20386Q8542J17789J28381j16281o1858k3365m1727O0670O7035j3055
$$ 506687 386301 474843 592632 721013 604732 542874 519509 477782 538452 605487 592432
2311E92432r5909j03244m5084Q8932m4419P3549J9940j53136o0776J0569J463
$$ 592432 496523 393279 348195 437127 392708 466257 486197 333061 272285 282854 284317
2300B84317l9165r6020K2797N9453j1588N0214q8896P7277K3159p9712Q3116j05753
$$ 284317 245152 149132 171929 231382 219794 270008 181112 258389 281548 201836 284952 179199
2288A79199J974R8646L2928o2716K3021m2235l1204P664j4609k0609R567m1427
$$ 179199 181173 279819 312747 250031 273052 230817 199613 207277 192668 172059 181626 140199
2276A40199o7350q894O6156k0555m588N5482p808m5261l122J3762l7050n0370
$$ 140199 72849 63955 130111 109556 104968 160450 152642 107381 104259 118021 80971 30601
2264C0601K3188R8149p5124k26094j29072O2125J59714J69538j400q4943O4488
$$ 30601 53789 151938 76814 -149280 -278352 -216227 -56513 113025 111625 26682 91170
2253I1170k8619Q6310J4064j18803l5621j3915o3842K6175J33446j2510M1703
$$ 91170 62551 148861 162925 44122 8501 -5414 -69256 -43081 90365 77855 119558
2242A19558n2068j61278O414o865R7192j1076j01250k1637k991J2232M9511J63102
$$ 119558 67490 -93788 -87374 -94239 2953 -8123 -109373 -131010 -134001 -121769 -72258 90844
2230I0844L0064K1319q316r4521N9828j32982L031J0450J43992j02974o0532R6181
$$ 90844 120908 142227 133911 39390 99218 -33764 -30733 -20283 123709 20735 -39797 56384
2218E6384m7997P2415K8082r2604p5897R380J00705j62879O9933J90961n4153
$$ 56384 8387 80802 108884 16280 -59617 -50237 50468 -112411 -42478 148483 94330
2207I4330O8486m2207r1760P6317q657j39400M4488O8724n6918l269L0153q2841
$$ 94330 162816 120609 28849 105166 96509 -42891 1597 70321 13403 10134 40287 -42554
2195d2554P3654L8375M7216Q913k4840k1380o8575l2729J11692L038k610r0334
$$ -42554 31100 69475 116691 125604 100764 79384 10809 -21920 89772 92810 90200 -134
2183a34j26594J10237p0957K2095J7403k143L5289o0680l0157r8182J15714p2580
$$ -134 -126728 -16491 -87448 -65353 -47950 -50093 -14804 -75484 -105641 -203823 -88109 -160689
2171a60689K3846J14977j5185j22569J6344M7429O1329J33394l4049j05961R8430
$$ -160689 -136843 -21866 -37051 -159620 -143276 -95847 -34518 98876 64827 -41134 57296
2160E7296J2359k6181M6167j0231o5163j942o6729P1525k8517k0434R7854n0436
$$ 57296 69655 43474 89641 79410 14247 12305 -54424 17101 -11416 -31850 66004 15568
2148A5568L078N7233n909J6329K745m9779L2814o3909J2053O4631O4386J8264
$$ 15568 18646 75879 69970 86299 89044 39265 72079 8170 20223 84854 149240 167504
2136A67504L0488j29557l2794M0586J81237J66305J5220o4026r2022P3574j79610
$$ 167504 197992 68435 35641 76227 257464 423769 438989 374963 282941 356515 176905
2125A76905j2203o1965n9711M2774j2724j71631j12167J4134J59936M3007p951
$$ 176905 164702 102737 43026 85800 73076 -98555 -210722 -196588 -36652 6355 -1596
2114a596M2399l5809n3629N479Q3465o7388L2574M5433j25934l9412l2955Q8290
$$ -1596 40803 4994 -48635 -43156 40309 -27079 5495 50928 -75006 -114418 -147373 -59083
2102e9083L6714J54858r1619j17832l1839m352M7081J915J55070n4174r7137J15035
$$ -59083 -22369 132489 40870 -76962 -108801 -113153 -66072 -64157 90913 36739 -60398 54637
2090E4637j5707K0335Q5256o7679k9981m8665l3922k1282Q8895k2094J990l8011
$$ 54637 38930 59265 144521 76842 46861 -1804 -35726 -57008 31887 9793 11783 -26228
2078b6228J31798j15112o9103K4449l0742K7416r4174k4937J1167m3754J13118
$$ -26228 105570 -9542 -78645 -54196 -84938 -57522 -151696 -176633 -165466 -209220 -96102
2067i6102j17584N00Q7764l5722M6447J73319j1876m6248j29059j3870J10426
$$ -96102 -213686 -213186 -125422 -161144 -114697 58622 46746 498 -128561 -142431 -32005
2056c2005j6174j4532J3549K5774j07411m786M7557Q06O1110r7384P3930P3207
$$ -32005 -48179 -62711 -49162 -23388 -130799 -135585 -88028 -87222 -26112 -123496 -49566 23641
2044B3641q1225j39500p7030J48287M4620N793Q5086k4273n6803R131r7897k812
$$ 23641 -57584 -197084 -274114 -125827 -81207 -75414 9672 -14601 -71404 -62273 -160170 -162982
2032a62982P8416k5464o22N8246J07817o3078j14140l4921J87205k2483K6071
$$ -162982 -84566 -110030 -110652 -52406 55411 -7667 -121807 -156728 30477 7994 34065
2021C4065M6443p739l5075l1529O619j19207m1544R027N0435j3597N7861R9942
$$ 34065 80508 72769 37694 6165 12784 -106423 -147967 -138940 -88505 -102102 -44241 55701
2009E5701j13204o5901J82839L5057o5161n4962p3968Q178N4298L8340n6628q3127
$$ 55701 -57503 -123404 59435 94492 29331 -25631 -99599 -91421 -37123 1217 -55411 -138538
1997a38538Q6575k5153q3389Q7722J0265l0873M8083q2592O2982O4580o6703k15102
$$ -138538 -51963 -77116 -160505 -72783 -62518 -93391 -45308 -127900 -64918 -338 -67041 -282143
1985b82143J05289Q049j4298J19890J64838m6179K6001r5046j25555k466J10076
$$ -282143 -176854 -168805 -183103 -63213 101625 55446 81447 -13599 -139154 -141620 -31544
1974c1544K6163j36539Q8012N1194J56928o4544p4974L5756Q368Q5070j29355
$$ -31544 -5381 -141920 -53908 -2714 154214 89670 14696 50452 58820 143890 14535
1963A4535j23402L7776L7320Q3713j0180o4973j26202J02962l0076j0209k4732
$$ 14535 -108867 -71091 -33771 49942 39762 -25211 -151413 -48451 -78527 -88736 -113468
1952a13468l411l839o9815p98M2336O3301K8620J09643K3704N757o9485J6508
$$ -113468 -116879 -120718 -190533 -191331 -148995 -85694 -57074 52569 76273 82030 12545 29053
1940B9053p9721k3063J51315j00584j49562J23151K1099j07821o0094Q1553O4308
$$ 29053 -50668 -73731 77584 -23000 -172562 -49411 -28312 -136133 -196227 -114674 -50366
1929e0366l0521K8203J59196j35410p4226J35874q9698p9916J29775K6800j75317
$$ -50366 -80887 -52684 106512 -28898 -103124 32750 -56948 -136864 -7089 19711 -155606
1918a55606L2125L0997K6661K3594L1730J24587j08580L7540m5311j93784J07432
$$ -155606 -123481 -92484 -65823 -42229 -10499 114088 5508 43048 -2263 -196047 -88615
1907h8615P1448N4078M0319p7575J5670j04234O4689m0531M7229J7222j5526N7101
$$ -88615 -17167 36911 77230 -345 15325 -88909 -24220 -64751 -17522 -300 -15826 41275
1895D1275p6037o8115J18197l735o207L2433J2702q3875J8042M8170r8461m4919
$$ 41275 -34762 -102877 15320 11585 5378 37811 50513 -33362 -15320 32850 -65611 -110530
1883a10530j3075q060P7988O6352q9615j06164q4469J04528O1164p3257J58N4207
$$ -110530 -123605 -131665 -53677 12675 -76940 -183104 -267573 -163045 -101881 -175138 -174980 -120773
1871a20773R5360J5159m6256N1545l2065j8608J30323L223j73678n348L5125Q3089
$$ -120773 -25413 -10254 -56510 -4965 -37030 -55638 74685 77908 -95770 -101118 -65993 17096
1859A7096j41142L3379J18401J1334k05459l967P240L8678O8555K3147M8966j8320
$$ 17096 -124046 -90667 27734 39068 -166391 -170358 -163118 -124440 -55885 -32738 16228 -2092
1847b092N8947M4539j02957r7907l156J83750r1598n389j5067Q1198R0579l5794
$$ -2092 56855 101394 -1563 -99470 -102626 81124 -10474 -15863 -30930 50268 140847 105053
1835A05053k4507J15980n2396K2794r0571r7402J12079n9764m8880M389j58783
$$ 105053 80546 196526 144130 166924 76353 -21049 91030 31266 -17614 -13225 -172008
$$ [...]
##END NTUPLES=NMR SPECTRUM
##END=
