##TITLE=1H_CA-9418-2
 200.13MHz,DMSO-d6.
 8 sc
 
 11.2.2026
##JCAMPDX= 6.0         $$ Bruker NMR JCAMP-DX V2.0
##DATA TYPE= NMR FID
##DATA CLASS= NTUPLES
##ORIGIN= UXNMR, Bruker Analytische Messtechnik GmbH
##OWNER= pz
$$ XWIN-NMR		Version 3.5
$$ Wed Feb 11 14:01:24 2026 Russian Standard Time (UT+4h)  she@DPX200
##.OBSERVE FREQUENCY= 200.1313
##.OBSERVE NUCLEUS= ^1H
##.DELAY= (6, 6)
##.ACQUISITION MODE= SIMULTANEOUS
##.ACQUISITION SCHEME= undefined
##.AVERAGES= 8
##.DIGITISER RES= 18
##SPECTROMETER/DATA SYSTEM= spect
##.PULSE SEQUENCE= zg30
##.SOLVENT NAME= DMSO
##.SHIFT REFERENCE= (INTERNAL, DMSO, 0, 14.3821)
##AUDIT TRAIL= $$ (NUMBER, WHEN, WHO, WHERE, WHAT)
$$ ##TITLE= Audit trail, XWIN-NMR		Version 3.5
$$ ##JCAMPDX= 5.01
$$ ##ORIGIN= Bruker BioSpin GmbH
$$ ##OWNER= she
$$ F:/spectra/data/she/nmr/H-C/1/audita.txt
$$ ##AUDIT TRAIL=  $$ (NUMBER, WHEN, WHO, WHERE, WHAT)
(   1,<2026-02-11 13:59:55.84 +0400>,<she>,<DPX200>,
      <created by zg, POWCHK disabled, PULCHK disabled
       configuration hash MD5:
       00 E9 B6 7A A2 85 ED C7 34 08 36 98 17 FE 4E 26
       data hash MD5: 16K
       F0 B9 3E 03 48 09 D3 A7 9C 9D E9 F3 6A AB 0C 9E>)
$$ ##END=
$$ 
$$ hash MD5
$$ 0B 3D 42 14 35 01 41 A0 A4 AB 7F CB 42 D3 55 B1
##$RELAX= 
##$RELAX= 
##$RELAX= 
##$RELAX= 
##$RELAX= 
##$RELAX= 
$$ Bruker specific parameters
$$ --------------------------
##$DU= <F:/spectra>
##$EXPNO= 1
##$NAME= <H-C>
##$PROCNO= 1
##$TYPE= <nmr>
##$USER= <she>
##$AMP= (0..31)
100 100 100 100 100 100 100 100 100 100 100 100 100 100 100 100 100 100 
100 100 100 100 100 100 100 100 100 100 100 100 100 100 
##$AQSEQ= 0
##$AQ_mod= 1
##$AUNM= <au_zg>
##$AUTOPOS= <>
##$BF1= 200.13
##$BF2= 200.13
##$BF3= 200.13
##$BF4= 200.13
##$BF5= 200.13
##$BF6= 200.13
##$BF7= 200.13
##$BF8= 200.13
##$BYTORDA= 1
##$CFDGTYP= 0
##$CFRGTYP= 5
##$CHEMSTR= <none>
##$CNST= (0..31)
1 1 145 1 1 1 1 1 1 1 1 1 1 1 1 1 1 1 1 1 1 1 1 1 1 1 1 1 1 1 1 1 
##$CPDPRG= <>
##$CPDPRG1= <>
##$CPDPRG2= <>
##$CPDPRG3= <>
##$CPDPRG4= <mlev>
##$CPDPRG5= <mlev>
##$CPDPRG6= <mlev>
##$CPDPRG7= <mlev>
##$CPDPRG8= <mlev>
##$CPDPRGB= <>
##$CPDPRGT= <>
##$D= (0..31)
0 0.7 0 0 0 0 0 0 0 0 0 0.03 0 0 0 0 0 0 0 0 0 0 0 0 0 0 0 0 0 0 0 0 
##$DATE= 1770803995
##$DBL= (0..7)
120 120 120 120 120 120 120 120 
##$DBP= (0..7)
150 150 150 150 150 150 150 150 
##$DBP07= 0
##$DBPNAM0= <>
##$DBPNAM1= <>
##$DBPNAM2= <>
##$DBPNAM3= <>
##$DBPNAM4= <>
##$DBPNAM5= <>
##$DBPNAM6= <>
##$DBPNAM7= <>
##$DBPOAL= (0..7)
0.5 0.5 0.5 0.5 0.5 0.5 0.5 0.5 
##$DBPOFFS= (0..7)
0 0 0 0 0 0 0 0 
##$DE= 6
##$DECBNUC= <off>
##$DECIM= 32
##$DECNUC= <off>
##$DECSTAT= 4
##$DIGMOD= 1
##$DIGTYP= 9
##$DL= (0..7)
0 120 120 120 120 120 120 120 
##$DP= (0..7)
150 150 150 150 150 150 150 150 
##$DP07= 0
##$DPNAME0= <>
##$DPNAME1= <>
##$DPNAME2= <>
##$DPNAME3= <>
##$DPNAME4= <>
##$DPNAME5= <>
##$DPNAME6= <>
##$DPNAME7= <>
##$DPOAL= (0..7)
0.5 0.5 0.5 0.5 0.5 0.5 0.5 0.5 
##$DPOFFS= (0..7)
0 0 0 0 0 0 0 0 
##$DQDMODE= 0
##$DR= 18
##$DS= 0
##$DSLIST= <SSSSSSSSSSSSSSS>
$$ [...]
##$SUBNAM0= <"">
##$SUBNAM1= <"">
##$SUBNAM2= <"">
##$SUBNAM3= <"">
##$SUBNAM4= <"">
##$SUBNAM5= <"">
##$SUBNAM6= <"">
##$SUBNAM7= <"">
##$SUBNAM8= <"">
##$SUBNAM9= <"">
##$SW= 18.0517328524113
##$SWIBOX= (0..15)
0 0 2 0 0 0 0 0 0 0 0 0 0 0 0 0 
##$SW_h= 3612.71676300578
##$TD= 16384
##$TD0= 1
##$TE= 0
##$TE2= 300
##$TE3= 300
##$TEG= 300
##$TL= (0..7)
0 120 120 120 120 120 120 120 
##$TP= (0..7)
150 150 150 150 150 150 150 150 
##$TP07= 0
##$TPNAME0= <>
##$TPNAME1= <>
##$TPNAME2= <>
##$TPNAME3= <>
##$TPNAME4= <>
##$TPNAME5= <>
##$TPNAME6= <>
##$TPNAME7= <>
##$TPOAL= (0..7)
0.5 0.5 0.5 0.5 0.5 0.5 0.5 0.5 
##$TPOFFS= (0..7)
0 0 0 0 0 0 0 0 
##$TUNHIN= 0
##$TUNHOUT= 0
##$TUNXOUT= 0
##$USERA1= <user>
##$USERA2= <user>
##$USERA3= <user>
##$USERA4= <user>
##$USERA5= <user>
##$V9= 5
##$VALIST= <valist>
##$VCLIST= <CCCCCCCCCCCCCCC>
##$VD= 0
##$VDLIST= <DDDDDDDDDDDDDDD>
##$VPLIST= <PPPPPPPPPPPPPPP>
##$VTLIST= <TTTTTTTTTTTTTTT>
##$WBST= 1024
##$WBSW= 4
##$XGAIN= (0..3)
0 0 0 0 
##$XL= 0
##$YL= 0
##$YMAX_a= 334353
##$YMIN_a= -580001
##$ZGOPTNS= <>
##$ZL1= 120
##$ZL2= 120
##$ZL3= 120
##$ZL4= 120
##$ABSF1= 10
##$ABSF2= 0
##$ABSG= 5
##$ABSL= 3
##$ALPHA= 0
##$AQORDER= 0
##$ASSFAC= 0
##$ASSFACI= 0
##$ASSFACX= 0
##$ASSWID= 0
##$AUNMP= <proc_1d>
##$AZFE= 0.1
##$AZFW= 0.1
##$BCFW= 1
##$BC_mod= 2
##$BYTORDP= 1
##$COROFFS= 0
##$CY= -3
##$DATMOD= 1
##$DC= 2
##$DFILT= <>
##$DTYPP= 0
##$F1P= 0
##$F2P= 0
##$FCOR= 0.5
##$FTSIZE= 0
##$FT_mod= 4
##$GAMMA= 1
##$GB= 0.15
##$INTBC= 1
##$INTSCL= 1
##$ISEN= 128
##$LB= 0.25
##$LEV0= 0
##$LPBIN= 0
##$MAXI= 10000
##$MC2= 0
##$MEAN= 0
##$ME_mod= 0
##$MI= 1.114404
##$NCOEF= 0
##$NC_proc= 0
##$NLEV= 6
##$NOISF1= 3.799351
##$NOISF2= 2.8
##$NSP= 1
##$NTH_PI= 0
##$NZP= 0
##$OFFSET= 14.38212
##$PC= 1
##$PHC0= -3698.926
##$PHC1= 6.992324
##$PH_mod= 1
##$PKNL= yes
##$PPARMOD= 0
##$PSCAL= 0
##$PSIGN= 0
##$REVERSE= no
##$SF= 200.129724274929
##$SI= 16384
##$SIGF1= 3
##$SIGF2= 2
##$SINO= 400
##$SIOLD= 16384
##$SREGLST= <1H.CDCl3>
##$SSB= 0
##$STSI= 0
##$STSR= 0
##$SW_p= 3205.1282051282
##$SYMM= 0
##$S_DEV= 0
##$TDeff= 0
##$TDoff= 0
##$TI= <>
##$TILT= no
##$TM1= 0
##$TM2= 0
##$TOPLEV= 0
##$USERP1= <user>
##$USERP2= <user>
##$USERP3= <user>
##$USERP4= <user>
##$USERP5= <user>
##$WDW= 1
##$XDIM= 8192
##$YMAX_p= 0
##$YMIN_p= 0
$$ End of Bruker specific parameters
$$ ---------------------------------
##NTUPLES= NMR FID
##VAR_NAME=  TIME,          FID/REAL,        FID/IMAG
##SYMBOL=    X,             R,               I
##VAR_TYPE=  INDEPENDENT,   DEPENDENT,       DEPENDENT
##VAR_FORM=  AFFN,          ASDF,            ASDF
##VAR_DIM=   8192,          8192,            8192
##UNITS=     SECONDS,       ARBITRARY UNITS, ARBITRARY UNITS
##FACTOR=    0.0002768,     1,               1
##FIRST=     0,             0,               0
##LAST=      2.2672688,     0,               0
##MIN=       0,             -580001,         0
##MAX=       2.2672688,     334353,          0
$$ Real data points
##PAGE= N=1
##DATA TABLE= (X++(R..R)), XYDATA
0@%%%%%%%%%%%%%%%%%%KmJ0j6J6j6J6j7K2k8L2l5L8m5N1n6O4p3Q3r2J02j16J30
$$ 0 0 0 0 0 0 0 0 0 0 0 0 0 0 0 0 0 0 0 2 -2 8 -8 8 -8 8 -9 13 -15 17 -18 20 -25 26 -30 34 -39 44 -48 54 -62 68
41F8j42J57j75J93k12K34k58K83l12L44l77M16m62N11n64O26o99P84q85J008j157
$$ 68 -74 83 -92 101 -111 123 -135 148 -164 180 -197 219 -243 268 -296 330 -369 415 -470 538 -619
62f19J345j594J937k440L240m713Q205k9579J0088J67887O8272M5491O6833m9025
$$ -619 726 -868 1069 -1371 1869 -2844 5361 -24218 -14130 153757 222029 267520 334353 285328
76B85328n9777o6701j53895r1262p0061n7288N9524J8178k2071N9365k2724n3782
$$ 285328 225551 158850 4955 -86307 -156368 -213656 -154132 -135954 -158025 -98660 -121384 -175166
88a75166K8716p614N1512J51369Q9595R7239O8025o7860o9431r6656j47988l7424
$$ -175166 -146450 -154064 -102552 48817 138412 235651 303676 235816 166385 69729 -78259 -115683
100a15683o203j0344Q2580N1012R260K9028m0677k5625K0374l9309J3731O4446
$$ -115683 -121886 -132230 -49650 1362 10622 39650 -1027 -26652 -6278 -45587 -31856 32590
112C2590l33M0936L1981o4863k5045k4525o8460j3139j2286K320O6128J8231J8183
$$ 32590 32257 73193 105174 40311 15266 -9259 -77719 -90858 -103144 -100824 -34696 -16465 1718
125A718O1220L947K4213M1892m4412j8709m037p0414l1012k0045l9634K6615J1520
$$ 1718 62938 66885 91098 132990 88578 69869 65832 -4582 -35594 -55639 -95273 -68658 -57138
138e7138j6568L3856l494j5770K8009j4031R415O1067K4931M4397M8110j4514
$$ -57138 -73706 -39850 -43344 -59114 -31105 -45136 -35721 25346 50277 94674 142784 128270
150A28270K81l1380q5200l1025l5893n4608J7423J1170M2M5482J3656L749K5348
$$ 128270 128551 97171 11971 -19054 -54947 -109555 -92132 -80962 -80920 -35438 -21782 -18033 7315
163G315j3719Q7J6591j1559L1050L3319j2885K0412L350m3984q584k9995m3618
$$ 7315 -6404 -6317 10274 -1285 29765 63084 50199 70611 73961 29977 21393 -8602 -52220
176e2220P144p092o863K6406P391K4384L4875j5451J485R402l2824k931o06j8589
$$ -52220 -45076 -52168 -59031 -32625 -25234 -850 34025 18574 20059 29461 -3363 -6294 -6900 -25489
190b5489K5239J3220r961J7344j0783j5619J3438k3542j4568K2313m314J2859
$$ -25489 -250 12970 3009 20353 9570 -6049 7389 -16153 -30721 -8408 -12722 137
202A37K8501n773J1045L955k9652q814j6935k5513J6192k195l887L1308J165j51
$$ 137 28638 22865 33910 37865 8213 -601 -17536 -43049 -26857 -29052 -32939 -1631 -466 -617
216f17K4770j0022o989Q209j5530N501J1447j3343J1083M193j6282R300j2045
$$ -617 24153 14131 7142 15351 -179 5322 16769 3426 14509 18702 2420 11720 -325
229c25k3419J1483p682j2018J3246o849J0903K7829j700Q598J1125j6669K607
$$ -325 -23744 -12261 -19943 -31961 -18715 -25564 -14661 13168 11468 20066 31191 14522 17129
242A7129l343k5084O768K857q398J3465m285n455J4417j1558q691P190j4739O384
$$ 17129 13786 -11298 -4530 -1673 -10071 3394 -891 -6346 8071 -3487 -12178 -4988 -19727 -13343
256a3343J8652o083J2098J3130j2397L524n832j8855M620n303p118J3751o526
$$ -13343 5309 -774 11324 24454 12057 15581 9749 -9106 -4486 -9789 -16907 -3156 -9682
269i682j165J7266p297J328R315j3602L403Q722r754P584K937r380R554m966j3088
$$ -9682 -10847 6419 -878 450 9765 -3837 -434 8288 -1466 6118 9055 -325 9229 4263 -8825
284h825Q691n702m222J0155j0731k81J3986n535N060O153q681Q789L664j2143
$$ -8825 -134 -5836 -10058 97 -10634 -10915 3071 -2464 2596 8749 68 8857 12521 378
298C78P860r70j0321O411q239r788J0744l363N74R751p680M540P755j0674M974
$$ 378 8238 7268 -3053 3358 -4881 -14669 -3925 -7288 -6714 3037 -4643 -103 7652 -3022 1952
313A952L980r141R359R29q423R491k956q121M619r333m495P733n633N292R410
$$ 1952 5932 -3209 6150 7079 -1344 8147 5191 -2930 1689 -7644 -12139 -4406 -10039 -4747 4663
328D663o639M890N583q744O062K154p220P080m309p755N259m994l306P242p618
$$ 4663 -1976 2914 8497 -247 5815 7969 749 7829 3520 -4235 1024 -3970 -7276 -34 -7652
343g652J180R177m856K406L290p266M625J689m796Q583J885k368P115r712j0229
$$ -7652 -6472 2705 -2151 255 3545 -3721 904 2593 -2203 6380 8265 5897 13012 3300 -6929
358f929L386q191r74P608l875O911J0030m745L860j10q001M320k549n858Q775
$$ -6929 -3543 -11734 -12708 -5100 -8975 -2064 7966 3221 7081 6971 -1030 3290 741 -5117 3658
373C658P14j353O553p477n880J533p649L93L819m204O787O644l050P285J328n334
$$ 3658 4372 3019 9572 2095 -3785 -2252 -9901 -9508 -5689 -9893 -3106 3538 488 7773 9101 3767
389C767N385m390o912K594m720l30O107n340K31M887m788L580J965p685L912K147
$$ 3767 9152 4762 -2150 444 -4276 -4606 1501 -3839 -3608 1279 -3509 71 2036 -5649 -1737 410
405D10m156O201J365OP234m361n664J329q264j784K009n439M373O578m53O522
$$ 410 -3746 2455 3820 3826 11060 6699 1035 2364 -5900 -7684 -5675 -11114 -6741 -163 -616 5906
421E906K861m300L946l856n706K235l013r07P104k424j512K151o558j391J61p288
$$ 5906 8767 4467 8413 4557 -1149 1086 -1927 -2834 4270 1846 334 2485 -4073 -5464 -5303 -12591
437a2591K981L828J30J0178M285L89N060k309o364J16p500k579L384l659O97K560
$$ -12591 -9610 -5782 -5652 4526 8811 9200 14260 11951 5587 5703 -1797 -4376 -992 -4651 -3954 -1394
453a394m109K287J553o458K694Q38j369O341J944J657P370o29j974J204o304k091
$$ -1394 -5503 -3216 -1663 -8121 -5427 -4589 -5958 383 2327 3984 11354 10725 8751 9955 3651 1560
469A560J51p331o29Q64l154M461K555j534M950k81l503K169k805p16N331j166
$$ 1560 1711 -5620 -6249 -5385 -8539 -4078 -1523 -3057 1893 1612 -1891 278 -2527 -3243 2088 922
485I22K199M494k966N0l00p137j145j300l327M555K621J383O500l34j835J140
$$ 922 3121 7615 4649 4699 4399 -2738 -3883 -5183 -8510 -3955 -1334 49 6549 6215 4380 5520
501E520n757l213J736l503J084L406j659K989J270l706J623j091k623L083oK69
$$ 5520 -237 -3450 -1714 -5217 -4133 -727 -2386 603 1873 -1833 -210 -1301 -3924 -841 -847 -578
517e78O527K01O30J855m284j702k21o094j817r7l177K332J741m11M727J356j077
$$ -578 5949 6150 6780 8635 4351 2649 2428 -3666 -5483 -5580 -8757 -6425 -4684 -5095 -368 988 -89
534h9J999k514Q2M391j116J574K695j931J158P78n620j529k626m321k7o32J8M242
$$ -89 1910 -604 -522 3869 2753 4327 7022 5091 6249 7027 1407 -122 -2748 -7069 -7096 -7728 -7710 -3468
552c468J825Q42L915k358p19K057k025K51J976j390L153J430k271J374j879l402
$$ -3468 -1643 -801 3114 756 37 2094 69 320 2296 906 4059 5489 3218 4592 2713 -689
568f89K32l173k242K548o87J855L247j524J081J527k563J33q62k311K596Q05m86
$$ -689 -457 -3630 -5872 -3324 -4011 -2156 1091 -433 648 2175 -388 -255 -1117 -3428 -832 -27 -513
585e13L616P09p38J713l057k275R72k269N37J142j842K121J399k108Q58j053k719
$$ -513 3103 3812 3074 4787 1730 -545 427 -1842 -1305 -163 -2005 116 1515 -593 265 -788 -3507
602c507J551j014j205L339R42Q99K921r87n64J098k443j12o0k632J332P74j329
$$ -3507 -1956 -2970 -4175 -836 106 1005 3926 2939 2375 3473 1030 918 858 -1774 -442 332 -997
619i97K132n07j371J217k148j669J354j344J138K555p44J393J865j083Q58m42
$$ -997 1135 628 -743 474 -1674 -3343 -1989 -3333 -2195 360 -384 1009 2874 1791 2649 2207
635B207k421Q91r57j412K285m6l47K173j442j415N61k146j88Q24j567J285J274
$$ 2207 -214 677 -280 -1692 593 547 200 2373 931 -484 77 -2069 -2257 -1433 -3000 -1715 -441
652d41k59J832L15j296J977j731j525K044j036N36K170j146p45P90j670J35m89
$$ -441 -700 1132 1447 151 2128 397 -1128 916 -120 416 2586 1440 695 1485 -185 -50 -539
669e39j911P45M11r70J762M51m26J781q48n79J033p82L30O22r95N22O84j016Q85
$$ -539 -2450 -1705 -1294 -2264 -502 -51 -477 1304 456 -123 910 128 458 1080 85 607 1291 275 1160
688A160n9j949O94k97j530J064l86N0J848p84K95J025j207M06O02j717N05M18
$$ 1160 1101 -848 -154 -451 -1981 -917 -1303 -1253 595 -189 106 1131 -76 330 932 -785 -280 138
706A38q00J366o3o59J334o98j182O75r63j6J223q06J84J025q57N53N94j529L54
$$ 138 -662 704 641 -18 1316 618 -564 111 -852 -868 355 -451 -267 758 -99 454 1048 -481 -127
725a27n4j141J195l08k03J529m43l98N74q22J05P33p22j18L01l93P81k27r32P99
$$ -127 -181 -1322 -127 -435 -638 891 448 50 624 -198 -93 640 -82 -200 101 -292 489 262 -670 129
745A29j57p54O11k99l73J374q17J73N39p99N31J020j098K47J56j018Q17m70p84
$$ 129 -28 -782 -171 -470 -843 531 -286 -113 426 -373 158 1178 80 327 483 -535 282 -188 -972
764i72J067l9m16R55q03j62Q52o74J3N98j030Q87N20q00N51k20q46N45n11k18
$$ -972 95 56 -360 595 -208 -370 482 -192 -179 419 -611 276 796 -4 547 327 -519 26 -485 -703
784g03Q09j94k63Q16q92N67N33q48M41K36q02R57k73o48N87m02n23Q32n51k34
$$ -703 106 -88 -351 465 -427 140 673 -175 266 502 -300 657 384 -264 323 -79 -602 230 -321 -555
804e55J068q08J59M00p45K37P39o75O11J99o62N58k83o44N85m12k41M27m79N1
$$ -555 513 -295 -136 264 -481 -244 495 -180 431 630 -32 526 243 -401 184 -228 -469 -42 -521 -470
824d70P38m16L9L27p66M78L46l94M42K03o36N77l54k96L10k75p7J79o11M5O38
$$ -470 268 -148 -109 218 -548 -70 276 -118 324 527 -109 468 114 -182 128 -147 -224 -45 -656 -611 27
845B7j21K71L32o75M47J16n31L54m8n21M75m42j54O38k75k16M27p32J24L35j97
$$ 27 -94 177 509 -166 281 397 -134 220 172 -349 126 -316 -470 168 -107 -323 104 -628 -504 -169 -366
866c66P00N7l59O55j71n30M04j19m34J95m71k50N85k20L62K64o91N03L5k85L74
$$ -366 334 391 32 687 516 -14 390 271 -163 32 -439 -689 -104 -324 38 302 -389 114 149 -136 238
887B38q2k60M31J62m25L60m13K0J83q41Q5K88k99M04M07o16N11K15m00O13n72
$$ 238 156 -104 327 489 64 424 11 31 214 -627 -542 -254 -553 -149 258 -358 153 368 -32 581 9
908Ij75L16p2m3K09j89l9L27p81J16P9l92M77M2m6M35j59n8N08j51l16L07l62
$$ 9 -166 150 78 35 244 55 16 343 -438 -322 -243 -635 -158 -116 -162 273 114 56 564 413 97 404 42
931D2l56J90j64K80K77m69J86N3k64J35k32j5L71j80P5L42K8oK24p14J56n7l11
$$ 42 -314 -124 -288 -8 269 -200 -14 39 -225 -90 -322 -337 34 -146 -71 271 299 293 517 -197 -41 -98 -409
954d09L53O3o1J76P7j81M64l72l79L54l04J74j20m5P9M14p4J0Jm58K35o2l6J62
$$ -409 -56 7 -54 122 199 18 482 110 -269 85 -219 -45 -165 -210 -131 283 209 219 220 -238 -3 -65 -101 61
978F1o2R3K82j02j49P6l74J3N4l30L15L52l74M38l51P1J04o3l53K69J6K3O9j41
$$ 61 -1 92 374 272 123 199 -175 -162 -108 -438 -123 229 -145 293 -58 13 117 54 -299 -30 -14 9 78 -63
1002f3J36J66k27J43J03n71L79rl36L66K65l60J96k95L0L44l92j04N8n2J97M26
$$ -63 73 239 12 155 258 -313 66 57 -279 87 352 -8 188 -107 -77 267 -125 -229 -171 -223 -26 400
1024D00m04O5J41O8k3j83j32M7L8k44O59m04P8K58m46q7q7j16K03J68rP2r6O8
$$ 400 -4 61 202 270 247 64 -68 -21 17 -227 432 28 106 364 -82 -169 -256 -372 -169 -1 -10 62 -34 34
1048C4L50j71k60K43l07J33K16l62K04K27l95J3m0r6J49j74j4J3K20R4K13k90
$$ 34 384 213 -47 196 -111 22 238 -124 80 307 -88 -75 -115 -211 -62 -236 -250 -237 -17 77 290 0
1070@J56L52m65n5J41l72p3K56j56J25j39K90o2J99l15J49J7k29K24q6j5K72p1
$$ 0 156 508 43 -12 129 -243 -316 -60 -216 -91 -230 60 -2 197 -118 31 48 -181 43 -43 -58 214 143
1093A43k03L61j07l40J39m67M69j6qK69j87M4K2l3j29j06j2K2K12q3KJ23l40K11
$$ 143 -60 301 194 -146 -7 -474 -5 -21 -29 240 53 97 119 86 -43 -149 -161 -139 73 -10 -8 115 -225 -14
1117a4j4m2J88Kl21N77k51R6L9r7j81p9Lk0Rq6J23j6J0J27M2k17p6M99n75L95
$$ -14 -28 -70 118 120 -201 376 125 221 260 163 -18 -97 -94 -114 -105 -191 -68 -84 -74 53 95 -122 -198 301 -274 121
1143A21m9k06K28k33jL65l12R6%k48K36o4l6oP0l6J67r3o6j6R8o0K67l20K03M
$$ 121 72 -134 94 -139 -140 225 -87 9 9 -239 -3 -67 -103 -109 -39 -75 92 -1 -67 -83 15 -45 222 -98 105 109
1169A09j39K77j77l74J34r%L26l34J80J07q9M26l00k61J70j36R9l1K5j10J43P0
$$ 109 -30 247 70 -304 -170 -179 -179 147 -187 -7 100 11 437 137 -124 46 -90 9 -22 3 -107 36 106
1192A06j40Q0k43L9O6N9k11M17k55J07J34k27K15q8j26K41k38J95k48M0k7J29
$$ 106 -34 46 -197 -158 -92 -33 -244 173 -82 25 159 -68 147 59 -67 174 -64 131 -117 -77 -104 25
1214B5k1K4K12m55K78n8j0J54k92rM29j66l80L21j82j67M22r6l9J83l35K4L11
$$ 25 4 28 240 -215 63 5 -5 149 -143 -152 277 111 -269 52 -130 -297 125 29 -10 173 -162 -138 173
1237A73k56M6J69k19K67k74J86j48O8k39M10j51O7r7J06j03K06j59L9K5k00J91
$$ 173 -83 -37 132 -87 180 -94 92 -56 12 -227 183 32 99 2 108 5 211 52 91 116 -84 107
1259A07m4l3J33N5j37L8k91K36P8j01J47l13K15J1R0k48K38j50k62J98Q6j35j6
$$ 107 63 30 163 218 81 119 -172 64 142 41 188 -125 90 101 191 -57 181 31 -231 -33 53 -82 -98
1282i8L15l31J57r4Q7O4j81N2j05J49K58l11k34K93k02J94j15J32O2M9jp9J83
$$ -98 217 -114 43 -51 36 100 -81 -29 -134 15 273 -38 -272 21 -181 13 -102 30 92 141 140 61 244
1305B44m51J60J72j32N0K0l9j30R6nR1K0M5R2j65k41m8K19J7pr2J61o1M9nk3p0
$$ 244 -207 -47 125 -7 43 63 24 -106 -10 -15 76 96 141 233 68 -173 -221 -2 15 8 -84 77 16 65 60 37 -33
1332c3J75k94Q4k1J0J70J01j46J87p9k52r3M92m33J87n5n4K16j32j79L17m4j88
$$ -33 142 -152 -68 -89 -79 91 192 46 233 154 -98 -191 301 -132 55 0 -54 162 30 -149 168 124 -64
1355f4j0J23J13j58l23J64L31k64N0J29j02O0q5R5N1j92J17L8o1j37K32r8Q5j64
$$ -64 -74 49 162 4 -319 -155 176 -88 -38 91 -11 49 -36 59 110 -82 35 73 12 -125 107 9 94 -70
1379g0L04k32j23K30j56O0j73Q8K41k18J26r4p6J89q3j04J27m2J47M9j20J0j56
$$ -70 234 2 -121 109 -47 13 -160 -72 169 -49 77 -17 -93 96 13 -91 36 -6 141 190 70 80 -76
1402g6j19J46Q0ml3J21l2k6j25Q9K12j64m0j28J93j04k4p6R5n8M4O5p7J69j51
$$ -76 -195 -49 31 27 -6 115 83 57 -68 21 233 69 29 -99 94 -10 -34 -110 -15 -73 -29 36 -41 128 -23
1427b3j87K09k27K67l8j52J31K0J21j99M7M2K38l39N7q3Q6Jq6J44j73K01k7l1
$$ -23 -210 -1 -228 39 1 -151 -20 0 121 -78 -31 11 249 -90 -33 -116 -30 -29 -115 29 -144 57 30 -1
1451ajp8j17mK78MJ1j72R7p5L30j95k40J81n7M7p0N8M7P1K78r0l14j16K17R3k9
$$ -1 -2 -80 -197 -201 77 81 92 -80 17 -58 272 77 -163 18 -39 8 -62 -4 43 114 392 302 -12 -128 89 182 153
1478A53j1k51J85k09J04K37p9k18K08j86P1N0j12J90R2k96K07m4r9p4J57j63N7
$$ 153 142 -109 76 -133 -29 208 129 -89 119 -67 4 54 -58 132 224 -72 135 91 -8 -82 75 -88 -31
1501c1rj3J03N0j51j82M72l06j62O6L77k12P5k15L48j17j64J59j98J53j87J56
$$ -31 -40 -53 50 100 -51 -233 239 -67 -229 -163 214 2 77 -138 210 93 -71 88 -110 43 -144 12
1523A2K20k03j95K56k37K37k89N2R5O0j38J09oJ51k62J76k81K23R6j56L22j42
$$ 12 232 29 -166 90 -147 90 -199 -147 -52 8 -130 -21 -27 124 -138 38 -243 -20 76 -80 242 100
1545A00l1k85L10j32J28j45j6j9P9M6P5J55k03j15R0j7k41K28R5l26K12kO6J11
$$ 100 69 -216 94 -38 90 -55 -71 -90 -11 35 110 265 62 -53 37 20 -221 7 102 -224 -12 -14 52 163
1569A63n5j24l7j2j82M44m25l9K26j26M5J44J3L2j04J60j26J33n5r0K41l21J00
$$ 163 108 -16 -53 -65 -247 197 -228 -267 -41 -167 -122 22 35 67 -37 123 -3 130 75 -15 226 -95 5
1592Ej7J45K8l98K84l16M05k14R4j65l0K50k21M36j90j7k23J77j92K74k18J77
$$ 5 -12 133 161 -237 47 -269 136 -78 16 -149 -179 71 -150 286 96 79 -144 33 -159 115 -103 74
1614G4j33j18J70J18k08l3K47Kj57J57l5o5J5j78J58k9J5k65L74j20J81o4j61
$$ 74 -59 -177 -7 111 -97 -130 117 119 -38 119 84 19 34 -144 14 -15 0 -265 109 -11 170 106 -55
1637e5M9j10J26j38J03r1Kn2J93J95l65K3J05J7J3n2kR0j02J2P4Q6j6j55J60m00
$$ -55 -6 -116 10 -128 -25 -116 -114 -166 27 222 -143 -120 -15 2 15 -37 -39 51 -51 -39 35 121 105 -50 110 -290
1663b90l10J020m36N3qp8om3K84j73j28J19J62j81J76k27M7m9N1n2MJ58k23J76
$$ -290 -600 420 -16 37 29 -49 -55 -98 186 13 -115 4 166 -15 161 -66 -19 -68 -17 -69 -65 93 -130 46
1687D6j12Q2j56J8J81l9P1O4J2M8k61j02K61n28L89R4k8N2j18P7n1J50k01k8M2
$$ 46 -66 16 -140 -122 59 20 91 155 167 215 -46 -148 113 -415 -26 68 40 92 -26 51 0 150 -51 -79 -37
1712c7J56k7%J6j17q0K89l81O3j8J92j17j22K32K1K7l5K2m6K43j06k27J57j79
$$ -37 119 92 92 108 -9 -89 200 -181 -118 -136 56 -61 -183 49 70 97 62 84 38 281 175 -52 105 -74
1736g4j21J60N1L6j20Q2k12K29q7P8L1J73j57Q6j06j36P9J3q3k28K00K74j92M
$$ -74 -195 -35 16 52 -68 14 -198 31 -56 22 53 226 69 155 49 -87 -8 5 -78 -306 -106 168 -24 -20
1760b0mN3j01j2K32k01O3J3o8K17l97K69j62K86l09R5M5J66j27J59k29KL2p7O9
$$ -20 -24 29 -72 -84 148 -53 10 23 -45 172 -225 44 -118 168 -141 -46 -1 165 38 197 -32 -30 2 -75 -6
1785fj23l9j1K05j55K18j84J78k02J30M7j64J67j08K2K13k93K02j54K0L0m5MO4
$$ -6 -129 -168 -179 26 -129 89 -95 83 -119 11 58 -106 61 -47 -25 188 -105 97 -57 -37 -7 -52 -48 16
1809A6P6l5J33j99K9J18O5l25K6K98m69K22l3N3J00J27k48J3L21l20j25K5K38
$$ 16 92 57 190 -9 20 138 203 -122 -96 202 -267 -45 -78 -25 75 202 -46 -33 288 -32 -157 -132 106
1832A06k7j89J68k02O0J83r1O8m20N46k10k9k3J7j53J85O2Qj4J17l43K01K48m46
$$ 106 79 -110 58 -144 -84 99 8 76 -344 202 -8 -37 -60 -43 -196 -11 51 59 45 162 -181 20 268 -178
1856a78K55N9o8k73L02r3K5r5K5LK2J36n1p0O7m2k7J05r9j39K47m9j40k8J21o0
$$ -178 77 136 68 -205 97 4 29 -66 -41 -38 -16 120 69 -1 66 24 -3 102 3 -136 111 62 -78 -106 15 -45
1882d5J80p6l10K50J13k46J27J22j9N5j58K59k77N4k41J86P8j02L5Q6j39J33K89
$$ -45 135 59 -251 -1 112 -134 -7 115 96 151 -7 252 -25 29 -212 -26 52 -50 -15 71 -68 65 354
1905C54l50K17k24o6lj8m4N9j04K34Q6j55l9J57j38Pmj62J00J31oj30J26j07J52
$$ 354 4 221 -3 -69 -72 -90 -134 -75 -179 55 141 -14 -53 104 -34 -27 -31 -193 -93 38 32 -98 28 -79 73
1930G3q3k0j2L2l7O2MN4J21j97r1K39j96J62k30o2K90j82J42j95P6J10q2K3qJ71
$$ 73 -10 -30 -42 -10 -47 15 19 73 194 -3 -94 145 -51 111 -119 -181 109 -73 69 -126 -50 60 -22 1 -7 164
1956A64q5j6J1k9j76J32K27k17J24k7r1n8J7M1o3r6%K02k15K39N8l12P6j66L59
$$ 164 79 63 74 45 -131 1 228 11 135 108 17 -41 -24 17 -46 -142 -142 60 -155 84 142 -170 -94 -260 99
1981I9O9j98J82l1k8rL8k22M3n0P5l3K36k36j55K43m3J87l11L58J0k20j7O4k7
$$ 99 168 -30 152 121 93 84 122 -100 -57 -107 -32 -65 171 -65 -220 23 -20 167 -144 214 224 4 -13 51 24
2006B4M9n1k34K38J28p1j25m1K43l46K52j43MJ9K09J16k84m9J80N9l60O0j56K91
$$ 24 73 22 -212 26 154 83 -42 -83 160 -186 66 -77 -73 -54 155 271 -13 -62 118 177 -183 -123 -279 12
2030A2m9j75L54k14n4N8j73J59L7m5J07j81N7J9J04o7J9q9J49K5K9k90J64mO7
$$ 12 -37 -212 142 -72 -126 -68 -241 -82 -45 -90 17 -164 -107 -88 16 -51 -32 -121 28 53 82 -208 -44 -48 19
2055A9k3L1lk3J36j92K4j79K5M92l19K22k66j9j59J34k1J18P9km8j0k1J17j7j48
$$ 19 -4 27 24 1 137 -55 -31 -210 -185 307 -12 210 -56 -75 -234 -100 -121 -3 76 74 26 16 -5 112 95 -53
2081e3J25L4N0k97K62r0j38Q1J68p6j02K9K71k46m7r3J06nJ60k7n1j27J44J13
$$ -53 72 106 156 -141 121 31 -107 -26 142 66 -36 -7 264 18 -29 -122 -16 -21 139 112 61 -66 78 191
2105A91l12L36k14J57m3l01K94l3q0q2N1Qj24j82L59m8O3N8j22K05m74K45O6k06
$$ 191 -121 215 1 158 115 -186 108 75 -5 -87 -36 -28 -152 -334 25 -23 40 98 -24 181 -293 -48 18 -188
2129a88K27k05K7L17j72j7P3m1K37n5m56K82J26j33n0j56J9L28k5k08m1L9L56
$$ -188 39 -166 -139 178 6 -11 62 21 258 203 -253 29 155 22 -28 -184 -165 163 138 -70 -111 -72 284
2152B84m40M9K63m2M8j07k0J97n2k17j16K05J3N6q2j49K5O1j93J08L5j59K17N
$$ 284 -156 -107 156 114 162 55 35 232 180 -37 -153 52 65 121 39 -110 -85 -24 -217 -109 -74 -233 -16 -11
2176a1rj44K48q9J52k02J36j00j7J5K8j07m3L35k53J50j19J4J25o9l8J36j10J53
$$ -11 -20 -164 84 -5 147 -55 81 -19 -36 -21 7 -100 -143 192 -61 89 -30 -16 109 40 2 138 28 181
2200A81l12N2P6j3Kq6J31k24J54k7k8J7J04J05k05l5l6K61j89J20K6Q0j87m5k22
$$ 181 -131 -79 -3 -16 -14 -100 31 -193 -39 -66 -94 -77 27 132 -73 -108 -144 117 -72 48 74 154 -33 -78 -300
2225c00K88J18j47O5O3m2K2L5j35K30k44K27%k36j49K88K4n8N2P0k37q2J98k06
$$ -300 -12 106 -41 24 87 45 67 102 -33 197 -47 180 180 -56 -205 83 107 49 101 171 -66 -148 50 -156
2249a56M09J8j82q3j6k4k1om4J58l8J10k68J56N8J8K7l58M61n33L21j3m9j23J01
$$ -156 253 271 89 6 -10 -34 -55 -61 -105 53 15 125 -143 13 71 89 116 -242 219 -314 7 -6 -55 -178 -77
2274g7j87K54J39Q2k11j5m7k1J53j15oL7K63j72p0m3m3O8l4J04J22k96J18p7p4
$$ -77 -264 -10 129 211 0 -15 -62 -83 70 -45 -51 -14 249 77 7 -36 -79 -11 -45 59 181 -115 3 -74 -148
2299a48L4J16J12j20j61K84K1Oj99Mj4j39L06j45L8L9j37L10j66p3J64j60j26
$$ -148 -114 2 114 -6 -167 117 138 144 -55 -51 -65 -204 102 -43 -5 34 -103 207 41 -32 132 -28 -154
2322a54L32k11m3L9L47l49M4j02NPJ93l85P8M32l05m7P7kO6roJ93q1O4j34J04
$$ -154 178 -33 -76 -37 310 -39 5 -97 -92 -85 108 -277 -199 233 -72 -119 -42 -44 22 13 7 200 119 183 49 153
2348A53l07J56J91j44q2p5P1J40k18N3p6J19K17k71M5r5r0K77k2m3Q7k98L03l07
$$ 153 -154 2 193 49 -33 -108 -37 103 -115 -62 -138 -19 198 -73 -28 -123 -213 64 42 -1 86 -212 91 -216
2372b16K52o8r0M4lK35l49O7O9P7r8P4K1O1J27j87J9k13L57k58L5P0Oj92N5m5
$$ -216 36 -32 -122 -78 -81 154 -195 -128 -59 18 -80 -6 15 76 203 16 35 -178 179 -79 -44 26 32 -160 -105 -150
2398a50J79J7K3J64q7j93R8j6k52K05q0J46o2J49l59J30N3J55J1j20J01j94Q4
$$ -150 29 46 69 233 146 -47 51 35 -217 -12 -92 54 -8 141 -218 -88 -35 120 131 11 112 -82 2
2421Bj51J49k00J42K51m82J94J43K2O3j64Q3P9O8k55J50r9j2J49k65K59o8J2j54
$$ 2 -149 0 -200 -58 193 -289 -95 48 70 133 -31 52 131 199 -56 94 -5 -17 132 -133 126 58 70 -84
2445h4R0k46J90J36j12%p8J52P9k23J77o9O2j22M3J47j29k7J16j67M4j0q9J22
$$ -84 6 -240 -50 86 -26 -26 -104 48 127 -96 81 12 74 -48 -5 142 13 -14 102 -65 -21 -31 -120 2
2469BK9k9r0J74J77j11q2l0j60J00k43M93j59j51q0J63j72J2R6n0JJ35n2k6j45
$$ 2 31 2 -88 86 263 152 70 40 -120 -20 -263 230 71 -80 -160 3 -169 -157 -61 -111 -110 25 -27 -53 -198
2494a98Q4M6m0J11K04k35J31j82RJ08j66J84j6k14J65J50J46k12o5j37K6K3kJ32
$$ -198 -114 -68 -108 3 207 -28 103 -79 -70 38 -128 56 40 -174 -9 141 287 75 10 -127 -101 -78 -80 52
2518E2p5j5j35%J86Q5j82K25k32l3N03m23Q3J6k10J31N0m4j21K46j53L7K0J07
$$ 52 -23 -38 -173 -173 13 98 -84 141 -91 -124 379 -44 39 55 -155 -24 26 -18 -139 107 -46 -9 11 118
2542A18j32J07k49L31l18P2K7mJ33m5N0P2j71O1J09o1J73l1m32M4K68j05j59J62
$$ 118 -14 93 -156 175 -143 -71 -44 -48 85 40 90 162 -9 52 161 100 273 242 -190 -146 122 17 -142 20
2566B0o5J84L9k61R0J5r4Q3j58J75m7k9Q9j58J39m4r1r9K83j71K6J6j70K41q9
$$ 20 -45 139 178 -83 7 22 -72 11 -147 28 -19 -48 41 -117 22 -22 -113 -212 71 -100 -74 -58 -228 13 -76
2591g6J45L2J15j76k2k6O6M2P5j35j00K35k49n3Q6L7n8J95j36j28K65j15P9P1
$$ -76 69 101 216 40 18 -8 58 100 175 40 -60 175 -74 -127 -41 -4 -62 133 -3 -131 134 19 98 169
2615A69j5j08r7M8J12j86m8J30j75K2J71j81J28j41K61q4L4j34J51m9J4j81K20
$$ 169 154 46 -51 -3 109 -77 -125 5 -170 -148 23 -158 -30 -171 90 6 40 -94 57 8 22 -159 61
2638F1l2K4j81J21r5J7k0J98jk02L05j58M6j42n0J34pj46J04m1J02k25N0Q7K63
$$ 61 29 53 -128 -7 -102 -85 -105 93 92 -110 195 37 83 -59 -109 25 18 -128 -24 -65 37 -188 -138 -51 212
2663B12k45j18p8K78j91K97k89P0J41p9N5JP9m7N4k07J67r3M5j63R3N7l9J04L6
$$ 212 -33 -151 -229 49 -142 155 -134 -64 77 -2 53 54 133 86 140 -67 100 7 52 -111 -18 39 0 104 140
2688A40l73L13n0LQ0j14j84J75j28M09k62j50K16j38K39l10J52J09K5k14qO0p4
$$ 140 -233 80 30 33 113 -1 -185 -10 -138 271 9 -141 75 -63 176 -134 18 127 152 -62 -70 -10 -84
2711h4P2j89J02K53j50n2R7J33k32Ok8l9J5K07j50O0k01J95q7oQ3K62n9j61o0
$$ -84 -12 -201 -99 154 4 -48 49 182 -50 -44 -72 -111 -96 111 -39 21 -180 15 -72 -78 5 267 208 47 -13
2736a3J8o3n4J4J91q0J13m7p5N8k11J41l1J7k0ln4%J02r1L10k98l7Q1J53k55L22
$$ -13 5 -58 -112 -98 93 13 126 79 4 62 -149 -8 -39 -22 -42 -45 -99 -99 3 -88 222 -76 -113 -32 121 -134 188
2763A88m20L41k63K15j62J47m1R0j48K9J19j52l6J0J7j41L06l60L3J45J67P6r4
$$ 188 -232 109 -154 61 -101 46 5 95 -53 -24 95 -57 -93 -83 -66 -207 99 -261 -228 -83 84 160 66
2786F6j11J58j36j7P1J7j03j37L30j80J04k66L70k81J10j07L29k22j20J63o9K0
$$ 66 -45 113 -23 -40 31 48 -55 -192 138 -42 62 -204 166 -115 -5 -112 217 -5 -125 38 -31 -11
2808a1j84K03l4j09K27j14N6Qm6p1j53J40K42q9K29l72J60j76J54j34jJ39j89
$$ -11 -195 8 -26 -135 92 -22 34 42 -4 -75 -228 -88 154 65 294 -78 82 -94 60 -74 -75 64 -125
2831a25K90j08j98K9J02j03J16O7q1n7m5J15K6k3J9L3r7P7j05K8J05k5j69J45
$$ -125 165 57 -141 -112 -10 -113 3 70 -11 -68 -113 2 28 5 24 57 -40 37 -68 -40 65 40 -129 16
2855A6K3K1L6k15L65j10j26P4m8J06j68J1J07n9pm7j63J40l3m1J17K79l07J8j74
$$ 16 39 60 96 -119 246 136 10 84 36 142 -26 -15 92 33 26 -21 -184 -44 -77 -118 -1 278 -29 -11 -185
2880a85K30r5J77r8r8J50k30O6J17n4J97k05O8k14M71l67J32k86J33R8K4j08j31
$$ -185 45 -50 127 29 -69 81 -149 -83 34 -20 177 -28 40 -174 297 -70 62 -224 -91 7 31 -77 -208
2903b08K13k35J81k11K88l3j05K51j48j73k4J79J95j27m4pN5n6nk8l9k8J60k25
$$ -208 5 -230 -49 -260 28 -5 -110 141 -7 -180 -204 -25 170 43 -1 -8 47 -9 -14 -42 -81 -109 51 -174
2927a74K13N0o8n1J00k00J35K0m2J51j72J08j05J2O3P8j93K71j26o4q3L7J06k25
$$ -174 39 89 21 -30 70 -130 5 25 -17 134 -38 70 -35 -23 40 118 -75 196 70 6 -77 -40 66 -159
2951a59J85j46J28j44K01k02M7R8l8O7k30K85k29N7J77K4n0j01j11J49M0k27J45
$$ -159 26 -120 8 -136 65 -137 -90 8 -30 37 -193 92 -137 -80 97 121 71 -30 -141 8 48 -179 -34
2974c4L9m0j79L20R4l39PP9J29j16r3K33J3j14l8k0K3k3K14j25l6j57K15q0K0
$$ -34 5 -35 -214 106 200 -139 -132 -53 76 -40 -133 100 113 -1 -39 -59 -36 -59 155 30 -6 -163 52 -28 -8
2999hj43L71o6j53p6k33L70j52J27r3j24J82O8j2j11J26j92Q9p0k0K39m1q8Q9
$$ -8 -151 220 154 1 -75 -308 62 -90 37 -56 -180 2 70 58 -53 73 -119 -30 -100 -120 119 78 -10 79
3023G9l4P7N1k81j08M14n9j8Oj66P6r6J59k56J16j4oJ90j17L2q7J86J0k48J84
$$ 79 45 122 173 -108 -216 198 139 121 127 -39 37 -59 100 -156 -40 -54 -60 130 13 45 -42 144 154 -94 90
3048I0j56k12K30J42m1j01J02k2j72J3J54L9k5j79K6J42P4j28Q6P4oj22k9j12
$$ 90 -66 -278 -48 94 53 -48 54 32 -140 -127 27 66 41 -138 -112 30 104 -24 62 136 130 8 -21 -133
3072a33L01j81P8j43Q3J43k23P1J24j48J59r9L5J4l2j67J92o8m5J6k03J61j74
$$ -133 168 -13 65 -78 5 148 -75 -4 120 -28 131 32 67 81 49 -118 74 6 -39 -23 -226 -65 -239
3095b39N41l41J4K19k43j27K54o4N2Q3j67J86j37L3O3k16J45j31O5K6J65p7M3
$$ -239 302 -39 -25 194 -49 -176 78 14 66 149 -18 168 31 64 127 -89 56 -75 -10 16 181 104 147
3118A47j00j01Q4j98N1P1Q8k1k7K9R9j06J72o1k44J70r2J17lk7Q8k41J55qJ18
$$ 147 47 -54 30 -168 -117 -46 42 21 -6 23 122 16 188 127 -117 53 -39 78 75 48 136 -105 50 42 160
3143A60j92j61L74j98J39j35m6J13q1K68k24j6n8j8J00n9J75J01N0l36q4J60j56
$$ 160 -32 -193 181 -17 122 -13 -59 54 -27 241 17 1 -57 -75 25 -34 141 242 292 -44 -128 32 -124
3166a24M21m09M26l24j50K8M0J06m3J49k13J26J1q4n1N0lQ0M9j3k92L22O4J34
$$ -124 297 -112 314 -10 -160 -132 -92 14 -29 120 -93 33 44 -40 -91 -41 -44 36 85 72 -220 102 166 300
3190C00j24k87k7R7J64l5k52M4J28j63J12r5J89j10L2J5J7P7Kl04K19m4J37J3
$$ 300 176 -111 -138 -41 123 88 -164 -120 8 -155 -43 -138 51 -59 -27 -12 5 82 84 -220 -1 -45 92 105
3214A05m5J59j78Mk5j76J65r7J84k8l87M51j2l08K0m1M10l34L16r9p2J61l36K59
$$ 105 60 219 41 45 20 -156 9 -88 96 68 -319 132 120 -188 -168 -209 201 -133 183 84 12 173 -163 96
3238I6j21pj51K8K03k01J45j43R0l2j6Q8nM3K55m38J60m8l3K20j63K8M1m1j38
$$ 96 -25 -32 -183 -155 48 -153 -8 -151 -61 -93 -109 -21 -26 17 272 -166 -6 -54 -87 133 -30 -2 39 -2 -140
3263a40K61j26J95k27K4L2N5j85J49N8j40j66L18k21j2N5LJ51k89J94j85K88j19
$$ -140 121 -5 190 -37 -13 19 74 -111 38 96 -44 -210 108 -113 -125 -70 -67 84 -205 -11 -196 92 -27
3286b7J37k25O6J36o4J36k37j7M4L8j05m7R3L8j04L43k25J86j57K7j15J32J40
$$ -27 110 -115 -49 87 23 159 -78 -95 -51 -13 -118 -165 -72 -34 -138 205 -20 166 9 36 -79 53 193
3309A93q3j26J09l0p5J36k73J23l8Q0j00J82k43J75j5j85J33J09P9k85J89r5J43
$$ 193 110 -16 93 63 -12 124 -149 -26 -64 16 -84 98 -145 30 15 -170 -37 72 151 -134 55 -40 103
3332A03r7J05l12J17K19k81Q5K00k7j22Q1j50j08J81p8J32r4Qr3J71j1j67P2Q1
$$ 103 6 111 -201 -84 135 -146 -61 139 112 -10 71 -79 -187 -6 -84 48 -46 -38 -131 40 29 -138 -66 15
3356A5J8K2K93k34j75J15n4j9K58l13J09p3j14K43l11J00J28j2L1K3k63O4Q6j38
$$ 15 33 55 348 114 -61 54 0 -19 239 -74 35 -38 -152 91 -220 -120 8 -4 27 50 -213 -149 -63 -201
3380b01L54l7J47m09j69M92o4k75J4J25J4L2j74J87k15J89j9j30m6K00O2j53K
$$ -201 153 116 263 -146 -315 177 113 -162 -148 -23 -9 23 -151 36 -179 10 -9 -139 -185 15 77 -76 -74
3403g4r2J96N8l10K13m5J72k03j29K87lj72K01j14Q9n9N5q7J32j68K37j59o8L8
$$ -74 -166 30 88 -222 -9 -54 118 -85 -214 73 70 -102 99 -15 74 15 70 -17 115 -53 184 25 -43 -5
3427el1K93k75J57j02j46K37j81J32k42K07j51M6R6k19J24J77k75Q5K61k03J10
$$ -5 -36 257 -18 139 37 -109 128 -53 79 -163 44 -107 -61 35 -184 -60 117 -158 -73 188 -15 95
3449I5k61L11k60O3J01k10P8k22K40l7O8k4J7J71P6P7l32M3J1J63L9j08j00J8
$$ 95 -166 145 -115 -52 49 -161 -83 -305 -65 -102 -34 -58 -41 130 206 283 -49 -6 5 168 207 99 -1 17
3473A7j47J24k8J12r0j3j48K20n3j07J20k3J36j03R5k27L05k22K15k19jJ17p0
$$ 17 -130 -6 -34 78 -12 -25 -173 47 -6 -113 7 -16 120 17 112 -115 190 -32 183 -36 -37 80 10
3496A0K45j97k95K12j15J21O%j24L2J40L2J44N5l05m3J39j17j0J43j51J04J08
$$ 10 255 58 -237 -25 -140 -19 -13 -13 -137 -105 35 67 211 266 -39 -82 57 -60 -70 73 -78 26 134
3519A34l32J99o4J12j8P7O3j97j30J06K44k01N0L0j07Q2J7mj54J6L44M2l89R6
$$ 134 -198 1 -63 49 31 108 171 -26 -156 -50 194 -7 43 73 -34 48 65 61 -93 -77 267 309 -80 16
3543A6P4j08J36l40NK89o6J38J24k63K46j14j21p4O0j06r6K75r3J42J2j3j3l07
$$ 16 90 -18 118 -222 -217 72 6 144 268 5 251 137 16 -58 2 -104 -200 75 -18 124 136 123 110 -197
3567a97L60j41M6Qk57K57j95K20j42m8j0L47j36n8j79K44j12j06J5K25j81R5o3
$$ -197 163 22 68 76 -181 76 -119 101 -41 -89 -99 248 112 54 -125 119 7 -99 -84 141 -40 55 -8
3590hJ14j96J02j80K96L5j75J92l35K89j51k3J93k8k8k12Q6J38k12J07j01J56
$$ -8 106 -90 12 -168 128 163 -12 180 -155 134 -17 -40 153 125 97 -115 -29 109 -103 4 -97 59
3612E9J10j71M0j28R6n1M5J41j10k09J93j01r6K34J86k80pK8J8k8o0K8O1P6j86
$$ 59 169 -2 38 -90 6 -45 0 141 31 -178 15 -86 -182 52 238 -42 -49 -21 -3 -31 -91 -63 -2 74 -112
3637a12K8J70J23m43K69j17O7J7j70L24l59O9k8J2Q5JJ2J33J40k18J45o1j24J12
$$ -112 -84 86 209 -234 35 -82 -15 2 -168 156 -203 -134 -162 -150 -65 -64 -52 81 221 3 148 87 -37 75
3661G5J3j07L7r0M6Q0L7j47k09J35M0M1k1L19j3j95K10m43l4J97Q2k4k0J18q5
$$ 75 88 -19 18 -72 -26 54 91 -56 -265 -130 -90 -49 -70 249 236 41 251 -192 -226 -29 53 29 9 127 42
3686D2j68N3K8N5q9r8K58q6k20J77K57j71m8Oj23P1J63k18L50j97j38p1J95J8
$$ 42 -126 -73 -45 10 -79 -177 81 -5 -225 -48 209 38 -10 -4 -127 -56 107 -111 239 42 -96 -167 28 46
3710D6J36j53rN3R0j62K4K9j5j29J54J63k07j42K5P4j07N6Q3J55Nk69M01o4k76
$$ 46 182 29 20 73 163 1 25 54 39 -90 64 227 20 -122 -97 -23 -130 -74 9 164 169 -100 301 237 -39
3735c9n9K03j10j10J92O4j26j47K96j69P2R0k57J18j4Q0M2K5m8j09J6j19J5L8
$$ -39 -98 105 -5 -115 77 141 15 -132 164 -5 67 157 -100 18 4 84 126 151 103 -6 10 -109 -94 -56
3759e6L3P6j41n2J94r1L5k96L74j95J51N0j09O8L6j54O9P9j32J96o3j47M8n8J38
$$ -56 -23 53 -88 -140 54 -37 -2 -298 76 -119 32 82 -27 41 77 -77 -8 71 -61 135 72 -75 -27 -85 53
3784E3j82K5P7K45j26o1j24K4J41J12j96K15j91K34n5j61k07o3M74k97J48m5n4
$$ 53 -129 -104 -27 218 92 31 -93 -69 72 184 -12 203 12 246 191 30 -177 -240 234 -63 85 40 -14
3807a4j78J82J46n9k24K87K32l62K00m2P2k58J24K5m30M01j75o9P0j24L76Q1k24
$$ -14 -192 -10 136 77 -147 140 372 10 210 168 240 -18 106 131 -299 102 -73 -142 -72 -196 180 261 37
3830C7m9l25J44pM69l7k50l36M6P8P7npo2J71l15N23O8j78J44p5J74k96r5N25
$$ 37 -12 -337 -193 -200 269 232 -18 -354 -308 -230 -153 -158 -165 -227 -56 -371 152 220 42 186 111 285 -11 -106 419
3855D19r9q56R73r75J247r54m5K83K66n18p3M67q87Q94J70m20M95l20P0n97L65
$$ 419 320 -536 437 -538 709 -245 -290 -7 259 -259 -332 135 -752 142 312 -108 387 67 137 -460 -95
3876i5L51K64p05M03j85m17P36m36m38M94q9Q3K41n20L94k74N1QM35j79K70L8
$$ -95 256 520 -185 218 33 -384 352 -84 -522 -28 -117 -34 207 -313 81 -193 -142 -134 301 122 392 430
3898D30p39L95L1m35K89l33J008L8j116K86k7P5n58P46K09o75K39l6N24p36P28
$$ 430 -309 86 117 -318 -29 -362 646 684 -432 -146 -173 -98 -656 90 299 -376 -137 -173 351 -385 343
3919C43q38M12M19j5L10n02K36m65R9k81L1M65q05Q26o55P3M51l91P09r2o95M15
$$ 343 -495 -83 336 321 631 129 365 -100 -1 -282 -251 214 -591 235 -420 -347 104 -287 422 330 -365 50
3941E0p9l6K87j00J88m10o8Q14j448N40Q74j060R8N93r03N5J199m81j13L06J13
$$ 50 -29 -65 222 122 310 -100 -168 646 -802 -262 612 -448 -350 243 -660 -605 594 113 0 306 419
3962D19o67l23J180j032O99m43K48P8O0o21K78K7K07k42n0j65M04L55r43L62N23
$$ 419 -248 -571 609 -423 276 -167 81 159 219 -402 -124 -97 110 -132 -182 -347 57 412 -531 -169 354
3983C54m65J55qK1l64K28L79K61r79J0M72j65n4j74L92m50J062j003q6K76j29
$$ 354 -111 44 36 57 -307 -79 300 561 -418 -408 64 -101 -155 -329 63 -387 675 -328 -414 -138 -267
4004b67P15l69l31M61o00M74j42L68m27K27j28k06K03O26ml84j63m29L93q1p3
$$ -267 448 79 -252 209 -391 83 -59 309 -118 109 -19 -225 -22 604 600 216 53 -376 17 -64 -137
4025a37M99L8q3n54N03l21j65l3K63m25N64k29M1L30k14j29J93k2j68J3K46k58
$$ -137 362 400 317 -237 266 -55 -220 -253 10 -415 149 -80 -39 291 77 -52 141 119 -49 -36 210 -48
4047d8k04M04l00K5n84K81O43K25n87k12J88j37qP17o99r5P45n76NM80o27M4J36
$$ -48 -252 152 -148 -123 -707 -426 217 442 -145 -357 -169 -306 -314 403 -296 -391 354 -222 -217 263 -364 -320 -184
4070a84k22n7K28K18O9L4k63K24J20j73J10q1J0j6j94M95k82k7j09rJ45m2j67
$$ -184 -406 -463 -235 -17 52 86 -177 47 167 -6 104 23 33 17 -177 318 36 9 -100 -109 36 -6 -173
4093a73K24j16l8P4R9M7r5q9nO3k88M38K6q7j42O5J88l21L1K44l53M31j73L0Q2
$$ -173 51 -65 -103 -29 70 117 22 -67 -72 -9 -297 141 167 80 -62 3 191 -130 -99 145 -208 223 50 80 162
4118A62l37K85Pj93Q2q4P5J30k94J16K59n7k93P5M1N2K65l12j32J64k60L87oj20
$$ 162 -175 110 117 -76 6 -78 -3 127 -167 -51 208 151 -142 -67 -26 26 291 -21 -153 11 -249 138 132 12
4142A2p9J33j47P5L0j31RK31n5Rj79n5Q6J85j7J07k14j8j2M5K09j90q5j48J31
$$ 12 -67 66 -81 -6 24 -107 -98 133 78 87 -92 -147 -61 124 107 214 0 -18 -30 15 224 34 -51 -199 -68
4167f8J75j79K11p5j64J44R9k58K56M4j20lJ67j1l96p7L13O1K6j0j66k5oK94O5
$$ -68 107 -72 139 64 -100 44 143 -115 141 185 65 62 229 218 -178 -255 58 119 145 135 -31 -56 -62 232 297
4192B97k65j02K02n8m5j76J12K91l41J43pJ8k51K07K12k59k96N08j96N6k89PL09
$$ 297 32 -70 132 74 29 -147 -35 256 -85 58 51 69 -182 25 237 -22 -318 190 -6 50 -239 -232 77
4215G7j75K06o2O3j56O7P9k36j9K12Oj89K15Q7k28J65k20K08l51K25P5J05qp9
$$ 77 -98 108 46 109 -47 20 99 -137 -156 56 62 -127 88 175 -53 112 -108 100 -251 -26 49 154 146 67
4239F7j49J9P8K36nl06K12j77J99k64j24M2Q1m1O7J21q4J28r4l9P9K85l41j50
$$ 67 -82 -63 15 251 246 -60 152 -25 174 -90 -214 -172 -91 -132 -65 56 -28 100 6 -33 46 331 -10 -160
4263a60L63J0R4r5j81J19j21j23R16j368P6L99J3k18O84o39m34J62J53qJ51M58
$$ -160 203 213 307 212 31 150 29 -94 822 -546 -470 -71 -58 -276 408 -231 -665 -503 -350 -358 -207 251
4285B51k91o10O43J02n1J39m09L16m54N77j41l07Q37o86L76j09n67L11J43k87
$$ 251 -40 -650 -7 95 44 183 -226 90 -364 213 72 -235 602 -84 292 183 -384 -73 70 -217
4305b17J58r3J94j19K05K53p17Q35q13K83K08k56j20j55P50j099J209n75J83n63
$$ -217 -59 -152 42 -77 128 381 -336 499 -314 -31 177 -79 -199 -354 396 -703 506 -69 114 -449
4325d49j2O61n66K48J8L74n61K57k52M23p12O59k10M13m62k06K64N9j76J03J76
$$ -449 -461 200 -366 -118 -100 274 -287 -30 -282 141 -571 88 -122 291 -171 -377 -113 -54 -230 -127 49
4346D9k49j00J17J44L87j034K52L57J12R5k08L62l87J28K48k53J91j85J1l7R8
$$ 49 -200 -300 -183 -39 348 -686 -434 -77 35 130 -78 284 -103 25 273 20 211 26 37 0 98
4367I8p7n0K23l79R4r7R2J1M88k07j98K05m92K15m1J59M8M4k36L21j79J17p3j34
$$ 98 21 -29 194 -185 -91 -188 -96 -85 403 196 -2 203 -289 -74 -115 44 92 136 -100 221 42 159 86 -48
4391d8k0L59r4j78j64RK35P6l16J35J71k10l7R5j32k6K13k62K56o6K78l26P5q0
$$ -48 -68 291 197 19 -145 -136 99 175 -141 -6 165 -45 -82 13 -119 -145 68 -194 62 -4 274 -52 23 -57
4415e7K49k36o3K56q3j02j6K51k11K31j00Q3j33kj85K18kq0q8M1j19K52K4j80
$$ -57 192 -44 -107 149 66 -36 -52 199 -12 219 119 202 69 67 -118 100 98 18 -70 -29 -148 104 128 -52
4439e2j64L88k58J18J38l35N3J63J33L5r3M0j55o3J76j23l9P8m1M5O9j37nr8j27
$$ -52 -216 172 -86 32 170 -165 -112 51 184 219 126 166 11 -52 124 1 -38 40 -1 44 113 -24 -29 -127 -254
4464b54J74J48j23L4j23K29j03J79n7L0k02r8L86r0o0Q3j20J3j34K1m1K37j63
$$ -254 -80 68 -55 -21 -144 85 -18 161 104 134 -68 -166 220 130 70 153 33 46 -88 -67 -108 129 -34
4487c4P8k95J57J06k45K78j06j83L61l99J17K00p0n9J80JMj32J81j08J75l30J92
$$ -34 44 -251 -94 12 -233 45 -61 -244 117 -282 -165 35 -35 -94 86 87 91 -41 140 32 207 -123 69
4510F9k56K80k32m4K63l50k13K54N23n54J4j55M87r0O43j234M84k37P89nJ41l67
$$ 69 -187 93 -139 -183 80 -270 -483 -229 294 -260 -246 -401 86 -4 639 -595 -111 -348 441 436 577 210
4532B10n8j38m36L53M4l65L94j22J03k23L31L4o5l7L7l91K84j1j8M2J04Oj1j61
$$ 210 152 14 -422 -69 -25 -390 4 -118 -15 -238 93 127 62 25 62 -329 -45 -56 -74 -32 72 78 67 -94
4556i4P6Q1j89M10l47J23M9J01n53K73J07j153O18j19R89J57p69L29p03N23j84
$$ -94 -18 63 -126 284 -63 60 109 210 -343 -70 37 -1116 -498 -617 372 529 -240 89 -614 -91 -275
4577b75J91k94L48l06J36q8J55n1L39m16K29Q7n56J152r62k42M78l8L06l12m38
$$ -275 -84 -378 -30 -336 -200 -288 -133 -184 155 -261 -32 55 -501 651 -311 -553 -75 -113 193 -119 -557
4598e57N05J48N1k06K73R8k99o6L42n10J42K71n02N63J08k34k81J74j79m8L99
$$ -557 -52 96 147 -59 214 312 13 -53 289 -221 -79 192 -310 253 361 127 -154 20 -159 -207 192
4619A92k34M33k41j64l41N25K97o15J12n43N74m14K57J51l67R2l85O19J31J56
$$ 192 -42 391 150 -14 -355 170 467 -148 -36 -579 -5 -419 -162 -11 -378 -286 -671 -52 79 235
4639B35n93M19p5M9Q9J37q1m20K87k42J84K00k09q9O6l12O02l10N0m23j04L32
$$ 235 -358 61 -14 35 124 261 180 -240 47 -195 -11 189 -20 -109 -43 -355 247 -63 -13 -436 -540 -208
4661b08M51j145R10N35m81p4j28p3M14J81q28K22n0k39k5L47l70L40K19J7L36
$$ -208 243 -902 8 543 62 -12 -140 -213 201 382 -446 -224 -274 -513 -538 -191 -561 -221 -2 15 351
4682C51l96m69J021n70j28k75K67K61j40N58o32q34J286k47M00m11k90K64K05
$$ 351 -45 -514 507 -63 -191 -466 -199 62 -78 480 -152 -986 300 53 453 42 -248 16 221
4701B21l47o21O78N89p02l20J88M10N63p59j19N68j22j59m61O91q1P7o84K24J87
$$ 221 -126 -747 -69 520 -182 -502 -314 96 659 -100 -219 349 227 68 -393 298 217 294 -390 -166 21
4722B1l51J061o60j78K66j70o41J039n75N15m47l06N76q00R35P4m66k7r70N63
$$ 21 -330 731 71 -107 159 -11 -652 387 -188 327 -120 -426 150 -650 285 359 -107 -134 -1104 -541
4742e41K34M27m3K53q2k70r4J4L06m28L04m9j92n7J76mk01L62l40L2L2J33q3n5
$$ -541 -307 120 77 330 248 -22 -116 -102 204 -224 80 31 -161 -218 -42 -46 -247 115 -225 -193 -161 -28 -111 -166
4766a66k70P31o34r2M49J5J72K81n56r6L01k91m50L64j11L37L81n57K77N1jo54
$$ -166 -436 295 -339 -431 18 33 205 486 -70 -166 135 -156 -606 -242 -353 -16 365 -192 85 136 135 -519
4788e19N91q3j10r3J19j62M56j06j52l1J55rR9L6l3p3p7k3n3K0J45p0J09j84K55
$$ -519 72 -11 -121 -214 -95 -257 199 93 -59 -90 65 56 155 191 158 85 8 -15 -68 -48 97 27 136 -48 207
4813B07l95mO6o5K98n0k21K91j49J01l1k02K34p5L6j91L67j51Q9j58J6j14M30
$$ 207 -188 -192 -126 -191 107 57 -164 127 -22 79 48 -154 80 5 41 -150 217 66 155 -3 13 -101 329
4836C29l52j77J05r8Q9j09L24k67K22k77J14O9j35pK12k05J7l69M50K78l84O78
$$ 329 -23 -200 -95 -193 -104 -213 111 -156 66 -211 -97 -28 -163 -170 42 -163 -146 -515 -65 213 -171 507
4858E07q29J80n4J97L4k51K27Q2k82P73m01k60M26K16r96N65j84l12N35m61N26
$$ 507 -322 -142 -196 1 35 -216 11 93 -189 584 183 -77 349 565 -431 134 -50 -362 173 -288 238
4879B38n72Q3k47J74N15q00Q66J33l00m07J89P47l64p8J45n72N1M32P0n58M89
$$ 238 -334 -251 -498 -324 191 -609 257 390 90 -317 -128 619 255 177 322 -250 -199 233 303 -255 234
4900B34k86R0M18l33M46r78N77P1J90l70m96L71j69r3L40K05l00P2j10K25l06
$$ 234 -52 38 456 123 569 -409 168 239 429 59 -437 -66 -235 -328 12 217 -83 -11 -121 104 -202
4921b02L75k39L23j87J79L3n18P6j28K30J30r3l94L27J83k90J80j05m72K91J45
$$ -202 173 -66 257 70 249 282 -236 -160 -288 -58 72 -21 -415 -88 95 -195 -15 -120 -592 -301 -156
4942a56M74R1l11k3j27k88L55m23j48L92O5j02M93l86J84R2J01o49N6L05K79m66
$$ -156 318 409 98 75 -52 -340 15 -408 -556 -164 -99 -201 292 -94 90 182 283 -366 -310 -5 274 -192
4964a92r5L68N2n62O34k11o3j63m28M67j40O50q91L01K48k52L85J17o33O62J30
$$ -192 -287 81 133 -429 205 -6 -69 -232 -660 -193 -333 317 -574 -273 -25 -277 108 225 -408 254 384
4985C84m70K76L86m18j069O58m1K58O85n11K35o33O59L11l38k84R9L18j166P44
$$ 384 -86 190 576 158 -911 -253 -294 -36 649 138 373 -260 399 710 372 88 187 505 -661 83
5005H3k81L76k54j48K83k55Mk68Q36n55r3P6k16M19j14J6M35r16K26M38j65R7
$$ 83 -198 178 -76 -224 59 -196 -192 -460 376 -179 -272 -196 -412 7 -107 -91 344 -572 -346 92 -73 24
5027B4K22l33mk80K24M63m24j61O4L87k10J56K86o41p3M91o57L62M61l46m32M90
$$ 24 246 -87 -91 -371 -147 316 -108 -269 -205 182 -28 128 414 -227 -300 191 -466 -104 357 11 -421 69
5049F9pj82M2j15R7K81N12m33l49M6l1J1j04K73J06k85K8j62K71n5R1j85p2m1
$$ 69 62 -120 -78 -193 -96 185 697 264 -85 -39 -70 -59 -163 110 216 -69 -41 -203 68 13 104 -81 -153 -194
5073a94J96p9J82r4k13J80J05j81KK16j70l42M21k0o5M8K30k06J31k70M31k41
$$ -194 2 -77 105 11 -202 -22 83 -98 -96 120 -50 -392 29 9 -56 -8 222 16 147 -123 308 67
5095F7r8L29m11k5L03p3J78l52j56L26j4J09l23L20j24L59n60Q5j87J87Q1N62
$$ 67 -31 298 -113 -138 165 92 270 -82 -238 88 74 183 -140 180 56 415 -145 -60 -247 -60 21 583
5117E83n63L1mJ20O6k56l68L35K60r6m70K76p2N7K62k16K78m95K82R0P9j65j60
$$ 583 20 51 47 167 233 -23 -391 -56 204 108 -362 -86 -158 -101 161 -55 223 -272 10 100 179 14 -146
5140a46L3l5L4J93L0r9l7j01JK77k70o3L27M7m43M81k12l20M25m34K47J46l0J28
$$ -146 -113 -148 -114 79 109 10 -27 -128 -127 150 -120 -183 144 191 -252 229 17 -303 122 -312 -65 81 51 179
5164A79O9k72L9J62q4m3j47M3O1L2J2k38Q9J10l8j3K10k23J18kj65j09j4J59K71
$$ 179 248 -24 15 177 93 50 -97 -54 7 39 51 -187 -98 12 -26 -39 171 -52 66 64 -101 -210 -224 -65 206
5189B06r5q6k54P9N36l37L0K43j88J9l3k72L19j28k12K71q7L04k70k4R9k52k2
$$ 206 111 25 -229 -150 386 49 79 322 134 153 120 -152 167 39 -173 98 11 315 45 21 120 -132 -154
5212a54M4J40k37L90r0j63J82o5n0j53N25l29k7K46m80R7J50J35k76O6J26l30
$$ -154 -110 30 -207 183 93 -70 112 47 -3 -156 369 40 13 259 -221 -124 26 161 -115 -49 77 -253
5234b53O8K31j51R3k4O0Q6N4j86m7Q6j07K78k84J13p6J4LM8J52l24K68j33J38
$$ -253 -185 46 -105 -12 -36 24 110 164 -22 -69 17 -90 188 -96 17 -59 -45 -42 6 158 -166 102 -31 107
5258A07o1j11K43o1j17k7j13M07k17M1k20K49k60J20jJ5M9L37n81R4M9J59J41
$$ 107 46 -65 178 117 0 -27 -140 267 50 91 -129 120 -140 -20 -21 -6 43 380 -201 -107 -58 101 242
5281B42n05L87j68r7J3l11O95j97l89K86m56N01l25O89m27l84K92k00J58L67m80
$$ 242 -263 124 -44 -141 -128 -439 256 59 -330 -44 -500 1 -324 365 -62 -446 -154 -354 -196 171 -309
5302c09n09N7O97J98k69j7O78m63k65k88L82Q19q74j48K42O10k33k26l53m7j92
$$ -309 -818 -761 -64 134 -135 -152 526 63 -202 -490 -108 711 -163 -311 -69 541 308 82 -271 -318 -510
5323e10L69J64M65m33J26J72m95Q8r9l1m7O05P0o74N44K03j90n20M99m44M61l05
$$ -510 -141 23 488 55 181 353 -142 -54 -153 -184 -231 374 444 -230 314 517 327 -193 306 -138 323 18
5345A8o2K74p73J088j010R91p65L29l16O53m53n16N57n76M19m22N24J50J31j36
$$ 18 -44 230 -543 545 -465 526 -239 90 -226 427 -26 -542 15 -561 -142 -564 -40 110 241 105
5365A05J22l44M48j26p18P28j52k03L83l66L09%J68l10q1o88P52Q63j087J012
$$ 105 227 -117 331 205 -513 215 63 -140 243 -123 186 186 354 44 -37 -725 27 890 -197 815
5385H15n26k61m02m25P09O26q15M24n82J41JJ91ql12M15k51r7R5N4K55l47L08
$$ 815 289 28 -374 -799 -90 536 -279 145 -437 -296 -295 -104 -112 -424 -9 -260 -357 -262 -208 47 -300 8
5407Hj48P1L06n49K10P3l78N26J38j99k41K69j22l70O66m65J4J74M69r36N27l03
$$ 8 -140 -69 237 -312 -102 -29 -407 119 257 58 -183 86 -36 -406 260 -205 -191 -17 452 -484 43 -260
5429b60M7J4L77l63k19N07J66o37K38RK83R0l97j29L72j15m52O26K77m89N8j86
$$ -260 -213 -199 178 -185 -404 103 269 -368 -130 -121 162 252 -145 -274 98 -17 -469 157 434 -55 3 -183
5451a83R6J48J5Nk00L50N7o02m01P23m91N43K46m17m01N4Q83l97J16k72M00k0
$$ -183 -87 61 76 81 -119 231 288 -314 -715 8 -483 60 306 -111 -512 -458 425 28 144 -128 272 252
5473B52j50K25m34R26n82l9L09j082N97k06J82L12k88M97p58N72N9m53J71n0m8
$$ 252 102 327 -107 819 237 198 507 -575 22 -184 -2 310 22 519 -239 333 392 -61 110 60 12
5494A2J07l04M62J29n19P77q65J83M90j81k83K48L84n25o11L57N94l65k61J65
$$ 12 119 -185 277 406 -113 664 -201 -18 472 291 8 256 640 115 -496 -139 455 90 -171 -6
5514fj45M23m4m90m44J065N48p40K1J4j05M50l44L81k67P4m14q9n12O21O35n04
$$ -6 -151 272 228 -262 -706 359 907 167 188 202 97 547 203 584 317 391 -23 -112 -624 -3 632 128
5536A28j33K78k93J06l86N8L27O29o69L9j24M2J32J9K71q32N84L0J58r20N45L6
$$ 128 -5 273 -20 86 -300 -242 85 714 45 84 -40 2 134 153 424 -408 176 206 364 -556 -11 25
5558B5j28L38k39o4j43Q27o90Q4k44J14M84L0k51n4l1J26o9k60L98q11J103q75
$$ 25 -103 235 -4 -68 -211 616 -74 10 -234 -120 364 394 143 89 58 184 115 -145 253 -558 545 -330
5580c30N20M5n14J34L03J4L14k24J22N1j131O12n78J564q63o2j81M31n06J57J90
$$ -330 190 235 -279 -145 158 172 486 262 384 435 -696 -84 -662 902 39 -23 -204 227 -279 -122 68
5601F8K24k18k2j08J85%l69k4K99m2L53l2k19J11l12K01M34n30K43n74N22j97
$$ 68 292 74 52 -56 129 129 -240 -264 35 -7 346 314 95 206 -106 95 529 -1 242 -332 190 -7
5623gj02J26o8O12m65m51J06o0R80m86J51j97K02k54k71j70j36N29L64J2n64j11
$$ -7 -109 17 -51 561 96 -355 -249 -309 671 185 336 139 341 87 -184 -354 -490 39 403 415 -149 -260
5645b60K10k46K74j85k80N92j55n27J121l43J85p50J61O62n21L7K72M4l02l62
$$ -260 -50 -296 -22 -207 -487 105 -50 -577 544 201 386 -364 -203 459 -62 -25 247 291 -11 -373
5665c73M91J96m06J42j06J10n31L72M49k59ol11J81n51R48r3p51N46N10o61n89
$$ -373 118 314 -92 50 -56 54 -477 -105 344 85 79 -232 -51 -602 346 253 -498 48 558 -103 -692
5686f92L30Q54K56l59n49K28K00j060j23J155j02k03K69J91n92k78M83j3j28K53
$$ -692 -362 492 748 389 -160 68 268 -792 -915 240 138 -65 204 395 -197 -475 8 -5 -133 120
5706A20j24N24k93J44r5k20m56J22K98J12l08K70p7l5j61P80j428J181r20K07
$$ 120 -4 520 227 371 276 56 -400 -278 20 132 -176 94 17 -18 -179 601 -827 354 -566 -359
5726c59K72l05J62L39j01j90J5q6L31j84K72m31L72m13O59j42k56j06L30m79L34
$$ -359 -87 -392 -230 109 8 -182 -167 -253 78 -106 166 -265 107 -306 353 211 -45 -151 179 -300 34
5747C4k73J93q3O9j8n84O14j12L23r7m83O42m12L5k59N8M80k37K39j43Q2J82n87
$$ 34 -239 -46 -129 -60 -78 -662 -48 -160 163 66 -417 225 -187 -152 -411 -353 127 -110 129 -14 68 250 -337
5770c37m7L1M83k24L35m85N35r1j1k46K98l98k2K00k30J74l73N06l50J53k56M51
$$ -337 -384 -353 130 -94 241 -244 291 200 189 -57 241 -157 -179 21 -209 -35 -408 98 -252 -99 -355 96
5792I6Q3j81n28L20O10r7o11j46L98K69o20Q23j86k19O94j064L87N8l29l99Q2
$$ 96 179 -2 -530 -210 400 303 -308 -454 -56 213 -407 416 230 11 705 -359 28 86 -243 -642 -560
5813e60N65po30O40r0m10M88P0j71l3M0lJ86k6p0q9j04k44L47N14m67N13j163
$$ -560 5 -2 -632 8 -82 -492 -4 66 -105 -138 -98 -101 85 59 -11 -100 -204 -448 -101 413 -54 459 -704
5836g04M11N66J47l15j2m16J19K65K9J78k60O3j25jJ82k57j43K22rP0j65N60j41
$$ -704 -293 273 420 105 93 -323 -204 61 90 268 8 71 -54 -55 127 -130 -273 -51 -60 10 -155 405 264
5859B64j70k03J18J67l44K55K04m78K69K04q5l72M67j91j09L17k36j38K65N3k23
$$ 264 94 -109 9 176 -168 87 291 -187 82 286 201 -171 296 105 -4 313 77 -61 204 257 34
5880C4l76L56j36L06r54Q70j45j5L30l89J6k70P7k20N08q4L62l2j54l01J85l81
$$ 34 -342 14 -122 184 -770 100 -45 -60 270 -119 -103 -373 -296 -516 -8 -92 270 238 84 -217 -32 -413
5902d13K2Q86r61m3K79N29Q0m14K16l76Q59n1k51n7k85j71P21n54L5J37l14J24
$$ -413 -391 495 -466 -509 -230 299 379 -35 181 -195 664 613 362 305 20 -151 570 16 51 188 -126 -2
5924bN06n16P74q85J91N94k31j25p2J63n9n69m98N00j85K93K97p41O93N51l13
$$ -2 504 -12 762 -123 68 662 431 306 234 397 338 -231 -729 -229 -414 -121 176 -565 128 679 366
5945C66m78j81J66J78m83O54k66M6N63r87N06J74l83P10n72M36n63j30l3K3K63
$$ 366 -112 -293 -127 51 -432 222 -44 2 565 -422 84 258 -125 585 13 449 -114 -244 -277 -254 9
5966Il01L74k86K28j80K90J48k12J61q2k39K61O4j4p0k99M97n74J15k39n3R9J40
$$ 9 -292 82 -204 24 -156 134 282 70 231 149 -90 171 235 221 151 -148 349 -225 -110 -349 -402 -303 -163
5989a63J63J48n72P55r9l57l83K36L94J02l5J27p7j37k12K80m3j58j88L16p8k7
$$ -163 0 148 -424 331 232 -125 -508 -272 122 224 189 316 239 102 -110 170 127 -31 -219 97 19 -8
6011hO5L69o49M64r3k94M60J17m53mK41k16o8K78l0l03L58q7L03K09j34p24O49
$$ -8 57 426 -223 241 148 -146 314 431 -22 -26 215 -1 -69 209 179 -124 234 147 450 659 525 -199 450
6034D50k6q27J165l19o63k31K98N65n70k63R00k46J40k1k64q9n4m75P27k5K22
$$ 450 424 -403 762 443 -220 -451 -153 412 -158 -421 479 233 373 352 88 -1 -55 -530 197 172 394
6055C94j59k81Q44j186NM07k66L42J48q87N62P9m41Q39K27o62N55K34j247K03
$$ 394 235 -46 798 -388 -383 24 -242 100 248 -639 -77 2 -439 400 627 -35 520 754 -493 -290
6075b90l99L81M98k89M82m88K74k12j34j15Q50j59j47o06l5Q5J23JL70n18R34
$$ -290 -689 -308 190 -99 383 -105 169 -43 -177 -292 558 399 252 -354 -389 -304 -181 -180 190 -328 606
6096F06n72K55o12J26M51O3P6o36L20L78n21k96L88JL6l47j22K7M52l96l45N44
$$ 606 34 289 -323 -197 254 317 393 -243 77 455 -66 -362 26 27 63 -284 -406 -379 73 -323 -668 -124
6118a24n5K08L35k66L9J10k38N34n75J44l53k20O21m88O17m5o6l38K28m96O28
$$ -124 -179 29 364 98 137 247 9 543 -32 112 -241 -461 160 -328 289 244 178 -160 68 -428 200
6139B00j35L69p10q8J00J82K3K43k15N8M2Mk19j26K25j21K03m97N45k39K52p4
$$ 200 65 434 -276 -364 -264 -82 -59 184 -31 27 69 73 -146 -272 -47 -168 35 -462 83 -156 96 22
6161B2m57P48K4m61N88p01M14l77n1j59Q06m26J07r8l13M50J84J05k3m58k10j24
$$ 22 -435 313 337 -124 464 -237 177 -200 -251 -410 396 -30 77 -21 -334 116 300 405 382 -76 -286 -410
6183d10M25L2J18M7k49m3m88N94j11L36m48M85l49K00m76K80M70m54j75j87O47
$$ -410 15 47 165 212 -37 -80 -568 26 -85 251 -197 288 -61 139 -337 -57 413 -41 -216 -403 244
6204B44M1K49o30K93L5l5k80J67k56J98p3N9J73K69o75K18r1J60k45K04k81J43
$$ 244 285 534 -96 197 232 197 -83 84 -172 26 -47 12 185 454 -221 -3 -94 66 -179 25 -256 -113
6226a13K88j0M5j1k96J27Q9R7l52j5J34kJ46Qj78L5n8j10J92Q9J08j56q2k3k5
$$ -113 175 165 210 199 -97 30 119 216 -136 -151 -17 -19 127 135 -43 -8 -66 -176 16 105 213 57 -25 -48 -73
6251g3J39K36j99k18K76k60Q6j24L43l26n5RQ4j10J92n0J19Q1j01j54j38J98l9
$$ -73 66 302 103 -115 161 -99 -13 -137 206 -120 -175 -166 -82 -192 0 -50 69 150 49 -105 -243 -45 -84
6274h4OM65n25l1J39l9j80M76l75L54l85O1Q7J44o9K9o9q2j24L73q6r4Q7k93L87
$$ -84 -78 387 -138 -169 -30 -69 -249 227 -148 206 -179 -118 -31 113 44 73 4 -78 -202 171 85 -9 78 -215 172
6299A72k59K08j72K39j16k63K14J15l7j18n6L95n74K46N9m10K50K0R1j06K05k95
$$ 172 -87 121 -51 188 72 -191 23 138 101 -17 -73 322 -252 -6 53 -357 -107 -87 4 -102 103 -192
6321a92J24J54k84M26l40L01n02L34L43m67l53N46N5k47j95J58K50j76K42J24
$$ -192 -68 86 -198 228 -112 189 -313 21 364 -103 -456 90 145 -102 -297 -139 111 -65 177 301
6341C01j88K4k28K26k83J66j6n6L2J25p8J11j67n6N0n4j8L29m97L00nRL2m5Oj20
$$ 301 113 137 -91 135 -148 18 2 -54 -22 103 25 136 -31 -87 -37 -91 -109 220 -277 23 18 27 59 14 20 -100
6367a00J29j62J91k47L4J72N1j43p1J22L2K08k17j1O3R6m9n5Q8j20O8k68O0J76
$$ -100 29 -133 58 -189 -155 17 68 -75 -146 -24 8 216 -1 -12 51 147 98 43 131 11 79 -189 -129 47
6391D7L8q5Q8k36R7r4L18r5j63O3R1j97j9jr6J15L38k07j11j6J77J7p6r3K67n2
$$ 47 85 0 88 -148 -51 -145 173 78 -85 -22 69 -128 -147 -148 -244 -129 209 2 -109 -125 52 69 -7 -100 167 115
6417A15j26n7r0K80k54%J30k55O7l4J48o7J84Pj29k54L91m9N5k20N0M9L1Q7j12
$$ 115 -11 -68 -158 122 -132 -132 -2 -257 -190 -224 -76 -143 41 48 -81 -335 56 7 62 -158 -108 -59 -28 59 -53
6442e3K9P5r6K1K70l68J62k06K01J34j09p4J86j38P4k49J39m3m3J43J05j13rk06
$$ -53 -24 51 -45 -24 246 -122 40 -166 35 169 60 -14 172 34 108 -141 -2 -45 -88 55 160 47 38 -168
6466a68K66j14mK4r4K03l08J2l53L10N24j65m15L12l84L80O0n53j12K21qK8R12
$$ -168 98 -16 -20 4 -90 113 -195 -183 -536 -226 298 133 -282 30 -354 26 86 -467 -579 -358 -366 -338 574
6489E74o17o7j08K9M49q12K07M21j26k49M54j84Kq7J31k85L87j25k95M79j17p1
$$ 574 -43 -110 -218 -189 260 -552 -345 76 -50 -299 155 -29 -27 -114 17 -268 119 -6 -301 178 61 -10
6511a0k64L80p9n2Q2l7o9K09j6p2L5l33J72K53m62R9j7L59k85L5k52K90J8K7j26
$$ -10 -274 106 27 -25 57 20 -49 160 144 72 107 -226 -54 199 -263 -164 -181 178 -107 -72 -324 -34 -16 11 -115
6536a15J73P0l42Q8L8J31k50P4J6K70N4k18j53J50K50j20j90K18k56K29j00K1
$$ -115 58 128 -214 -126 -88 43 -207 -133 -117 153 207 -11 -164 -14 236 116 -74 144 -112 117 17 38
6558C8k67J96l6K27k10p6J22l02K61r7J53J36m50O27n32K63k8n3o4L89k43k06
$$ 38 -229 -33 -69 158 -52 -128 -6 -308 -47 -144 9 145 -305 322 -210 53 25 -28 -92 297 54 -152
6580a52K42J20k14j6N3o7N4k45L25j91L44l24M8k02J70J20o9J86q4J0j41R9j34
$$ -152 90 210 -4 -20 33 -34 20 -225 100 -91 253 -71 -23 -225 -55 65 -4 182 98 108 -33 66 -68
6603f8K48l17R0L9k71L61n0j14L06m97L30r1O6j33j32K55J35j39k12kJ25o5K16
$$ -68 180 -137 -47 -8 -279 82 32 -82 224 -273 57 -34 32 -101 -233 22 157 18 -194 -196 -71 -136 80
6626H0m5j59m3K70p1P1j92RJ38j47J53Jo5k9Q4R1P0l69K45j33L7k15L31j05p1
$$ 80 35 -124 -167 103 32 103 -89 -80 58 -89 64 65 0 -29 55 146 216 -153 92 -41 -4 -219 112 7 -64
6651f4J82O5l82K28q5K18j47r5K6K7R8j54J39Q1r2Q9k47J79M1k64Q0O0k05K01
$$ -64 118 183 -199 29 -56 162 15 -80 -54 -27 71 -83 56 137 45 134 -113 66 107 -157 -77 -17 -222 -21
6675b1rN0j23J42J41M1k13k61K14K66m74O6J08J93q9k9j28L36k94J43K9M8P7m16
$$ -21 -30 20 -103 39 180 221 8 -253 -39 227 -247 -181 -73 120 31 2 -126 210 -84 59 88 136 213 -203
6699b03J95j05J62j25J68k43K45M4j17p8J37k20J11J00m1m29L02J93l39L60j50
$$ -203 -8 -113 49 -76 92 -151 94 138 21 -57 80 -140 -29 71 30 -399 -97 96 -243 117 -33
6720c3j35K44j7j51j10J54K05k72K04j67M9J60j81K10k35jM6KK4P8J34k56j17
$$ -33 -168 76 59 -92 -202 -48 157 -115 89 -78 -29 131 -50 160 -75 -76 -30 -28 -4 74 208 -48 -165
6743a65J83O2n3J3J72j10j62R2j71Q6K91l71J04J6J9L3l3L0O3j31J10L5Q0j96
$$ -165 18 80 27 40 212 102 -60 32 -139 -53 238 -133 -29 -13 6 39 6 36 99 -32 78 113 193 -3
6767cj49J62j00r7N1p9J76l09L49l0j06L99N2o59M68k67L82k81k81J70L58ok65
$$ -3 -152 10 -90 -187 -136 -215 -39 -348 1 -29 -135 264 316 -343 125 -142 240 -41 -322 -152 206 200 -65
6790f5q6m9r6M19l69K41k47J11K39J78l71J09L73r89K61J076j249K66M73r78O68
$$ -65 -151 -200 -296 123 -246 -5 -252 -141 98 276 -95 14 387 -602 -341 735 -514 -248 225 -753 -85
6811h5J02L28j44%l11J75l39j73l1M50j52K00J39l36R41p50J03n9L85j008L78
$$ -85 17 345 201 201 -110 65 -274 -447 -478 -28 -180 20 159 -177 764 14 117 58 443 -565 -187
6832a87K24k19K64l41L38m4N32n00l2Q1m06N6L79l00J23M79L1m70o7k16k25N92
$$ -187 37 -182 82 -259 79 35 567 67 35 116 -290 -234 145 -155 -32 447 478 8 -59 -275 -500 92
6854I2k5M5M41q36j4M78l48M15n09L47n79L86K92j17k55M80k77J33j34j96k18
$$ 92 67 112 553 -283 -297 181 -167 248 -261 86 -493 -107 185 68 -187 293 16 149 15 -181 -399
6875c99L08j80O74l30q00O79n85Q99n19l97L82jJ13k05K68K16m38K68l16O89k53
$$ -399 -91 -271 403 73 -727 -48 -633 266 -253 -650 -268 -269 -156 -361 -93 123 -315 -47 -363 326 73
6896G3k89K79K31n80M14J44n15K57p77K73O42k46M6O3J38k04M26J24l37k1K81
$$ 73 -216 63 294 -286 128 272 -243 14 -763 -490 152 -94 -48 15 153 -51 375 499 162 141 422
6917D22n11L46m54j4O8jn9L28o72M6M79k4K55l47L94p1j86k26K60K86o67N94p38
$$ 422 -89 257 -197 -211 -143 -144 -203 125 -547 -501 -22 -46 209 -138 256 185 -1 -227 33 319 -348 246 -492
6940d92N76K20k24n0N70p19n88P52n14L1M24O21m55p78J16N19J40m92N49k12L66
$$ -492 84 304 80 30 600 -119 -707 45 -469 -438 -14 607 152 -626 -510 9 149 -343 206 -6 360
6961C60r50R85J75l46m72pL85P7J74m46p42N67N21M25o49R7m33j10O60J67q3l06
$$ 360 -590 395 570 224 -248 -255 130 207 381 -65 -807 -240 281 706 57 154 -279 -389 271 438 355 49
6983D9m3L26q01M39o5L01j40K36m61M0L05n18M87M2m21P14q35K54L7M15m20J02
$$ 49 6 332 -469 -30 -95 206 66 302 -159 -119 186 -332 155 197 -224 490 -345 -91 -54 361 -59 43
7005D3l75O01n14N4j68J42j17L06K92l59k1k05j6M06l24P9M73k27j03K01Q4l60
$$ 43 -332 269 -245 -191 -359 -217 -334 -28 264 -95 -116 -321 -337 69 -255 -176 297 70 -33 168 252 -108
7027a08K23l02L84l75j73M35j47q5Q6l79j60O95k05k26N13n26K30M19p55P59j27
$$ -108 115 -187 197 -178 -351 84 -63 -148 -62 -441 -601 94 -111 -337 176 -350 -120 299 -456 303 176
7048A76n83Q15j21l25j6l00N42j60R9l34J67K72J57o17r2K6J18n7o7N5M41j60
$$ 176 -407 408 287 -38 -54 -354 188 28 127 -207 -40 232 389 -228 -320 -294 -176 -233 -300 -245 196 36
7070C6K22k14j58L03j24Q3j22j80L46j93k3j27J76knj19K19j67N3J00p5oP2q2
$$ 36 258 44 -114 189 65 148 26 -154 192 -1 -24 -151 25 23 18 -101 118 -49 4 104 29 23 95 13
7094A3o4j7j26J15K33j11J25k42j77J51ml5O91m75j01J6j25J93k35J42L8J11m9
$$ 13 -51 -68 -194 -79 154 43 168 -74 -251 -100 -104 -139 552 77 -24 -8 -133 60 -175 -33 5 116 67
7117F7m45N03N2k92k9L29j96J3K85j71o8nJ27j28J74k78K69k20k32O5L48k52P3
$$ 67 -378 125 177 -115 -144 185 -11 2 287 116 48 43 170 42 216 -62 207 -13 -245 -180 168 -84 -11
7140a1K54k57J10k63L9o0K2o2K55j97k30P25p51M34j39M51m06L34m86N39o25K64
$$ -11 243 -14 96 -167 -128 -188 -166 -228 27 -170 -400 325 -426 8 -131 320 -86 248 -238 301 -324 -60
7162f0o0k53O25j42k10o6lM83n70L14j32J39J54m03jr4J41K01j58m8K27n2K21
$$ -60 -120 -373 252 110 -100 -166 -169 314 -256 58 -74 65 219 -184 -185 -279 -138 63 -95 -143 84 32 253
7185B53K5p17J162q30j30L17K50J7q3p26j93M40o81J258k38m48K82J04l56M60
$$ 253 278 -439 723 -107 -237 80 330 347 264 -462 -655 -215 -896 362 124 -324 -42 62 -294 166
7205A66m05O48m08R2n6L23k61o39L92q7O18q30K09M77o33j9K67j09N32ll98j86
$$ 166 -239 409 1 93 37 360 99 -540 -148 -235 383 -447 -238 239 -394 -413 -146 -255 277 274 -124 -310
7227c10M4Q9K20K7n51N32K30m84O30m81J90J06j68m34K30P8j89p4M48L2J92m84
$$ -310 -266 -177 43 70 -481 51 281 -203 427 -54 136 242 74 -360 -130 -52 -241 -315 133 165 357 -127
7249a27K6M42k70J13l12J37j72J13k51P86K49r92R55r63P64n28j82m0k62K41L96
$$ -127 -101 341 71 184 -128 9 -163 -50 -301 485 734 -258 697 -266 498 -30 -212 -252 -514 -273 123
7270A23k48m07Q13m40K64j14J05k73J99j46L66o0N5n09J74K53l4l06J39L47m88
$$ 123 -125 -532 281 -159 105 -9 96 -177 22 -124 242 182 237 -272 -98 155 121 -185 -46 301 -187
7291a87P61j091J37L89M9J14k79J43j67K16k54o6N33k66L01k37l28K83n3l91J57
$$ -187 574 -517 -380 9 58 172 -107 36 -131 85 -169 -235 298 32 333 96 -232 51 -2 -393 -236
7312b36K77oj68k78L31l4M6j03l7P9j05K73j47J91k77K01j02K25j96J8j4K22k87
$$ -236 41 35 -133 -411 -80 -114 -68 -171 -208 -129 -234 39 -108 83 -194 7 -95 130 -66 -48 -62 160 -127
7335a27K57k68q1M45l25M7J93l86R6J62M14p41L44L83q52M43n9J88K67J00n63
$$ -127 130 -138 -219 226 -99 -52 141 -245 -149 13 427 -314 30 413 -439 4 -55 133 400 500 -63
7356f3M34k32j39K4M2J25l54Q6M8j11K83K63l09J30r2j90J06L09p20N19K01n37
$$ -63 371 139 0 24 66 191 -163 -77 -29 -140 143 406 97 227 135 -55 51 360 -360 159 360 -177
7378a77o9M11Q7m04J76O0j7rJ69m02J17K8K3J7Q0k02J55o8M6M1o0J9j78K39k34
$$ -177 -246 165 252 -152 24 84 67 58 227 -175 -58 -30 -7 10 90 -112 43 -25 21 62 2 21 -157 82 -152
7403a52J86Q1k48K8j24K94j07J53j26q0m1J71o2J9j6J01q5j2q5K2J8j2J58n7L3
$$ -152 34 115 -133 -105 -229 65 -42 111 -15 -95 -136 35 -27 -8 -24 77 -8 -20 -105 -83 -65 -77 81 24 57
7428E7M1j24J13l6p2J92k27K77j94q3j10N6J56L5N2j3O1j37M3j12J09l46J94P0
$$ 57 98 -26 87 51 -21 171 -56 221 27 -56 -166 -110 46 81 133 120 181 44 87 -25 84 -262 -68 2
7452Bk53M48j74j16Q6Q5m2O7k84J58l1j14L0K90k16j03J02j47L02kk14J80J54
$$ 2 -251 197 23 -93 -7 78 36 103 -181 -23 -54 -168 -138 152 -64 -167 -65 -212 90 88 -126 54 208
7475B08k08J16j00L3J72Qk87J71q2m2J54q1j71J57j81M7J10p1Q0K3N7j60K54l14
$$ 208 0 116 16 49 221 229 -58 113 31 -11 143 62 -109 48 -133 -86 24 -47 33 56 113 -47 207 -107
7499a07m9J97J16l1k66J58j26J59L9j73O1J41q7n2j04Q6J52m2m3Mm9j21K07N2
$$ -107 -156 41 157 126 -140 18 -108 51 90 -83 -22 119 32 -20 -124 -38 114 72 29 33 -16 -137 70 122
7523A22k20q2J77O3j69K52j94J08m7k70K76O6k41J94%K5m7%Q4j31J01p1j06J50
$$ 122 -98 -180 -3 60 -109 143 -51 57 10 -260 16 82 -159 35 35 60 13 13 97 -34 67 -4 -110 40
7547D0l2Kj03K0Q6R4j09j12L8K21n9j05J66J27j25k8k00P2j78J12K02j85p2m5
$$ 40 8 10 -93 -73 13 107 -2 -114 -76 145 86 -19 147 274 149 121 -79 -7 -185 -73 129 -56 -128 -173
7571a73K12l0qp5R3q0L9R0j61J54l60L13j14J96O6m8k46j65K35J1M4j3l8J6O9
$$ -173 39 9 1 -74 19 -61 -22 68 -93 61 -299 14 -100 96 162 114 -132 -297 -62 -51 -7 -20 -58 -42 27
7596B7P1r9J05j92J70j96J45jk9Jk3MN9nNQ6l6j26p8K54n9j91N0o2J72J23j49
$$ 27 98 -1 104 -88 82 -114 31 30 1 2 -21 -17 42 37 42 128 92 -34 -112 142 83 -108 -58 -120 52 175 26
7623B6j89J71J62k56M3Q9j54L1j25K81O8k32N9n9L28l86L73k39q0K87l15L36j96
$$ 26 -163 8 170 -86 -43 46 -108 -77 -202 79 147 -85 -26 -85 243 -143 230 -9 -89 198 -117 219 23
7646B3m4kR8q4J20q9O5l4k1M0nq6K33l49Q1J18l41K60J0J37r7r9J74j01j52J02
$$ 23 -21 -23 75 -9 111 22 87 53 32 72 67 -19 214 -135 -54 64 -277 -17 -7 130 33 -66 108 7 -145 -43
7672d3K13o3J22l50nL27k45o8j50O4K21N1j90NQ5n1P3J78m2Q5k13K39j90j10J85
$$ -43 170 107 229 -121 -126 201 -44 -112 -262 -198 23 74 -116 -111 -26 -77 -4 174 132 217 4 243 53 -57 128
7697A28l16L83j56Q4L2k80K03j14l5M2p0J2J26j24j14M36j24P0j81L2Q3j14l22
$$ 128 -188 195 39 123 155 -125 78 -36 -71 -29 -99 -87 39 -85 -199 237 113 183 2 34 117 3 -319
7720c19K91R8j27k64L09k41J29N9J65j16N4o6O9q3j78K60j80j55K28M0L9j05K25
$$ -319 -28 70 -57 -321 -12 -253 -124 -65 100 -16 38 -28 41 -42 -220 40 -140 -295 -67 -27 12 -93 132
7743A32j76j53L64k14mK28j53J35k28R1Q2o6J45l14Q4j8n8J24j04J55k0J13k73
$$ 132 -44 -197 167 -47 -51 177 24 159 -69 22 104 38 183 -131 -47 -65 -123 1 -103 52 32 145 -128
7766a28K40r4j24L26l50J64P4j4j32p7K81r2j69K28j72R6N7j39QN5ok07P6J95
$$ -128 112 18 -106 220 -130 34 108 94 -38 -115 166 74 -95 133 -39 57 114 -25 -17 38 32 -175 -99 96
7790I6L21m71o0j77J67j99N22k89J30N6k02R2k0J60j52K07r6k7J34m04K44p1q2
$$ 96 417 -54 -114 -291 -124 -323 199 -90 40 96 -106 -14 -34 126 -26 181 85 58 192 -212 32 -39 -121
7813a21J77k56J69n7M2j23J08R2j19J51j7o4N6R0k90N4Q1j49J2J76L0j77L4K13
$$ -121 56 -200 -31 -88 -46 -169 -61 31 -88 63 46 -18 38 128 -162 -108 -27 -176 -164 12 42 -135 -101 112
7837A12p7Jj37j31K56lj15m8J47m2lK3j6J74K9Ql84M7K26l8j68J04J22Q3r8J55
$$ 112 35 36 -101 -232 24 21 -94 -142 5 -37 -40 -17 -33 141 170 178 -206 -159 67 29 -139 -35 87 170 72 227
7863B27k04j01J85l65K23k2j7k28L16j02J77j09j8J45J10l65J29j55J17J16Jj07
$$ 227 23 -78 107 -258 -35 -57 -74 -302 14 -88 89 -20 -38 107 217 -148 -19 -174 -57 59 60 -47
7885d7J03j86M07m68L25j58j75M3J23J55k9j28l6L4k4p9L55m7L1k06k44K66%L
$$ -47 56 -130 277 -191 134 -24 -199 -156 -33 122 93 -35 -71 -37 -61 -140 215 168 199 -7 -251 15 15 18
7909A8P0j92K97k23K55j60kq7j34K26n3K21l29j7P1K14k25RN5J39j28m8M4j16
$$ 18 88 -104 193 -30 225 65 63 -24 -158 68 15 236 -93 -110 -39 175 -50 -41 14 153 25 -23 21 -95
7933i5J76J06n7j20k05R7Q3J47O2k38J09r5J23k39L6RL9M8r4L2J71J01j23jj74
$$ -95 81 187 130 10 -195 -98 -15 132 194 -44 65 -30 93 -146 -110 -101 -62 -14 -108 -76 95 196 73 72 -102
7958a02j26J78J31l9nq0O1p8j1M6l7R1J06p8J28j6j58j47Q4LL6l5J5N8Q6k43K03
$$ -102 -228 -50 81 42 37 -43 18 -60 -71 -25 -62 29 135 57 185 169 11 -136 -52 -49 -13 -48 -33 25 111 -132 71
7985G1K15k36L9k26J97M8J8j44J14m2Rj73P6kk9o7J63q6J09j05J57J46m16J2K96
$$ 71 286 50 89 -137 60 108 126 -18 96 54 63 -110 -34 -36 -65 -132 31 -55 54 -51 106 252 -164 -152 144
8010A44l30K16K5j80K48o2J18k58M6K5J2k1M7j12L00j54l7j15J43j80J8N3M58
$$ 144 -186 30 55 -125 123 61 179 -79 -33 -8 4 -17 30 -82 218 64 27 -88 55 -125 -107 -54 404
8033D04m99Q5p6K25M4j74M4K92j71r5j0n7N2JM42k14k28k15M58l15k47L25N1q2
$$ 404 -95 -10 -86 139 183 9 53 345 174 79 69 12 64 65 507 293 65 -150 308 -7 -254 71 122 40
8057D0m02N69l54j22K49J26m9k63J76R6k44L79j12l86K66K49m10K43l55K69P7
$$ 40 -362 207 -147 -269 -20 106 57 -206 -30 66 -178 201 89 -297 -31 218 -192 51 -304 -35 42
8078D2O2j17KQ4N5m48N80p0l41R7l09O39l46j99K07J51O5j10P6j99j62J27J9k9
$$ 42 104 -13 -11 73 128 -320 260 190 -151 -54 -363 276 -70 -269 -62 89 154 44 120 -79 -241 -114 -95 -124
8102a24j9M3K54k14J7J62j16J53l25K46P9l07l09M78l11N46k90K77m75J49K1l33
$$ -124 -143 -100 154 -60 -43 119 3 156 -169 77 156 -151 -460 18 -293 253 -37 240 -235 -86 -65 -398
8124c98J077k66n58l34M46k03J59J11P4m83N53m63L66j87l0L59l61J91n11O77
$$ -398 679 413 -145 -479 -33 -236 -77 34 108 -375 178 -285 81 -106 -136 223 -138 53 -458 219
8144B19j76j32q6q8K87m2k41J47J35J40J17jP8J55k24l48N6M49p09K01K66l87
$$ 219 43 -89 -175 -263 24 -18 -259 -112 23 163 280 279 357 512 288 -60 -4 445 -264 -63 203 -184
8166a84o5J44%J28P4j65K80p7k41J07l71N89m44O52r0k49m7n12N97J35j18r4M65
$$ -184 -249 -105 -105 23 97 -68 212 135 -106 1 -370 219 -225 427 337 88 41 -471 126 261 143 49 514
8189E14r83M85
$$ 514 -469 16
8191A6
$$ Imaginary data points
##PAGE= N=2
##DATA TABLE= (X++(I..I)), XYDATA
0@%%%%%%%%Kj0J6j6J6k4L2m0M9n7P2q9J10j32J58j89K21k55K96l43L97m59N24
$$ 0 0 0 0 0 0 0 0 0 2 -8 8 -8 8 -16 16 -24 25 -32 40 -49 61 -71 87 -102 119 -136 160 -183 214 -245 279
31B79n97O78p71Q73r83J103j235J385j549J725j917K129k360K611k886L185l513
$$ 279 -318 360 -411 462 -521 582 -653 732 -817 908 -1009 1120 -1240 1371 -1515 1670 -1843
48a843L873m266M700n178N707o295O949p688Q527r485J0593j1893J3445j5329
$$ -1843 2030 -2236 2464 -2714 2993 -3302 3647 -4041 4486 -4999 5594 -6299 7146 -8183
62h183J7681k0714K4793l0611L9647n5754R3365l50791k89434K78992R7361K66370
$$ -8183 9498 -11216 13577 -17034 22613 -33141 60224 -290567 -580001 -301009 -203648 62722
74F2722R1122N7862Q455n9891p4596J9519k9960O8810L3274m5436k188l7891j46017
$$ 62722 153844 211706 220161 160270 85674 105193 75233 144043 177317 131881 129693 91802 -54215
87e4215n4424p7589o6191M8502L8098L4463J07893L2917M5696P1462q129J8727
$$ -54215 -108639 -186228 -252419 -203917 -165819 -131356 -23463 9454 55150 126612 118483 137210
99A37210L0772o4318k6134l3442q9489k8026j7624r356P3291J9420O972N4022
$$ 137210 167982 103664 77530 44088 -45401 -73427 -91051 -100407 -27116 -7696 -724 53298
111E3298l1158l7916J0898m7869N060P5781J9293L3038K0198m8351l3349p4000
$$ 53298 22140 -15776 -4878 -52747 -47687 28094 47387 80425 100623 52272 18923 -55077
123e5077r7443l618L962L0616J04130M8463M1891P2855j6484l1993j0752n8034
$$ -55077 -152520 -156138 -152176 -121560 -17430 31033 72924 145779 129295 97302 86550 28516
135B8516j6384K397l3782K1107J7364l0790J436l5288n8251K702j3861k215N6319
$$ 28516 12132 14529 -19253 1854 19218 -11572 -10136 -45424 -103675 -100973 -114834 -117049 -60730
148f0730L0618M9501O6121P072K6338K3740m8826k2666k3888o7771j6327r905
$$ -60730 -30112 19389 85510 92582 118920 142660 93834 71168 47280 -20491 -36818 -46723
160d6723k2695K4629P491l678K2055j6670m972K1704k1322J3403M2325q7K9449
$$ -46723 -69418 -44789 -37298 -40976 -18921 -35591 -40563 -18859 -40181 -26778 15547 15460 44909
173D4909L1582j7856N889j0758m8866j6318k1727j7890K1726o310M925M1013k367
$$ 44909 76491 58635 64524 53766 4900 -11418 -33145 -51035 -29309 -35619 -30694 10319 7952
186G952Q89J4401k3081j080O072k3952Q972J1775q316K5098j285k3670J2772j1345
$$ 7952 8841 23242 161 -919 5153 -18799 -9827 1948 -6368 18730 17445 -6225 6547 -4798
200d798j8165J3022j0192J710K8876j713J1824K0607j5223O961q104l8659k350
$$ -4798 -22963 -9941 -20133 -18423 10453 8740 20564 41171 25948 32909 24805 -13854 -16204
213a6204r675k0371K4438O981k639K3840j408k832J1433j7167k309J1564r402
$$ -16204 -25879 -46250 -21812 -14831 -17470 6370 4962 2130 13563 -3604 -5913 5651 -3751
226c751J4058J4101j0063J5699K106k8098n088j6696j6820J4881n443j618K3590
$$ -3751 10307 24408 14345 30044 32150 4052 -1036 -17732 -34552 -19671 -25114 -26732 -3142
239c142k26P045J4947j5525K736J1680j5604L773J775j1176J4650k055j4873R063
$$ -3142 -3368 3677 18624 3099 5835 17515 1911 5684 7459 -3717 10933 8878 -5995 3068
253C068r287p014J3591j0875l958J5130p688K968J3529o683R310O433j3071N718
$$ 3068 -6219 -13233 358 -10517 -14475 655 -7033 -4065 9464 2781 12091 18524 5453 11171
267A1171p288j5733J0608m530r616J3235n735r54J5814o963p61P806j0400M922
$$ 11171 3883 -11850 -1242 -5772 -15388 -2153 -7888 -8842 6972 9 -752 7054 -3346 1576
281A576N015j0683J0752M687q913P043q020j1870R771o018p056Q422n918M615
$$ 1576 6591 -4092 6660 11347 2434 9477 1457 -10413 -642 -6660 -13716 -5294 -11212 -6597
295f597J2178p660O700R372j0966M307K90j2294Q813P52p712O723o599n464R163
$$ -6597 5581 -2079 4621 13993 3027 7334 7624 -4670 4143 4895 -2817 3906 -2693 -8157 1006
310A006r421l87J0535p618M222Q214r290O883M575r188N460r86n591Q537m024
$$ 1006 -8415 -8802 1733 -5885 -1663 6551 -2739 4144 8719 -469 4991 4005 -1586 6951 2927
325B927n492N233j0977n036Q239n934M617J1190l199O758L922j0959M053k296
$$ 2927 -2565 2668 -8309 -13345 -5106 -11040 -6423 4767 1568 8326 12248 1289 5342 3046
339C046p858O500l385k256J0706l357m571L759j0060j823M579o218O320R213j802
$$ 3046 -4812 1688 -1697 -3953 6753 3396 -1175 2584 -7476 -9299 -4720 -10938 -4618 4595 2793
354B793P549N09r033O250k179p768L220n471l212N789m663n23O222m725M394M953
$$ 2793 10342 10851 1818 8068 5889 -1879 1341 -4130 -7342 -1553 -6216 -6739 -517 -5242 -848 4105
370D105p572N856K583n630N365j874m613Q323j37l128M125p995n701K078r204
$$ 4105 -3467 2389 4972 -658 4707 2833 -1780 6543 6406 3278 7403 -592 -6293 -4215 -13419
385a3419J731O513j657R129O821m258M130p20p013K239o123n283P626p22J669
$$ -13419 -11688 -5175 -6832 2297 9118 4860 8990 8270 1257 3496 -2627 -7910 -284 -1006 663
400F63O260o308o00J404r032n56K198j447P705M083j275P419j058m027J801q139
$$ 663 6923 615 15 1419 -7613 -8169 -5971 -7418 287 4370 3095 10514 9456 5429 7230 -909
416i09p069K655m224P00O518k004N422M487m874K215L14m403N131j289k698N988
$$ -909 -7978 -5323 -9547 -8847 -2329 -4333 1089 5576 702 2917 3231 -1172 3959 2670 -28 5960
432E960r46j322M164o972m091L44p926j6K003k744N799N810K35N924K891j428
$$ 5960 5014 3692 7856 884 -3207 -2863 -10789 -10805 -8802 -11546 -5747 63 298 6222 9113 7685
448G685L744l711o154J920m951o68L771l927J311K640o028q19k026n310L827J881
$$ 7685 11429 7718 1564 3484 -1467 -2135 1636 -2291 -980 1660 -4368 -5187 -7213 -12523 -8696 -6815
464f815O27P902M385L052N404l735m917m9p634k270J916l031L620L297l088K188
$$ -6815 -6188 1714 6099 9151 14555 10820 5903 5854 -1780 -4050 -2134 -5165 -1545 1752 -1336 852
480H52j200m519K265k005k105N104P04J960O140j830m71Q64n990j061p13m376
$$ 852 -348 -4867 -2602 -4607 -6712 -1608 -904 1056 7196 5366 4895 5759 -231 -1292 -2005 -6381
496f381K227J560j292N608J273l08M501k142m031J015m255j314K293k023J887
$$ -6381 -4154 -2594 -3886 1722 2995 2687 7188 5046 1015 2030 -2225 -3539 -1246 -3269 -1382
511a382K878k856J877j149m428K009k32k000L568K856K310N790q85j392R00m810
$$ -1382 1496 -1360 517 -632 -5060 -3051 -3283 -5283 -1715 1141 3451 9241 8356 6964 7864 3054
527C054l105p19m738Q64O16k084L684n19j754K949m35k659K872j53J604N408j18
$$ 3054 -51 -770 -5508 -4644 -4028 -6112 -2428 -2947 -4701 -1752 -2187 -4846 -1974 -2127 -523 4885 4767
544D767J305L001l286J36j638n065p41k226k943K887q98J9M460p34k65J219k586
$$ 4767 6072 9073 5787 5923 4285 -780 -1521 -3747 -6690 -3803 -4701 -4682 -222 -956 -1221 -2 -2588
561b588j31L032k060K766L007n29K044L10l851O97j582l723R91j475l68L451j07
$$ -2588 -2719 313 -1747 1019 4026 3497 5541 5851 2000 2697 1115 -2608 -1617 -3092 -3460 -9 -116
578a16K49J276k561O30j46l324J709J117j390K889J021j033L189m88j610Q77k588
$$ -116 133 1409 -1152 -522 -668 -3992 -2283 -1166 -2556 333 1354 321 3510 3022 1412 2289 -299
595b99k19J918j745P23J460j860J228Pl290P09q52k212J960l68r9L656J03R92
$$ -299 -518 1400 -345 378 1838 -22 1206 1213 -2077 -1368 -2220 -4432 -2472 -2840 -2939 717 820 1812
613A812J550k369J2O87j964N70J134j575J770O62j841R13j421k046N87j586p27
$$ 1812 3362 993 1005 1692 -272 298 1432 -143 1627 2289 448 1361 -60 -2106 -1519 -3105 -3832
630c832K053OJ077K159j144O47N80j961O42L88j234J956m5r14J988o87q94J001
$$ -3832 -1779 -1773 -696 1463 319 966 1546 -415 227 615 -619 1337 1292 378 2366 1679 785 1786
648A786k134j099P29j451L70J351j283J595N79j667J167Q44j778J715j150l28
$$ 1786 -348 -1447 -718 -2169 -1799 -448 -1731 -136 443 -1224 -57 787 -991 724 -426 -754
664g54K292n68K90J157j505r8N92j888k20J12j494Q18N45p11J685n15j43J150
$$ -754 1538 970 1260 2417 912 814 1406 -482 -702 -590 -2084 -1266 -721 -1432 253 -262 -405 745
682G45j295k25J146o49P59J283j309R87O68j794J51j24j447P65m34p49J591m59
$$ 745 -550 -775 371 -278 481 1764 455 1442 2110 316 467 343 -1104 -339 -773 -1522 69 -390
700c90K01J083j448m1Q13r21L35P41j026J049M63j102Q33j89o69Q40p15n46R42
$$ -390 -189 894 -554 -595 218 -703 -368 373 -653 396 859 -243 590 401 -268 572 -143 -689 253
719B53k90j43J074j135J27R41j083L02R4j021Q69q5q04Q08K4l89J254n02o79Q69
$$ 253 -37 -180 894 -241 -114 827 -256 46 140 -881 -12 -97 -901 -93 -69 -458 796 294 -385 484
739D84r02K77O88j080M00P04r81P16N6j049J024n77q53R93k96l0J285o09l51R23
$$ 484 -418 -141 547 -533 -133 571 -410 306 362 -687 337 -240 -1093 -100 -396 -426 859 250 -101 822
759H22r22K39L83q73N25L06p45M49k51n61R40n64n36R26m04J06Q24q73J45N28
$$ 822 -100 139 522 -351 174 480 -265 184 -67 -628 312 -252 -788 138 -266 -160 664 -209 -64 464
779D64q26O86J87p75N43J24p85L58l93m59Q35j92k84P04l92J39R32r04J04L21
$$ 464 -362 324 511 -264 279 403 -382 -24 -417 -876 -41 -233 -517 187 -205 -66 866 -38 66 387
799C87o99L77O50r13Q41n30p27O64m57l37R10o06J45M75q11Q28L35m00M65J27
$$ 387 -312 65 715 -198 643 113 -614 50 -407 -744 166 -440 -295 180 -631 197 532 132 597 724
819G24q23M04m84n7M06l23l25M71n66L12N93o95K86J21n96M65K60m05O96J68l00
$$ 724 -99 305 -179 -236 170 -153 -478 -7 -573 -261 332 -363 -77 44 -552 -87 173 -232 464 632 332
840C32K89n55m65O18p45m1O42o75N02L99m15M09L94r42O39k06m55M84o8j06M10
$$ 332 621 66 -399 219 -526 -567 75 -600 -98 301 -114 295 689 -253 386 180 -275 209 141 35 445
861D45m34L6P7l89k30L13o10L53N08k99M59L91m64L65k88m58M85m88j72K36p4
$$ 445 11 47 124 -265 -495 -182 -792 -439 69 -230 229 620 156 521 233 -225 260 -228 -400 -164 -238
882b38K6L66l65J45P7l70J44R2n7M32Q2j52O36n06l11M85k13k35k74m31K08M24
$$ -238 -212 154 -211 -66 11 -359 -215 -123 -180 252 334 182 818 312 1 486 273 38 -236 -667 -459 -35
904c5k42J6L80l47M11l7m37M88j42j5J51M0k94M05m00j10J73n15J59J91n72Q52
$$ -35 -277 -261 119 -228 183 146 -291 197 55 40 191 231 -63 342 -58 -168 5 -510 -351 -160 -732 120
926A20jl07O47P2m19K26m52OK35m33J95N17m58K34J16m78P8J73o54N59p0NM53
$$ 120 119 -188 459 531 112 338 -114 -108 127 -306 -111 406 -52 182 298 -180 -102 71 -583 -24 -94 -89 364
949C64q6k34K54l68J23K82q01J43L76l86O59q6m09L54j38k67M46l85j27N10n45
$$ 364 278 44 298 -70 53 335 -466 -323 53 -333 326 240 -169 185 47 -220 226 -159 -286 224 -321
970c21L12K44j49j28M45p29L00J7k42M18k29j79N13M9m50K98r1QJ32k76l98L73
$$ -321 -9 235 86 -42 403 -326 -26 -9 -251 167 -62 -241 272 321 -129 169 78 86 218 -58 -456 -83
992h3k6J31K96l01J48K9m72K74q2l03N33l93M29J59k42j44L91n65N6o1J8M3N26
$$ -83 -109 22 318 17 165 194 -278 -4 -86 -389 144 -249 180 339 97 -47 344 -221 -165 -226 -208 -165 361
1015C61l07M35k33k43J08m70QL06k83K42J33j85K09N2m61N16l11j07K26Mj23J67
$$ 361 54 489 256 13 121 -349 -341 -35 -318 -76 57 -128 81 133 -328 188 -123 -230 -4 0 -123 44
1037D4J75k57J74L2k31J38k18p3J15j96L81J55m06L92nk66L32p7j64K17k36p1
$$ 44 219 -38 136 168 -63 75 -143 -216 -101 -297 84 239 -167 225 220 -46 286 209 45 262 26 -45
1059d5M3l3J26K6l14J12K42n09lJ72j33M47J53M4q6N0j33j19J95m27L48k39k33
$$ -45 -2 -35 91 117 -197 -85 157 -352 -355 -183 -316 131 284 328 242 292 159 40 235 -192 156 -83 -316
1082c16P00l56L4O6k10J57j95j20K67q6J11J6K2M7j6j99l1K55l95K00n1J9J78
$$ -316 384 28 62 128 -82 75 -120 -240 27 -59 52 68 90 137 121 -78 -109 146 -249 -49 -100 -81 97
1105I7k3R2k10K76l13K84k22k60K34j17M1M65l44Q4p1j89j21Q8k1L28m6o2k9K61
$$ 97 74 166 -44 232 -81 203 -19 -279 -45 -162 -121 344 0 84 13 -176 -297 -209 -230 98 52 -10 -39 222
1129B22j95J62r0j42J19j56L0n5J29j22J55o7j48J71k47J93k7Q0J47k74J33N1
$$ 222 27 189 99 -43 76 -80 -50 -105 24 -98 57 -10 -158 13 -234 -41 -68 12 159 -115 18 69
1151F9K8J00m30K28k8R9q3m0O8m0K24k01j7m1r8q3M79l66o7N59m26J96j08j29
$$ 69 97 197 -233 -5 -33 66 -17 -57 11 -29 195 -6 -23 -64 -162 -245 234 -132 -199 360 -66 130 22 -107
1175a07J20l0p3K44l08m4J27j6N5P2j92M78n43L80k27Q1k5j23L9K9M42n36K41
$$ -107 13 -17 -90 154 -154 -198 -71 -87 -32 40 -152 326 -217 163 -64 17 -8 -131 -92 -63 379 -157 84
1198H4N1j99M3K4%J04O4r2P2j80k54K38m4r9J64j5k4L4K2j40J24Mj5K61l96K15
$$ 84 135 -64 -21 3 3 107 171 79 151 -29 -283 -45 -89 -188 -24 -39 -63 -29 -7 -147 -23 -19 -34 227 -169 46
1224D6L0q5q5J48o1K76k13l15L18j16pL37l55K0J55j41J21Pj37O1p3l7K45r8n4
$$ 46 76 -9 -94 54 -7 269 56 -259 59 -57 -64 273 -82 -62 93 -48 73 80 -57 4 -69 -106 139 41 -13
1249a3J24q3p8Jj48J15K62m38o0L03j18NL36k44j14J90j7p5l9j01L88j66J81r5
$$ -13 111 28 -50 -49 -197 -82 180 -258 -318 -15 -133 -128 208 -36 -150 40 23 -52 -91 -192 196 30 211 116
1273A16k16RK13j83J25J18n22L45J49q3J17k29j8J18j22P3m5o7J65j03q4p7J37
$$ 116 -100 -91 122 -61 64 182 -340 5 154 71 188 -41 -59 59 -63 10 -35 -102 63 -40 -124 -201 -64
1296f4K4K58j85j99M64m9j19j06q7n9K94m42K76J69k34j1P9p5k9j09j44L66l5
$$ -64 -40 218 33 -166 298 249 130 24 -63 -122 172 -270 6 175 -59 -70 9 -66 -95 -204 -348 18 -17
1319a7O0N6q0n1Q9pj0J60k11Kk53K77L7Jj08J84M8l46RJ0q3L75k00j3K08l47J18
$$ -17 43 99 19 -32 57 50 40 200 -11 -9 -262 15 52 53 -55 129 177 -169 -160 -150 -233 142 -58 -71 137 -210 -92
1346i2L5j2J74j44n4n4J16j0J58R2l79J73J03l30K73N6j59L32k77n3J71j11n1
$$ -92 -57 -69 105 -39 -93 -147 -31 -41 117 209 -170 3 106 -224 49 105 -54 278 1 -52 119 8 -43
1369d3o3n5J26r0J49K8j20P7J90j18k89K25k25J62O2j60L60j43j61J9J15j69J58
$$ -43 -106 -161 -35 -125 24 52 -68 9 199 81 -208 17 -208 -46 16 -144 216 73 -88 -69 46 -123 35
1392C5j41L00k55l1Q0l0Q8L7j33J15j82L08j69m3O2j80J82k8R7j71O9J2Q1l19
$$ 35 -106 194 -61 -92 -12 -42 46 83 -50 65 -117 191 22 -21 41 -139 43 15 112 -59 10 22 103 -216
1416b16L75k48J02ko4M1%O3j25N1o1J81j10M4n7j10Q3j87J94j86M7P6j41K37L1
$$ -216 159 -89 13 11 -53 -12 -12 51 -74 -23 -84 97 -13 31 -26 -136 -53 -240 -46 -232 -185 -109 -250 -13 18
1441A8k13J55P3J4m3J27l07K61K00l71K01Jr5P0J2k11R9K7pJ79j88K4o8N7O2k34
$$ 18 -195 -40 33 47 4 131 -176 85 285 -86 115 116 21 91 103 -108 -9 18 11 190 2 26 -42 15 77 -157
1467a57Q7J6J89j36j82J69K07j86R3o1J90k98O1J12j90O6K38k62J41K1j07p8n9
$$ -157 -70 -54 135 -1 -183 -14 193 7 100 39 229 -69 -8 104 -86 -20 218 -44 97 118 11 -67 -126
1490a26J8j57K07j1K00j49j8K63k02J10j86K49k97K06j6j57k2J9J38q2N0J05l6
$$ -126 -108 -265 -58 -69 131 -18 -36 227 25 135 -51 198 -99 107 91 -66 -88 -69 69 -13 37 142 106
1513A06l1J28l05j93J31J10O3q7q0ON4lQ3j8J61K2l15P7n9J59J42J8m3l17K12
$$ 106 75 203 -102 -295 -164 -54 9 -78 -158 -152 -98 -101 -18 -36 125 147 -168 -91 -150 9 151 169 126 -191 21
1538B1M1l18K50l4Q5j08Q3m7l0r6J48j01Q1OK59l36N9o9k07M79o6j46K24k22K01
$$ 21 62 -256 -6 -40 45 -63 20 -27 -57 -153 -5 -106 -25 -19 240 -96 -37 -106 -313 166 100 -46 178 -44 157
1563A57k64L1K41j1J6j59J3J82r3l00K22j5j13O1K50k75Q6Q3l02K06M6Oo4M2m4
$$ 157 -107 -76 165 154 170 11 24 206 113 -187 35 20 -93 -32 218 -57 29 112 -190 16 62 68 4 46 2
1588Bj15L6Q1k48J79K24p9j82J04P0j10J07l37K99J3k08K51K48k88R3j97P8M3
$$ 2 -113 -77 4 -244 -65 159 80 -102 2 72 -38 69 -268 31 44 -164 87 335 47 140 -57 21 64
1611F4l5j84rM17l22n6j9J93n0J03j31J30l8k5J04m4m0qj24K73Oj80o3k5rj85
$$ 64 29 -155 -164 253 -69 -125 -144 49 -1 102 -29 101 63 38 142 98 58 50 -74 199 205 25 -38 -63 -72 -257
1637b57L14j50O7o4j01O3K13r2p1R6j28J04j4J72o2l14M50k41N9j39J79k07K62
$$ -257 57 -93 -26 -90 -191 -128 85 -7 -78 18 -110 -6 -20 152 90 -224 226 -15 44 -95 84 -123 139
1660A39k39M48k28l82N21n30Q2J81Ql1m8J26j24M3rl1N4j94J87Ro5r7K89l3j4
$$ 139 -100 348 120 -262 259 -271 -189 -8 0 -31 -79 47 -77 -34 -43 -74 -20 -214 -27 -18 -83 -180 109 76 62
1685F2k06J47K8m8J16r7o0K12k90M4J41k0o1L70k32k34J80n2L3n8P9M1Q1k16%
$$ 62 -144 3 31 -17 99 2 -58 154 -136 -92 49 29 -32 338 106 -128 52 0 33 -25 54 95 176 -40 -40
1710d0L0J28N5l01N0nL8l3J7J43j3q7j0j94K09O1p3n5O9j18p8L80j34ppJ15j17
$$ -40 -10 118 173 -128 -78 -83 -45 -78 -61 82 69 -18 -28 -222 -13 48 -25 -80 -11 -129 -207 173 39 32 25 140 23
1737B3j03JJ34m0N4O8p7o8j46n7L24n9l2M7J21M7k77O6J67r5L0k23K78j29j14
$$ 23 -80 -79 55 15 69 137 60 -8 -154 -211 113 54 22 69 190 237 -40 26 193 98 128 -95 183 54 -60
1762f0l6om4K34j07J57j63N3K15l01lj78J66q1Q6K17k89K42N0j77R2j01J49J8
$$ -60 -96 -102 -146 88 -19 138 -25 28 243 -58 -61 -239 -73 -154 -68 149 -140 102 152 -25 67 -34 115 133
1786A33j92N8J12j06J44j77J16m5l2J19p2k64O9J4K26j95lL13k63J07j87Q0j03
$$ 133 -59 -1 111 5 149 -28 88 43 11 130 58 -206 -137 -123 103 -92 -95 218 -45 62 -125 -45 -148
1809a48M12j1k72p8o3O4j7P2O2M4j46J45J2J22j01Q9j18q8J7K6%N0j00O4R0k18
$$ -148 264 253 -19 -97 -160 -96 -113 -41 21 65 -81 64 76 198 97 186 68 -20 -3 23 23 73 -27 37 127 -91
1835i1O5J08j77P9J24J2q9J01j59l6j30J86J29k93J75J3P0j06k6J61O2k27o0L65
$$ -91 -26 82 -95 -16 108 120 31 132 -27 -63 -193 -7 122 -171 4 17 87 -19 -45 116 178 -49 -109 256
1859B56k59J57l2Pk39J67k24K46r7j9J47k4j29R6n2j54L7J16O0k32K93j49Q4r1
$$ 256 -3 154 122 129 -110 57 -167 79 -18 -37 110 86 -43 53 1 -153 -116 0 60 -172 121 -28 56 -35
1883c5P6p9J03M5k36oK79o1r8m6N8p1J82o8k62J92L0k46J73rL7J50p7j63Q3J00
$$ -35 41 -38 65 110 -126 -132 147 86 -12 -58 0 -71 111 43 -219 -27 3 -243 -70 -79 -42 108 31 -132 -49 51
1909E1j25l8P7K37l96K58j86J74Nj96P5L3Q9m6R7j63K4J4J1k2O8l43J79R0J18
$$ 51 -74 -112 -35 202 -194 64 -122 52 57 -139 -64 -31 58 12 109 -54 -30 -16 -5 -27 41 -302 -123 -33 85
1934H5pk02nK12j1M7j50J11J46l84N0L14j44k00K77k30J90k42K37j50j1m6j8Q4
$$ 85 78 -124 -129 83 72 119 -31 80 226 -158 -108 206 62 -138 139 -91 99 -143 94 -56 -67 -113 -131 -47
1958d7j20K22k08J10J18j57J7J0n8O1J05j59K8qM7ON1P9j95JJ92r5o2K02j09j1
$$ -47 -167 55 -153 -43 75 -82 -65 -55 -113 -52 53 -106 -78 -86 -39 -33 18 97 -98 -97 95 0 -62 140 31 20
1984B0n8n2L4K56k07l3J75j89O2J85l7j10Q1m6k35L44k65J78j53J81q7J52l41
$$ 20 -38 -90 -56 200 -7 -40 135 -54 8 193 156 46 127 81 -154 190 -75 103 -50 131 44 196 -145
2007a45J39M4K50k81k6MQ1K6k16L09M7l13N2j31M4J51j00J51J55p7p0j04k2J14
$$ -145 -6 38 288 7 -19 -15 66 92 -124 185 232 -81 -29 -160 -116 35 -65 86 241 164 94 -10 -32 82
2031H2j18L7l0L0J14j21m0J34p9j2l7J77j68O4q7J39r5j11J56J02k02J15M0k72
$$ 82 -36 1 -29 1 115 -6 -46 88 9 -3 -40 137 -31 33 -54 85 -10 -121 35 137 -65 50 90 -182
2055a82L26k21J5J3l3J2K43l08nK9K18k7J2Q2J6p4J11j87k4m8L1l1J70k24J03
$$ -182 144 -77 -62 -49 -82 -70 173 -135 -140 -111 107 80 92 174 190 116 227 40 16 -32 -1 -32 138 -86 17
2080A7o1j38j23L84m1k47K10q7qJ51k57K83j07J37j60K82j04j26j38L75R6m4k29
$$ 17 -44 -182 -305 79 38 -209 1 -86 -94 57 -200 83 -24 113 -47 235 131 5 -133 242 338 294 65
2103F5R3o7k23J65M5n6N3j71K47j41j81M1K29j65K5P0K1J63m61L68j67j9K71j18
$$ 65 158 91 -132 33 78 22 75 -96 151 10 -171 -130 99 -66 -41 29 50 213 -248 120 -47 -66 205 87
2127H7k78L2J46n4J25r1k6J62k07J28J0K10k88j25K43J4o4K0Q7l02LQ2J10j1n2
$$ 87 -191 -159 -13 -67 58 -33 -59 103 -104 24 34 244 -44 -169 74 88 24 44 131 -171 -168 -86 24 13 -39
2152c9k36J42K31j9J00j05m9J28o2j48j74J43J51j05l7J84l22J59J2o1N9J38n1
$$ -39 -275 -133 98 79 179 74 25 153 91 -57 -231 -88 63 -42 -79 105 -217 -58 -46 -107 -48 90 39
2175C9P0k84J91j0O3J52m14J10L2J57j50RP3N5j37l4Q8J70lk22J68L3r0J3o6J14
$$ 39 109 -175 16 6 69 221 -193 -83 -51 106 -44 -35 38 93 -44 -78 10 180 177 -45 123 156 66 79 13 127
2201A27k56Q2k7J1K1R7j59J26N6p8R5j85J14J13j68P8k08Q0O2j0K00l3n7k23P4
$$ 127 -129 -47 -74 -63 -42 55 -104 22 78 0 95 -90 24 137 -31 47 -161 -81 -19 -29 171 138 81 -142 -68
2226f8J74k48J02J13j77m6J79Q6j17O7Kn1K3l0p1o4j33L32J01j98J21j87J69j88
$$ -68 106 -142 -40 73 -104 -150 29 115 -2 65 67 16 39 9 -62 -126 -259 73 174 -24 97 -90 79 -109
2250a09J89n5J54j91Rpj76J63K3P9k28J47L4N5j66L4R5q1J89j86l4O9j72J16P2
$$ -109 80 25 179 -12 -3 -10 -186 -23 0 79 -149 -2 32 87 -79 -45 50 -31 158 -28 -62 7 -165 -49 23
2275B3j07P8j01Q4R0j20j06R0r5n1jJ80n9J83j46J85L1l68K31O8j15j55K50j20
$$ 23 -84 -6 -107 -23 67 -53 -159 -69 -164 -215 -216 -36 -95 88 -58 127 158 -210 21 89 -26 -181 69 -51
2299e1Q6nj55QK54j77k46P3J76n5J27J16k39JJ58J5L3n1L1l7j81l4J12n6K86k86
$$ -51 35 30 -125 -117 137 -40 -286 -213 -37 -92 35 151 -88 -87 71 86 119 68 99 62 -119 -153 -41 -97 189 -97
2325i7L82l34q5K75k08J15J05j05j68J74L1j96m8m8K20n3J00k2K5j64J31M4k28
$$ -97 285 -49 -134 141 -67 48 153 48 -120 54 85 -111 -159 -207 13 -40 60 38 63 -101 30 74 -154
2348a54K25k22N0K2J42m5j73J20L7J12l0q7k20L09q7P9O0k27j6N2L0j27O0J35
$$ -154 71 -151 -101 -79 63 18 -155 -35 2 114 84 -3 -223 86 -1 78 138 -89 -105 -53 -23 -150 -90 45
2372D5j36n5K55k93K65k65J73j73J60J48j25P2n4j5p1J72q0p9J17o7Lj3o2K8L
$$ 45 -91 -146 109 -184 81 -184 -11 -184 -24 124 -1 71 17 2 -69 103 23 -56 61 -6 -3 -16 -78 -50 -47
2397d7mJ96k73J08l6O7j43K89J57l00j6N5m6K6j96L7K5K7J11p0J22j24J3M3kJ30
$$ -47 -51 145 -128 -20 -56 11 -132 157 314 14 -2 53 7 33 -163 -126 -101 -74 37 -33 89 -35 -22 21 19 149
2423A49k5O8j94Q7R8k03J1J4j01l7p9J8J04O0j01j99M33l09J55J13o8rKL03m04
$$ 149 124 192 -2 85 183 -20 -9 5 -96 -133 -212 -194 -90 -30 -131 -330 103 -206 -51 62 -6 -15 -13 290 -114
2448a14K58k3o4lM6o5O0N3m0Jk67L75k60J98k09j2J76k37R1p8M30l92K4j78J36
$$ -114 144 121 57 54 100 35 95 148 108 109 -158 217 -43 155 -54 -66 110 -127 -36 -114 316 -76 -52 -230 -94
2473i4N2P7n3K53k42L00l79K00j09Nj18K3k5J15K60k83J21r7J12l74L89k94N3
$$ -94 -42 35 -18 235 -7 293 -86 114 5 10 -108 -85 -110 5 265 -18 103 6 118 -256 133 -161 -108
2496a08j3K71k03O6j23L73l35K73j88m8j12L41j84rJ28j23Q3j27k7j46K77r5J4
$$ -108 -121 150 -53 13 -110 263 -72 201 13 -35 -147 194 10 1 129 6 89 -38 -65 -211 66 -29 -15
2519a5q4K2Q5r7j05M09k15K55k12o2on0N7K9o9M0J04j63K18j98j00R7J1J61m6
$$ -15 -99 -77 8 -89 -194 215 0 255 43 -19 -25 -75 -18 11 -58 -18 86 -77 141 -57 -157 -60 -49 112 66
2544F6k01J69p6K37k81J37K80k93k41K58lnj14J15r8j25J55J33o1J6k4Nl9Oj58
$$ 66 -135 34 -42 195 -86 51 331 38 -203 55 52 47 -67 48 -50 -175 -20 113 52 68 44 49 10 16 -142
2569a42L03l03L6K51k25n7L06k45m6p0K57j0q4J63j46n0k46K90j3Q3k43Q4J53
$$ -142 161 -142 -106 145 -80 -137 169 -76 -122 -192 65 55 -29 134 -12 -62 -308 -18 -31 52 -191 -107 46
2592D6J55j27k3o2L0j83J58J75l97J40J56k30K52o6j15N3q4K16q8Q3m4J2j96J27
$$ 46 201 74 51 -11 19 -164 -6 169 -228 -88 68 -162 90 24 -91 -38 -122 94 6 89 45 57 -139 -12
2616a2jO4J27o5j32j24M4M6q7O2Q2P0m8J03m8j3j6k0J67j46l6k61L59k18J55J49
$$ -12 -13 51 178 113 -19 -143 -99 -53 -140 -78 4 74 26 129 81 68 52 32 199 53 17 -244 115 -103 52 201
2642B01l13K33j16J60k64M2l4J9L04k37J75j45M9j42k6K13r0J00l91K33mK6O3
$$ 201 -112 121 5 165 -99 -57 -91 -72 232 -5 170 25 74 -68 -94 119 29 129 -262 -29 -33 -7 56
2665E6N4k33J32p7N7r4K39J0j12j20RJ09J3j19o1J69Jj8o5J01K4J43j37k7j39
$$ 56 110 -123 9 -68 -11 -105 134 144 32 -88 -79 30 43 -76 -137 32 33 15 -50 51 75 218 81 54 -85
2690h5Q6O9K5NR7j68j11J19q6J41j19q0N6Q7q0M2J54o4j01q0K02J20j20j91J97
$$ -85 1 70 95 100 197 29 -82 37 -49 92 -27 -107 -51 36 -44 -2 152 88 -13 -93 109 229 109 -82 115
2715A15l92K11J4J10%j21J66q9q5J2N8mk77K19O3r7J12k0O8j83K04k16Q1K02j94
$$ 115 -277 -66 -52 58 58 -63 103 14 -71 -59 -1 -5 -282 -63 0 -97 15 -5 63 -120 84 -132 -51 151 -43
2740d3L7L7r3J09O3l57L78r0j03K10k10J34j68J18J25k99Q2p1n6L3L75j59o4N0
$$ -43 -6 31 -62 47 110 -247 131 41 -62 148 -62 72 -96 22 147 -152 -70 -141 -197 -164 211 52 -12 38
2764C8m3Qj87J89q8K00l35J92k2J50j0p9m9k3K10k50Q5n3O3J41k97R8R9l6J1j38
$$ 38 -5 3 -184 5 -83 117 -218 -26 -48 102 92 13 -36 -59 151 -99 -14 -67 -4 137 -160 -62 37 1 12 -126
2790a26o0J91j65J02m8J3K95np9j24J52l23L05k28J3J63J40lj21j9m5k1M4l1P8
$$ -126 -186 5 -160 -58 -106 -93 202 197 118 -6 146 -177 128 -100 -87 76 216 213 92 73 28 7 51 20 98
2815I8q1Mo7J68j37J73j15K0j28RN4q2Q1l1J39o8N2k93P6K19J21l05nJ93j81q2
$$ 98 17 21 -46 122 -15 158 43 63 -65 -56 -2 -84 -3 -34 105 37 89 -204 -128 91 212 -93 -98 95 -86 -168
2841a68K68k72J32j27J44M7k01K19K0k1J13j35jm7j68J79j98J91K7J44j08k0J09
$$ -168 100 -172 -40 -167 -23 24 -177 42 62 41 154 19 18 -29 -197 -18 -216 -25 2 146 38 18 127
2864A27p7Q9o9n3K79k54k59J02LJ29o5q0J88j00K6Q7k57mL71j31j4k27K18o8J3
$$ 127 50 139 70 17 296 42 -217 -115 -112 17 -48 -128 60 -40 -14 73 -184 -188 183 52 38 -189 29 -39 -26
2889b6k3J46r0q2N5j6Q7k4k35J76K1n7M1J25o7q3M4Ll1J97k5j17j5J11n6J4NO5
$$ -26 -49 97 7 -75 -20 -36 51 27 -208 -32 -11 -68 -27 98 31 -52 -8 -5 -36 161 136 19 4 115 59 73 78 143
2917A43m7j05j57J33J11j82J47J65j24R2k22K23j24m7P3J2m03K30L14l31Q8k52
$$ 143 96 -9 -166 -33 78 -104 43 208 84 176 -46 177 53 6 79 91 -312 -82 232 -99 -11 -263
2939b63P1M3N12m45O4j31J18o2j03M34j84q0J07j7L7r8Q1j58J13k8n8J69j71N2
$$ -263 -192 -149 363 -82 -18 -149 -31 -93 -196 238 54 -26 81 64 101 3 84 -74 39 11 -47 122 -49 3
2963Ck3J7O9k12P6Q8J1ok00Q8K01o2k12K17q1K4k12J03n3K50j27L1Oj23K5J76
$$ 3 -20 -3 66 -146 -70 18 29 23 -177 -89 112 50 -162 55 -26 -2 -214 -111 -164 86 -41 -10 -4 -127 -102 74
2989G4o3J7K39k08J5m1J5j01N0j65K57j92J63R2P3j70K5j00JM2j61L27n2k26K9
$$ 74 11 28 267 59 74 33 48 -53 -3 -168 89 -103 60 152 225 55 80 -20 -19 23 -138 189 137 -89 -60
3014f0j4K67j07rj2j35j2K69k29K7l3J01k91J74J85l29J55K9l8J1M4O7j30O0M3
$$ -60 -74 193 86 77 65 -70 -82 187 -42 -15 -48 53 -238 -64 121 -208 -53 -24 -62 -51 -7 60 -70 -10 33
3039C3j97J09K10p5l7L8Q4j50r0l0J22m1K8R0q3OJ28l10K10Kj63J16M0L8J31j54
$$ 33 -164 -55 155 80 43 81 165 15 -75 -105 17 -24 4 94 11 17 145 -165 45 47 -116 0 40 78 209 55
3065E5k21q2L78j59J31q9j77K65k11K4K98j67m7O9j64K6J41j18o0J71k15R5%m5
$$ 55 -166 -248 130 -29 102 13 -164 101 -110 -86 212 45 -2 67 -97 -71 70 -48 -108 63 -152 -57 -57 -102
3089a02OJ64k41J01K82k06m7kJ21l26N65k50j74J73Nq5RJ0J60j80o4J18N5j90
$$ -102 -96 68 -173 -72 210 4 -43 -45 76 -250 315 65 -109 64 69 -16 -7 3 163 -17 -81 37 92 -98
3113i8Q9kq4k6l9J17j56J54J01j02N0jJ4Q4j46p7L96l15m2L9K21j18j84K00k5
$$ -98 -9 -11 -95 -121 -160 -43 -199 -45 56 -46 4 3 17 101 -45 -122 274 -41 -83 -44 177 59 -125 75 50
3138E0j65N8J3K3K8J5o5j64L48k81M6Q4N1j6Q5k55m8J94l38K93P7j89J66Q9j66
$$ 50 -115 -57 -44 -21 7 22 -43 -207 141 -140 -94 -10 41 25 110 -145 -193 1 -337 -44 33 -156 10 99 -67
3163f7MJ28J71k87J49l4j99J38Q6q1J55l15L1L77j70K2j17J40O5q4k14J57j04
$$ -67 -63 65 236 -51 98 64 -135 3 89 8 163 -152 -121 256 86 108 -9 131 196 112 -102 55 -49
3186d9n7L5j4L2j49J70p6J31M6j08M4ko2J03j33Q8Q6l2k09K11m5j90J59Q4Pn7
$$ -49 -106 -71 -85 -53 -202 -32 -108 23 69 -39 5 3 -59 44 -89 -1 85 53 -156 55 10 -180 -21 63 70 13
3212A3OJ91k99N3Q0P8j22q9J24rO7m8k7n4R5k69L94j48J50k71J03n9j43K25k05
$$ 13 19 210 -89 -36 44 122 0 -89 35 26 93 45 18 -36 59 -210 184 36 186 -85 18 -41 -184 41 -164
3237a64K01j50K45m1j59r6J11M3J46j07L4o5j60K05J69m3k96L32o5j97K68j21
$$ -164 37 -113 132 91 -68 -164 -53 -10 136 29 63 -2 -162 43 212 169 -127 205 140 -57 211 90
3259I0j57M6K6p0K43j29N5p4N3j00n0k24J94J59j29m5Q4N9k0K90k43j98M52l95
$$ 90 -67 -21 5 -65 178 49 104 30 83 -17 -67 -291 -97 62 -67 -112 -28 31 11 301 58 -140 312 -83
3283h3k4L5J37j81j53L29j2r5k3m1M9q7K7m9J18l7J10r8J45J02p6j94j25L84k00
$$ -83 -107 -72 65 -116 -269 60 48 -47 -70 -111 -62 -149 -122 -171 -53 -90 20 -78 67 169 93 -101 -226 158 -42
3308d2Q2O5j71k4J37Q5k18J81l58K95L9j31r1J25J40k72K75k36J76q7j06K7J58
$$ -42 40 105 -66 -90 47 132 -86 95 -263 32 71 -60 -151 -26 114 -158 117 -119 57 -30 -136 -109 49
3331D9m5j43J43j40K25j44J17O6m20L24M2qn9O1j65K28j22M3N5n8k23n8K14L1
$$ 49 4 -139 4 -136 89 -55 62 128 -292 32 74 66 7 68 -97 131 9 52 107 49 -174 -232 -18 13
3355A3Q0m19L39R5k31R1k9M2n7P2pN1R3j39o6O8j7J47j53M9J61k48R4j34NJ24
$$ 13 93 -326 13 108 -123 -32 -61 -19 -76 -4 -11 40 133 -6 -72 -4 -21 126 -27 22 183 -65 29 -105 -100 24
3381B4K00k63k7RK4Qj6J18P9l03K28P8j61L10k36j86J33r9m7j9L17l30N7o0J63
$$ 24 224 -39 -66 -57 -33 -25 -41 77 156 -147 81 159 -2 308 72 -114 19 -80 -127 -146 171 -159 -102 -162 1
3406Aq0p9M30o3j76o6R4j92J62j20L5j22J28m4k9J33K21q8m58K21K09j21N1j91
$$ 1 -79 -158 272 209 33 -33 61 -131 31 -89 -54 -176 -48 -92 -121 12 233 145 -313 -92 117 -4 47 -144
3430a44R9jp3J79k88N0J52j47R5N9n9k7K01rl5j29R7N3k06L29j09r1k3j21K25
$$ -144 -45 -46 -119 60 -228 -178 -26 -173 -78 -19 -78 -105 96 87 52 -77 20 73 -133 196 87 -4 -27 -148 77
3455G7o2J8l3j77J27L7o3m0K56k35R4o8K95O6l25q6J12M1J4rP6l79K44K54l13
$$ 77 15 33 0 -177 -50 -13 -76 -116 140 -95 -1 -69 226 292 -33 -119 -7 34 48 39 115 -264 -20 234 -79
3480g9M6P6k58K93k43N6J89P2r7j29n5K92j76m1j16J66J87l09J75L5Rk77j13J51
$$ -79 -33 43 -215 78 -165 -109 80 152 55 -74 -129 163 -13 -54 -170 -4 183 -126 49 84 93 -184 -297 -146
3504a46K42n2L1r8n0O7Q8j58j19K51r9j40L18k9j64K75l93K75j59K02q5kk6k33
$$ -146 96 44 75 -23 -73 -6 82 -76 -195 56 -43 -183 135 106 -58 217 -176 99 -60 142 57 55 29 -204
3528b04J62j09Q5j62K88q6J41j25J48j71j7N4m0j66o0L61k8m2r5L79k98j20O2
$$ -204 -42 -151 -66 -228 60 -26 115 -10 138 -33 -50 4 -36 -202 -262 99 71 29 -66 313 15 -105 -43
3551d3J4L9n9j42K68J1n5N6q0Q0J35k84l0o7J06j17nM03j23j31N7ll03L98l02
$$ -43 -29 10 -49 -191 77 88 33 89 9 89 224 -60 -90 -157 -51 -168 -173 230 107 -24 33 30 -273 125 -177
3576a77J40J81p0L7j68K68q0j51Q7k78J74K3m3L7P0j39p6Q3P1rO7Q7j64P4q0K06
$$ -177 -37 144 74 111 -57 211 131 -20 67 -211 -37 -14 -57 -20 50 -89 -165 -82 -11 -20 47 134 -30 44 -36 170
3602A70m28L72k99K35j17L6l3l1J52j93rJ41J04j55O7o7O5J00j37l5J79k34P5
$$ 170 -258 114 -185 50 -67 -31 -64 -95 57 -136 -145 -4 100 -55 12 -55 10 110 -27 -62 117 -117 -42
3625d2J6J50k95J58K2K10o5P6l42K45l2k47M11j16m2m3jJ45k88QJ14j43L5k24
$$ -42 -26 124 -171 -13 9 219 154 230 -112 133 101 -146 265 149 107 64 63 208 -80 -72 42 -101 -66 -290
3649b90J31J13L3l9n6J27j26j37K68j07JJ85j01l9l0MKJ03j87m4J88J49j43j60
$$ -290 -159 -46 -13 -52 -108 19 -107 -244 24 -83 -82 103 2 -37 -67 -63 -61 42 -145 -189 -1 148 5 -155
3673a55n2J47J3R1j48J49L3j91j4K71K8k89L88j76j11O4r2L6J01P2k15K01k86
$$ -155 -207 -60 -47 44 -104 45 78 -113 -127 144 172 -117 271 95 -16 48 -44 -8 93 165 -50 151 -135
3696a35l5J45R3j53j0K68q1Jn4J38k98j0N0J64j90K6O2k3O4J22j03o7j16Q9m2
$$ -135 -170 -25 68 -85 -95 173 92 93 39 177 -121 -131 -81 83 -107 -81 -19 -42 22 144 41 -26 -142 -53 -95
3721i5K59j65j16K81j14Kj76K58j88K6j19R0j6K29k19J87J43k07j36Q6J26p3j16
$$ -95 164 -1 -117 164 50 52 -124 134 -54 -28 -147 -57 -73 156 -63 124 267 60 -76 10 136 63 -53
3744e3R3R0p8J21k04Q7m4p9J94Mk42P9K74j38j41Q4j00J72l55K68k50Q0J8O5K64
$$ -53 40 130 52 173 -31 56 12 -67 127 131 -111 -32 242 104 -37 47 -53 119 -236 32 -218 -138 -120 -55 209
3769B09l47J85J34k24J45n3J66l51J84Q4j82J19q6j43K4l2K67r6l7J46q4L1r7
$$ 209 -138 47 181 -43 102 49 215 -136 48 132 -50 69 -17 -160 -136 -168 99 3 -34 112 28 59 -38
3792c8J5J37j26j41l6K75nj72J53n7j8%J59j41L20j45k44K28k98K56l44K24J63
$$ -38 -23 114 -12 -153 -189 86 81 -91 62 5 -13 -13 146 5 325 180 -64 164 -134 122 -222 2 165
3815A65l20L0J54K92l08n8Lk7J11O3L7k34J40o6j08M79l09k89r0M74M9j19J54
$$ 165 -155 -125 29 321 13 -45 -42 -69 42 105 142 -92 48 -18 -126 353 44 -245 -335 139 188 69 223
3838B23j89K76N7k97j41M24j78m82M95j63j35J68K8p5n75O46m68L33k1Q2M26k22
$$ 223 34 310 367 70 -71 353 175 -307 188 25 -110 58 86 11 -564 82 -386 -53 -74 8 434 212
3860B12N2p25M89k16o9L99l13K8k52LlO5J162n82o7K81l90J10m5K95k88K79r0
$$ 212 264 -461 28 -188 -257 142 -171 -143 -395 -392 -395 -330 832 250 183 464 74 184 139 434 146 425 335
3883C35l05o8M14k67l5m79L25m83Q09q9m49P4k42M49r6q5J88L71k79l23L22o68
$$ 335 30 -38 376 109 74 -405 -80 -563 246 157 -292 -218 -460 -11 -107 -192 -4 367 88 -235 87 -581
3905e81Q78k83K65l59N80q6p77L91j26J37q01R95n58L62L6L4j88K9K36l44N14
$$ -581 297 14 279 -80 500 414 -363 28 -98 39 -762 233 -325 37 73 107 -81 -52 184 -160 354
3926C54o19K49J56o69J12Q92j035R16n98N5M10q2mj29k43K0N49m18J96O35q79
$$ 354 -265 -16 140 -529 -417 475 -560 356 -242 -187 223 141 137 8 -235 -215 334 -84 112 747 -132
3947a32r5R01l34l44M0j85N50J29r30O93j064K60J81J1Q6M45j80l61K73K32l42
$$ -132 -227 674 340 -4 36 -149 401 530 -400 293 -771 -511 -330 -319 -233 212 32 -329 -56 176 -166
3968a66L14L33o30N88n57l24N28j8n72M98J59j31L37J54j05m61M83n63M19J78
$$ -166 148 481 -149 439 -118 -442 86 68 -504 -6 153 22 359 513 408 -53 430 -133 286 464
3988D64n67L19j07J03j24l5j55P1J04l4k8p3K06j22q0J5Jl28M55j06J30J70l65
$$ 464 -103 216 109 212 88 53 -102 -31 73 39 11 -62 144 22 -58 -43 -42 -370 85 -21 109 279 -86
4011h6K38k80O58q16M7K11J30m70n1M87J49j81j58L37P2j87l06L51l34J61J9J69
$$ -86 152 -128 530 -286 -239 -28 102 -368 -419 68 217 36 -122 215 287 100 -206 145 -189 -28 -9 160
4033A60j61M55l34m34P58l34J79K24o43K9P57o23L0J56j86k79j2P11q13K63N48
$$ 160 -1 454 120 -314 444 110 289 513 -130 -101 656 33 63 219 33 -246 -258 453 -360 -97 451
4054D51n57J85r9P7J76o64O80j84J98j53r9J87m9k8j24Q4o0p13L18O51l93o4O7
$$ 451 -106 79 -20 57 233 -431 249 65 263 110 11 198 149 121 -3 81 21 -692 -374 277 -116 -180 -113
4077a13M25j89J75m50N2j17j1N35l36NR9Jo2J28j41J26%j63J63l2o4n5L0L6k01
$$ -113 312 123 298 -152 -100 -217 -228 307 -29 -24 75 76 14 142 1 127 127 -36 127 95 31 -24 6 42 -159
$$ [...]
8191c0
##END NTUPLES=NMR FID
##END=
