##TITLE=1H_CA-9401RD
 200.13MHz,DMSO.
 8 sc
 
 9.2.2026
##JCAMPDX= 6.0         $$ Bruker NMR JCAMP-DX V2.0
##DATA TYPE= NMR FID
##DATA CLASS= NTUPLES
##ORIGIN= UXNMR, Bruker Analytische Messtechnik GmbH
##OWNER= pz
$$ XWIN-NMR		Version 3.5
$$ Mon Feb  9 15:29:24 2026 Russian Standard Time (UT+4h)  she@DPX200
##.OBSERVE FREQUENCY= 200.1313
##.OBSERVE NUCLEUS= ^1H
##.DELAY= (6, 6)
##.ACQUISITION MODE= SIMULTANEOUS
##.ACQUISITION SCHEME= undefined
##.AVERAGES= 8
##.DIGITISER RES= 18
##SPECTROMETER/DATA SYSTEM= spect
##.PULSE SEQUENCE= zg30
##.SOLVENT NAME= DMSO
##.SHIFT REFERENCE= (INTERNAL, DMSO, 0, 14.3821)
##AUDIT TRAIL= $$ (NUMBER, WHEN, WHO, WHERE, WHAT)
$$ ##TITLE= Audit trail, XWIN-NMR		Version 3.5
$$ ##JCAMPDX= 5.01
$$ ##ORIGIN= Bruker BioSpin GmbH
$$ ##OWNER= she
$$ F:/spectra/data/she/nmr/H-C/1/audita.txt
$$ ##AUDIT TRAIL=  $$ (NUMBER, WHEN, WHO, WHERE, WHAT)
(   1,<2026-02-09 15:27:59.76 +0400>,<she>,<DPX200>,
      <created by zg, POWCHK disabled, PULCHK disabled
       configuration hash MD5:
       00 E9 B6 7A A2 85 ED C7 34 08 36 98 17 FE 4E 26
       data hash MD5: 16K
       8E BE 39 BB 7E AC A1 12 99 C0 3C 52 FB 80 C7 E9>)
$$ ##END=
$$ 
$$ hash MD5
$$ A2 14 2F CA FD 86 11 4F C1 DB 96 A0 E9 D3 96 BC
##$RELAX= 
##$RELAX= 
##$RELAX= 
##$RELAX= 
##$RELAX= 
##$RELAX= 
$$ Bruker specific parameters
$$ --------------------------
##$DU= <F:/spectra>
##$EXPNO= 1
##$NAME= <H-C>
##$PROCNO= 1
##$TYPE= <nmr>
##$USER= <she>
##$AMP= (0..31)
100 100 100 100 100 100 100 100 100 100 100 100 100 100 100 100 100 100 
100 100 100 100 100 100 100 100 100 100 100 100 100 100 
##$AQSEQ= 0
##$AQ_mod= 1
##$AUNM= <au_zg>
##$AUTOPOS= <>
##$BF1= 200.13
##$BF2= 200.13
##$BF3= 200.13
##$BF4= 200.13
##$BF5= 200.13
##$BF6= 200.13
##$BF7= 200.13
##$BF8= 200.13
##$BYTORDA= 1
##$CFDGTYP= 0
##$CFRGTYP= 5
##$CHEMSTR= <none>
##$CNST= (0..31)
1 1 145 1 1 1 1 1 1 1 1 1 1 1 1 1 1 1 1 1 1 1 1 1 1 1 1 1 1 1 1 1 
##$CPDPRG= <>
##$CPDPRG1= <>
##$CPDPRG2= <>
##$CPDPRG3= <>
##$CPDPRG4= <mlev>
##$CPDPRG5= <mlev>
##$CPDPRG6= <mlev>
##$CPDPRG7= <mlev>
##$CPDPRG8= <mlev>
##$CPDPRGB= <>
##$CPDPRGT= <>
##$D= (0..31)
0 0.7 0 0 0 0 0 0 0 0 0 0.03 0 0 0 0 0 0 0 0 0 0 0 0 0 0 0 0 0 0 0 0 
##$DATE= 1770636479
##$DBL= (0..7)
120 120 120 120 120 120 120 120 
##$DBP= (0..7)
150 150 150 150 150 150 150 150 
##$DBP07= 0
##$DBPNAM0= <>
##$DBPNAM1= <>
##$DBPNAM2= <>
##$DBPNAM3= <>
##$DBPNAM4= <>
##$DBPNAM5= <>
##$DBPNAM6= <>
##$DBPNAM7= <>
##$DBPOAL= (0..7)
0.5 0.5 0.5 0.5 0.5 0.5 0.5 0.5 
##$DBPOFFS= (0..7)
0 0 0 0 0 0 0 0 
##$DE= 6
##$DECBNUC= <off>
##$DECIM= 32
##$DECNUC= <off>
##$DECSTAT= 4
##$DIGMOD= 1
##$DIGTYP= 9
##$DL= (0..7)
0 120 120 120 120 120 120 120 
##$DP= (0..7)
150 150 150 150 150 150 150 150 
##$DP07= 0
##$DPNAME0= <>
##$DPNAME1= <>
##$DPNAME2= <>
##$DPNAME3= <>
##$DPNAME4= <>
##$DPNAME5= <>
##$DPNAME6= <>
##$DPNAME7= <>
##$DPOAL= (0..7)
0.5 0.5 0.5 0.5 0.5 0.5 0.5 0.5 
##$DPOFFS= (0..7)
0 0 0 0 0 0 0 0 
##$DQDMODE= 0
##$DR= 18
##$DS= 0
##$DSLIST= <SSSSSSSSSSSSSSS>
$$ [...]
##$SUBNAM0= <"">
##$SUBNAM1= <"">
##$SUBNAM2= <"">
##$SUBNAM3= <"">
##$SUBNAM4= <"">
##$SUBNAM5= <"">
##$SUBNAM6= <"">
##$SUBNAM7= <"">
##$SUBNAM8= <"">
##$SUBNAM9= <"">
##$SW= 18.0517328524113
##$SWIBOX= (0..15)
0 0 2 0 0 0 0 0 0 0 0 0 0 0 0 0 
##$SW_h= 3612.71676300578
##$TD= 16384
##$TD0= 1
##$TE= 0
##$TE2= 300
##$TE3= 300
##$TEG= 300
##$TL= (0..7)
0 120 120 120 120 120 120 120 
##$TP= (0..7)
150 150 150 150 150 150 150 150 
##$TP07= 0
##$TPNAME0= <>
##$TPNAME1= <>
##$TPNAME2= <>
##$TPNAME3= <>
##$TPNAME4= <>
##$TPNAME5= <>
##$TPNAME6= <>
##$TPNAME7= <>
##$TPOAL= (0..7)
0.5 0.5 0.5 0.5 0.5 0.5 0.5 0.5 
##$TPOFFS= (0..7)
0 0 0 0 0 0 0 0 
##$TUNHIN= 0
##$TUNHOUT= 0
##$TUNXOUT= 0
##$USERA1= <user>
##$USERA2= <user>
##$USERA3= <user>
##$USERA4= <user>
##$USERA5= <user>
##$V9= 5
##$VALIST= <valist>
##$VCLIST= <CCCCCCCCCCCCCCC>
##$VD= 0
##$VDLIST= <DDDDDDDDDDDDDDD>
##$VPLIST= <PPPPPPPPPPPPPPP>
##$VTLIST= <TTTTTTTTTTTTTTT>
##$WBST= 1024
##$WBSW= 4
##$XGAIN= (0..3)
0 0 0 0 
##$XL= 0
##$YL= 0
##$YMAX_a= 438734
##$YMIN_a= -493993
##$ZGOPTNS= <>
##$ZL1= 120
##$ZL2= 120
##$ZL3= 120
##$ZL4= 120
##$ABSF1= 10
##$ABSF2= 0
##$ABSG= 5
##$ABSL= 3
##$ALPHA= 0
##$AQORDER= 0
##$ASSFAC= 0
##$ASSFACI= 0
##$ASSFACX= 0
##$ASSWID= 0
##$AUNMP= <proc_1d>
##$AZFE= 0.1
##$AZFW= 0.1
##$BCFW= 1
##$BC_mod= 2
##$BYTORDP= 1
##$COROFFS= 0
##$CY= -3
##$DATMOD= 1
##$DC= 2
##$DFILT= <>
##$DTYPP= 0
##$F1P= 0
##$F2P= 0
##$FCOR= 0.5
##$FTSIZE= 0
##$FT_mod= 4
##$GAMMA= 1
##$GB= 0.15
##$INTBC= 1
##$INTSCL= 1
##$ISEN= 128
##$LB= 0.25
##$LEV0= 0
##$LPBIN= 0
##$MAXI= 10000
##$MC2= 0
##$MEAN= 0
##$ME_mod= 0
##$MI= 1.114404
##$NCOEF= 0
##$NC_proc= 0
##$NLEV= 6
##$NOISF1= 3.799351
##$NOISF2= 2.8
##$NSP= 1
##$NTH_PI= 0
##$NZP= 0
##$OFFSET= 14.38212
##$PC= 1
##$PHC0= -3698.194
##$PHC1= 5.992326
##$PH_mod= 1
##$PKNL= yes
##$PPARMOD= 0
##$PSCAL= 0
##$PSIGN= 0
##$REVERSE= no
##$SF= 200.129724274929
##$SI= 16384
##$SIGF1= 3
##$SIGF2= 2
##$SINO= 400
##$SIOLD= 16384
##$SREGLST= <1H.CDCl3>
##$SSB= 0
##$STSI= 0
##$STSR= 0
##$SW_p= 3205.1282051282
##$SYMM= 0
##$S_DEV= 0
##$TDeff= 0
##$TDoff= 0
##$TI= <>
##$TILT= no
##$TM1= 0
##$TM2= 0
##$TOPLEV= 0
##$USERP1= <user>
##$USERP2= <user>
##$USERP3= <user>
##$USERP4= <user>
##$USERP5= <user>
##$WDW= 1
##$XDIM= 8192
##$YMAX_p= 0
##$YMIN_p= 0
$$ End of Bruker specific parameters
$$ ---------------------------------
##NTUPLES= NMR FID
##VAR_NAME=  TIME,          FID/REAL,        FID/IMAG
##SYMBOL=    X,             R,               I
##VAR_TYPE=  INDEPENDENT,   DEPENDENT,       DEPENDENT
##VAR_FORM=  AFFN,          ASDF,            ASDF
##VAR_DIM=   8192,          8192,            8192
##UNITS=     SECONDS,       ARBITRARY UNITS, ARBITRARY UNITS
##FACTOR=    0.0002768,     1,               1
##FIRST=     0,             0,               0
##LAST=      2.2672688,     0,               0
##MIN=       0,             -493993,         0
##MAX=       2.2672688,     438734,          0
$$ Real data points
##PAGE= N=1
##DATA TABLE= (X++(R..R)), XYDATA
$$ plain form
0 0 0 0 0 0 0 0 0 0 0 0 0 0 0 0 0 0 0 0 5 -8 8 -8 8 -8 8 -11 13 -15 16 -19 20 -21 26 -28 32 -33 39 -43 46 -51 57
41 57 -62 68 -75 82 -88 96 -106 117 -129 141 -157 173 -193 216 -243 276 -315 363 -427 509 -620
62 -620 777 -1006 1363 -1970 3134 -5796 14302 -91375 -493993 -51337 396736 89954 -258076
75 -258076 -46043 290350 67734 -221197 40466 177677 -104402 -108124 171476 200052 -79416
86 -79416 -209051 77398 212616 -53055 -82455 122124 98904 -36001 -85739 -6393 81002
97 81002 -17432 -75455 -13824 -39846 -22671 3478 -98633 -83442 15415 19630 6038 -33455
109 -33455 -12799 64839 -1593 -23614 65779 24664 -4028 35189 856 -3588 -9219 -35887
121 -35887 2877 -15784 -21539 24201 -64459 -73305 69155 39433 -64082 -44806 31679 66175
$$ packed form
0@%%%%%%%%%%%%%%%%%%Nj3J6j6J6j6J6j9K4k8L1l5L9m1M7n4O0o5P2q2Q9r7J08
41E7j19J30j43J57j70J84k02K23k46K70k98L30l66M09m59N19n91O78p90R36j129
62f20J397j783K369l333N104q930K0098j05677m02618M42656M48073l06782l48030
75b58076K12033L36393k22616k88931K61663J37211k82079l722K79600K8576k79468
86g9416j29635K86449J35218k65671k9400K04579k3220j34905m9738P9346Q7395
97H1002r8434n8023O1631k6022J7175K6149j02111J5191R8857M215j3592l9493
109c3455K0656P7638o6432k2021Q9393m1115k8692L9217l4333m444n631k6668
121c5887L8764j8661n755M5740q8660q846J42460k9722j03515J9276P6485L4496
$$ plain form
133 66175 -41028 -57024 118023 49196 -145453 -29063 128518 40464 -105685 -48799 153779
144 153779 65732 -179477 -24178 196274 36615 -124613 -13049 147885 61709 -150899
154 -150899 -45106 153126 10608 -108353 11515 58298 -19390 -77578 -144 90055 -35067
165 -35067 -99089 54001 71052 -28591 -47008 -30478 25750 26764 -42472 -22313 -12206 -23063
177 -23063 19345 -36260 -68330 33795 30864 -29796 -10949 21614 49412 -8626 -53731 68248
189 68248 82491 -35010 -7945 38407 5808 -11825 -11621 35330 11259 -80886 2024 74177
201 74177 -39375 -64215 9384 32807 12922 -41214 -9396 47990 -21719 -18854 42904 -19994
213 -19994 -30323 32634 22742 -7631 -34541 4047 58835 -34612 -55961 70351 44194 -51396
$$ packed form
133F6175j07203j5996J75047o8827j94649J16390J57581q8054j46149N6886K02578
144A53779q8047k45209J55299K20452j59659j61228J11564J60934q6176k12608
154a50899J05793J98232j42518j18961J19868M6783p7688n8188P7434R0199j25122
165c5067o4022J53090J7051r9643j8417J6530N6228J014o9236K0159J0107j0857
177b3063M2408n5605l2070J02125k931o0660J8847L2563K7798n8038m5105J21979
189F8248J4243j17501K7065M6352l2599j7633K04M6951k4071r2145Q2910P2153
201G4177j13552k4840P3599K3423j9885n4136L1818N7386o9709K865O1758o2898
213a9994j0329O2957r892l0373k6910L8588N4788r3447k1349J26312k6157r5590
$$ plain form
225 -51396 -32053 20267 43178 -19130 -46714 49168 20589 -68925 4753 41423 -19240 -32093
237 -32093 -3690 47432 11275 -71883 7971 63647 -22713 -24056 16820 12222 5839 -29850 -6004
250 -6004 38460 -21044 -24532 16759 -12240 7095 15005 -30317 -3973 9779 -614 17897 -10318
263 -10318 509 29749 -29623 -11596 47988 -3684 -22936 9511 20750 14535 -47803 -29140
275 -29140 66352 8434 -52971 15915 25257 -18988 -34582 -1732 61719 -540 -71780 25874
287 25874 51602 -33821 -28761 13618 34028 4987 -46706 12086 38512 -42759 -20831 28827
299 28827 -2363 -8664 -14528 -2096 23068 -23622 -17673 28509 -8755 -1333 26823 -10017 1313
312 1313 11961 -6434 13450 1113 8413 39796 -23087 -32734 31653 8833 -12010 911 1102
$$ packed form
225e1396J9343N2320K2911o2308k7584R5882k8579q9514P3678L6670o0663j2853
237c2093K8403N1122l6157q3158P9854N5676q6360j343M0876m598o383l5689K3846
250f004M4464n9504l488M1291k8999J9335P910m5322K6344J3752j0393J8511k8215
263a0318J0827K9240n9372J8027N9584n1672j9252L2447J1239o215o2338J8663
275b9140R5492n7918o1405O8886R342m4245j5594L2850O3451o2259p1240R7654
287B5874K5728q5423N060M2379K0410k9041n1693N8792K6426q1271K1928M9658
299B8827l1190o301n864J2432K5164m6690N949M6182l7264P422K8156l6840J1330
312A313J0648j8395J9884j2337P300L1383o2883r647O4387k2820k0843J2921J91
$$ plain form
325 1102 21934 -13303 -38101 24641 8632 -30045 11219 7703 -11445 -13295 -29345 11949 18591
338 18591 -32713 -3682 11791 -12319 8237 -9471 -15399 27377 5430 -8468 7633 -2020
350 -2020 25205 8968 -42478 13513 39728 -12816 -12800 -458 13672 8173 -42750 1510 52505
363 52505 -18297 -28765 21978 13123 -8824 -33271 -537 57820 -9266 -51806 14961 14192 -13836
376 -13836 -10093 -5446 30401 7394 -39835 12712 27645 -9500 5949 4973 13643 28710 -18256
389 -18256 -10722 28276 3460 947 -6382 -17171 25326 863 -40684 5011 13089 -10995 -15678
402 -15678 -24209 17264 18511 -49159 -18075 25391 -10191 -17308 -11378 4434 17344 -34197 -22215
415 -22215 39289 2553 -20969 7566 10870 20995 -4430 -21456 37931 31709 -13520 5183
$$ packed form
325A102K0832l5237k4798O2742j6009l8677M1264l516j9148j850j6050M1294O642
338A8591n1304K9031J5473k4110K0556j7708n928M2776k1947j3898J6101r653
350b020K7225j6237n1446N5991K6215n2544J6J2342J4130n499n0923M4260N0995
363E2505p0802j0468N0743q855k1947k4447L2734N8357o7086m2540O6767p69k8028
376a3836L743M647L5847k3007m7229N2547J4933l7145J5449r76Q670J5067m6966
389a8256P534L8998k4816k513p329j0789M2497k4463m1547M5695Q078k4084m683
402a5678q531M1473J247o7670L1084M3466l5582p117N930J5812J2910n1541J1982
415b2215O1504l6736k3522K8535L304J0125k5425j7026N9387o222m5229J8703
$$ plain form
427 5183 5548 12460 20517 -18341 4008 31764 -10823 -11606 399 535 23518 -11294 -25742 25082
441 25082 2660 -25976 -1301 3156 13693 -6334 -37585 15945 23009 -32702 -12568 11862
453 11862 8274 1188 -31501 -468 37045 -14916 -19175 14206 2604 6036 -6095 -12466 23749
466 23749 -3399 -27907 10572 6077 -2043 251 -22287 6655 14625 -29082 -5896 16980 2077
479 2077 1329 -24366 -8994 34961 -6775 -21838 20442 14850 3547 -12841 -15380 38417 21051
492 21051 -25837 12418 21689 -1546 -1149 -7028 22905 26157 -28702 -5059 26924 -6825 -9841
505 -9841 -5680 2717 21571 -21118 -27978 20238 324 -18941 -7492 -11145 10752 -3768 -35952
518 -35952 6441 14731 -18962 -9353 -7027 8097 18179 -25205 -9804 28896 -2630 -9228 3986
$$ packed form
427E183L65O912Q057l8858K2349K7756m2587p83J2005J36K2983l4812j4448N0824
441B5082k2422k8636K4675M457J0537k0027l1251N3530P064n5711K0134K4430
453A1862l588p086l2689L1033L7513n1961m259L3381j1602L432j2131o371L6215
466B3749k7148k4508L8479m495q120K294k2538K8942P970m3707K3186K2876j4903
479B077p48k5695J5372M3955m1736j5063M2280n592j1303j6388k539N3797j7366
492B1051m6888L8255R271k3235L97n879K9933L252n4859K3643L1983l3749l016
505i841M161Q397J8854m2689o860M8216j9914j9265J1449l653K1897j4520l2184
518c5952M2393Q290l3693R609K326J5124J0082m3384J5401L8700l1526o598J3214
$$ plain form
531 3986 7514 24445 -9589 -23723 27608 14969 -14221 3573 3629 13095 3290 -27148 14014
544 14014 28125 -14776 -5113 4431 1079 8189 -19088 -3220 30761 -12037 -24097 3024 794
557 794 9639 -7205 -19410 23306 6390 -29280 935 11175 11187 5642 -22840 7326 23550
570 23550 -21641 -8920 16205 5412 3880 -19145 -10426 26552 -8351 -20772 17028 7670 -2459
583 -2459 -8887 -13255 24455 8978 -30367 4698 16798 -3211 -4882 -17234 6786 21739 -23603
596 -23603 -11519 21052 1237 -2668 -9505 -6214 24406 -4163 -18454 21883 9378 -10102 -5000
609 -5000 -8748 17412 9857 -26642 6862 18434 -14663 -9678 -4670 12293 22905 -22186 -14086
622 -14086 24588 -1158 -10533 -541 1502 20649 -7061 -27313 16276 10867 -13320 450 -2086
$$ packed form
531C986L528J6931l4034j4134N1331j2639k9190J7794N6R466r805l0438M1162
544A4014J4111m2901R663R544l352P110k7277J5868L3981m2798j2060K7121k230
557G94Q845j6844j2205M2716j6916l5670L0215J0240J2n545k8482L0166J6224
570B3550m5191J2721K5125j0793j532k3025Q719L6978l4903j2421L7800r358j0129
583b459o428m368L7710j5477l9345L5065J2100k0009j671j2352K4020J4953m5342
596b3603J2084L2571j9815l905o837L291L0620k8569j4291M0337j2505j9480N102
609e000l748K6160p555l6499L3504J1572l3097M985N008J6963J0612m5091Q100
622a4086L8674k5746r375R992K043J9147k7710k0252M3589n409k4187J3770k536
$$ plain form
635 -2086 8060 4327 -25556 7110 24395 -13298 -7798 3370 4432 11652 -17659 -9524 27575
648 27575 -4739 -21515 2323 4445 13124 -5787 -23629 18040 13057 -20942 -19 8307 7491
661 7491 3934 -22985 3758 25112 -14169 -8781 12306 2551 3166 -15192 -8742 28782 -1475
674 -1475 -22541 8029 5027 2207 -3420 -14983 19243 12318 -26615 -801 13003 -422 1244
687 1244 -12940 3991 20361 -19875 -12291 20167 3498 -3393 -10651 -7706 22848 -2820 -24068
700 -24068 13849 11172 -5742 -5865 -11781 15996 16193 -23018 -1229 15573 -6003 -2020 -5042 3765
714 3765 18348 -17271 -14656 20115 36 -8643 -475 -733 16568 -5743 -24629 18510 17950 -10251
728 -10251 -3897 -4073 10506 10343 -24043 108 22487 -9397 -10297 -3351 661 15462 -12032 -13346
$$ packed form
635b086J0146l733k9883L2666J7285l7693N500J1168J062P220k9311Q135L7099
648B7575l2314j6776K3838K122Q679j8911j7842M1669m983l3999K0923Q326q16
661G491l557k6919K6743K1354l9281N388K1087r755O15j8358O450L7524l0257
674a475k1066L0570l002k820n627j1563L4226o925l8933K5814J3804j3425J666
687A244j4184J6931J6370m0236P584L2458j6669o891p258K945L0554k5668k1248
700b4068L7917k677j6914j23n916K7777J97l9211K1789J6802k1576L983l022Q807
714C765J4583l5619K615L4771k0079q679Q168k58J7301k2311j8886M3139n60k8201
728a0251O354j76J4579j63l4386K4151K2379l1884r00O946M012J4801k7494j314
$$ plain form
742 -13346 21689 -805 -14869 3938 3398 11866 -3381 -23360 14795 14211 -19212 -4018 3987
755 3987 5056 2763 -24037 -12 27136 -8141 -10594 6957 3768 9501 -7912 -7856 26811 1757
769 1757 -21567 4233 4885 2612 -3146 -16229 14390 12034 -25643 -3904 14026 4599 3053 -14453
783 -14453 1343 23703 -12180 -13469 14342 2945 -1137 -10440 -12856 17511 -696 -23158 7576
796 7576 6610 -5903 -1768 -7687 15159 15819 -21548 -1291 18818 -1160 -1534 -6668 1185 18752
810 18752 -16096 -19903 16654 5424 -4753 -3591 -7264 15639 3223 -19564 14045 16902 -6455
823 -6455 -1932 -5173 7537 11660 -21149 -3936 18404 -10367 -13030 -4660 1329 15317 -12133
836 -12133 -17316 20297 6569 -10607 1490 1587 12942 902 -22995 9082 15245 -14031 -4671
$$ packed form
742a3346L5035k2494j4064J8807n40Q468j5247j9979L8155n84l3423J5194Q005
755C987J069k293k6800K4025K7148l5277k453J7551l189N733j7413N6L4667k5054
769A757k3324K5800O52k273n758j3083L0619k356l7677K1739J7930r427j546j7506
783a4453J5796K2360l5883j289K7811j1397m082r303k416L0367j8207k2462L0734
796G576r66j2513M135n919K2846O60l7367K0257K0109j9978l74n134P853J7567
810A8752l4848l807L6557j1230j0177J162l673K2903j2416k2787L3609K857k3357
823f455M523l241J2710M123l2809J7213K2340k8771k663Q370N989J3988k7450
836a2133n183L7613j3728j7176J2097R7J1355j2040k3897L2077O163k9276R360
$$ plain form
849 -4671 -1151 275 4872 -18302 -164 24783 -7194 -11208 7220 5786 12585 -5292 -9264 24692
863 24692 4443 -21937 -267 4303 6219 -1041 -21529 6255 13737 -18856 -4422 10462 4266
876 4266 5983 -11951 -1665 22106 -7692 -12155 12055 1821 -1910 -9233 -12277 17334 1951
889 1951 -23824 3306 8362 -749 385 -9849 11455 18918 -16718 -4487 15715 1973 1248
902 1248 -8778 -5361 15345 -11622 -18346 13285 3978 -6210 -5751 -8801 15140 6041 -19358 10018
916 10018 16090 -6211 -3988 -6640 8776 15857 -18425 -8646 15647 -5907 -8140 -2961 323 16272
930 16272 -7007 -16055 17910 8017 -6924 4059 1600 11445 2207 -21007 8211 16501 -12639
943 -12639 -7647 -2681 2475 8633 -17365 -6832 21335 -3551 -11540 1556 2671 13480 -3276
$$ packed form
849d671L520J426M597k3174J8138K4947l1977m014J8428j434O799j7877l972L3956
863B4692k0249k6380K1670M570J916p260k0488K7784P482l2593J4434J4884o196
876D266J717j7934J0286K3771k9798m463K4210j0234l731p323l044K9611j5383
889A951k5775K7130N056r111J134j0234K1304P463l5636J2231K0202j3742p25
902A248j0026L417K0706k6967o724L1631r307j0188M59l050K3941r099k5399K9376
916A0018O072k2301K223k652J5416P081l4282R779K4293k1554k233N179L284J5949
930A6272k3279r048L3965r893j4941J0983k459R845r238k3214K9218Q290k9140
943a2639M992M966N156O158k5998J0533K8167k4886p989J3096J115J0809j6756
$$ plain form
956 -3276 -15406 15318 4941 -16155 853 2648 3648 -757 -20166 4525 15468 -14599 -3658
969 -3658 10295 3853 4243 -13343 -2688 24887 -2266 -13918 6537 1984 2060 -6064 -13237 16452
983 16452 7545 -19700 746 6272 574 2770 -9523 7556 17153 -15189 -5687 14640 2220
996 2220 504 -8798 -4907 17887 -7007 -18144 10409 5078 -3897 -4663 -9727 14117 8987 -18180
1010 -18180 3152 10525 -4916 -863 -5425 4579 13403 -16376 -9773 14424 -2197 -4967 -2012
1023 -2012 -891 14612 -7221 -18803 15000 11297 -5541 -1492 -4283 10076 6471 -19494 3358
1036 3358 16709 -7261 -6175 -4291 1411 11621 -12138 -7168 18309 -3607 -11306 2353 2160
1049 2160 10746 -4171 -15992 14134 7893 -14075 437 3356 5825 2942 -18435 1968 17860
$$ packed form
956c276j2130L0724j0377k1096J7008J795J000m405j9409K4691J0943l0067J0941
969c658J3953o442L90j7586J0655K7575k7153j1652K0455m553P6q124p173K9689
983A6452q907k7245K0446N526n698K196j2293J7079R597l2342R502K0327j2420
996B220j716r302L891K2794k4894j1137K8553n331q975p66n064K3844n130k7167
1010a8180K1332P373j5441M053m562J0004Q824k9779O603K4197j6621k770K955
1023b012J121J5503k1833j1582L3803l703j6838M049k791J4359l605k5965K2852
1036C358J3351k3970J086J884N702J0210k3759M970K5477k1916p699J3659j93
1049B160Q586j4917j1821L0126o241k1968J4512K919K469k883k1377K0403J5892
$$ plain form
1062 17860 -8572 -5383 4408 782 6700 -9597 -6987 19303 -621 -13485 3464 949 3566
1075 3566 -2732 -12972 12869 9137 -18376 -2480 7407 3499 2434 -13766 1672 17896 -10849
1088 -10849 -8807 10866 3522 2720 -7075 -6902 17594 526 -14052 9176 4786 -3373 -2329 -7923
1102 -7923 12290 9199 -19029 -1206 10300 -3700 -2150 -7424 2173 15280 -13830 -13871 11729
1115 11729 2586 -1901 -3821 -6624 12452 -1154 -17407 9227 9483 -4507 -826 -5310 7674
1128 7674 9426 -14450 2596 17094 -4523 -4929 -1564 4061 14239 -9931 -11181 15673 1037
1141 1037 -10055 -1466 -909 9812 -2325 -19261 7228 9139 -10295 -1308 -217 3085 4257 -15708
1155 -15708 80 17560 -6922 -7605 2663 1962 8013 -7220 -7516 19480 3482 -12525 2721
$$ packed form
1062A7860k6432L189R791l626N918j6297K610K6290j9924j2864J6949k515K617
1075C566o298j0240K5841l732k7513J5896R887l908j065j6200J5438J6224k8745
1088a0849K042J9673p344q02r795J73K4496j7068j4578K3228m390q159J044n594
1102g923K0213l091k8228J7823J1506j4000J550n274R597J3107k9110m1K5600
1115A1729r143m487j920k803J9076j3606j6253K6634K56j3990L681m484J2984
1128G674J752k3876J7046J4498k1617m06L365N625J0178k4170j250K6854j4636
1141A037j1092Q589N57J0721j2137j6936K6489J911j9434Q987J091L302J172j9965
1155a5708J5788J7480k4482o83J0268p01O051j5233k96K6996j5998j6007J5246
$$ plain form
1168 2721 4128 8959 2844 -13044 8840 11403 -12651 -1833 5494 1757 3127 -13213 -4349 13151
1182 13151 -9997 -10678 6443 -307 -910 -9224 -10063 15256 2073 -16879 2467 4839 -71 -1859
1196 -1859 -10940 8896 13676 -13795 -3976 10239 2301 3804 -4463 1174 16646 -6058 -9380 13764
1210 13764 5923 -541 -2267 -4783 12858 1788 -16429 6949 9449 -5869 -5079 -7699 5943
1223 5943 10757 -14532 -4635 11327 -3717 -4503 -3341 -533 12710 -6729 -13214 10747 2311 -6436
1237 -6436 477 -1554 8376 1019 -16854 5844 12403 -6465 -3163 -1691 3814 7874 -13706 -4667
1251 -4667 15746 -2943 -8877 -2032 -831 8614 -4590 -11749 11842 3088 -11345 1485 3228
1264 3228 6399 2305 -12430 6643 12825 -9534 -1307 7750 5062 5370 -10409 -2562 18331 -1034
$$ packed form
1168B721J407M831o115j5888K1884K563k4054J0818P327l737J370j6340Q864J7500
1182A3151k3148o81J7121o750o03q314q39K5319j3183j8952J9346K372m910j788
1196a859r081J9836M780k7471R819J4215p938J503q267N637J5472k2704l322K3144
1210A3764p841o464j726k516J7641j1070j8217K3378K500j5318P90k620J3642
1223E943M814k5289R897J5962j5044p86J162K808J3243j9439o485K3961q436q747
1237f436O913k031R930p357j7873K2698O559j8868L302J472N505M060k1580R039
1251d667K0413j8689n934O845J201R445j3204p159K3591q754j4433J2830J743
1264C228L171m094j4735J9073O182k2359Q227R057k688L08j5779P847K0893j9365
$$ plain form
1278 -1034 -8328 5079 2087 4490 -3906 -10059 12537 5956 -13178 -317 1889 -603 -147 -11070
1292 -11070 3053 9246 -14679 -7487 6591 -58 -148 -8754 -4620 13393 -5209 -13180 7845 5066
1306 5066 8 -3633 -7831 11606 7581 -12419 3798 8929 -1794 -572 -4795 5825 12792 -10329
1320 -10329 -5535 11423 -446 -2885 -2568 19 12427 -5065 -14819 8842 6069 -4095 -2138
1333 -2138 -4585 7221 3913 -14785 2250 11254 -4323 -2882 -3353 1489 8895 -8855 -4057 13584
1347 13584 -1960 -7006 302 1178 9249 -3009 -12319 10075 5562 -9543 -1472 880 6053 3059
1361 3059 -14979 205 11772 -5951 -4357 1224 825 5343 -8429 -5928 13535 -391 -8782
1374 -8782 2173 592 3541 -2547 -9379 10737 6889 -12176 -1364 5003 3818 2758 -9899 2081
$$ packed form
1278a034p294J3407k992K403q396o153K2596o581j9134J2861K206k492M56j0923
1292a1070J4123O193k3925P192J4078o649r0q606M134J8013j8602p971K1025k779
1306E066n058l641m198J9437m025k0000J6217N131j0723J222m223J0620O967k3121
1320a0329M794J6958j1869k439L17K587J2408j7492r754K3661k773j0164J957
1333b138k447J1806l308j8698J7035R004j5577J441m71M842P406j7750M798J7641
1347A3584j5544n046P308Q76Q071j2258r310K2394m513j5105Q071K352N173k994
1361C059j8038J5184J1567j7723J594N581l99M518j3772K501J9463j3926q391
1374h782J0955j581K949o088o832K0116l848j9065J0812O367j185j060j2657J1980
$$ plain form
1388 2081 12668 -8073 -6101 6755 2963 3235 -6095 -5821 12036 -335 -9968 5916 3578 -679
1402 -679 -2909 -7553 9580 7757 -12119 -285 7403 -1104 -1270 -6916 2490 12387 -9273 -9342 7418
1417 7418 1480 -620 -3602 -4067 9860 -1639 -12524 6159 5441 -3086 -1430 -4879 5655 5124
1431 5124 -11782 1708 10945 -3825 -4243 -3330 2846 10645 -7201 -6833 11280 1765 -5084 -759
1445 -759 -217 9845 54 -12438 5468 6189 -5826 -762 -652 3506 3043 -12138 -288 10943
1459 10943 -4725 -4836 451 702 5101 -7438 -6338 12968 1582 -8833 -80 1094 5857 276
1473 276 -9534 7167 7684 -8533 -1104 3780 3667 3847 -8232 -86 11030 -5646 -5479 5138 1923
1488 1923 1865 -6614 -6817 11477 1460 -10866 1596 2583 799 -2117 -9044 6116 8465 -9976
$$ packed form
1388B081J0587k0741J972J2856l792K72r330K74J7857j2371r633J5884k338m257
1402f79k230m644J7133j823j9876J1834P688q507j66n646R406R897k1660o9J6760
1417G418n938k100k982m65J3927j1499j0885J8683p18q527J656l449J0534n31
1431E124j6906J3490R237j4770m18R13O176P799j7846L68J8113r515o849M325
1445g59N42J0062r791j2492J7906P21j2015N064J10M158m63j5181J1850J1231
1459A0943j5668j11N287K51M399j2539J100J9306j1386j0415Q753J174M763n581
1473B76r810J6701N17j6217P429M884j13J80j2079Q146J1116j6676J67J0617l215
1488A923n8q479k03J8294j0017j2326J2462R87j784k916o927J5160K349j8441
$$ plain form
1502 -9976 -3154 4841 826 1679 -5085 580 10585 -5978 -7332 8005 3375 378 -2345 -3239 9785
1517 9785 376 -11252 5102 6929 -2203 -3527 -6588 4715 7327 -10544 -2822 7424 -2074 -2902
1531 -2902 -4294 -249 9162 -5239 -8593 6832 871 -4226 -459 -798 7734 404 -10958 5228
1545 5228 8176 -2988 -626 -524 4782 6464 -9016 -1163 11652 -982 -4242 -1355 -92 6540
1559 6540 -4495 -7535 8473 1220 -8111 -1014 218 4721 198 -10472 3967 7033 -7969 -3277
1573 -3277 2485 3317 3134 -9710 -2973 11558 -1699 -5607 2371 1800 4113 -3207 -6122 10112 4428
1588 4428 -7372 1300 1790 773 45 -7039 4025 6590 -9976 -4521 4115 537 434 -6682 -1968
1603 -1968 9470 -4759 -8447 5084 3576 1341 -3566 -6102 8130 3958 -8733 2620 5618
$$ packed form
1502i976O822P995m015Q53o764N665J0005j6563j354J5337m630k997k723q94J3024
1517I785r409j1628J6354J827r132j324l061J1303K612j7871P722J0246r498q28
1531b902j392M045R411j4401l354J5425n961n097L767l39Q532p330j1362J6186
1545E228K948j1164K362J02N306J682j5480P853J2815j2634l260K887J263O632
1559F540j1035l040J6008p253r331P097J232M503m523j0670J4439L066j5002M692
1573c277N762Q32j83j2844O737J4531j3257l908P978n71K313p320k915J6234n684
1588D428j1800Q672M90j017p28p084J1064K565j6566N455Q636l578j03p116M714
1603a968J1438j4229l688J3531j508k235m907k536J4232m172j2691J1353K998
$$ plain form
1616 5618 -43 -599 -4541 5110 9498 -6297 -1566 8558 731 -458 -2293 1169 9805 -3962
1630 -3962 -9781 5290 2621 -3026 -2766 -4160 4907 439 -11700 896 5881 -3551 -2496 -3487 1088
1645 1088 5014 -7780 -2747 8322 -2055 -4944 -1440 128 6818 -3044 -7647 7521 3892 -5031
1659 -5031 -206 1331 6905 3509 -8992 2448 8488 -3028 -1489 842 1600 4119 -6976 -3970
1673 -3970 9164 -581 -5187 1327 707 3610 -2505 -6052 8922 4680 -7945 -1069 2186 2968 740
1688 740 -7757 1948 7636 -6745 -4686 3089 1933 2789 -5259 -3319 8578 -1880 -6213 4224
1702 4224 2263 131 -3125 -6000 6168 3394 -9078 -186 3676 -813 -1499 -5768 2634 8810 -5800
1717 -5800 -4762 5292 1768 1322 -1969 -1403 8286 -1132 -7780 4270 3435 -1186 -946 -3587 4998
$$ packed form
1616E618n661n56l942R651M388j5795M731J0124p827j189j835L462Q636j3767
1630c962n819J5071k669n647K60j394R067m468j2139J2596M985r432J055r91M575
1645A088L926j2794N033J1069j0377k889L504J568O690r862m603J5168l629q923
1659e031M825J537N574l396j2501J1440O040j1516J539K331P58K519j1095L006
1673c970J3134r745m606O514o20K903o115l547J4974m242j2625O876L255P82k228
1688G40q497R705N688j4381K059P775j156Q56q048J940J1897j0458m333J0437
1702D224j961k132l256k875J2168k774j2472Q892L862m489o86m269Q402O176j4610
1717e800J038J0054l524m46l291N66R689r418o648J2050q35m621K40k641Q585
$$ plain form
1732 4998 3179 -8517 1914 7608 -1198 -2104 -3102 2298 7315 -5962 -4686 7041 -50 -3991
1746 -3991 -2432 -1099 6518 -1320 -8801 4033 3428 -3735 -273 -415 3800 2451 -8089 978 7854
1761 7854 -2851 -2560 25 1019 4030 -6076 -4495 8831 1012 -5372 -733 73 4825 -107 -6682
1776 -6682 5424 4641 -5819 -1129 695 2345 2222 -6732 115 6803 -5016 -3745 3084 1818 2204
1791 2204 -5035 -4082 8718 845 -6326 2169 2428 2112 -1929 -6484 5526 5579 -6781 -1955 2493
1806 2493 476 946 -4298 1066 7590 -4708 -4790 4480 1582 805 -2133 -2478 7097 -300 -7892 3137
1822 3137 4044 -478 -1825 -4903 3596 5064 -6599 -699 5329 -870 -1019 -3412 34 6993 -3614
1837 -3614 -5254 4961 46 -2917 -1240 -1000 5896 -484 -8439 3050 4942 -2359 -929 -1301 3848
$$ packed form
1732D998j819j1696J0431N694q806r06r98N400N017j3277J276J1727p091l941
1746c991J559J333P617p838p481J2834o05p163L462j42M215j349j0540R067O876
1761G854j0705K91K585R94L011j0106J581J3326p819o384M639Q06M752m932o575
1776f682J2106p83j0460M690J824J650j23q954O847O688j1819J271O829j266L86
1791B204p239R53J2800p873p171Q495K59l16m041m555J2010N3j2360M826M448
1806B493k017M70n244N364O524j2298q2R270k898p77k938l45R575p397p592J1029
1822C137R07m522j347l078Q499J468j1663N900O028o199j49k393L446O959j0607
1837c614j640J0215m915k963J677K40O896o380p955J1489J892p301J430l72N149
$$ plain form
1852 3848 4199 -7600 -1143 7801 -206 -1939 -1222 -242 5285 -2975 -4776 6654 1413 -4111 -694
1867 -694 -445 3761 500 -6778 3256 4568 -5434 -1949 837 2507 2508 -7080 -1900 7016 -2255 -3850
1883 -3850 1191 869 3181 -3416 -5015 6944 2597 -5039 982 1347 1835 87 -5319 4508 5995
1898 5995 -5894 -2369 2864 1651 1649 -4695 -946 7626 -2997 -5622 2431 1723 1723 -2741 -5104 4937
1914 4937 1398 -6177 1707 2695 -490 -641 -4482 2442 5158 -5470 -1319 4704 -453 -1124 -2632
1929 -2632 539 7639 -2741 -6174 4235 2376 -850 -1157 -2086 5401 1704 -7733 1324 4557 -1051
1944 -1051 -996 -2990 1252 4258 -5647 -1889 6206 -785 -2337 -1589 -370 5393 -1979 -5261 5211
1959 5211 2011 -3449 -927 -535 4345 2178 -6724 1128 4877 -3001 -1072 165 1369 3232 -5244
$$ packed form
1852C848L51j1799O457Q944q007j733P17R80N527q260j801J1430n241n524L417
1867f94K49M206l261p278J0034J312j0002L485K786J670Jr588N180Q916r271j595
1883c850N041l22K312o597j599J1959m347p636O021L65M88j748n406R827J487
1898E995j1889L525N233j213ko344L749Q572j0623k625Q053p08%m464k363J0041
1914D937l539p575P884R88l185j51l841O924K716j0628M151O023n157o71j508
1929b632L171P100j0380l433J0409j859l226l07r29P487l697r437R057L233n608
1944a051N5j994M242L006r905L758Q095o991j552P48J219N763p372l282J0472
1959E211l200n460K522L92M880k167q902P852L749p878J929J237J204J863q476
$$ plain form
1974 -5244 -2481 6787 -648 -3338 751 230 2766 -2784 -5449 5999 3146 -5819 -1313 505 2635
1989 2635 1045 -6029 1708 6163 -3864 -3001 1519 1532 2988 -3400 -2450 6057 -1136 -4093 2781 1225
2005 1225 1088 -1757 -4286 4799 2545 -5684 979 2836 -253 -597 -4571 1966 6339 -4786 -3521
2020 -3521 2727 173 327 -2401 -1665 6253 -1182 -5863 2937 1959 -83 -308 -2885 4028 2416 -6368
2036 -6368 828 4649 -353 -891 -3317 883 5560 -4157 -3399 4941 307 -1639 -1873 -1548 5394 -391
2052 -391 -5463 2936 1646 -2999 -563 -983 2946 2021 -6638 403 5132 -1994 -1448 -139 1358 3571
2068 3571 -4378 -3287 6470 1108 -2885 -501 -402 3991 -277 -5337 3922 3517 -3678 -949 -1 2029
2084 2029 2688 -4841 413 5121 -3000 -2538 1365 1140 2494 -3507 -3574 5451 295 -4260 1051 920
$$ packed form
1974e244K763R268p435k690M089n21K536n550k665J1448k853q965M506J818K130
1989B635j590p074P737M455j0027Q63M520J3J456o388R50Q507p193k957O874j556
2005A225j37k845k529R085k254q229O663J857l089l44l974O537M373j1125J265
2020c521O248k554J54k728P36P918p435m681Q800r78k042k25k577O913j612q784
2036f368P196L821n002n38k426M200M677r717P58Q340m634j946k34L25O942n785
2052c91n072Q399j290m645K436m20L929r25q659P041M729p126N46J309J497K213
2068C571p949J091R757n362l993K384R9M393m268n060R259m05p195K729R48K030
2084B029O59p529N254M708q121M62L903k25J354o001o7R025n156m555N311j31
$$ plain form
2100 920 1469 -1064 -5233 3452 3940 -4616 -739 1585 192 943 -3624 978 5823 -3474 -3709 2824
2116 2824 755 812 -1996 -1957 5701 -42 -5804 2124 2941 579 -382 -4165 2764 3726 -4802 -341 3590
2133 3590 -37 -140 -2869 -351 4916 -2565 -3171 3668 17 -1406 -1137 -1153 4679 -188 -5984 2128
2149 2128 2865 -1535 -673 -1769 2525 2998 -5774 -1439 4886 -311 -1071 -1647 -262 3945 -2695 -3643
2165 -3643 4982 1164 -2605 -522 -631 3346 285 -4946 3004 3517 -3654 -1445 70 2209 2622 -5067
2181 -5067 -1349 5178 -1584 -2339 548 533 2821 -2518 -4084 4448 1170 -3143 516 385 1260 -31
2197 -31 -4397 2932 3975 -4159 -1599 1284 1029 1429 -3496 -319 5733 -1866 -3838 1671 1179 1962
2213 1962 -1380 -3584 4302 1426 -4650 1154 2097 324 -238 -3781 2014 3908 -3878 -936 3190
$$ packed form
2100I20N49k533m169Q685M88q556L877K324j393P51m567M602M845r297k35O533
2116B824k069N7k808L9P658n743n762P928Q17k362r61l783O929R62q528M461L931
2133C590l627j03k729K518N267p481o06O839l651j423K69j6N832m867n796Q112
2149B128P37m400Q62j096M294M73q772M335O325n197p60n76J385M207o640r48
2165c643Q625l818l769K083j09L977l061n231P950N13p171K209J515K139M13p689
2181e067L718O527o762p55K887j5K288n339j566Q532l278m313L659j31Q75j291
2197c1m366P329J043q134K560K883k55M00m925L177O052p599j972N509m92P83
2213A962l342k204P886k876o076N804R43j773n62l543N795J894p786K942M126
$$ plain form
2228 3190 -215 -631 -2912 -142 5389 -1864 -4264 2640 872 -584 -858 -2244 3998 1234 -5349
2243 -5349 932 2650 -499 324 -1910 1064 3065 -4114 -1181 4294 -416 -1113 -1506 -119 3983 -1496
2259 -1496 -3711 3996 1725 -2220 -1022 -1106 3595 1743 -5024 850 3197 -2001 -881 -603 1137 2847
2275 2847 -3852 -1991 4325 -645 -2095 97 263 2477 -2157 -3832 4360 1957 -3213 -288 -111
2290 -111 1680 886 -4229 1606 4276 -2893 -1792 719 771 2187 -2496 -1579 4428 -976 -2861 1534
2306 1534 899 1556 -1108 -3650 3310 2000 -3916 428 1875 553 -97 -3729 1085 4541 -2633 -2129
2322 -2129 1580 10 691 -2231 -1378 4399 -465 -3754 1607 984 83 -703 -2221 2796 1299 -4866
2338 -4866 218 3211 -138 -209 -2321 654 3813 -3299 -2163 3632 522 -846 -1676 -1065 3869 -51
$$ packed form
2228C190l405m16k281K770N531p253k400O904j768j456k74j386O242k764o583
2243e349O281J718l149Q23k234K974K001p179K933N475m710o97l93J387M102n479
2259a496k215P707k271l945J198q4M701j852o767N874K347n198J120K78J740J710
2275B847o699J861O316m970j450K192J66K214m634j675Q192k403n170K925J77
2290a11J791p94n115N835K670p169J101K511N2J416m683R17O007n404j885M395
2306A534o35O57k664k542O960j310n916M344J447j322o50l632M814L456p174N04
2322b129L709j570O81k922Q53N777m864l289N361o23r01p86j518N017j497o165
2338d866N084K993l349p1k112K975L159p112J136N795l110j368q30O11M934l920
$$ plain form
2354 -51 -3583 2283 1440 -1292 -415 -1359 2360 1840 -4351 -91 3212 -1240 -806 -429 922 3025 -3292
2371 -3292 -2882 4030 526 -1634 -838 -753 2433 -387 -4077 2711 2078 -2364 -642 -668 1377 1565 -3424
2388 -3424 602 3798 -2139 -1695 953 1292 2240 -2396 -2403 4070 211 -2918 613 809 1683 -452 -3838
2405 -3838 2327 2772 -2494 -317 662 291 692 -2771 166 3734 -1912 -2450 987 84 705 -1541 -1719
2422 -1719 3720 -61 -3902 872 1378 899 -292 -2966 2002 2464 -3455 -514 2241 319 192 -2317
2438 -2317 -198 3751 -1379 -2011 2377 470 -509 -971 -1117 3657 634 -3815 1389 1987 -941 -548
2454 -548 -1489 1917 2196 -3989 -1041 2845 -107 -319 -736 -275 2840 -1761 -2519 3016 834 -1472 -632
2471 -632 -957 2219 310 -3453 1782 2322 -1877 -982 -280 1536 2193 -3276 -828 3407 -827 -1361 116
$$ packed form
2354e1l532N866q43k732Q77r44L719n20o191M260L303m452M34L77J351K103o317
2371c292M10O912l504k160P96Q5L186k820l690O788o33m442J722k6K045J88m989
2388c424M026L196n937M44K648L39R48m636pO473l859l129L531J96Q74k135l386
2405c838O165M45n266K177R79l71M01l463K937L568n646n38L437r03O21k246j78
2422a719N439l781l841M774N06m79j191k674M968M62n919K941K755j922j27k509
2438b317K119L949n130o32M388j907r79m62j46M774l023m449N204N98k928L93
2454e48r41L406K79o185K948L886k952k12m17M61L115m601p58N535k182k306Q40
2471f32l25L176j909l763N235N40m199Q95P02J816O57n469K448M235m234n34J477
$$ plain form
2488 116 417 2441 -1611 -3156 2618 849 -1772 332 198 1165 96 -3005 1585 3043 -2338 -938
2504 -938 659 609 1128 -2459 -602 3829 -1187 -2593 475 555 1460 -1008 -2434 2490 848 -2737 608
2521 608 1317 680 370 -2890 1168 2571 -2602 -768 1896 362 -142 -2298 -661 3801 -736 -2861
2537 -2861 1356 619 314 -775 -1700 2692 1071 -3331 184 1403 -254 5 -1498 956 1971 -2758
2553 -2758 -1257 2480 112 -624 -1170 -215 2808 -872 -2828 2212 1476 -1031 -946 -1217 2148 1436 -3175
2570 -3175 387 2127 -879 -427 -657 802 2489 -2313 -1319 2760 -115 -1015 236 147 1914 -1182
2586 -1182 -3036 2369 1533 -1660 -504 -144 1345 768 -2932 830 2940 -1223 -1208 77 329 1566
2602 1566 -1682 -1192 2785 -613 -2210 482 501 1152 -643 -2383 1960 1367 -2452 -104 816 651 245
$$ packed form
2488A16L01K024m052j545N774j769k621K104j34R67j069l101M590J458n381J400
2504i38J597n0N19l587J857M431n016j406L068Q0R05k468j426M924j642l585L345
2521F08P09o37l10l260M058J403n173J834K664j534n04k156J637M462m537k125
2537b861M217p37l05j089r25M392j621m402L515J219j657K59j503K454J015m729
2553b758J501L737k368p36n46R55L023l680j956N040p36k507Q5k71L365p12m611
2570c175L562J740l006M52k30J459J687m802R94M079k875r00J251q9J767l096
2586a182j854N405q36l193J156L60J489n77l700L762K110m163J5J285K52J237
2602A566l248M90L977l398j597K692J9O51j795j740M343n93l819K348R20j65m06
$$ plain form
2619 245 -2694 251 2863 -1175 -1347 858 154 562 -1453 -1214 2934 95 -2475 938 825 412 -158
2636 -158 -1489 1850 1381 -3098 -450 1798 350 -58 -1779 10 2482 -1972 -1666 1848 648 -96
2652 -96 -1117 -1157 2416 373 -2530 1385 913 -587 -470 -946 1539 1619 -2719 2 2034 -626 -471
2669 -471 -581 708 2057 -1606 -1908 2230 600 -649 -403 -539 1747 -81 -2643 1244 1441 -956
2685 -956 -512 -600 640 1062 -2345 72 2236 -1043 -1427 -137 445 1773 -1297 -1868 2290 696 -1761
2702 -1761 -14 187 1319 18 -2426 1162 1886 -1327 -113 432 375 810 -2119 -65 2627 -839
2718 -839 -1281 608 254 604 -1130 -1251 2356 445 -2483 72 572 618 -66 -1966 942 1501 -2141
2735 -2141 -644 909 389 454 -1487 -391 2150 -930 -1338 1312 645 -107 -936 -1012 2270 724 -2302
$$ packed form
2619B45k939K945K612m038j72K205p04M08k015K39M148k839k570L413j13m13n70
2636a58j331L339m69m479K648K248j448m08j721J789K472m454L06L514j200p44
2652i6j021m0L573k043k903L915m72j500J17m76K485Q0m338K721K032k660J55
2669d71j10J289J349l663l02M138j630j249K46j36K286j828k562L887J97k397
2685i56M44q8J240M22l407K417K164l279l84J290N82J328l070n71M158j594k457
2702a761J747K01J132j301k444L588P24l213J214N45n7M35k929K054K692l466
2718h39m42J889l54L50j734j21L607j911k928K555N00M6o84j900K908N59l642
2735b141J497J553n20O5j941J096K541l080m08K650o67p52q29p6L282j546l026
$$ plain form
2752 -2302 630 1113 -70 -277 -1074 1119 1719 -2143 -901 1370 66 -146 -653 -71 1903 -890 -1918
2769 -1918 1611 804 -350 -311 -509 1523 307 -2539 824 1678 -791 -544 -808 865 1460 -1776 -712
2786 -712 2011 -222 -740 -250 89 1478 -753 -1786 1492 716 -1074 16 85 977 240 -2108 531
2803 531 1939 -1135 -533 38 579 908 -1581 -591 2367 -110 -1466 20 154 1132 -354 -1533 1259
2820 1259 732 -1442 -133 517 421 8 -1622 368 1731 -1454 -961 919 310 51 -1389 -843 2186
2837 2186 -160 -1490 574 610 127 -512 -1191 1644 1231 -1732 -40 936 55 29 -796 722 1704 -1598
2855 -1598 -765 1449 683 49 -915 -257 1707 -385 -1770 1176 915 -257 -551 -1009 1213 966 -1977
2872 -1977 -184 1153 -417 -437 -559 260 1454 -1453 -1059 1645 39 -560 137 -58 1598 -280 -1714
$$ packed form
2752b302K932M83j183k07p97K193O00l862J242K271j304k12n07N82J974k793j028
2769a918L529q07j154L9j98K032j216k846L363Q54k469K47k64J673N95l236J064
2786g12K723k233n18M90L39J389k231j033L278p76j790J090O9Q92p37k348K639
2803E31J408l074O02N71N41L29k489R90K958k477j356J486J34R78j486j179K792
2820A259n27k174J309O50r6m13j630J990J363l185M93J880o09k59j440N46L029
2837B186k346j330K064L6m83o39o79K835m13k963J692R76q81k6q25J518R82l302
2855a598Q33K214p66o34r64O58J964k092j385K946k61j172k94m58K222k47k943
2872a977J793J337j570k0j22Q19J194k907L94K704j606n99O97j95J656j878j434
$$ plain form
2889 -1714 1010 1153 -534 -370 -287 910 562 -1817 160 1876 -371 -356 -343 97 1138 -928 -987 1594
2907 1594 -165 -1089 301 244 1085 -434 -1486 1244 1002 -1362 -348 230 705 258 -1841 29 1919
2924 1919 -680 -787 495 -72 508 -1004 -905 1750 298 -1170 524 88 264 -392 -1033 1166 1068 -1541
2942 -1541 -327 970 408 232 -958 110 1582 -1058 -1339 935 276 90 -595 -1001 1583 262 -1491
2959 -1491 409 463 -332 -282 -827 704 1217 -1537 -180 1114 -79 -292 -642 369 1717 -880 -1100
2976 -1100 1087 327 -51 -179 -286 1287 225 -1513 580 1148 -302 -153 -442 400 635 -1323 -95
2993 -95 1513 -465 -418 -177 183 1000 -698 -1078 1257 251 -1187 -247 -96 1043 177 -1566 415 946
3011 946 -846 -26 201 268 496 -1105 -175 1630 -541 -386 108 126 488 -485 -865 1373 347 -1421
$$ packed form
2889a714K724J43j687J64Q3J197l48k379J977J716k247J5J3M40J041k066n9K581
2907A594j759r24J390n7Q41j519j052K730k42k364J014N78M75m47k099J870J890
2924A919k599j07J282n67N80j512R9K655j452j468J694m36J76o56o41K199r8k609
2942a541J214J297n62j76j190J068J472k640k81K274o59j86o85m06K584j321j753
2959a491J900N4p95N0n45J531N13k754J357J294j193k13l50J011J348k597k20
2976a100K187p60l78j28j07J573j062j738K093N68j450J49k89Q42K35j958J228
2993i5J608j978M7K41L60Q17j698l80K335j006j438R40J51J139q66j743J981N31
3011I46j792Q20K27O7K28j601R30J805k171J55M94J8L62r73l80K238j026j768
$$ plain form
3029 -1421 170 123 512 367 -1276 549 1149 -1286 -638 453 347 466 -1114 -452 1318 -556 -934
3046 -934 400 295 79 -420 -844 1144 443 -1135 299 788 161 -100 -867 442 1411 -1076 -722 962
3064 962 221 118 -384 -361 1157 -445 -1350 733 644 -297 2 -589 964 260 -1224 310 944 -298
3082 -298 -252 -686 322 1031 -1132 -556 1174 60 -480 -283 163 1223 -331 -1025 826 447 -538 -14
3100 -14 -122 544 360 -1265 236 1041 -251 -247 -175 275 636 -861 -360 1294 122 -682 -131 120 589
3119 589 -99 -1066 963 618 -805 39 103 402 166 -811 166 1010 -777 -418 482 322 351 -809 -500
3138 -500 1407 -72 -893 412 153 279 -256 -877 775 774 -995 7 252 -20 291 -484 174 1001 -821
3157 -821 -656 508 224 113 -378 -471 1188 16 -978 841 336 -44 -179 -764 610 707 -1035 127
$$ packed form
3029a421J591m7L89j45j643J825O00k435O48J091j06J19j580O62J770j874l78
3046i34J334j05k16m99m24J988p01j578J434M89o27k61p67J309R69k487L54J684
3064I62p41j03n02K3J518j602r05K083q9r41K99n91J553p04j484J534O34j242
3082b98M6m34J008P09k163N76J730j114n40J97M46J060j554o94J851l79r85N24
3100a4j08O66j84j625J501Q05j292MP2M50L61j497N01J654j172q04N51K51M69
3119E89o88r67K029l45j423Q44O4K99k36r77R77Q44j787L59R00j60K9j160L09
3138e00J907j479q21J305k59J26n35o21J652jj769J002K45k72L11p75O58Q27j822
3157h21J65J164k84j11m91r3J659j172r94J819n05l80j35n85J374R7j742J162
$$ plain form
3175 127 899 33 -217 -564 205 927 -728 -555 805 -70 -273 -290 -287 880 -119 -1236 620 570 -254 -186
3195 -186 -261 555 358 -979 -289 957 -11 -247 -4 -51 660 -446 -611 895 44 -481 -196 178 945
3214 945 -18 -980 546 644 -585 -105 73 373 644 -995 -232 882 -312 -584 152 224 420 -387 -583
3233 -583 802 336 -641 87 33 215 -4 -874 620 914 -868 -444 321 329 105 -701 -193 1016 -449
3252 -449 -722 107 108 311 -145 -449 795 157 -912 187 353 -100 23 -622 371 748 -699 -239 764
3271 764 -216 31 -637 -77 848 -407 -916 289 256 -148 -39 -325 526 331 -1077 251 588 -63 -136
3290 -136 -410 195 385 -823 -311 819 -184 -186 -432 47 802 49 -557 672 293 -509 -325 -157 693
3309 693 86 -999 357 816 -371 -163 -44 203 493 -770 -249 730 9 -471 -1 -12 269 -179 -561
$$ packed form
3175A27P72q66k50l47P69P22j655J73J360q75k03j7LJ167r99j117J856n0q24O8
3195a86p5Q16j97j337O90J246r68k36K43m7P11j106j65J506q51n25K85L74P67
3214I45r63r62J526R8j229M80J78L00K71j639P63J114j194k72P36P2J96q07j96
3233e83J385m66r77P28n4J82k19q70J494K94j782M24P65Qk24q06N08J209j465
3252d49k73Q29JK03m56l04J244o38j069J099J66m53J23o45R93L77j447M60J003
3271G64r80K47o68N60R25j255n09J205l3m04J09k86Q51j95j408J328L37o51p3
3290a36k74O05J90j208N12J130j003kk46M79P55p53o06J229l79q02J84J68Q50
3309F93o07j085J356M59j187K08J19K47K90j263N21R79p21m80M70j1K81m48l82
$$ plain form
3328 -561 642 438 -499 -189 4 344 223 -449 44 820 -371 -238 171 -17 422 -560 -336 612 99
3347 99 -454 244 -19 316 -90 -670 355 315 -515 -50 246 92 157 -473 -128 582 -557 -414 480 63
3367 63 14 -413 -280 641 -147 -874 146 271 -77 -132 -302 377 383 -636 60 458 -6 45 -418 58 536
3388 536 -387 -490 699 217 -209 14 -171 569 -16 -538 194 295 -95 -146 -206 290 347 -657 -240 586
3408 586 51 -162 -153 96 260 -277 -755 615 78 -264 -35 -254 202 117 -624 396 479 -423 -157 114 339
3429 339 291 -405 201 773 -236 -339 58 54 232 -109 -494 597 142 -392 11 121 196 39 -667 152 515
3450 515 -450 -124 180 50 131 -404 -92 539 -37 -649 93 160 239 -246 -531 424 51 -742 168 355 -139
3471 -139 -110 -467 302 451 -496 -216 397 100 183 -251 -153 659 -100 -441 219 105 49 -111 -153 473 285 -615
$$ packed form
3328e61J203k04r37L10J93L40j21o72M93P76j191J33M09j88M39r82K24R48n13
3347I9n53O98k63L35m06n80J025m0q30M65K96j54O5o30L45P10j139J43Q94m17
3367F3m9m27J33R21p88p27J020J25l48n5j70O79Oj019O96L98m64N1m63M76M78
3388E36r23j03J189m82m26K23j85P40n85n22P32J01l90n1o0M96N7j004M17Q26
3408E86n35k13RK49J64n37m78J370n37l42K29k19M56q5p41J020Q3r02K66K71K25
3429C39m8o96O06N72j009j03L97mJ78l41l85J091m55n34M03J10P5j57p06Q19L63
3450E15r65L26L04j30Q1n35L12O31n76o12P42O7P9m85k85R55l73p93R10J87m94
3471a39K9l57P69J49r47K80O13k97Q3m34R8Q12p59l41O60j14n6j60m2O26j88r00
$$ plain form
3493 -615 -98 367 31 -4 -203 221 540 -297 -142 274 11 -67 -95 -167 395 -109 -447 517 141 -136 -54 62
3515 62 374 301 -504 95 437 -182 -238 -214 253 352 -63 -360 439 283 -122 -135 -50 391 2 -519 182 344
3537 344 -222 -80 113 -23 200 -670 52 531 -373 -361 110 2 279 -391 -464 345 -96 -636 -247 102 161
3558 161 109 -565 303 288 -511 105 194 -5 125 -368 -164 470 -112 -226 246 -45 42 -102 -198 584 188 -450
3580 -450 -51 155 -26 -165 -218 210 139 -520 -118 230 -26 -16 -40 -46 584 -229 -313 370 151 -68 -203 -73
3602 -73 376 18 -543 151 292 -197 15 -425 -7 425 -277 -95 331 -147 -237 23 -87 395 -154 -341 329
3623 329 319 -184 -64 8 204 186 -498 71 352 -162 -147 -28 8 350 -278 -374 444 86 -345 -108 56 188
3645 188 147 -176 363 91 -375 31 -21 124 172 -426 -101 386 -266 -140 19 6 321 -438 -106 291 160
$$ packed form
3493f15N17M65l36l5j99M24L19q37J55M16k63p8k8p2N62n04l38R64l76k77Q2J16
3515F2L12p3q05N99L42o19n6K4M67R9m15k97P99j56m05j3Q5M41l89n21P01J62
3537C44n66J42J93j36K23q70P22M79r04J2M71j08K77o70p3Q09m41n40L89L49N9
3558A61n2o74Q68j5p99O16Q9j99J30m93K04O34n82j14M72k91Q7j44r6P82l96o38
3580d50L99K06j81j39n3M28p1o59M02L48k56J0k4oO30q13q4O83k19k19j35J30
3602g3M49l58n61O94J41m89K12m40M18M32p02J82M26m78r0K60j10M82n49j87O70
3623C29j0n03J20P2J96j8o84N69K81n14J5J19L6L42o28r6Q18l58m31K37J64J32
3645A88m1l23N39k72m66M06n2J45M8n98L25M87o52J26J59j3L15p59L32L97j31
$$ plain form
3666 160 -353 134 113 77 4 -278 197 310 -422 -190 40 -72 79 -497 -85 368 11 -312 211 158 -240
3687 -240 -298 -225 492 76 -421 -2 323 186 145 -224 239 678 -310 27 306 152 -209 70 50 491 -246
3708 -246 -449 347 181 69 -167 -123 404 -20 -505 243 367 161 -148 -413 109 213 -484 -265 432 31
3728 31 -127 -99 43 136 -190 -77 286 165 -308 97 87 125 45 -412 104 469 -177 118 115 83 152 -336 -372 551
3752 551 -198 -119 258 -84 237 -26 -458 506 200 -298 -56 54 298 -64 -521 -17 401 -197 -188 -58 137
3773 137 169 -138 -175 474 37 -134 -35 77 326 -257 29 254 250 -222 102 224 -101 -56 -409 -54 367 -251
3795 -251 -293 318 295 124 -186 -28 242 -33 -531 147 -6 146 -13 -178 143 63 -378 -13 297 171 -106
3816 -106 -161 -92 416 -63 -389 597 250 -117 -176 -61 317 147 -301 177 143 -118 -176 -16 92 381 -488 -121
$$ packed form
3666A60n13M87k1l6p3k82M75J13p32K32K30j12J51n76M12M53l57l23N23n3l98
3687b40n8P3P17m16m97M19L25j37m1l69M63M39r88L37K79j54l61K79k0M41p37
3708b46k03P96j66j12k36M4N27m24m85P48J24k06l09k65N22J04o97K19O97m01
3728C1j58K8J42R3l26J13L63j21m73M05j0L8q0m57N16L65o46K95ll2O9m88l6R23
3752E51p49P9L77l42L21k63m32R64l06m98K42J10K44l62m57N04M18n98RJ30J95
3773A37L2l07l7O49m37j71R9J12K49n83K86K25mm72L24J22l25M5l53L55M21o18
3795b51m2O11k3j71l10J58K70k75m98O78j53J52j59j65L21q0m41L65L10j26k77
3816a06n5O9N08m79l26R86l47l67n9J15L78j70m48M78l4k61n8J60J08K89q69L67
$$ plain form
3838 -121 46 20 35 204 146 259 -115 -350 549 67 -179 -73 -29 128 43 -477 206 249 -15 62 -112 -73 238
3861 238 -213 -15 569 97 -197 47 -112 253 22 -328 406 99 -565 111 -26 102 95 -384 7 508 -140
3882 -140 -49 150 223 186 -345 23 455 -154 -42 92 46 181 -246 -185 194 76 -546 -114 240 212 -13 -390
3904 -390 142 379 -470 -414 243 13 136 -320 14 524 110 -336 261 304 145 -63 3 376 130 -430 -120
3925 -120 181 -155 47 -93 37 475 -388 -199 347 25 43 -80 34 659 -56 -615 164 264 -236 -6
3945 -6 -291 73 319 -473 14 609 -282 -372 136 -3 425 -338 -316 407 -8 -204 -295 43 497 -69 -576 123
3967 123 492 -313 -56 198 47 213 -416 -58 527 -210 -166 104 66 209 -135 -248 336 100 -335 -105 -49
3988 -49 215 125 -443 234 536 -327 -133 171 51 145 -289 -315 406 -120 -253 268 31 39 -244 -347 351 -7
$$ packed form
3838a21J67k6J5J69n8J13l74k35Q99m82k46J06M4J57q5n20O83M3k64P7j74L9L11
3861B38m51J98N84m72k94K44j59L65k31l50P34l07o64O76j37J28pm79L91N01o48
3882a40R1J99P3l7n31L68M32o09J12J34m6J35m27O1L79j18o22M32L54k8k25l77
3904c90N32K37q49N6O57k30J23m56L34N10m14m46N97M3j59k08O6L73k46n60L10
3925a20L01l36K02j40J30M38q63J89N46l22J8j23J14O25p15n59P79J00n00K30
3945fk85L64K46p92M87N95q91r0N08j39M28p63K2P23m15j96r1L38M54n66n07O99
3967A23L69q05K57K54j51J66o29L58N85p37M4K70l8J43l44j13N84k36m35K30N6
3988d9K64r0n68O77L02q63J94L04j20R4m34k6P21n26j33N21k37Qk83j03O98l58
$$ plain form
4010 -7 -523 367 119 239 -29 -290 308 458 -503 -195 118 -131 19 -221 17 389 -274 -638 447 27
4030 27 -108 -169 -342 276 93 -323 230 474 -121 -100 86 30 609 -616 -119 507 -40 -150 -234 137 478
4051 478 -243 -408 141 50 -160 -60 72 378 79 -463 235 403 -152 -45 -80 389 416 -153 -21 671 -17
4072 -17 -550 -46 -3 107 -202 -384 364 214 -372 -108 27 358 84 -621 132 396 -574 -129 24 42 139
4093 139 -292 -300 583 -46 -490 74 -110 70 -116 -432 504 465 -452 -33 218 265 -61 -343 134 637 -340
4114 -340 -267 265 127 179 -218 -173 376 -163 -462 286 209 -4 -307 -516 417 303 -538 -78 326 82 -138
4135 -138 -387 40 457 -344 -209 666 78 -174 -103 13 539 -71 -715 249 386 -190 15 -202 382 205
4155 205 -551 -215 474 63 -313 -104 18 496 -297 -463 695 183 -247 -188 -48 420 94 -369 117 628
$$ packed form
4010gn16Q90k48J20k68k61N98J50r61L08L13k49J50k40K38L72o63l64J085m20
4030B7j35o1j73O18j83m16N53K44n95K1J86n6N79j225M97O26n47j10q4L71L41
4051D78p21j65N49r1k10J00J32L06k99n42O98J68n55J07l5M69K7n69J32O92o88
4072a7n33N04M3J10l09j82P48j50n86K64J35L31k74p05P53K64r70M45J53J8R7
4093A39m31qQ83o29m44N64j84J80j86l16R36l9r17M19K51M7l26k82M77N03r77
4114c40P3N32j38N2l97M5N49n39k99P48p7k13l03k09R33j14q41M60M04k44k20
4135a38k49M27M17q01J35Q75n88k52P1J16N26o10o44R64J37n76K05k17N84j77
4155B05p56L36O89m11l76K09J22M78p93j66J158n12m30N9J40M68l26m63M86N11
$$ plain form
4175 628 -493 -204 95 296 209 -498 -183 612 -176 -223 114 110 111 -219 -416 592 233 -162 309 178 233 3
4197 3 -606 106 628 -405 -81 116 171 192 -193 -111 609 -119 -562 133 362 222 -205 -220 147 17 -580 259
4219 259 16 -42 -85 -502 135 435 -412 1 200 106 41 -215 55 708 -211 -751 237 149 43 43 -73 394
4241 394 190 -574 116 455 -152 53 -216 147 261 -611 -116 471 24 25 -259 -68 485 -3 -522 617
4261 617 241 -338 -218 -201 374 -62 -643 161 468 -311 -49 -34 363 307 -527 -246 582 -120 -155 28 -155
4282 -155 414 -324 -393 590 186 -432 -105 -56 17 118 -467 253 489 -291 -175 78 250 154 -364 -218 638
4303 638 -362 -428 303 63 100 -248 -541 554 165 -541 95 273 56 21 -636 151 488 -423 -638 263
4323 263 46 149 -210 -110 532 -124 -637 193 326 -101 -157 -288 454 312 -745 -5 396 19 -89 -403
$$ packed form
4175F28j121K89K99K01q7p07L15P95p88m7L37mJl30j97J008l59l95M71j31N5k30
4197Co09P12N22j033L24J97N5K1l85Q2P20p28m43O95K29j40m27j5L67j30n97Q39
4219B59k43n8m3m17O37L00q47M13J99r4o5k56K70O53r19n40R88q8j06%j16M67
4241C94k04p64O90L39o07K05k69L63J14q72M95N87m47Jk84J91N53m88n19J139
4261F17l76n79J20J7N75m36n81Q04L07p79K62J5L97n6q34K81Q28p02l5J83j83
4282a55N69p38o9R83m04o18L27M9P3J01n85P20K36p80J16K53J72r6n18J46Q56
4303F38j000o6P31k40L7l48k93J095l89p06O36J78k17l5o57P87L37r11k15R01
4323B63k17J03l59J00O42o56n13Q30J33m27n6j31P42j42j057P40M01l77j08l14
$$ plain form
4343 -403 -59 641 -349 -127 524 121 -134 5 -291 511 67 -442 209 370 -115 -158 -257 370 282 -748 96
4364 96 623 -38 -167 -160 124 410 -377 -386 708 357 -231 -14 5 261 3 -513 346 398 -410 -227 -121 128
4386 128 293 -600 -105 537 -367 -160 118 187 323 -551 -464 555 48 -472 -21 194 206 -197 -631 448
4406 448 526 -411 -73 -53 174 140 -638 -7 447 -503 -320 347 154 264 -30 -113 601 -67 -591 269 310 163
4428 163 -277 -573 286 417 -709 -178 481 -175 35 -462 -45 494 -151 -405 576 -70 -128 -202 -129 615 -116
4449 -116 -561 381 360 -173 -24 -56 302 563 -728 -109 732 -88 -130 -102 189 587 -33 -387 488 84 -259
4470 -259 -141 -101 334 -38 -598 124 333 -306 -178 -223 44 586 -820 -337 602 -193 -279 5 -24 355 -417
4491 -417 -853 390 387 -355 54 231 -13 63 -611 355 651 -558 -305 194 72 309 -485 -244 680 -117
$$ packed form
4343d03L44P00r90K22O51m03k55J39k96Q02m44n09O51J61m85m3r9O27q8j030Q44
4364I6N27o61j29PK84K86p87rJ094l51n88K17J9K56k58n16Q59N2q08J83J06K49
4386A28J65q93M95O42r04K07K78O9J36q74Q7J019n07n20M51K15J2m03m34J079
4406D48P8r37L38K0K27l4p78O31M54r50J83O67j93J10k94q3P14o68n24Q60M1j47
4428A63m40k96Q59J31j126N31O59o56K10m97M17N39o45k54R81o46n8p4P3P44p31
4449a16m45R42k1n33J49l2L58K61j291O19Q41q20m2K8K91L98o20l54Q75m04l43
4470b59J18M0M35l72n60P22K09o39J28m5K67N42j406M83R39p95q6K84k9L79p72
4491d17m36J243lp42M09J77k44P6o74R66K96j209K53M99j22K37p94K41R24p97
$$ plain form
4511 -117 -606 153 133 378 -298 -569 625 339 -546 90 79 -67 12 -479 60 737 -338 8 220 114
4531 114 87 -403 -169 894 -210 -445 298 -12 218 29 -467 614 205 -777 28 614 16 -189 -283 58
4551 58 556 -625 -202 645 -113 -208 -157 -154 513 -351 -645 475 305 -87 -376 -120 453 225 -787 -43 417
4572 417 -122 -182 -254 175 589 -493 -349 789 90 -222 33 279 511 -192 -596 361 344 -382 -304 44 222
4593 222 133 -678 219 626 -212 -336 -96 -6 428 -508 -279 756 -150 -335 306 160 405 -244 -554 345
4613 345 311 -684 195 103 237 24 -717 163 718 -472 -272 118 3 124 -499 -321 769 -130 -603 164
4633 164 125 -33 -49 -270 359 349 -752 94 529 9 -111 -534 -2 542 -552 -340 415 46 -245 -244 -455
4654 -455 818 121 -629 345 79 -125 59 -217 538 328 -661 -143 315 -242 -99 -392 128 661 -456
$$ packed form
4511a17m89P59k0K45o76k71J194k86q85O36j1j46P9m91N39O77j075L46K12j06
4531A14k7m90K34J063j104k35P43l10K30j89m96J081m09r82Q05N86n98k05r4L41
4551E8M98j181M23Q47p58r5N1LO67q64k94J120j70l92k89K56N73k28j012P44M60
4572D17n39o0p2M29M14j082J44J138o99l12K55K46K32p03m04R57j7p26P8L48J78
4593B22q9q11Q97M07q38j24K40R0M34r36K29J035r06j85O41j46K45o49l10Q99
4613C45l4r95Q79r2J34k13p41Q80N55j190K00L90j15J21o23J78J090q99m73P67
4633A64l9j58j6k21O29j0j101Q46M35n20j20m23N32N44j094K12P55l69k91Jk11
4654d55J273o97p50R74k66k04J84k76P55k10r89N18M58n57J43k93N20N33j117
$$ plain form
4673 -456 -340 606 -36 -58 -55 -143 510 31 -600 489 315 -288 -88 -235 259 188 -633 -84 770 -513 -69
4694 -69 116 126 469 -258 -491 531 65 -384 68 -13 283 -241 -733 468 508 -507 -312 137 80 216 -424
4715 -424 -227 575 -208 -334 319 199 280 -449 -470 790 87 -573 230 247 83 -252 -636 563 396 -692
4735 -692 -266 160 -92 -22 -472 97 711 -488 -338 529 61 -117 -165 -443 786 54 -851 19 386 -221
4755 -221 -295 -491 408 357 -561 -96 657 54 150 -475 -102 374 -431 -458 542 109 -132 -207 -226 560 215 -710
4777 -710 169 476 -216 -75 -106 295 608 -516 -239 611 -75 -361 -96 166 358 -245 -491 498 53 -312
4797 -312 44 78 286 -38 -642 400 396 -466 -57 16 289 169 -544 -293 742 -210 -523 110 53 271 -146
4818 -146 -476 651 77 -508 6 307 218 42 -763 433 562 -585 -119 307 247 48 -681 26 871 -238
$$ packed form
4673d56J16R46o42k2Lq8O53m79o31J089j74o03K00j47M94p1q21N49Q54j283M44
4694f9J85J0L43p27k33J022m66m49M52q1K96n24m92J201M0j015J95M49n7J36o40
4715d24J97Q02p83j26O53j20Q1p29k1J260p03o60Q03J7j64l35l84J199j67j088
4735f92M26M26k52P0m50N69O14j199J50Q67m68j78m8k78J229p32r05Q70L67o07
4755b21p4j96Q99n1r18M65P53o03R6o25L73M76q05k7J000m33k41p5j9P86l45r25
4777g10Q79L07o92J41l1M01L13j124K77Q50o86k86K65K62J92o03k46R89m45l65
4797c12L56L4K08l24o04J042mq62M09P3K73j20p13K51J035r52l13O33n7K18m17
4818a46l30J127n74n85N14L01q9j76q05J196J29j147M66M26o0j99p29P07Q45j109
$$ plain form
4838 -238 -384 108 -22 241 -89 -411 754 114 -551 299 275 39 55 -422 267 500 -689 -205 469 240
4858 240 -79 -338 86 579 -215 -682 648 241 -138 -173 -239 552 333 -683 193 442 -241 -223 31 182
4878 182 406 -546 -227 675 -54 -170 -205 104 386 -553 -363 684 307 -515 87 -108 319 123 -898 534
4898 534 605 -355 -219 -133 -21 584 -595 -350 826 -43 -386 148 -13 491 -291 -444 508 63 -482 227
4918 227 303 205 -58 -541 337 672 -392 -251 299 108 -26 -473 117 881 -204 -509 64 270 -165 -223
4938 -223 -383 495 287 -725 32 268 134 44 -611 142 835 -527 -275 366 44 47 -336 -82 602 -150
4958 -150 -459 238 411 -89 -205 -218 428 536 -718 0 472 18 -260 -212 287 411 -707 -312 602 201
4978 201 -272 -123 48 467 -317 -714 468 393 -212 -237 -122 384 239 -733 136 548 -232 -262 -70 159 416
$$ packed form
4838b38j46M92j30K63l30l22J165o40o65Q50k4k36J6m77O89K33j189M84O74k29
4858B40l19k59M24M93p94m67J330m07l79l5o6P91k19j016Q76K49o83J8K54J51
4878A82K24r52L19R02p29j16l5L09K82r39J90J047l77q22O02j95M27j96j021J432
4898E34P1r60J36Q6J12O05j179K45J176q69l43N34j61N04p82j53R52m45n45P09
4918B27P6r8k63m83Q78L35j064J41N50j91j34m47N90P64j085l05N73K06m35n8
4938b23j60Q78k08j012P57K36j34r0o55P53O93j362K52O41l22Ll83K54O84p52
4958a50l09O97J73n00j16j3O46J08j254P18M72m54k78M8M99J24j118L95R14m01
4978B01m73J49J71M19p84l97J182p5o05k5J15N06j45r72Q69M12p80l0J92K29K57
$$ plain form
4999 416 -489 -333 733 53 -431 18 117 507 -158 -328 533 241 -443 -113 81 381 33 -646 408 831
5019 831 -358 -45 183 181 119 -288 -188 669 -128 -525 176 60 273 -136 -644 353 254 -466 56 137 233 -28
5041 -28 -442 40 697 -262 -247 317 245 49 -179 -66 843 -69 -558 323 391 111 -130 -374 586 259 -767
5062 -767 -221 329 -164 93 -308 -124 383 -366 -363 516 222 -73 -156 -112 531 -191 -630 159 220 -121 -117 -317
5084 -317 354 483 -589 -36 758 26 -143 58 182 661 -362 -350 517 156 -236 -22 76 432 -125 -687
5104 -687 526 437 -397 -80 -2 144 401 -607 -12 737 -249 -277 40 192 333 -413 -446 695 78 -529
5124 -529 139 223 280 -81 -237 549 371 -391 -9 117 4 167 -295 -73 888 -183 -416 418 113 -3
5144 -3 -127 -425 677 138 -590 59 168 -25 -74 -454 178 481 -528 -211 430 138 -78 -366 18 738
$$ packed form
4999D16r05J56J066o80m84M49R9L90o65j70Q61k92o84L30J94L00l48o79J054M23
5019H31j189L13K28ko2m07J00Q57p97l97P01j16K13m09n08R97r9p20N22Q1R6k61
5041b8m14M82O57r59J5N64p2j96k28J13R09r12m89Q81O8k80k41k44R60l27j026
5062g67N46N50m93K57m01J84N07p49LQ79k94k95q3M4O43p22m39P89O1l41Mk00
5084c17O71J29j072N53P94p32j69K01J24M79j023J2Q67l61l92K14R8L56n57n62
5104f87J213q9q34L17P8J46K57j008N95P49r86k8L17J52J41p46l3J141o17o07
5124e29O68Q4N7l61j56P86j78p62L82J26j13J63m62K22R61j071k33Q34l05j16
5144cj24k98J102n39p28O49J09j93m9l80O32L03j009L17O41k92k16k88L84P20
$$ plain form
5164 738 -371 -648 641 291 -7 -256 -299 685 -54 -619 227 248 -48 -28 -170 309 416 -604 -177 526
5184 526 -81 -63 31 50 623 -304 -561 528 415 -111 -67 -113 465 38 -598 365 427 -310 -145 91 -33 426
5206 426 -503 -365 637 -247 -214 24 268 377 -100 -534 434 190 -540 104 -104 418 181 -763 140 678
5226 678 -450 -138 253 -5 217 -567 -298 785 -234 -392 152 -123 213 -146 -372 627 144 -666 -75
5245 -75 51 314 142 -426 261 437 -484 -412 443 143 101 -394 -23 826 -158 -435 266 153 11 -393 -187
5266 -187 433 167 -739 91 350 -188 92 -326 297 495 -737 -359 667 82 107 -298 -154 531 -88 -527
5286 -527 461 146 -209 111 -30 365 1 -599 157 393 -311 -192 -13 150 298 -474 -161 483 -176 -390
5306 -390 31 22 481 -72 -776 354 141 -500 19 -33 167 114 -504 -15 541 -424 -32 21 20 303 -422 -114
$$ packed form
5164G38j109k77J289l50k98k49m3R84p39n65Q46K1k96K0j42M79J07j020M27P03
5184E26o07J8R4J9N73r27k57J089j13n26M4m6N78m27o36R63O2p37J65K36j24M59
5206D26r29J38J002q84L3K38K44J09m77m34R68k44p30O44k08N22k37r44R03N38
5226F78j128L12L91k58K22p84K69J083j019j58N44k75L36l59k26R99m83q10N91
5245g5J26K63j72n68O87J76r21P2Q55l00m2m95L71Q49r84k77P01j13j42m04K06
5266a87O20k66r06Q30K59n38K80m18O23J98j232L78J026n85K5m05J44O85o19m39
5286e27R88l15l55L20j41L95l64o00P56K36p04J19J79J63J48p72L13O44o59k14
5306c90M21rM59n53p04J130k13o41N19n2K00n3o18M89N56r65L92N3jK83p25L08
$$ plain form
5328 -114 722 71 -519 186 149 119 -275 -309 432 387 -892 -137 247 -64 133 -457 55 461 -396 -269 377
5349 377 -101 20 -340 -444 531 167 -702 -118 158 -208 -221 -505 538 172 -684 60 398 16 -87 -184
5369 -184 15 707 -545 -293 365 132 -49 -207 -177 406 -258 -416 334 204 -136 -105 -147 304 328 -477 34
5390 34 244 -110 -189 -183 185 434 -357 -430 551 -99 -270 45 71 480 -172 -885 314 443 -397 -129 -70 151
5412 151 230 -733 61 713 -368 -373 149 105 367 -436 -278 797 13 -422 134 142 22 184 -559 282 402
5433 402 -569 14 32 63 189 -567 226 695 -436 -268 116 159 -16 -311 -377 757 166 -571 150 199 41
5454 41 10 -156 250 135 -718 -83 154 119 37 -315 2 630 -421 -256 517 25 -44 -185 -316 610 29
5475 29 -436 365 266 -185 -177 -407 276 394 -528 32 370 -209 -23 -97 9 485 -439 -415 607 51 -357 -125
$$ packed form
5328a14Q36o51n90P05l7l0l94l4P41m5j279P55L84l11J97n90N12M06q57J27O46
5349C77m78J21l60j04R75l64q69N84K76l66j3k84J043l66q56P44L38l82j03r7
5369a84J99O92j252K52O58k33j81j58L0N83o64j58P50j30l40L1m2M51K4q05N11
5390C4K10l54p9OL68K49p91p3R81o50j71L15K6M09o52p13J199J29q40K68N9K21
5412A51P9r63P94O52j081nN22m4K62q03J58J075p84m35N56Qj20J62p43Q41J20
5433D02r71N83J8L1J26p56P93M69j131J68L84M3j75k95o6J134n91p37P21M9j58
5454D1l1j66M06j15q53O35K37l5q2l52L17O28j051J65P73m92o9j41j31R26n81
5475B9m65Q01r9m51Qk30O83J18r22N60L38n79J86p4J06M76r24K4J022n56m08K32
$$ plain form
5497 -125 -412 665 -62 -340 321 318 -250 14 -236 162 365 -560 11 516 -322 -15 149 47 113 -99 -466
5518 -466 729 257 -188 -186 111 482 -50 -575 257 507 -476 -210 -162 -92 274 -524 155 709 -347 -295 98
5539 98 -75 77 -283 -371 573 -116 -404 99 1 50 -75 -510 196 453 -385 -192 294 212 -10 -220 52 378
5561 378 -167 -384 386 -147 -378 3 -111 444 101 -695 136 243 -184 53 -312 265 384 -425 -96 224
5581 224 77 21 -214 -13 476 -301 -441 431 72 -121 -87 -23 375 162 -530 206 310 -275 -168 -60 147
5602 147 434 -435 -196 506 -54 -194 62 -74 401 -205 -575 414 54 -607 11 -50 46 -56 -460 199 260
5623 260 -578 -60 38 128 153 -578 -51 630 -269 -425 57 89 308 -105 -262 411 236 -299 -58 58 277
5644 277 71 -642 58 409 -448 -40 385 -46 210 -314 -128 670 -262 -384 114 35 -43 -94 -410 411 326
$$ packed form
5497a25k87J077p27k78O61ln68K64k50L98K03r25N71N05q38L07J64j02O6k12l67
5518d66J195m72m45KK97L71n32n25Q32K50r83K66M8P0L66p98O79N54j056N2L93
5539I8j73J52l60q8R44o89k88N03r8M9j25m35P06K57q38J93M86q2k22k10K72L26
5561C78n45k17P70n33k31L81j14N55l43p96Q31J07m27K37l65N77J19q09L29L20
5581B24j47n6k35K01M89p77j40Q72l59j93L4O4L98k13o92P36J04n85J07J08K07
5602A47K87q69K39P02n60j40K56j36M75o06l70R89l60o61O18o1R6j02m04O59O1
5623B60q38N18R8R0K5p31N27O81q99j56M82L2K19m13j57O73j75n35K41J16K19
5644B77k06p13P00L51q57M08M25m31K56n24J86P98r32j22M98p9p8n1l16Q21q5
$$ plain form
5665 326 -556 65 126 -185 193 -273 227 342 -421 -433 366 -97 -42 -193 -170 421 -250 -647 271 274 43 -221
5687 -221 -328 447 339 -360 95 380 -9 -75 -441 249 321 -499 -408 149 -188 -98 115 -106 524 -219 -558
5708 -558 530 224 -30 -43 -89 254 25 -459 212 377 -331 -182 15 -2 264 -141 -228 495 -233 -312 -40
5729 -40 43 469 -112 -433 214 177 -382 -52 286 326 123 -702 195 333 -112 -141 161 186 257 -142 -306 536
5751 536 -97 -315 37 -68 -91 -43 -142 374 370 -373 6 215 89 42 -375 264 620 -556 -56 339 -107 124
5773 124 -21 159 446 -114 -578 103 95 -169 277 -419 495 195 -674 -119 129 -40 70 -162 117 385 -303
5794 -303 -254 -55 120 80 -228 -123 418 -81 -429 355 263 -97 -131 -250 232 54 -560 207 278 -331 -75 -126
5816 -126 126 345 -228 -483 574 -115 -497 70 -28 256 -173 -441 34 457 -273 -30 -134 -103 82 -357
$$ packed form
5665C26q82O21O1l11L78m66N00J15p63j2P99m63N5j51K3N91o71l97R18Lk31k64
5687b21j07P75j08o99M55K85l89o6l66O90P2q20R1N57l37R0K13k21O30p43l39
5708e58J088l06k54j3m6L43k29m84O71J65p08J49J97j7K66m05q7P23p28p9K72
5729d0Q3M26n81l21O47l7n59L30L38M0k03q25Q97J38m45k9L02K5P1l99j64Q42
5751E36o33k18L52j05k3M8r9N16mp43L79K09j26m7m17O39L56j176N00L95m46K31
5773A24j45J80K87n60m64O81qk64M46o96R14l00q69N55K48j69J10k32K79K68o88
5794c03M9J99J75m0l08J05N41m99l48P84r2l60l4j19M82j78o14P67P1o09K56n1
5816a26K52K19n73k55J057o89l82N67r8K84m29k68M75M23p30K43j04L1J85m39
$$ plain form
5836 -357 32 667 -227 -212 223 -62 301 -378 -212 712 10 -563 167 56 275 56 -348 196 357 -408
5856 -408 -47 339 411 180 -349 -48 356 -274 -215 283 186 14 -45 -165 534 -13 -283 186 -38 28 -6 -115
5878 -115 382 425 -581 19 312 5 -98 -197 49 405 -431 -76 443 67 27 59 28 405 -88 -547 308
5899 308 210 -316 -253 -400 415 185 -532 18 352 -275 50 13 28 410 -265 -215 263 77 -293 -2 211 58
5921 58 -105 -527 290 284 -340 -55 -34 172 120 -502 19 504 -231 -307 159 249 291 -162 -260 454 -86 -438 -100
5944 -100 151 26 34 -482 53 89 -251 18 141 252 24 -255 -226 501 -200 -145 337 246 141 -308 -175 511
5966 511 263 -612 2 205 -11 88 -150 142 317 -447 -179 350 18 -225 -137 31 266 -370 -424 288 28
5987 28 16 -327 -150 341 -14 -592 204 256 -59 -16 -199 158 260 -275 -152 295 -84 -217 58 58 388 -203
$$ packed form
5836c57L89O35q94J5M35k85L63o79J66R24p02n73P30j11K19k19m04N44J61p65
5856d08L61L86P2k31n29L01M04o30N9M98r7j72n9j20O99n47k70M69k24O6l4j09
5878a15M97M3j006O00K93l07j03r9K46L56q36L55N19l76m0L2l1L77m93m59Q55
5899C08r8n26O3j47Q15k30p17N50L34o27L25l7J5L82o75N0M78j86l70K91K13j53
5921E8j63m22Q17oo24K85K1K06n2o22N21M85p35p6M66R0M2m53r8P14n40l52L38
5944a00K51j25Qn16N35L6l40K69J23J11k28k79K9P27p01N5M82r1j05m49J33O86
5966E11k48q75O14K03k16R9k38K92J75p64K68N29l32k43Q8J68K35o36n4P12k60
5987B8j2l43J77M91l55n78P96N2l15M3j83L57J02n35J23M47l79j33K75%L30n91
$$ plain form
6009 -203 -467 410 211 71 -229 -10 251 75 -466 202 197 -348 -36 -205 287 79 -237 139 436 -261 -234
6030 -234 81 106 249 -78 -426 207 57 -256 -64 236 298 -103 -516 290 365 -495 -125 214 138 -115 -413
6051 -413 -29 379 -87 -262 -34 1 193 -116 -169 511 174 -519 2 245 158 -60 -347 91 271 -415 -138
6072 -138 221 -35 185 -117 -82 261 -92 -455 82 -97 -87 -220 -39 352 252 -479 197 422 -120 -102 -246
6093 -246 269 312 -229 -310 257 154 -395 -124 -4 383 25 -264 325 115 38 -118 -143 246 299 -211 -269 339
6115 339 -121 -78 -63 225 169 -146 -135 234 -135 -360 -50 28 310 -153 -268 65 314 -430 -29 109 296 21
6137 21 -504 130 472 -153 -303 116 -135 61 -265 -136 452 -126 -195 2 136 98 -79 -184 325 192 -336
6158 -336 -291 269 156 -146 -349 123 316 -327 -219 193 -143 -147 -139 -276 321 -34 -131 330 157 86 -81 -242
$$ packed form
6009b03k64Q77j99j40l00K19K61j76n41O68nn45L12j69M92k08l16L76K97o97K7
6030b34L15K5J43l27l48O33j50l13J92L00O2m01m13Q06P5q60L70L39p6k53k98
6051d13L84M08m66j75K28L5J92l09n3O80l37o93N21K43q7k18k87M38J80o86K77
6072a38L59k56K20l02L5L43l53l63N37j79J0j33J81L91j00p31O76K25n42J8j44
6093b46N15M3n41q1N67j03n49K71J20L87l58k89N89k10p7j56k5L89N3n10n8O08
6115C39m60M3J5K88n6l15J1L69l69k25L10P8K82m63j15L33K49p44M01J38J87k75
6137B1n25O34L42o25j50M19k51J96l26J29N88n78o9J97J34l8j77j05N09j33n28
6158c36M5N60j13l02k03M72J93o43J08M12l36mQj37N97l55r7M61j73p1j67j61
$$ plain form
6180 -242 455 326 -308 110 176 46 -54 -290 180 476 -225 -59 150 -17 -27 29 12 309 -41 -325 221
6201 221 213 -33 65 117 183 -74 -353 82 225 -60 -224 -140 57 283 -179 -137 198 -65 -79 -57 13 303 -65
6224 -65 -447 297 244 -171 -118 139 100 176 -510 21 564 23 -139 107 265 173 -265 -175 364 -29 -333 10
6246 10 40 41 -118 -310 297 56 -465 -94 165 76 164 -344 31 482 -266 -36 320 178 265 -360 -68 284
6268 284 191 -193 -146 4 127 94 -195 -33 194 -496 -50 101 144 69 -124 192 298 -280 -298 199 119 128 -63
6291 -63 -209 364 51 -353 -18 158 -163 -97 -158 133 178 -297 124 280 -89 -136 -113 154 408 -245 -248 131 216
6314 216 -272 20 -62 250 -57 -482 166 248 75 -185 -15 246 48 -207 -84 439 -104 -283 -4 63 201
6335 201 -103 -129 407 -47 -258 134 129 249 124 -352 98 88 -213 -106 -101 161 67 -361 18 459 -21 115
$$ packed form
6180b42O97j29o34M18O6j30j00k36M70K96p01J66K09j67j0N6j7K97l50k84N46
6201B21qk46R8N2O6k57k79M35J43k85j64Q4J97K26m62M2L35k63j4K2P0K90l68
6224f5l82P44n3m15N3K57l9P6o86N31N43n41j62K46J58r2m38R0N39l93l04L43
6246A0L0Jj59j92O07k41n21L71K59q9Q8n08L75M51p48K30L56j42Q7o25K92L52
6268B84r3l84M7J50J23l3k89J62K27o90M46J51M3p5j93L16J06n78j8M97q0Rj91
6291f3j46N73l13m04L35J76l21O6o1K91M5m75M21J56l69m7K3K67K54o53lL79Q5
6314B16m88K92q2L12l07m25O48Q2j73k60J70K61j98k55J23N23n43j79K79O7J38
6335B01l04k6N36m54k11L92nJ20j25m76M50j0l01J07NK62r4m28L79M41m80J36
$$ plain form
6357 115 279 -188 157 -113 -125 274 74 -287 -16 -125 10 15 -530 239 392 -190 -207 183 138 341 -216 -49
6379 -49 393 -30 -171 242 61 180 -225 -91 202 113 -334 33 87 -121 -291 -101 150 282 -266 -139 175
6400 175 173 39 -51 -39 493 -231 -165 376 12 24 85 -24 224 -2 -188 214 297 -322 8 123 -88 279 -406
6423 -406 -143 433 -152 -327 -85 62 413 -18 -395 343 -25 -132 123 -113 317 -115 -410 -6 193 -240
6443 -240 -6 -21 71 91 -183 -34 460 -165 -116 23 170 83 -31 -18 367 173 -323 31 -128 298 -100 -267
6465 -267 98 502 -213 -27 106 91 -30 -207 31 441 -83 -330 128 -121 48 -71 -354 469 -33 -230
6485 -230 80 2 -70 -160 -150 289 216 -170 -67 157 132 68 -128 197 171 -47 -270 227 8 -137 -4 -233 132
6508 132 50 -293 100 196 117 -256 -65 199 385 -12 -283 280 -37 84 119 -159 154 -153 -281 215 250 -231
$$ packed form
6357A15J64m67L45k70j2L99k00l61K71j09J35Nn45P69J53n82j7L90m5K03n57J67
6379d9M42m23j41M13j81J19m05J34K93q9m47L67N4k08j70J90K51J32n48J27L14
6400A75kj34r0J2N32p24O6N41l64J2O1j09K48k26j86M02Q3o19L30J15k11L67o85
6423d06K63N76n85j75K42J47L51m31l77P38l68j07K55k36M30m32k95M04J99m33
6443b40K34j5R2K0k74J49M94o25M9J39J47q7j14J3L85j94m96L54j59M26l98j67
6465b67L65M04p15J86J33j5j21j77K38M10n24k47M58k49J69j19k83Q23n02j97
6485b30L10p8p2r0J0M39p3l86J03K24k5o4j96L25k6k18k23M97k19j45J33k29L65
6508A32q2l43L93R6p9l73J91K64J86l97k71N63l17J21L5k78L13l07j28M96L5m81
$$ plain form
6530 -231 -99 -141 190 141 -349 77 285 -247 -13 -272 -96 399 -267 69 134 125 -145 124 -28 150 -6 -168
6552 -168 263 12 -148 -39 265 124 156 -180 159 273 -244 -154 63 205 -28 -228 -108 350 -160 66 68
6573 68 -131 105 -172 -151 412 255 -417 49 118 -37 -128 -196 33 413 -455 -268 3 98 110 -316 -6 209
6595 209 -49 -178 150 -55 76 -330 -297 238 103 -219 203 67 -38 -135 -267 258 75 -109 -59 244 -85
6616 -85 -197 -229 69 359 -39 -109 159 170 -312 123 -119 167 122 -350 -113 279 -103 -146 -217 223 -52 -146 -52
6639 -52 188 73 -272 -117 -127 316 -56 -271 192 223 -322 -292 -3 50 324 -305 47 182 -187 24 253 192
6661 192 76 -132 -252 322 -45 -190 58 118 134 -40 -148 145 372 -293 -111 417 -201 -16 -248 -38 362
6682 362 -254 -177 361 29 -147 -188 -46 334 -66 -190 69 134 34 -94 -331 142 119 -314 -201 60 13 -12
$$ packed form
6530b31J32m2L31m9m90M26K08n32K34k59J76M95o66L36O5rk70K69j52J78j56j62
6552a68M31k51j60J09L04j41L2l36L39J14n17R0K17J42k33k00J20M58n10K26K
6573F8j99K36k77K1N63j57o72M66O9j55r1o8K29L80q68J87K71R5J2m26L10K15
6595B09k58j29L28k05J31m06L3N35j35l22M22j36j05r7j32N25j83j84N0L03l29
6616h5j12l2K98K90l98p0K68J1m82M35k42K86m5m72K37L92l82m3p1M40k75r4R4
6639e2K40j15l45J55j0M43l72k15M63L1n45L0K89N3K74o29L52J35l69K11K29o1
6661A92j16k08j20N74l67j45K48O0J6j74j08K93K27o65J82N28o18J85k32K10M00
6682C62o16P7N38l32j76m1J42L80m00j24K59O5j00j28k37M73k3m33J13K61m7k5
$$ plain form
6704 -12 50 38 198 -40 -27 332 65 -79 -169 -36 155 -19 -107 235 211 63 -169 19 57 77 -121 -21 333
6727 333 -14 -57 -25 116 266 -157 -277 262 185 -99 230 29 252 9 -375 91 274 -217 -132 81 119 -132
6749 -132 -190 38 375 -34 35 -40 28 145 -57 -184 517 174 -227 18 -50 2 -182 -118 31 -3 -137 50 -1
6772 -1 73 268 -266 51 207 -247 11 119 4 -81 -180 -249 157 157 -228 156 142 -77 -70 -164 214 277 -356 -140
6796 -140 12 -96 -101 -64 88 206 -215 -306 149 -38 87 41 26 281 -6 -256 318 161 116 189 1 117 292
6819 292 -252 131 141 -144 8 -118 141 280 -235 -94 338 -100 -149 -39 -30 148 -228 -334 135 100 156 -42
6841 -42 -157 186 163 -236 135 158 -61 -152 36 75 388 -161 -102 368 40 -262 -108 150 110 -9 -344 258
6863 258 147 -65 -148 -75 101 -72 -106 -151 116 -246 -104 82 44 92 -261 -172 323 28 -161 132 16 -12 30
$$ packed form
6704a2O2j2J60k38J3L59k67j44r0J33J91j74q8L42k4j48k32J88L8K0j98J00L54
6727C33l47m3L2J41J50m23j20N39p7k84L29k01K23k43l84M66J83m91Q5K13L8k51
6749a32n8K28L37m09O9p5O8J17k02j27P01l43m01K45o8N2j84O4J49l4j34J87n1
6772aP4J95n34L17J56m54K58J08j15q5r9o9M06%l85L84j4k19Pr4L78O3o33K16
6796a40J52j08nL7J52J18m21r1M55j87J25m6j5K55k87k50N74j57m5P3j88J16J75
6819B92n44L83J0k85J52j26K59J39n15J41M32m38m9J10RJ78l76j06M69l5N6j98
6841d2j15L43k3l99L71K3k19r1J88L9L13n49N9M70l28l02J54K58m0j19l35O02
6863B58j11k12q3P3J76j73l4m5K67l62J42J86l8M8l53Q9M95k95j89K93j16k8M2
$$ plain form
6886 30 -253 149 208 -325 -146 164 73 70 -162 247 354 -110 -190 17 38 104 183 -173 84 -173 -126 141 21
6909 21 47 -48 79 186 138 -77 19 119 -208 -100 -205 -141 146 112 -211 145 90 -151 -231 -160 -29 84 -428
6932 -428 -4 77 -86 -168 101 -14 250 -324 -113 360 -52 -230 -194 -128 211 96 -157 190 34 -241 44
6953 44 52 323 121 -240 -9 254 -212 175 -180 12 133 -193 -163 329 -83 -82 1 145 112 -163 -188 268 100
6976 100 -211 -4 32 162 46 -154 -78 163 -164 -170 30 85 33 -23 -81 250 -59 -60 20 335 124 11 -251 237
7000 237 153 -316 43 27 51 -130 -162 332 234 -209 -86 31 151 198 237 -46 221 72 -106 118 13 -289
7022 -289 100 -85 208 -326 -104 126 -58 -140 -38 -38 182 322 41 306 270 148 -30 67 84 -112 -203 -170 131
7045 131 142 25 -35 -169 34 -57 -197 -55 89 -148 -90 125 86 -25 -173 -12 302 61 -132 138 84 74
$$ packed form
6886C0k83M02N9n33J79L10r1lk32M09J07m64q0K07K1O6P9l56K57k57M7K67j20
6909B1K6r5J27J07m8k15R6J00l27J08j05O4K87l4l23L56n5k41q0P1J31J13n12
6932d28M24Q1j63q2K69j15K64n74K11M73m12j78L6O6L39j15k53L47j56k75K85
6953D4QK71k02l61K31K63m66L87l55J92J21l26L0M92m12JQ3J44l3k75k5M56j68
6976A00l11K07L6J30j16k00P6K41l27oK00N5n2n6n8L31l09jQ0L15k11j13k62M88
7000B37q4m69L59j6K4j81l2M94r8m43J23J17J20M7L9k83K67j49j78K24j05l02
7022b89L89j85K93n34K22K30j84q2J02%K20J40k81K65l6j22j78R7J7j96r1L3L01
7045A31J1j17o0j34K03r1j40J42J44k37N8K15l9j11j48J61L14k41j93K70n4j0
$$ plain form
7067 74 -66 -257 432 43 -90 -197 2 -84 -171 -161 -9 202 -17 -157 343 -61 95 -183 -42 178 121 -175
7089 -175 -168 -48 151 88 -79 270 183 -239 -64 86 -25 -125 -215 186 43 -197 -36 187 -72 33 -303 -55
7111 -55 308 -211 36 105 64 -14 -45 -270 241 -23 -153 40 190 -204 -37 -142 2 91 -184 -35 151 56
7133 56 3 7 147 246 -38 -539 48 113 -15 47 96 209 5 -406 -40 453 -96 116 -159 -22 315 1 -307
7156 -307 282 207 -196 14 -215 234 -21 -57 116 85 -217 1 182 3 65 -257 83 217 -147 -61 -31 -123
7178 -123 138 -83 -265 148 -60 -106 152 -151 219 -308 61 231 174 -27 -211 155 -78 -21 -138 61 40
7199 40 129 -60 89 92 -35 109 -32 254 185 -207 293 -131 51 -105 21 80 115 -159 -78 37 -57 1 -58 -13
7223 -13 98 -157 -146 215 164 116 -64 -114 12 -145 -309 233 165 18 75 56 108 285 -80 -147 210 -16 40 87
$$ packed form
7067G4j40j91O89l89j33j07J99q6q7J0J52K11k19j40N00m04J56k78J41K20n7k96
7089a75PJ20J99o3j67L49q7m22J75J50j11j00r0M01j43k40J61K23k59J05l36K48
7111e5L63n19K47O9m1p8l1k25N11k64j30J93J50l94J67j05J44Q9k75J49J86r5
7133E6n3MJ40R9k84n01N87O5j28O2M9J13k04m11L66M93n49K12k75J37L37l14l08
7156c07N89p5m03K10k29M49k55l6J73l1l02K18J81j79O2l22L40J34l64Q6L0r2
7178a23K61k21j82M13k08m6K58l03L70n27L69J70n7k01j84L66k33N7j17J99k1
7199D0Q9j89J49Lj27J44j41K86o9l92N00m24J82j56J26N9L5k74Q1J15r4N8n9M5
7223a3J11k55J1L61n1m8j80n0J26j57j64N42o8j47N7j9N2J77l65o7L57k26N6M7
$$ plain form
7247 87 78 94 -163 -92 287 168 -21 -83 193 -4 -148 -266 120 102 -108 -71 -128 168 155 -22 42 298 -132 82
7271 82 203 -41 14 -15 19 262 208 -158 -69 -200 4 -81 -43 344 -30 -274 215 135 123 155 -91 -131 72 -76
7295 -76 -44 195 90 246 -1 -161 266 -28 -405 156 116 7 -219 -151 175 34 31 -62 -59 -52 -111 -37 60 214 -65
7320 -65 -64 27 30 -56 -235 14 169 -53 -237 189 96 175 10 -29 -45 171 -153 -92 37 152 -17 -133 190 118
7344 118 -62 -55 67 -169 -187 22 58 9 23 -356 79 221 -78 87 117 -98 -66 -237 -32 229 1 94 -143
7367 -143 71 -117 89 -272 80 -27 -119 117 145 -52 49 7 362 77 -180 -232 147 7 253 -238 -62
7388 -62 91 -160 -162 30 -69 62 -43 -213 161 -123 -187 -33 43 67 154 -263 -140 2 -13 -62 233 -126 155
7411 155 17 182 161 20 -113 123 250 183 96 -137 -36 -36 -106 -9 127 -107 70 27 287 146 -233 -202 35
$$ packed form
7247H7rJ6k57P1L79j19j89o2K76j97j44j18L86j8k10L7n7K96j3j77O4K56m30K14
7271H2J21k44N5k9L4K43n4l66Q9j31K04q5L8L87l74k44M89q0j2L2k46m0K03j48
7295g6L2K39j05J56k47j60M27k94l77N61m0j09k26O8L26j41lr3LPn9P4R7J54k79
7320f5JR1Lq6j79K49J55k22j84M26r3P9j65l9j6K16l24O1J29J15j69j16L23p2
7344A18j80PJ22k36j8K09L6m9J4l79M35J42k99J65L0k15L2j71K05K61k28R3k37
7367a43K14j88K06l61L52j07r2K36K8j97J01m2L55k85k57n2L79j40K46m91J76
7388f2J53k51kJ92r9J31j05j70L74k84o4J54P6K4Q7m17J23J42j5m9K95l59K81
7411A55j38J65k1j41j33K36J27o7q7k33J01%p0R7J36k34J77m3K60j41l79L1K37
$$ plain form
7434 35 35 -226 -36 128 232 -38 -49 -25 46 31 105 -69 98 127 -211 331 9 -60 -75 56 78 -16 -216 39
7458 39 -91 185 -137 109 -132 37 -89 82 213 42 23 70 123 -99 -63 -311 -201 138 -44 -131 64 4
7480 4 5 -98 -17 226 127 -126 -86 -133 -91 -190 -108 154 96 -132 164 -53 135 -80 181 193 287 -211 103 -142 -64
7505 -64 142 167 -161 220 -65 -41 171 -187 -4 -15 36 87 -174 -188 286 -48 147 56 -209 86 218 -313 -54
7528 -54 220 156 -11 254 28 -66 -273 8 240 84 -117 62 179 26 86 -84 134 57 -100 -137 -49 31 -169
7551 -169 -143 -34 223 84 -60 49 24 115 39 -178 107 177 128 17 65 -50 -9 -134 52 -59 -213 -106 -2
7574 -2 -95 57 -49 -3 275 -43 -192 -119 252 111 -71 -278 92 170 -60 -21 1 122 -41 -279 155 100 -4
7597 -4 -177 -35 179 175 166 -188 96 -26 66 -43 -27 -133 -25 -147 290 -136 -258 203 266 96 174 -25 -69 213
$$ packed form
7434C5%k61J90J64J04k70j1K4P1j5P4j74J67K9l38N42l22o9j5J31K2r4k00K55
7458C9j30K76l22K46k41J69j26J71J31j71j9M7N3k22L6k48J10L39j82q7J95o0
7480DJj03Q1K43r9k53M0m7M2r9Q2K62n8k28K96k17J88k15K61J2R4m98L14k45P8
7505f4K06K5l28L81k85K4K12l58J83j1N1N1k61j4M74l34J95r1k65K95J32n31K59
7528e4K74o4j67K65k26r4k07K81K32j56k01J79J17j53O0j70K18p7j57l7Q8Q0k00
7551a69K6J09K57j39j44J09k5R1p6k17K85P0m9j11M8j15M1j25J86j11j54J07J04
7574br3J52j06M6K78l18j49P3L71j41j82k07L70P8k30L9K2J21j63k38M34n5j04
7597dj73J42K14mrl54K84j22R2j09J6j06J08j22M37m26j22M61O3j70P8j99m4K82
$$ plain form
7621 213 -143 -35 160 -94 -73 232 -41 197 -166 -252 61 68 -62 235 -55 96 5 13 8 -119 -216 104 124 24
7645 24 229 -85 37 45 60 -178 19 50 0 -161 104 78 174 38 14 42 -91 -118 -188 108 222 28 3 -8 92
7670 92 10 30 129 -69 -28 114 -67 8 -204 -91 45 38 3 -182 -106 -31 23 -161 -267 93 120 -107 -169 0 121
7695 121 -18 49 -37 49 -108 -37 20 -36 90 45 80 34 6 -273 -50 84 112 -123 100 59 66 -177 -292 -11 -49
7720 -49 -14 53 -137 77 52 -66 67 -78 -68 -9 -66 200 64 45 143 31 -55 -116 84 166 174 140 -56 97 -47
7745 -47 -131 87 118 194 -87 -63 -124 -31 -92 55 18 -66 17 -180 78 57 -281 -85 -11 -12 -99 8 -120 73 42 -306
7771 -306 -233 -11 24 -222 -19 62 4 -198 25 203 142 85 -176 -239 11 -182 36 106 -13 116 -60 -14 168
7794 168 -73 48 -96 -89 18 -126 108 58 -46 -80 -53 73 -92 204 144 71 38 -240 119 332 -60 -131 -180
$$ packed form
7621B13l56J08J95k54K1L05k73K38l63q6L13Pj30K97k90J51r1Qnj27r7L20K0j00
7645B4K05l14J22QJ5k38J97L1n0j61K65k6R6j36k4K8j33k7p0K96J14j94k5j1J00
7670I2q2K0R9j98M1J42j81P5k12J13J36pl5j85P6P5N4j84j06L60K7k27o2J69J21
7695A21j39O7q6Q6j57P1N7n6J26m5L5m6k8k79K23J34K8k35K23m1Pk43j15K81l8
7720d9L5O7j90K14k5j18J33j45J0N9n7K66j36j9R8j12q6o1K00Q2Ql4j96J53j44
7745d7q4K18L1P6k81K4o1R3o1J47l7q4Q3j97K58k1l38J96P4jq7J07j28J93l1l48
7771c06P3K22L5k46K03Q1n8k02K23J78o1n7k61o3K50j93K18P0j19J29j76M6J82
7794A68k41J21j44PJ07j44K34n0j04l4K7J26j65K96o0p3l3k78L59K13l92p1m9
$$ plain form
7817 -180 -98 177 199 -203 126 65 -2 -191 -274 34 -135 36 123 61 -75 10 -101 108 -64 -31 64 121 -56 104
7841 104 -72 -19 -34 -86 -95 -68 13 -53 -86 -14 59 -18 30 -18 145 245 -17 -38 83 -64 -229 -40 150 -12 139
7866 139 -160 265 -48 -65 -226 84 -102 -156 -68 131 56 101 -78 32 129 -18 198 -45 134 93 -105 -36 391
7889 391 1 -83 26 34 75 -151 -161 -95 68 82 -216 66 -47 -38 11 -216 15 -142 -156 -72 157 272 -139 -54
7913 -54 155 -73 -373 244 71 14 93 -118 87 211 -229 159 65 -56 -3 -82 16 -59 63 -384 56 -114 -104
7936 -104 53 -229 38 119 -81 46 116 -90 -32 50 -28 34 31 -20 114 32 40 170 35 77 -70 -86 -7 15 149
7961 149 -83 -64 -234 191 -13 58 -10 -100 -18 158 95 -13 50 -142 222 -102 114 204 -16 -147 31 -130 -65
7984 -65 -121 -118 -54 -28 143 196 -132 -91 113 -121 18 40 -68 95 -238 -145 28 -70 94 -71 64 -95 159 256
$$ packed form
7817a80Q2K75K2m02L29o1o7j89q3L08j69J71Q7o2j36Q5j11K09j72L3R5N7j77J60
7841A04j76N3j5n2rK7Q1o6l3P2P3p7M8m8J63J00k62k1J21j47j65J89J90j62J51
7866A39k99M25l13j7j61L10j86n4Q8J99p5M5j79J10R7j47K16k43J79m1j98O9M27
7889C91l90q4J09QM1k26j0O6J63J4k98K82j13RM9k27K31j57j4Q4K29J15m11Q5
7913e4K09k28l00O17j73n7P9k11K05J24m40L88r4j21N3p9R8p5J22m47M40j70J0
7936a04J57k82K67Q1k00J27P0k06N8Q2p8O2ln1J34q2QJ30j35M2j47j6P9K2J34
7961A49k32J9j70M25k04P1o8r0Q2J76o3j08O3j92L64l24K16R0k20j31J78j61O5
7984f5n6LO4K6J71N3l28M1K04k34J39K2j08J63l33R3J73r8J64j65J35j59K54R7
$$ plain form
8008 256 138 -162 -142 77 220 -28 -37 -29 -5 62 119 50 -96 -54 -105 -52 -77 139 -17 -10 347 179 40 -146 111
8033 111 8 168 43 -66 -39 -145 131 -93 86 197 -159 -96 94 -93 -106 127 -81 156 -234 -56 -44
8054 -44 -73 -116 -199 -170 75 -149 -47 131 92 -77 -10 150 -24 -34 -443 117 167 -113 -103 -135 -112 -3 229 4
8078 4 239 -16 -88 -7 241 167 -72 -92 136 270 -38 222 15 2 -180 -109 0 76 124 15 81 85 -2 -76 135
8103 135 -33 43 -63 -39 -84 57 182 -44 167 217 -142 -255 77 -373 -176 126 14 5 -155 104 16 -5 17
8126 17 -47 177 34 196 -135 -38 20 -123 -50 148 317 -375 16 -113 -35 162 190 229 -24 45 -233 -103 332
8149 332 -156 -141 -151 -157 29 -160 6 29 197 127 122 -33 21 18 -15 10 70 118 -113 113 -29 148 -35 126 72
8174 72 -28 42 -19 -49 228 58 128 -286 4 -99 -192 -107 -191 -165 -23 55 -106
$$ packed form
8008B56j18l00K0K19J43k48rQK4O7N7o9j46M2n1N3k5K16j56PL57j68j39j86K57
8033A11j03J60j25j09K7j06K76k24J79J11l56O3J90j87j3K33k08K37l90J78J2
8054d4k9m3q3K9K45k24J02J78l9j69O7J60j74j0m09N60N0k80J0l2K3J09K32k25
8078DK35k55p2Q1K48p4k39k0K28J34l08K60k07j3j82P1J09P6M8j09O6Mq7p4K11
8103A35j68P6j06K4m5J41J25k26K11N0l59j13L32m50J97L02j12rj60K59q8k1K2
8126A7o4K24j43J62l31R7N8j43P3J98J69o92L91j29P8J97K8L9k53O9k78J30M35
8149C32m88J5j0oJ86j89J66K3J68p0nj55N4ll3K5O0M8k31K26j42J77j83J61n4
8174G2j00P0o1l0K77j70P0m14K90j03r3Q5q4K6J42P8j61
8191a06
$$ Imaginary data points
##PAGE= N=2
##DATA TABLE= (X++(I..I)), XYDATA
$$ plain form
0 0 0 0 0 0 0 0 0 0 0 -8 8 -8 16 -16 24 -24 32 -40 48 -59 72 -86 102 -120 138 -161 190 -219 253 -289 332
31 332 -378 430 -487 550 -619 694 -777 871 -969 1080 -1200 1332 -1474 1630 -1801 1988
47 1988 -2190 2413 -2660 2931 -3229 3559 -3928 4339 -4804 5333 -5941 6647 -7481 8481
61 8481 -9708 11255 -13274 16029 -20035 26419 -38190 67121 -290491 -205560 438734 41924
73 41924 -287314 -102062 234300 -1751 -275118 -6660 261092 -28772 -91124 161136
83 161136 161505 -121561 -192454 79090 230259 -57105 -130102 113092 103466 -81772 -94575
94 -94575 4326 106838 43939 -25668 47307 32638 -22085 11764 -41582 -27689 86437 55080
106 55080 -27943 -63216 -54497 32110 8816 -40820 43700 23070 -44500 11744 7779 -12505
$$ packed form
0@%%%%%%%%%qJ6j6K4l2M0m8N6p2Q8j07J31j58J88k22K58k99L51m09M72n42O21
31C32p10Q08r17J037j169J313j471J648j840K049k280K532k806L104l431L789
47A988m178M603n073N591o160O788p487Q267r143J0137j1274J2588j4128J5962
61H481j8189K0963k4529K9303l6064M6454o4609J05311l57612Q4931O44294l96810
73D1924l29238J85252L36362k36051k73367K68458K67752k89864o2352K52260
83A61136L69k83066p0893K71544J51169k87364p2997K43194r626j85238j2803
94i4575R8901J02512o2899o9607P2975j4669n4723L3849n3346J3893J14126l1357
106E5080q3023l5273Q719Q6607k3294m9636Q4520k0630o7570N6244l965k0284
$$ plain form
118 -12505 7838 -16071 8272 15725 -21248 10972 -37335 -75948 54188 48996 -72123 -36604
130 -36604 43161 48710 -33150 -61138 92881 74918 -124440 -34243 131692 15670 -127963
141 -127963 -60015 108255 38923 -198620 -76807 169001 10776 -167416 -21171 135842
151 135842 49766 -130829 -33848 187564 60649 -104186 32381 105282 5777 -42015 20157
162 20157 89932 -14235 -101540 46512 86790 -49161 -60545 -7643 29102 33251 -35142 -24552
174 -24552 19013 -9093 8507 -13636 -60280 26868 40621 -49160 -31800 9458 12894 -20279
186 -20279 -60053 36195 74827 -52933 -40818 45654 10010 -13152 664 25075 20005 -55627
198 -55627 -5733 81332 -27766 -75716 24889 43094 3282 -33102 -13992 51114 -292 -32007
$$ packed form
118a2505K0343k3909K4343P453l6973L2220m8307l8613J30136n192j21119L5519
130c6604P9765N549q1860k7988J54019j7963j99358R0197J65935j16022j43633
141a27963O7948J68270o9332k37543J21813K45808j58225j78192J46245J57013
151A35842q6076j80595R6981K21412j26915j64835J36567P2901r9505m7792O2172
162B0157O9775j04167q7305J48052M0278j35951j1384N2902L6745M149o8393J0590
174b4552M3565k8106J7600k2143m6644Q7148J3753q9781J7360M1258L436l3173
186b0279l9774R6248L8632j27760J2115Q6472l5644k3162J3816K4411n070p5632
198e5627M9894Q7065j09098m7950J00605J8205l9812l6384J9110O5106n1406l1715
$$ plain form
210 -32007 42683 4459 -34105 35007 24657 -23380 -29887 -4716 40940 -23618 -68513 49246
222 49246 44505 -71422 -38813 33735 37929 -10238 -41667 40664 45596 -55265 1697 65514
234 65514 -9644 -28383 11893 36900 9863 -64616 -7604 69137 -22021 -48112 19807 10073
246 10073 -7151 -21358 -12136 35724 -8996 -36316 22817 4366 -7260 17493 -22781 -10238
258 -10238 25062 -493 7256 -2827 -13933 22303 -15370 -23695 43947 3036 -37069 9841
270 9841 16649 209 -32835 -26876 59634 21248 -64470 5357 37618 -20436 -23221 10935 50587
283 50587 7563 -68338 14670 66361 -31554 -35864 28411 30613 1175 -39846 800 46341
295 46341 -29941 -31539 39106 3763 -22038 -7615 -6164 15030 -15328 -29622 25198 395
$$ packed form
210c2007P4690l8224l8564O9112j0350m8037o507K5171M5656o4558m4895J17759
222D9246m741j15927L2609P2548M194m8167l1429Q2331M932j00861N6962O3817
234F5514p5158j8739M0276K5007k7037p4479N7012P6741r1158k6091O7919r734
246A0073j7224j4207R222M7860m4720k7320N9133j8451j1626K4753m0274J2543
258a0238L5300k5555P749j0083j1106L6236l7673q325O7642m0911m0105M6910
270I841O808j6440l3044N959Q6510l8386q5718O9827L2261n8054k785L4156L9652
283E0587m3024p5901Q3008N1691r7915m310O4275K202k9438m1021M0646M5541
295D6341p6282j598P0645l5343k5801J4423J451K1194l0358j4294N4820k4803
$$ plain form
307 395 -21005 18587 -10225 -17125 13541 -6536 4259 10772 -2613 24090 -12594 -37468 34391
320 34391 24822 -20097 3499 6652 10975 -1949 -31151 23925 31783 -24830 9716 24711 -11559
333 -11559 -4235 -6882 12745 29387 -25636 -14980 20710 -14640 -8391 -3894 -23264 13111 3740
346 3740 -28164 -1479 -3012 2695 7178 -36437 4068 48438 -12563 -21911 11134 11391 8914 -24991
360 -24991 -4106 53476 -9362 -42405 23628 17707 -15078 -17781 3525 49002 -2223 -60139
372 -60139 12219 30685 -19577 -10976 -550 13400 3691 -44427 -3965 31543 -18456 -11210 8318
385 8318 316 16430 -11973 -16586 35021 15381 -4980 8439 -2483 24553 19556 -30007 9176
398 9176 33132 -7673 -8488 -4337 15475 25206 -35396 -20993 39189 -519 -24102 -2374 1353
$$ packed form
307C95k1400L9592k8812o900L0666k0077J0795O513j3385K6703l6684k4874P1859
320C4391r569m4919K3596L153M323j2924k9202N5076P858n6613L4546J4995l6270
333a1559P324k647J9627J6642n5023J0656L5690l5350O249M497j9370L6375r371
346C740l1904K6685j533N707M483m3615M0505M4370o1001r348L3045K57k477l3905
360b4991K0885N7582o2838l3043O6033n921l2785k703K1306M5477n1225n7916
372f0139P2358J8466n0262Q601J0426J3950r709m8118M0462L5508m9999P246J9528
385H318q002J6114k8403m613N1607j9640k0361J3419j0922K7036m997m9563L9183
398I176K3956m0805q15M151J9812R731o0602J4403O0182l9708k3583K1728L727
$$ plain form
411 1353 8763 -25907 -32192 30470 2607 -43699 -5375 2727 -5442 -13989 -31781 16101 25506
424 25506 -31494 -12275 12018 4142 16187 -8830 -3806 35161 -2785 -16322 15509 10274 18976
437 18976 2727 -22607 24652 19651 -24406 4976 17778 8076 367 -26547 10740 33869 -27204
450 -27204 -17456 23220 5359 -6076 -21993 -6644 34816 -10136 -32282 16534 8055 -4129
462 -4129 -156 -10614 17269 8305 -27049 11394 19479 -8157 163 -11924 -333 19803 -21410
475 -21410 -12663 23247 -2895 -12557 -17345 -14130 26549 -3303 -36370 11049 11679 -15954 -15865 -15094
489 -15094 23273 19740 -36252 -4544 24887 -9301 -6298 2311 15249 25722 -20892 -10715 37979
502 37979 4166 -11179 10931 10645 21535 -4401 -22374 28480 19216 -18211 2581 4746 8361
$$ packed form
411A353P410l4670o285O2662k7863m6306L8324Q102q169q547j7792M7882R405
424B5506n7000J9219K4293p876J2045k5017N024L8967l7946j3537L1831n235Q702
437A8976j6249k5334M7259n001m4057K9382J2802r702p709k6914L7287K3129o1073
450b7204R748M0676j7861j1435j5917J5349M1460m4952k2146M8816q479j2184
462d129L973j0458K7883q964l5354L8443Q085k7636Q320j2087J1591K0136m1213
475b1410Q747L5910k6142r662m788L215M0679k9852l3067M7419O30k7633Q9P71
489a5094L8367l533n5992L1708K9431l4188L003Q609J2938J0473m6614J0177M8694
502C7979l3813j5345K2110k86J0890k5936j7973N0854r264l7427K0792K165L615
$$ plain form
515 8361 6380 -27209 2062 23732 -20672 -16505 1632 -438 8258 -23822 -23594 23359 -3659
528 -3659 -25242 2320 2295 7210 -8514 -28376 19857 21392 -22669 -2315 9596 3277 3776 -20091
542 -20091 6298 32768 -14625 -14308 13823 2801 6748 -5156 -4848 30226 -3079 -28953 11126
555 11126 11535 2839 -1462 -18313 13510 12414 -31794 -2894 20202 1651 -1339 -18642 -1814
568 -1814 26568 -14587 -14478 24366 6832 -4272 -9668 -9597 24876 1895 -26142 14701 12747 -12960
582 -12960 -6720 -7511 16124 14321 -29303 -850 26097 -6139 -9047 -6763 3010 21305 -16754
595 -16754 -19297 23567 2822 -14660 -5028 -6187 16498 2022 -24280 15131 14723 -17731 -3293
608 -3293 1792 12470 14573 -22560 -1454 24358 -14424 -14294 5650 7757 15019 -18211 -22501 25165
$$ packed form
515H361j981l3589K9271K1670m4404M167J8137k070Q696l2080K28M6953k7018
528c659k1583K7562k5M915j5724j9862M8233J535m4061K0354J1911o319M99k3867
542b0091K6389K6470m7393L17K8131j1022L947j1904L08L5074l3305k5874M0079
555A1126M09q696m301j6851L1823j096m4208K8900K3096j8551k990j7303J6828
568a814K8382m1155J09L8844j7534j1104n396P1L4473k2981k8037M0843j954k5707
582a2960O240p91K3635j803m3624K8453K6947l2236k908K284R773J8295l8059
595a6754k543M2864k0745j7482R632j159K2685j4476k6302L9411m08l2454J4438
608c293N085J0678K103l7133K1106K5812l8782J30J9944K107P262l3230m290M7666
$$ plain form
622 25165 5741 -18405 4083 5209 11136 -2059 -26549 13399 21496 -16434 -2465 5987 1175
635 1175 5181 -18256 -43 27376 -12719 -16682 10504 3922 6140 -8444 -11858 26033 3142
648 3142 -26474 6373 11964 3932 -3796 -21962 10460 19190 -23004 -5960 14922 594 -1133
661 -1133 -16204 -2701 26535 -10024 -17916 15725 3405 -4068 -6404 -7629 24320 5383 -28108
674 -28108 6861 13472 -4534 -1114 -9141 10913 16501 -24717 -6012 22096 -1936 -4388 -5658
687 -5658 -1616 18218 -12618 -18027 23008 6865 -12564 -4972 -4567 17228 3952 -26352 9217
700 9217 17373 -13281 -7180 -3957 9417 16511 -21114 -9428 21524 -4141 -7318 3171 1057
713 1057 13557 -9937 -18540 21006 6810 -15930 1838 1160 6458 -1977 -23915 12264 22828
$$ packed form
622B5165j9424k4146K2488J126N927j3195k4490L9948Q097l7930J3969Q452m812
635A175M006k3437J8213K7419m0095l963K7186o582K218j4584l414L7891k2891
648C142k9616L2847N591q032p728j8166L2422Q730m2194J7044K0882j4328j727
661a133j5071J3503K9236l6559p892L3641j2320p473k336j225L1949j8937l3491
674b8108L4969O611j8006L420q027K0054N588m1218J8705K8108k4032k452j270
687e658M042J9834l0836n409M1035j6143j9429P592M05K1795j3276l0304L5569
700I217Q156l0654O101L223J3374P094l7625J1686L0952k5665l177J0489k114
713A057J2500k3494q603L9546j4196k2740J7768o78N298q435k1938L6179J0564
$$ plain form
726 22828 -16681 -8882 4459 6430 11613 -15971 -4578 27177 -5609 -16343 5086 3076 9460
739 9460 -5923 -18224 17248 5383 -21056 4733 8566 3253 -22 -18472 10101 22236 -18016
752 -18016 -7214 12993 1450 -165 -16359 -5264 25582 -7910 -23203 6928 2829 98 -3813
765 -3813 -9917 20379 7651 -24354 5663 15443 -208 419 -9672 7765 15336 -23417 -9401
778 -9401 20444 925 -5401 -9884 -3743 21542 -5217 -18161 18379 9943 -6090 -2010 -5827
791 -5827 15316 7920 -23496 3263 12467 -12787 -5867 -4752 3664 11551 -21191 -9830 22939
804 22939 -203 -7316 1356 1367 16046 -6776 -20421 18544 11794 -13738 -4632 -5580 6050 4681
818 4681 -21512 5337 19672 -11822 -6352 3964 6394 14845 -10200 -5015 25131 -2922 -15660
$$ packed form
726B2828l9509P799J3341J971N183k7584J1393L1755l2786j0734K1429k010O384
739I460j5383j2301L5472j1865k6439K5789L833n313l275j8450K8573J2135m0252
752a8016J0802K0207j1543j615j6194J1095L0846l3492j5293L0131m099k731l911
765c813o104L0296j2728l2005L0017R780j5651O27j0091J7437P571l8753J4016
778i401K9845j9519o326m483O141K5285k6759j2944L6540q436j6033M080l817
791e827K1143p396l1416K6759R204k5254O920J115Q416P887l2742J1361L2769
804B2939k3142p113Q672J1J4679k2822j3645L8965o750k5532R106r48J1630j369
818D681k6193K6849J4335l1494N470J0316K430Q451k5045N185L0146k8053j2738
$$ plain form
831 -15660 4681 3877 8175 -8776 -22380 14364 9753 -19353 -1180 5500 5345 3627 -17337 6224
845 6224 23357 -11494 -8245 7643 -662 2730 -11555 -7638 20029 -8577 -23626 5900 4523
858 4523 1748 -2930 -11040 18613 11295 -21565 3447 17488 5043 1544 -14162 1911 18061
871 18061 -16507 -11871 14015 160 -3344 -8624 -6613 19571 -1086 -16361 15241 9006 -5446
884 -5446 -1102 -4754 14334 8497 -24333 -917 13594 -7935 -6233 -8161 1291 14579 -15746
897 -15746 -11747 20656 4754 -3567 -67 -2065 15854 -14 -17404 14759 9813 -13520 -5782
910 -5782 -5764 6902 6853 -21252 438 17926 -10714 -8159 2032 6892 15460 -11803 -12356 20205
924 20205 276 -12969 2104 -10 6752 -5803 -21676 11029 10600 -15025 248 5355 4547
$$ packed form
831a5660K0341q04M298j6951j3604L6744m611k9106J8173O680j55j718k0964K3561
845F224J7133l4851L249J5888q305L392j4285L917K7667k8606j5049K9526j377
858D523k775m678q110K9653p318l2860K5012J4041j2445l499j5706J6073J6150
871A8061l4568M636K5886j3855l504n280K011K6184k0657j5275L1602o235j4452
884e446M344l652J9088n837l2830K3416J4511k1529J702j928R452J3288l0325
897a5746L999L2403j5902q321L500j998J7919j5868j7390L2163m946k3333P738
910e782J8J2666m9k8105K1690J7488k8640K555J0191M860Q568k7263n53L2561
924B0205j9929j3245J5073k114O762j2555j5873L2705m29k5625J5273N107q08
$$ plain form
937 4547 5456 -13946 6271 24281 -9043 -9174 7680 3718 6790 -10450 -11022 19406 -1089 -19811
951 -19811 2981 4975 5451 -613 -15541 11227 12991 -15527 1424 11546 260 -22 -13647
964 -13647 -215 17882 -13264 -12502 11507 -907 -4647 -8757 -5771 21671 1984 -19754 7881
977 7881 8817 -1665 -395 -8001 11540 11645 -21095 -4386 12252 -3606 -1833 -6505 -585 14357
991 14357 -12522 -12127 18236 4183 -4994 -1955 -2518 16066 1393 -19024 10475 11240 -9349 -4173
1005 -4173 -5059 7620 10620 -18343 -3246 16019 -5271 -3704 2030 1961 11906 -10148 -12575 17539
1019 17539 2967 -10507 1282 -841 6873 -3535 -20093 10696 15306 -12721 -5400 318 4836
1032 4836 8235 -14656 -701 21393 -6111 -10767 3165 1832 8862 -6377 -11795 16074 668
$$ packed form
937D547R09j9402K0217J8010l3324j31J6854l962L072j7240n72L0428k0495j8722
951a9811K2792J994M76o064j4928K6768J764k8518J6951J0122j1286k82j3625
964a3647J3432J8097l1146P62K4009j2414l740m110K986K7442j9687k1738K7635
977G881R36j0482J270p606J9541J05l2740J6709J6638j5858J773m672N920J4942
991A4357k6879L95L0363j4053r177L039n63J8584j4673k0417K9499P65k0589N176
1005d173q86J2679L000k8963J5097J9265k1290J567N734o9R945k2054k427L0114
1019A7539j4572j3474J1789k123P714j0408j6558L0789M610k8027P321N718M518
1032D836L399k2891J3955K2094k7504m656J3932j333P030j5239n418K7869j5406
$$ plain form
1045 668 -16448 4745 5444 3791 -1528 -15297 9467 13553 -15501 -2032 9582 1104 1298 -12733
1059 -12733 -1648 20113 -6489 -12560 7394 790 1502 -4006 -8409 16393 4181 -17584 4261
1072 4261 7416 -336 583 -9361 7038 12344 -18040 -5799 13993 1246 -1632 -9042 -2617 17047
1086 17047 -7541 -15089 12266 4536 -4863 -3857 -6444 13377 5215 -17170 6227 10280 -7244
1099 -7244 -822 -1717 7282 11184 -16207 -4542 16861 -2307 -4675 -148 608 12417 -8333 -16629
1113 -16629 14292 7293 -7897 -2127 -4624 6868 3415 -17482 4906 13162 -9884 -5291 -2147
1126 -2147 1515 8201 -12346 -4586 17324 -5106 -11042 3730 4108 10059 -4940 -13236 15479 7748
1140 7748 -12540 2234 5119 5874 2009 -15709 4817 15272 -10900 -5057 4785 -617 2718 -10119
$$ packed form
1045F68j7116K1193O99j653n319j3769K4764M086k9054J3469J1614q478J94j4031
1059a2733J1085K1761k6602o071J9954o604P12n508m403K4802j2212k1765K1845
1072D261L155p752R19r944J6399N306l0384J2241J9792j2747k878p410O425J9664
1086A7047k4588p548K7355p730r399J006k587J9821q162k2385K3397M053j7524
1099g244O422q95Q999L902k7391J1665K1403j9168k368M527P56J1809k0750q296
1113a6629L0921o999j5190N770k497J1492l453k0897K2388Q256k3046M593L144
1126b147L662O686k0547P760K1910k2430n936J4772L78N951j4999q296K8715p731
1140G748k0288J4774K885P55l865j7718K0526J0455k6172N843R842n402L335j2837
$$ plain form
1154 -10119 -3936 17541 -5577 -14348 5037 1672 1337 -4667 -10634 13130 4975 -18345 581
1167 581 8359 2725 2360 -10503 4033 15759 -9899 -3629 13138 3181 2438 -4510 -2936 16590
1181 16590 -1561 -11834 10394 3836 -5125 -3849 -7301 11402 5912 -19221 -834 9219 -4847
1194 -4847 -4008 -7960 2238 11441 -15108 -11812 10888 -208 -4305 -3697 -4239 10599 -3784 -14331
1208 -14331 12157 8212 -6637 -773 -1294 9434 7208 -13476 5392 16245 -6401 -4741 330
1221 330 5040 11699 -10406 -8645 14688 -399 -7883 1734 636 8611 -2487 -14947 9317 7433
1235 7433 -10059 369 1515 2540 2513 -14455 2353 15992 -7889 -7449 3138 2096 6262 -8114
1249 -8114 -6862 16789 536 -13133 1761 2567 4918 -1811 -12994 7435 6236 -14934 -1417
$$ packed form
1154a0119O183K1477k3118q771J9385l365l35o004n967K3764q155k3320J8926
1167E81P778n634l65j2863J4536J1726k5658O270J6767r957p43o948J574J9526
1181A6590j8151j0273K2228o558q961J276l452J8703n490k5133J8387J0053j4066
1194d847Q39l952J0198R203k6549L296K2700j1096m097O08n42J4838j4383j0547
1208a4331K6488l945j4849N864n21J0728k226k0684J8868J0853k2646J660N071
1221C30M710O659k2105J761K3333j5087p484R617j098P975j1098j2460K4264j884
1235G433j7492J0428J146J025k7j6968J6808J3639k3881M40J0587j042M166j4376
1249h114J252K3651j6253j3669J4894Q06K351o729j1183K0429j199k1170J3517
$$ plain form
1262 -1417 5805 -178 -715 -11642 105 13016 -10027 -7736 9286 1479 -731 -6928 -4582 16880
1276 16880 2258 -12899 6208 6109 804 716 -6039 10708 11691 -11938 -120 10211 667 2363
1290 2363 -3741 1224 12163 -9562 -9334 11588 1652 -4454 -4656 -5308 10236 -1473 -16321 5984
1304 5984 6722 -7332 -5180 -6496 5542 7567 -14249 -2837 10741 -4896 -4043 -1072 2080 10415
1318 10415 -8094 -9784 12729 2390 -6437 1505 1024 8425 -1121 -14222 8404 11575 -7372
1331 -7372 -2619 -307 3710 5636 -11822 -1083 14417 -4744 -6896 714 401 6650 -5090 -7941
1345 -7941 12125 526 -11200 2565 3636 4842 -445 -11572 7260 10225 -10598 -1920 6182
1358 6182 3117 2568 -10844 -1995 14945 -3901 -8217 4338 622 1802 -4619 -7453 11876 2846
$$ packed form
1262a417P222n983n37j0927J1747J2911k3043K291J7022p807k210o197K346K1462
1276A6880j4622j5157J9107r9n305q8o755J6747R83k3629J1818J0331r544J696
1290B363o104M965J0939k1725K28K0922r936o106k02o52J5544j1709j4848K2305
1304E984P38j4054K152j316J2038K025k1816J1412J3578j5637Q53K971L152Q335
1318A0415j8509j690K2513j0339q827P942m81P401r546j3101K2626L171j8947
1331g372M753K312M017J926j7458J0739J5500j9161k152P610l13O249j1740k851
1345g941K0066j1599j1726J3765J071J206n287j1127J8832K965k0823Q678Q102
1358F182l065n49j3412Q849J6940j8846m316J2555l716J180o421k834J9329r030
$$ plain form
1372 2846 -12755 2053 3877 -321 -424 -7641 5792 8304 -13643 -4302 8798 990 -457 -7209
1386 -7209 -1543 12305 -5634 -9890 8829 3776 -1766 -3697 -5719 9848 3722 -11893 4471
1399 4471 6896 -4149 -1991 -3809 5767 8899 -11703 -3564 11034 -1255 -2793 -1477 1569 11094
1413 11094 -5605 -11256 9900 4926 -4217 -914 -2836 6602 1696 -12639 4423 9300 -6443
1426 -6443 -3269 -1523 2061 5517 -9718 -2485 12385 -3985 -7776 644 1768 7327 -4962 -10534
1440 -10534 9969 3976 -8966 501 2211 5848 1934 -11669 3641 11040 -6008 -1679 3292
1453 3292 1306 3258 -7620 -1931 13513 -2834 -8608 3429 1193 2229 -4010 -7469 10327 3335
1467 3335 -12713 -337 4115 1894 357 -9083 2743 9095 -9523 -4203 6819 1251 990 -5545
$$ packed form
1372B846j5601J4808J824m198j03p217J3433K512k1947R341J3100p808j447o752
1386g209N666J3848j7939m256J8719n053n542j931k022J5567o126j5615J6364
1399D471K425j1045K158j818R576L132k0602Q139J4598j2289j538J316L046R525
1413A1094j6699n651K1156m974r143L303j922R438m906j4335J7062M877j5743
1426f443L174J746L584L456j5235P233J4870j6370l791Q420J124N559j2289n572
1440a0534K0503n993j2942R467J710L637l914j3603J5310P399j7048M329M971
1453C292j986J952j0878N689J5444j6347n774J2037k236J036o239l459J7796o992
1467C335j6048J2376M452k221j537r440J1826O352j8618N320J1022n568k61o535
$$ plain form
1481 -5545 -2556 11458 -2408 -7864 7736 3912 -1499 -2782 -4744 10045 5394 -11756 1089
1494 1089 6791 -1426 -1380 -5429 3403 9330 -9803 -7220 7368 28 -1644 -3005 -2405 7798 -4015
1509 -4015 -10259 7873 4672 -4242 -1876 -2417 6546 3572 -10633 3954 10661 -3881 -3867 -1586 3843
1524 3843 8765 -7471 -4994 10120 -456 -5287 -93 532 6957 -2442 -10512 6171 3816 -7138
1538 -7138 -542 40 2567 370 -11471 1396 9718 -5741 -4397 1264 1542 4356 -6524 -3554
1552 -3554 12473 845 -7093 1841 2276 5337 -146 -7133 7563 5237 -8874 41 4289 2137
1566 2137 1141 -8196 1354 9404 -6819 -5088 5607 1764 158 -7189 -4440 10689 -257 -9760
1580 -9760 2157 2363 -99 -2124 -6336 7107 6225 -9215 -204 5771 157 1547 -2947 2841 8781
$$ packed form
1481e545K989J4014j3866n456J5600l824n411j283j962J4789m651j7150J2845
1494A089N702q217M6m049Q832N927j9133K583J4588p340j672j361O00J0203j1813
1509d015o244J8132l201q914K366n41Q963k974j4205J4587O707j4542J4K281N429
1524C843M922j6236K477J5114j0576m831N194O25O425r399q070J6683k355j0954
1538g138O596N82K527k197j1841J2867Q322j5459J344N661K78K814j0880K970
1552c554J6027j1628p938Q934M35L061n483o987J4696k326j4111Q915M248k152
1566B137r96r337R550Q050j6223J731J0695l843j606p347K749J5129j0946r503
1580i760J1917K06k462k025m212J3443q82j5440R011N975n614J390m494N788N940
$$ plain form
1595 8781 -7295 -5336 8260 1496 -1701 -3552 -3077 7978 -1901 -10700 5036 4939 -3456 -3464 -5437
1610 -5437 4471 5053 -9852 -1130 6705 -3474 -3355 -2887 1369 7438 -6403 -6303 8188 1184 -3547
1625 -3547 1020 1814 8453 -76 -8437 7528 8264 -3375 -159 287 4280 3890 -8781 365 9591
1640 9591 -3223 -4231 -264 116 4481 -4923 -5192 8326 -1065 -8073 406 878 3287 -2188 -9723
1655 -9723 4114 4490 -8791 -2391 2209 2053 1381 -8755 -880 10291 -2420 -3857 3504 1481
1669 1481 2751 -3508 -4214 9708 1897 -7735 1782 2368 665 -917 -5234 6122 6088 -9176 -1902
1684 -1902 6035 2066 847 -4600 443 9099 -4882 -6211 5820 2347 -520 -3500 -4259 6801
1698 6801 1281 -7900 4017 4882 -2254 -1228 -3036 5085 6093 -8417 -1764 6586 -1649 -2707 -3010
$$ packed form
1595H781j6076J959J3596o764l197j851M75J1055r879q799J5736r7q395qj973
1610e437R908N82j4905Q722P835j0179J19M68M256O069j3841J00J4491p004m731
1625c547M567P94O639q529q361J5965P36j1639L216M46L993l90j2671R146R226
1640I591j2814j008L967L80M365r404k69J3518r391p008Q479M72K409n475p535
1655i723J3837L76j3281O400M600j56o72j0136P875J1171j2711j437P361k023
1669A481J270o259p06J3922p811r632R517N86j703j582m317J1356l4j5264P274
1684a902P937l969j219n447N043Q656j3981j329J2031l473k867k980p59J1060
1698F801n520r181J1917Q65p136J026j808Q121J008j4510O653Q350q235j058l03
$$ plain form
1713 -3010 492 6933 -5713 -8528 5385 1996 -2813 -1411 -2125 5397 916 -8613 3805 6107
1727 6107 -3157 -1291 -1630 2215 3794 -7240 -817 8764 -2252 -4603 -21 1805 6447 -2999 -5895
1742 -5895 8147 2784 -5459 -40 1368 4895 273 -8901 2420 5861 -5138 -1711 1345 930
1756 930 1594 -6719 -1350 9200 -2050 -4932 2441 1264 2337 -3223 -5103 8004 2617 -8143
1770 -8143 -632 1984 2329 531 -6533 2810 6414 -6186 -2311 4089 1649 1792 -4571 -1778 7434
1785 7434 -2830 -5554 4669 1698 -751 -3419 -4466 7014 2514 -8391 1188 4204 -584 -1357
1799 -1357 -4170 3669 7131 -6897 -3957 5046 192 -492 -2389 -737 6376 -3380 -6949 5517 2853
$$ packed form
1713c010L502O441j2646k815J3913l389m809J402p14P522m481r529J2418K302
1727F107r264J866l39L845J579j1034O423R581j1016k351M582J826M642r446k896
1742e895J4042n363q243N419J408L527m622r174J1321L441j0999L427L056m15
1756I30O64q313N369J0550j1250k882P373j177J073n560j880J3107n387j0760
1770h143P511K616L45j798p064R343L604j2600L875O400k440J43o363K793R212
1785G434j0264k724J0223k971k449k668j047J1480m500j0905R579L016m788p73
1799a357k813P839L462j4028K940R003m854o84j897J652P113r756l569J2466k664
$$ [...]
8191A20
##END NTUPLES=NMR FID
##END=
