##TITLE=1H_CA-9401K
 200.13MHz,DMSO.
 8 sc
 
 9.2.2026
##JCAMPDX= 6.0         $$ Bruker NMR JCAMP-DX V2.0
##DATA TYPE= NMR FID
##DATA CLASS= NTUPLES
##ORIGIN= UXNMR, Bruker Analytische Messtechnik GmbH
##OWNER= pz
$$ XWIN-NMR		Version 3.5
$$ Mon Feb  9 15:23:06 2026 Russian Standard Time (UT+4h)  she@DPX200
##.OBSERVE FREQUENCY= 200.1313
##.OBSERVE NUCLEUS= ^1H
##.DELAY= (6, 6)
##.ACQUISITION MODE= SIMULTANEOUS
##.ACQUISITION SCHEME= undefined
##.AVERAGES= 8
##.DIGITISER RES= 18
##SPECTROMETER/DATA SYSTEM= spect
##.PULSE SEQUENCE= zg30
##.SOLVENT NAME= DMSO
##.SHIFT REFERENCE= (INTERNAL, DMSO, 0, 14.3821)
##AUDIT TRAIL= $$ (NUMBER, WHEN, WHO, WHERE, WHAT)
$$ ##TITLE= Audit trail, XWIN-NMR		Version 3.5
$$ ##JCAMPDX= 5.01
$$ ##ORIGIN= Bruker BioSpin GmbH
$$ ##OWNER= she
$$ F:/spectra/data/she/nmr/H-C/1/audita.txt
$$ ##AUDIT TRAIL=  $$ (NUMBER, WHEN, WHO, WHERE, WHAT)
(   1,<2026-02-09 15:21:13.68 +0400>,<she>,<DPX200>,
      <created by zg, POWCHK disabled, PULCHK disabled
       configuration hash MD5:
       00 E9 B6 7A A2 85 ED C7 34 08 36 98 17 FE 4E 26
       data hash MD5: 16K
       E9 D5 6E 87 77 88 1F D5 1A 62 B7 0A E0 90 F0 BC>)
$$ ##END=
$$ 
$$ hash MD5
$$ CA 1F 44 60 3C 3A 91 58 EC 31 4D 99 29 F0 D6 7B
##$RELAX= 
##$RELAX= 
##$RELAX= 
##$RELAX= 
##$RELAX= 
##$RELAX= 
$$ Bruker specific parameters
$$ --------------------------
##$DU= <F:/spectra>
##$EXPNO= 1
##$NAME= <H-C>
##$PROCNO= 1
##$TYPE= <nmr>
##$USER= <she>
##$AMP= (0..31)
100 100 100 100 100 100 100 100 100 100 100 100 100 100 100 100 100 100 
100 100 100 100 100 100 100 100 100 100 100 100 100 100 
##$AQSEQ= 0
##$AQ_mod= 1
##$AUNM= <au_zg>
##$AUTOPOS= <>
##$BF1= 200.13
##$BF2= 200.13
##$BF3= 200.13
##$BF4= 200.13
##$BF5= 200.13
##$BF6= 200.13
##$BF7= 200.13
##$BF8= 200.13
##$BYTORDA= 1
##$CFDGTYP= 0
##$CFRGTYP= 5
##$CHEMSTR= <none>
##$CNST= (0..31)
1 1 145 1 1 1 1 1 1 1 1 1 1 1 1 1 1 1 1 1 1 1 1 1 1 1 1 1 1 1 1 1 
##$CPDPRG= <>
##$CPDPRG1= <>
##$CPDPRG2= <>
##$CPDPRG3= <>
##$CPDPRG4= <mlev>
##$CPDPRG5= <mlev>
##$CPDPRG6= <mlev>
##$CPDPRG7= <mlev>
##$CPDPRG8= <mlev>
##$CPDPRGB= <>
##$CPDPRGT= <>
##$D= (0..31)
0 0.7 0 0 0 0 0 0 0 0 0 0.03 0 0 0 0 0 0 0 0 0 0 0 0 0 0 0 0 0 0 0 0 
##$DATE= 1770636073
##$DBL= (0..7)
120 120 120 120 120 120 120 120 
##$DBP= (0..7)
150 150 150 150 150 150 150 150 
##$DBP07= 0
##$DBPNAM0= <>
##$DBPNAM1= <>
##$DBPNAM2= <>
##$DBPNAM3= <>
##$DBPNAM4= <>
##$DBPNAM5= <>
##$DBPNAM6= <>
##$DBPNAM7= <>
##$DBPOAL= (0..7)
0.5 0.5 0.5 0.5 0.5 0.5 0.5 0.5 
##$DBPOFFS= (0..7)
0 0 0 0 0 0 0 0 
##$DE= 6
##$DECBNUC= <off>
##$DECIM= 32
##$DECNUC= <off>
##$DECSTAT= 4
##$DIGMOD= 1
##$DIGTYP= 9
##$DL= (0..7)
0 120 120 120 120 120 120 120 
##$DP= (0..7)
150 150 150 150 150 150 150 150 
##$DP07= 0
##$DPNAME0= <>
##$DPNAME1= <>
##$DPNAME2= <>
##$DPNAME3= <>
##$DPNAME4= <>
##$DPNAME5= <>
##$DPNAME6= <>
##$DPNAME7= <>
##$DPOAL= (0..7)
0.5 0.5 0.5 0.5 0.5 0.5 0.5 0.5 
##$DPOFFS= (0..7)
0 0 0 0 0 0 0 0 
##$DQDMODE= 0
##$DR= 18
##$DS= 0
##$DSLIST= <SSSSSSSSSSSSSSS>
##$DSPFIRM= 0
$$ [...]
##$SUBNAM0= <"">
##$SUBNAM1= <"">
##$SUBNAM2= <"">
##$SUBNAM3= <"">
##$SUBNAM4= <"">
##$SUBNAM5= <"">
##$SUBNAM6= <"">
##$SUBNAM7= <"">
##$SUBNAM8= <"">
##$SUBNAM9= <"">
##$SW= 18.0517328524113
##$SWIBOX= (0..15)
0 0 2 0 0 0 0 0 0 0 0 0 0 0 0 0 
##$SW_h= 3612.71676300578
##$TD= 16384
##$TD0= 1
##$TE= 0
##$TE2= 300
##$TE3= 300
##$TEG= 300
##$TL= (0..7)
0 120 120 120 120 120 120 120 
##$TP= (0..7)
150 150 150 150 150 150 150 150 
##$TP07= 0
##$TPNAME0= <>
##$TPNAME1= <>
##$TPNAME2= <>
##$TPNAME3= <>
##$TPNAME4= <>
##$TPNAME5= <>
##$TPNAME6= <>
##$TPNAME7= <>
##$TPOAL= (0..7)
0.5 0.5 0.5 0.5 0.5 0.5 0.5 0.5 
##$TPOFFS= (0..7)
0 0 0 0 0 0 0 0 
##$TUNHIN= 0
##$TUNHOUT= 0
##$TUNXOUT= 0
##$USERA1= <user>
##$USERA2= <user>
##$USERA3= <user>
##$USERA4= <user>
##$USERA5= <user>
##$V9= 5
##$VALIST= <valist>
##$VCLIST= <CCCCCCCCCCCCCCC>
##$VD= 0
##$VDLIST= <DDDDDDDDDDDDDDD>
##$VPLIST= <PPPPPPPPPPPPPPP>
##$VTLIST= <TTTTTTTTTTTTTTT>
##$WBST= 1024
##$WBSW= 4
##$XGAIN= (0..3)
0 0 0 0 
##$XL= 0
##$YL= 0
##$YMAX_a= 220864
##$YMIN_a= -345771
##$ZGOPTNS= <>
##$ZL1= 120
##$ZL2= 120
##$ZL3= 120
##$ZL4= 120
##$ABSF1= 10
##$ABSF2= 0
##$ABSG= 5
##$ABSL= 3
##$ALPHA= 0
##$AQORDER= 0
##$ASSFAC= 0
##$ASSFACI= 0
##$ASSFACX= 0
##$ASSWID= 0
##$AUNMP= <proc_1d>
##$AZFE= 0.1
##$AZFW= 0.1
##$BCFW= 1
##$BC_mod= 2
##$BYTORDP= 1
##$COROFFS= 0
##$CY= -3
##$DATMOD= 1
##$DC= 2
##$DFILT= <>
##$DTYPP= 0
##$F1P= 0
##$F2P= 0
##$FCOR= 0.5
##$FTSIZE= 0
##$FT_mod= 4
##$GAMMA= 1
##$GB= 0.15
##$INTBC= 1
##$INTSCL= 1
##$ISEN= 128
##$LB= 0.25
##$LEV0= 0
##$LPBIN= 0
##$MAXI= 10000
##$MC2= 0
##$MEAN= 0
##$ME_mod= 0
##$MI= 1.114404
##$NCOEF= 0
##$NC_proc= 0
##$NLEV= 6
##$NOISF1= 3.799351
##$NOISF2= 2.8
##$NSP= 1
##$NTH_PI= 0
##$NZP= 0
##$OFFSET= 14.38212
##$PC= 1
##$PHC0= -3691.535
##$PHC1= -4.207672
##$PH_mod= 1
##$PKNL= yes
##$PPARMOD= 0
##$PSCAL= 0
##$PSIGN= 0
##$REVERSE= no
##$SF= 200.129724274929
##$SI= 16384
##$SIGF1= 3
##$SIGF2= 2
##$SINO= 400
##$SIOLD= 16384
##$SREGLST= <1H.CDCl3>
##$SSB= 0
##$STSI= 0
##$STSR= 0
##$SW_p= 3205.1282051282
##$SYMM= 0
##$S_DEV= 0
##$TDeff= 0
##$TDoff= 0
##$TI= <>
##$TILT= no
##$TM1= 0
##$TM2= 0
##$TOPLEV= 0
##$USERP1= <user>
##$USERP2= <user>
##$USERP3= <user>
##$USERP4= <user>
##$USERP5= <user>
##$WDW= 1
##$XDIM= 8192
##$YMAX_p= 0
##$YMIN_p= 0
$$ End of Bruker specific parameters
$$ ---------------------------------
##NTUPLES= NMR FID
##VAR_NAME=  TIME,          FID/REAL,        FID/IMAG
##SYMBOL=    X,             R,               I
##VAR_TYPE=  INDEPENDENT,   DEPENDENT,       DEPENDENT
##VAR_FORM=  AFFN,          ASDF,            ASDF
##VAR_DIM=   8192,          8192,            8192
##UNITS=     SECONDS,       ARBITRARY UNITS, ARBITRARY UNITS
##FACTOR=    0.0002768,     1,               1
##FIRST=     0,             0,               0
##LAST=      2.2672688,     0,               0
##MIN=       0,             -345771,         0
##MAX=       2.2672688,     220864,          0
$$ Real data points
##PAGE= N=1
##DATA TABLE= (X++(R..R)), XYDATA
$$ [...]
1668i63J745L42j605n07O45J151P9j820J4J409m8k89m01k08J000Oq38R7j67L22
$$ -963 782 1124 -481 -988 -343 808 887 -933 -919 490 442 153 -248 -456 544 550 -288 -191 -358 -36
1688c6Q47p22p90M63L85L02n00m37Q34m3n71K52K22q5J09o69O14J37o72P2O15
$$ -36 811 89 -701 -238 147 449 -51 -488 346 303 -268 -16 206 121 230 -439 175 312 -360 -288 327
1709C27J83l57q12J01J065k73l31j89r0P60n7o25k28L51P69M53j603p64J342P49
$$ 327 510 153 -659 -558 507 234 -97 -286 -376 384 327 -298 -526 -175 594 1047 -556 -1320 22 771
1729G71j00j355l77J753N11j559p04P49R22M67j295j072J155O28M43j001j376
$$ 771 671 -684 -1061 692 1203 -356 -1060 -311 611 1078 -217 -1289 -134 494 937 -64 -1440
1746a440J366J198p59j074l93J304J385j445j232M55J055P64j168j253R38P57
$$ -1440 -74 1124 365 -709 -1102 202 1587 142 -1090 -635 420 1184 16 -1237 -299 458
1762D58p8m07q01N18J221l19j085k29N04J530m96j901J94J136O18n26j444O23
$$ 458 380 -27 -828 -310 911 592 -493 -722 -218 1312 816 -1085 -891 245 863 337 -1107 -484
1780d84J450k95j075k62K08J476l83j280J56L09Q92P9j394l50J324M18m60j268
$$ -484 966 671 -404 -666 -458 1018 635 -645 -489 -180 712 791 -603 -953 371 789 329 -939
1798i39L52J549k8j644l1M60R08j16j009J95N25N4j72l98o4R06k25l29n43J30
$$ -939 -587 962 934 -710 -741 -281 627 511 -498 -303 222 276 104 -294 -358 548 323 -6 -549 -419
1818d19P87L76j391J27R42Q8l28p50R5J187n07p29M91K7L92l14n35R23k25l99
$$ -419 368 744 -647 -520 422 510 182 -568 -473 714 207 -522 -31 -4 388 74 -461 462 237 -162
1838a62J35k84K07L81j14l82Q8L2M14J13r88N55M84m18k85j1M33K70q66J6P06
$$ -162 -27 -311 -104 277 163 -219 -131 -99 315 428 -560 -5 479 61 -224 -235 198 468 -398 -382 324
1859C24l98mm9m1P47q74o4N43K4k36N8l16M05M1o20K89K07J81K30o08p38J093
$$ 324 -74 -78 -127 -168 579 -295 -359 184 208 -28 30 -286 119 160 -460 -171 36 217 447 -161 -899 194
1881A94L92l53q54j67J313Q07j674o32R63Q91p2j391o25J807M77r67q70o3J557
$$ 194 586 233 -621 -788 525 1332 -342 -974 -11 880 808 -583 -1208 599 1076 109 -761 -824 733
1900G33L44j346o59L75J280N77j915r38J732J036k42k174j93J851J220j916j324
$$ 733 1077 -269 -928 -553 727 1304 -611 -1549 183 1219 977 -1197 -1390 461 1681 -235 -1559
1917a559R81J746Rj860q33J297J213m6j768o67J823O09n96j185j80J584O25j373
$$ -1559 -578 1168 1177 -683 -1516 -219 994 948 -820 -1487 336 945 349 -836 -1016 568 1193 -180
1935a80r12R60Q77J32j422p75J618O17j119j89j72P45K51q96J04J50L49L34n91
$$ -180 -1092 -132 745 877 -545 -1320 298 915 -204 -393 -565 180 431 -465 -361 -211 138 472 -119
1954a19l24M55L52l03R5l48J10M02n52J94J90j08Oj47J57L16o10J8M34J65n16
$$ -119 -443 12 364 61 156 -192 -82 320 -232 -38 152 44 50 -97 60 376 -234 -216 218 383 -133
1975a33k19n6Q71k48n61O8M47J19j30n65J86Q32m45j14k96k26Q23l4p69qM94K99
$$ -133 -352 -408 463 215 -346 -278 169 288 158 -407 -221 611 166 52 -244 -470 353 319 -450 -458 36 335
1997C35J61r13K01O52j89k50m35p6J144n23n00M56l1K73j55l79K74Q1j95J56j18
$$ 335 496 -417 -216 436 247 -3 -438 -514 630 107 -393 63 32 305 150 -229 45 126 -69 87 -31
2018c1m33Q71l20n7J41q3K69l65j92L73K35o05J4J71R4j8l91K26O84l54n85J50
$$ -31 -464 407 87 30 171 88 357 -8 -200 173 408 -197 -183 -12 82 64 -327 -101 583 229 -356 -206
2040b06OM55j7p44M42K55j44J55p20Q6Q47k72m43n3K88O49l07r94K0R30J46m69
$$ -206 -200 255 238 -506 -64 191 47 202 -518 -432 415 143 -300 -353 -65 584 277 -717 -697 233 379 -90
2062i0q0K26N48m79l09J01K04L7m1j57K03l85J62M38n78J59M46l69r6j75L9N71
$$ -90 -170 56 604 125 -184 -83 121 158 117 -40 163 -222 -60 378 -200 -41 405 36 -60 -235 -196 375
2084C75m61k75O46J0j98k46n7N81k29o34O84R8k67j63j61L32K89n59L8L13l26
$$ 375 -86 -361 285 295 97 -149 -206 375 146 -488 196 294 27 -136 -297 35 324 -235 -197 116 -210
2105b10N46k36o19L86K76M9K06p91J97O15k95k05k33K43N66k74m89K65J89o6q0
$$ -210 336 100 -519 -133 143 192 398 -393 -196 419 124 -81 -314 -71 495 221 -268 -3 186 120 40
2126D0j33J83M6n57M01K81l32Q1k16K52l1j11K40rk32J33J75l35J42J43r1n8k72
$$ 40 -93 90 136 -421 -20 261 -71 10 -206 46 15 -96 144 135 -97 36 211 -124 18 161 70 12 -260
2149b60K97M67j74n28N2K09K33j16n74N05L96m50J23p18K23Q72o65N4o8J29K46
$$ -260 37 504 330 -198 -146 63 296 180 -394 111 507 57 180 -538 -315 557 -108 -54 -122 7 253
2170B53K6j136L86Q87Q6l94q05K89J187p87m11P5K44O44n16n22L30N37L7j45p37
$$ 253 279 -857 -471 416 502 108 -697 -408 779 -8 -419 -344 -100 544 28 -494 -164 373 410 265 -472
2191d72K5J007l54p3n88J49P55J9r11P7O50L67m42o76J35N75J2r0l44k34P19q4
$$ -472 -447 560 206 133 -455 -306 449 468 -443 -366 284 651 209 -467 -332 243 255 165 -179 -413 306 222
2213B22n77J63J53K47J13o55k52O73L08l1o89k55O97K43m64K11n33N90K85n87
$$ 222 -355 -192 -39 208 321 -334 -586 87 395 364 -325 -580 117 360 -104 107 -426 164 449 -138
2233a38J53p5K04K11m10l45M30J5P2j63m32N11L59l91k69P8K50K38l75l36N04
$$ -138 15 -60 144 355 -55 -400 30 45 117 -46 -478 33 392 1 -268 -190 60 298 -77 -413 91
2254I1Po4L37n46K87L34m36J84m11J3M54k89j22J10J51o5j38j21M15l2k85O8N6
$$ 91 98 34 371 -175 112 446 10 194 -217 -204 250 -39 -161 -51 100 35 -103 -224 191 159 -126 -58 -2
2277bK22j94n45L94L04k89O2K55l24K34p3j98J97K32k98K16k41o2J88j19j36J93
$$ -2 220 26 -519 -125 179 -110 -48 207 -117 117 44 -154 43 275 -23 193 -48 -110 78 -41 -177 16
2299A6r9M60k14o01N42j04L0N7k08K80k18k53M15K51l50M8L1m8K32k10j01J17
$$ 16 -83 377 163 -438 104 0 30 87 -121 159 -59 -312 103 354 4 52 83 35 267 57 -44 73
2321G3j91K06Q9l89J69J07j76L37l18RM18k22l39N6J29L00o4n38L36J15R7m39
$$ 73 -118 88 177 -212 -43 64 -112 225 -93 -84 334 112 -227 -171 -42 258 194 -344 -8 107 204 -235
2343b35j41L09M19k03j88j96P7O05j73n78O0M23q6j01m52J72P90m15k28k44K26
$$ -235 -376 -67 352 149 -39 -235 -158 447 274 -304 -244 179 93 -8 -460 -288 502 87 -141 -385 -159
2364a59N68n96m5L16P9k02J41k59J78J93P8l71O3l23O85k63l36P3K28m4pl66L26
$$ -159 409 -187 -232 84 163 -39 102 -157 21 214 292 -79 -16 -339 346 83 -253 -180 48 4 -3 -369 -43
2387d3N80k01m77P5PJ76j07j32M73k25L0r8j22Q8q7k2K72j69j21K29m25J55M04
$$ -43 537 336 -141 -66 -59 117 10 -122 351 126 156 58 -64 24 -63 -85 187 18 -103 126 -299 -144 260
2410B60k28P5l08J0L19j10k05J56K98l32pj71L03M43m98l3k20L53J61n9k16q6
$$ 260 32 107 -201 -191 128 18 -187 -31 267 -65 -72 -243 60 503 5 -28 -248 105 266 207 -9 -95
2432i5J83p7K73o46J37N33J9k92k62qO38k83l20j69O22j82q7l28J19K79j34J49
$$ -95 88 11 284 -362 -225 308 327 35 -227 -235 403 120 -200 -369 253 71 -16 -344 -225 54 -80 69
2454F9k67q3K99J73k75J15j02J20J0j21l4P4J33J27l55j07L40j04r8J82j70j13
$$ 69 -198 -281 18 191 -84 31 -71 49 59 -62 -96 -22 111 238 -117 -224 116 12 -86 96 -74 -187
2476a87K84j11K61j22l26M49j80m00L54J58R5k22k28l2K31j9J59Rl32K12k08M34
$$ -187 97 -14 247 125 -201 248 68 -332 22 180 275 53 -175 -207 24 5 164 173 -159 53 -155 279
2498B79l51q4K97N1j01k02K6K1K87k28j60K00L8l0r0P4PM9l20K75K5j47M35k94
$$ 279 -72 -156 141 192 91 -111 -85 -64 223 -5 -165 35 73 43 -47 27 34 83 -237 38 63 -84 351 57
2522E7j92J69o3J58j2m40L02L18m73J25j13J57J00k60P1K10p5k9J13k91J65L0
$$ 57 -135 34 -29 129 117 -323 -21 297 -176 -51 -164 -7 93 -167 -96 114 39 10 123 -168 -3 27
2544B7J2R7l15JJ15j49J18J51N4k28J2j18J79m0j52K28k6K70k10p9J43jk49K12
$$ 27 39 136 -179 -178 -63 -212 -94 57 111 -117 -105 -223 -44 -84 -236 -8 -34 236 26 -53 90 89 -160 52
2568E2K5j11J31l34K5J88r2L58p6j45m0N8J3O5k34p6K34l6Q0o1J46k00L04m21
$$ 52 77 -34 97 -237 -212 -24 -116 242 166 21 -19 39 52 117 -117 -193 41 5 85 24 170 -30 274 -147
2592a47Q5k9j59L35j24k06K43R5L5n8l06K65J61l68K6N8J3K11j0lp1l89N06j90
$$ -147 -62 -91 -250 85 -39 -245 -2 93 128 70 -236 29 190 -178 -152 -94 -81 130 120 117 46 -343 163 -27
2616b7K32l19M3J53j34oo6M40j85k52r7n3M62j2l98J44n1J45K11l35k82L35L34
$$ -27 205 -114 -71 82 -52 -58 -124 316 131 -121 -218 -271 191 179 -219 -75 -126 19 230 -105 -387 -52 282
2639B82l4j20m55M26J43j10k86p9K58L22m44j47L47P2k97L5k64J59L64n3m2k12
$$ 282 248 128 -327 99 242 132 -154 -233 25 347 -97 -244 103 175 -122 -87 -351 -192 172 119 77 -135
2661a35J8K30j13k85L56kK34m36l60N30K23j65k89m9N9K04k14J3J85l0J07p0J8
$$ -135 -117 113 0 -285 71 69 303 -133 -493 37 260 95 -194 -243 -184 20 -194 -181 4 -26 81 11 29
2684B9J16pk11j55L62l8L07m08j5L7oJ13m19L18P4j41LJ17r8j04J07k8QM43k97
$$ 29 145 138 -73 -228 134 96 403 -5 -20 17 11 124 -295 23 97 -44 -41 76 -22 -126 -19 -47 -39 404 107
2709A07k67p4K60J01k7k64L24j13j07R7l51K05J16J37j82j01N4K09M2l77l0J34
$$ 107 -160 -234 26 127 100 -164 160 47 -60 37 -314 -109 7 144 -38 -139 -85 124 166 -211 -241 -107
2731a07J67j01k55L62Q9j61k34J12l8M48k36k9l7J54p6o4j91J34r2M05j55l12
$$ -107 60 -41 -296 66 155 -6 -240 -128 -166 282 46 17 -20 134 58 -6 -197 -63 -155 250 95 -217
2753b17J40M53n91Q0M2J5M5j17j24L36J02k11O9k05K19J23j40P7k45Nj6K28k96
$$ -217 -77 376 -215 -135 -93 -78 -33 -150 -274 62 164 -47 22 -183 36 159 19 96 -149 -144 -160 68 -228
2776b28M37o8l3j53q8K04m8k75K63l3Jk8O9N2N3k1j87m2j82K47J40j0j13j1M1
$$ -228 209 141 108 -45 -133 71 23 -252 11 -22 -21 -49 20 72 125 104 -83 -125 -307 -60 80 70 -43 -54 -13
2801a3k6k10p9K51R5P0k55P8L75l94m3K45q3J12k11K46k7J28j38p4M0l12L57M9
$$ -13 -39 -249 -328 -77 18 88 -167 -89 286 -108 -151 94 11 123 -88 158 131 259 121 47 87 -225 132 181
2825A81r6J46l00K19m8j98p7L69j20Oq1L7L6j40P6J32j63j01n4J39L3J48l99K21
$$ 181 85 231 -69 150 102 -96 -173 196 76 82 1 38 74 -66 10 142 -21 -122 -176 -37 -4 144 -255 -34
2849c4K37j76Q4k91J27J63j89QL4j32L74r8L8k57J63P1m3l39J17L53p9l78J52
$$ -34 203 27 111 -180 -53 110 -79 -71 -37 -169 205 107 145 -112 51 122 79 -260 -143 210 131 -247 -95
2872i5K62p5K6r7k06L06o9R8j35n9J40j71K6N0j20J18j17O5K3L2j28J48k33K4
$$ -95 167 92 118 21 -185 121 52 150 15 -44 96 -75 -49 1 -119 -1 -118 -53 -30 2 -126 22 -211 -187
2896a87J42j12K28P9j56k01K30j95J57L8LK17k57oJ56P2k01j42N4J27J62m55M96
$$ -187 -45 -157 71 150 -6 -207 23 -172 -15 23 26 243 -14 -20 136 208 7 -135 -81 46 208 -247 249
2919B49k74k37J97l6K92k05j93J79J14p5Q2j52K03j06l58K76K10N0l00L14k05
$$ 249 -25 -262 -65 -101 191 -14 -207 -28 86 11 93 -59 144 38 -320 -44 166 216 -84 230 25
2940B5j20L08p8m7m8j05L43l39q1J25NJ26K9k05O8L9j14J4J17j64K42l16J98l1
$$ 25 -95 213 135 88 40 -65 278 -61 -142 -17 -12 114 143 -62 6 45 -69 -55 62 -102 140 -176 22 -9
2964il68L58jK2J9J17j01r3q6N4J1J05j15O6k1N5K4j57K84j86j91P4M10k77J48
$$ -9 -377 -19 -20 2 21 138 37 -56 -142 -88 -77 28 -87 -21 -42 13 37 -120 164 -22 -213 -139 271 -6 142
2989A42j71J03K17k29j84J38j19M8Q0P4R7l28K31j69J19n4l0M9J63l51kL77rj79
$$ 142 -29 74 291 62 -122 16 -103 -55 25 99 196 -132 99 -70 49 -5 -35 14 177 -174 -176 201 192 13
3013A3j38O5K6p6J36K70k71J58j51R6j50J41q9m2j73n9K51N8M2j90n8L30j38r1
$$ 13 -125 -60 -34 -110 26 296 25 183 32 128 -22 119 30 -12 -185 -244 7 65 107 -83 -141 189 51 -40
3037d0J1J95k55N4K04r4kJ1l0J9Q2l47K78j20N4q8K35n5m8R0j71k2k2J9K66k48
$$ -40 -29 166 -89 -35 169 75 73 84 54 73 155 -192 86 -34 20 -68 167 112 64 154 -17 -39 -61 -42 224 -24
3063b4L9p0J15j08k3Mm5K04j75K4K5J89k73J45Pj08J75mj25l3P4m4O0k59Q8K56
$$ -24 15 -55 60 -48 -71 -67 -112 92 -83 -59 -34 155 -118 27 34 -74 101 97 -28 -61 13 -31 29 -230 -142 114
3089A14j42K05m56J41J70j40p4N8J46o6p0M4R4J17j54m8l7K10j4j28J52o3J23
$$ 114 -28 177 -279 -138 32 -108 -182 -124 22 -44 -114 -70 24 141 -13 -61 -98 112 98 -30 122 59 182
3112A82n1L9p2K7j88K14j91p0P6J32j48Q5j5LJ55n6K7k36K7K5J69j02j11J75j32
$$ 182 131 170 98 125 -63 151 -40 -110 -34 98 -50 35 20 23 178 122 149 -87 -60 -35 134 32 -79 96 -36
3137c6k9K01k87L31j82j69K22J2k28K10r2K43j78j35O8J26n9K9r8K1L9j7K3K00
$$ -36 -65 136 -151 180 -2 -171 51 63 -165 45 -47 196 18 -117 -49 77 18 47 -51 -30 9 -8 15 215
3161B15l33N3J68j65K32p4j27l3J01k5j33K57o4L7k52L71j1m52L76o7J09j61O7
$$ 215 -118 -65 103 -62 170 96 -31 -64 37 12 -121 136 72 109 -143 228 217 -235 141 74 183 22 89
3184H9rp6p7OL0k4k15M91l36M7J88k67L13j84j55J57j33JR8K11j43Po2rJ05j07
$$ 89 80 4 -73 -67 -37 -61 -276 215 -121 -74 114 -153 160 -24 -179 -22 -155 -154 -56 155 12 19 -43 -52 53 -54
3210e4o5K18j07K05j04k34K35k72J17J65l27J67K57k78J00Lr2J11O7j8M9k14J12
$$ -54 -119 99 -8 197 93 -141 94 -178 -61 104 -223 -56 201 -77 23 26 -66 45 112 94 143 -71 41
3233D1m6j08L67j31k03J37k40J43%j00K04M3j19j16J04O3p2J6J7m5K08k33J45
$$ 41 -5 -113 254 123 -80 57 -183 -40 -40 -140 64 107 -12 -128 -24 39 -33 -17 0 -45 163 -70 75
3256G5j52J06L33l42L2j38O8Q2j14N5l25K32L06j39jj44K41j58J16r6l4o4Q1R8
$$ 75 -77 29 362 20 52 -86 -18 64 -50 5 -320 -88 218 79 78 -66 175 17 133 37 3 -61 20 118
3280A18k19q5K67j37K8J4j24OK30kL6k98K45j50k6M0J7J18q5K8Lj08K53k67J2
$$ 118 -101 -186 81 -56 -28 -14 -138 -132 98 96 132 -166 79 -71 -97 -57 -40 78 -7 21 24 -84 169 -98 -86
3305h6R5J58l06K40K4r4rk03M4L37l17l1J12R1J16m75L66J14k94J25j05m7Q1Q7
$$ -86 9 167 -139 101 125 31 22 -181 -137 200 -117 -148 -36 55 171 -304 62 176 -118 7 -98 -145 -64 23
3329B3o7Q1l39M92p5k74J25J24Q9j31K0j28R2l7k11J60n7K08q9j82K25J11j08
$$ 23 -44 37 -302 190 115 -159 -34 90 179 48 68 -60 32 -5 -216 -56 -113 95 6 -176 49 160 52
3352E2j83J05l9M1L6k9P3q0K58l20J67O1l6j49R4j76K32m1j96K78k21J27j12m1
$$ 52 -131 -26 -65 -24 12 -17 56 -24 234 -86 81 142 106 -43 51 -125 107 66 -130 148 -73 54 -58 -99
3376i9M2K09n8O1o1j32j02L04l33K63q6r3O0M9k5K55j56j74m2J16J68j6q9j80
$$ -99 -57 152 94 155 94 -38 -140 164 -169 94 8 -85 -25 24 -1 254 98 -76 -118 -2 166 150 61 -119
3400a19K14j17n2j02J42J33j99M3K68o5m09K30qj19M2J58r3J6r0o6p6L91j05J49
$$ -119 95 -22 -74 -176 -34 99 -100 -57 211 146 -263 -33 -41 -160 -118 40 -53 -37 -127 -193 -269 122 17 166
3424A66k16N1j17m1J61p8J49O5K19k54j17k2P7j15K7k8r5K02j40r6K06P2j41J59
$$ 166 -50 1 -116 -157 4 -74 75 140 359 105 -12 -34 43 -72 -45 -73 -168 34 -106 -202 4 76 -65 94
3448I4r7j1k43M57j9k98K64l2q6j84N0K4R9J30k18l5J60J3o5J04j21N2k1j4k01
$$ 94 -3 -14 -257 200 181 -117 147 115 29 -155 -105 -81 18 148 -70 -105 55 68 3 107 -14 38 17 3 -198
3473a98M1P2K61k45J33M4R5l42R7pJ10k1J8K67l08m4j69K12j80K04j52M19l83
$$ -198 -157 -85 176 -69 64 108 203 -139 -42 -49 61 40 58 325 17 -27 -196 16 -164 40 -112 307 -76
3496g6J2J11P5l53K49j33K38l2k72M99l01j18Q6L26k39j06J56q2q9J41O8j53P8
$$ -76 -64 47 122 -231 18 -115 123 91 -181 318 17 -101 -15 311 72 -34 122 40 -49 92 160 7 85
3519H5j60o5n7O7J3J31m0L0j00J43j43J85j33o5N2k05K89k40P7J23p5K26k06R8
$$ 85 -75 -140 -197 -130 -117 14 -26 4 -96 47 -96 89 -44 -109 -57 -262 27 -213 -136 -13 -88 138 -68 30
3543C0j44J91j99K28j42R1j0j45K56l9j06J6L14m51L24m02K83j77K7L8K3m3o8
$$ 30 -114 77 -122 106 -36 55 45 -100 156 117 11 27 341 -110 214 -188 95 -82 -55 -17 6 -37 -105
3566a05K31l37Q9o5M5L08j14n7m3J94l51K24jj20K05j03j80L05j02L3j09K58j28
$$ -105 126 -211 -122 -187 -142 166 52 -5 -48 146 -205 19 18 -102 103 0 -180 125 23 56 -53 205 77
3589G7n8R0k10j03K10j47M6K02j57K03j84K13l84J97m9J30o3j98J47j02J19MO7
$$ 77 19 109 -101 -204 6 -141 -95 107 -50 153 -31 182 -202 -5 -54 76 13 -185 -38 -140 -21 -17 50
3612E0o0j05J66ppl1k32L62k65K52k49J71J70k78J96k6r0M3k3Q7m2k69J52L0j33
$$ 50 -10 -115 51 44 37 6 -226 136 -129 123 -126 45 215 -63 133 107 17 60 37 124 82 -187 -35 -5 -138
3637a38K80j09N4n7j36k59K42P3j16L6o7K04m7J15j17J0J40l84N05l80N3J89n8
$$ -138 142 33 87 30 -106 -365 -123 -50 -166 -130 -197 7 -40 75 -42 -32 108 -276 229 -151 -98 91 33
3660C3j73K00K2o3K4j71K23m5j64K74k77jR6j21J32O5J35k07q0j3K2L02J6r5j98
$$ 33 -140 60 82 19 43 -128 95 50 -114 160 -117 -118 -22 -143 -11 54 189 -18 -98 -111 -89 213 229 134 -64
3685f4J57j30J7r6Q8P7j19K86m2m9k50K13l8L3p9O6nN4k9k34K16J8j05J93j03
$$ -64 93 -37 -20 -116 -28 49 -70 216 174 125 -125 88 50 83 4 70 65 119 90 -144 72 90 -15 178 75
3710G5k7J01j59j51R7LJ51p3P2j99K87k93K93k2k03P1k77M59r1j81o5J97j53K57
$$ 75 48 149 -10 -161 -64 -61 90 17 89 -110 177 -116 177 155 -48 23 -254 205 114 -67 -132 65 -88 169
3734A69j72O3K6K2o1o5j55M71m24k3P0Q6K8j75Q8J7n7P0q1mJ48o5J46p6N4j0L8
$$ 169 -3 60 86 108 47 -18 -173 298 -126 -149 -79 7 35 -140 -52 -35 -92 -22 -103 -107 41 -24 122 46 100 90 128
3761A28q4l7r7L3r5J26J0O4RK2j37J95l1M7J47m48P2J20J0R1l08M8j9J73j17O5
$$ 128 44 7 -90 -57 -152 -26 -16 48 57 79 -58 137 106 153 300 -148 -76 44 54 145 -163 -115 -134 39 -78 -13
3787a3m5O5j24K99k53J61j54o3L3P3M4nQ4N6n4Q1j98NK7m5j23l0M1P6J32j56K40
$$ -13 -58 7 -117 182 -71 90 -64 -127 -94 -21 23 18 102 158 104 185 -13 -8 19 -26 -149 -179 -138 -62 70 -86 154
3814A54k0J1k95K66j56J39j59O9j0j04K15l28Q7K69M5l5l8l8n7j20J78l9k43K08
$$ 154 134 145 -150 116 -40 99 -60 9 -1 -105 110 -218 -131 138 183 148 110 72 15 -105 73 34 -209 -1
3838aJ38k29M5o0M33k82k1j55J01K3M4J71k54jn6%R0o8P3P9J12m3q0j88o8KJ08
$$ -1 137 -92 -47 -107 326 44 23 -132 -31 -8 36 207 -47 -48 -104 -104 -14 -82 -9 70 182 139 59 -129 -197 -195 -87
3865h7J26K0j7Q1J03k31J27k87J93N3j31J03O6q9K38k67r8j7q3J63j86J98r1n8
$$ -87 39 59 42 123 226 -5 122 -165 28 81 -50 53 119 30 268 1 -97 -114 -197 -34 -220 -22 -113 -171
3889a71J65J89k81J29kj71O9J78K7l30J19o2j8j6K40Kk9l0K9J6j25L02k25J25
$$ -171 -6 183 -98 31 29 -142 -73 105 132 -198 -79 -141 -159 -175 65 67 38 8 37 53 -72 230 5 130
3913A30j01P0k27Q7J92j55L0J05lJ18l26k44L00o5M7J01j1J51k60Q3P2M6P7j80
$$ 130 29 99 -128 -41 151 -4 26 131 128 246 -80 -324 -24 -89 -42 59 48 199 -61 22 94 140 217 37
3937C7N0j24O6L5P0j17p1O7j44L18k18J4q8J67J3j06K16j12j15Q9k19K07l0r0
$$ 37 87 -37 29 64 134 17 -54 13 -131 187 -31 -17 -105 62 75 -31 185 73 -42 47 -172 35 5 -85
3961h5P7kl6P0K2n9j49K07k1j00P9M7m4jrj89lK55o5O5k3j35K24J33k13L8o5P
$$ -85 -8 -10 -46 24 46 -13 -162 45 24 -76 3 50 6 5 -4 -193 -196 59 -6 59 36 -99 125 258 45 83 18 25
3989B5J56j53J16j8k44J76k03O3J76j63QM3KL1Q4j30M1R6l30J83n6J00N3J02k54
$$ 25 181 28 144 126 -118 58 -145 -82 94 -69 -61 -18 -16 15 99 -31 10 106 -224 -41 -97 3 56 158 -96
4014i6p9j86L23j0K46l64J6R5K18r0j49L46l81K29n6k24O0J31Kj95P2K54k52K28
$$ -96 -175 -361 -38 -48 198 -166 -150 -55 163 73 -76 270 -111 118 62 -162 -102 29 31 -164 -92 162 -90 138
4038A38j56K22k66j25J29J20M9k1k03J80r2o5K02o4p0L9M5k9p1J30k02K46k17
$$ 138 -18 204 -62 -187 -58 62 111 90 -113 67 -25 -90 112 48 -22 17 62 33 -38 92 -110 136 -81
4061h1J05K8o4m6o8J16pJ46k02k66J74K03k38J06J95j35j04P4j4J21K1m2j68m8
$$ -81 24 52 -12 -58 -126 -10 -17 129 -73 -339 -165 38 -200 -94 101 -34 -138 -64 -78 43 64 22 -146 -194
4085a94R9J79r9K92k59m5kJ42k33J55j33PP3j60J89l1J3n5L0N4J34k79k7O1K2
$$ -194 -95 84 -15 277 18 -27 -29 113 -120 35 -98 -91 -18 -178 11 -20 -7 -62 -32 22 156 -123 -150 -89 -67
4110f7o2k1J1J18r1R2j5J19j50M6Q3j54J8J59nk51m3J37L45m91J61J5q3J65o6
$$ -67 -129 -150 -139 -21 -112 -20 -35 84 -66 -20 63 -91 -73 86 81 -170 -213 -76 269 -222 -61 -46 -129 36 -30
4135c0R6J34k19K53k78j08J73q5P2j01J62O1j60L8m0j15o1L17j72J1lp5K38j38
$$ -30 66 200 -19 234 -44 -152 21 -64 8 -93 69 130 -30 8 -32 -147 -208 109 -63 -52 -55 -130 108 -30
4159c0l8K14j02Q8J48l83M7N4R8N8j64L4j78J02M1J11j25N8o6L5m3J58j82J84
$$ -30 -68 146 44 132 280 -103 -56 -2 96 154 -10 24 -154 -52 -11 100 -25 33 -33 2 -41 117 -65 119
4183A19j2pP9m9j83j40L27j35K1R5k66L20j95J67J06k40m4O8kK3o6L8j02K5j13
$$ 119 107 100 179 130 -53 -193 134 -1 20 115 -151 169 -26 141 247 7 -37 31 29 52 -14 24 -78 -53 -166
4208a66n5K11j44K25R5j05q5k23K52K15q2Mr2j71JJ34Q0j20K41l0k61Q0q4j0J47
$$ -166 -221 -10 -154 71 166 61 -24 -247 5 220 138 142 50 -121 -120 14 94 -26 215 185 -76 4 -80 -90 57
4233E7m6j03j3J17j10K05p7j29J58R7j6j93O1J15j18j6j05R6k6M9oj01p9J0K43
$$ 57 11 -92 -105 12 -98 107 30 -99 59 156 140 -53 8 123 5 -11 -116 -20 -46 3 -3 -104 -183 -173 70
4258G0j36K03j24k16K38j22J61k77J62J71j02L8j38J79l3j21J51Q0j60r7J09l09
$$ 70 -66 137 13 -203 35 -87 74 -203 -41 130 28 66 -72 107 74 -47 104 184 24 -73 36 -273
4280b73K32rN2k05K01Mj57J38m2M0NP0Nj3k74K34R7o7o5J23m0J08j53J02r3m6
$$ -273 -41 -50 2 -203 -2 2 -155 -17 -59 -19 -14 56 61 48 -226 8 105 38 -27 96 56 164 11 113 20 -26
4306b6l1j8J20Q8k08J13o5J4nj15M9J89P7k90J50Op6kpPl7o1L71m67L96l57L30
$$ -26 -57 -75 45 133 -75 38 -27 -13 -18 -133 -84 105 182 -108 42 48 -28 -30 -37 -30 -67 -128 243 -224 172 -185 145
4333A45p1l4J71j52l6J10j92K3K50l88K72j72N3k9J40L2j04o2L4J9K84l99M5J66
$$ 145 74 40 211 59 23 133 -59 -36 214 -174 98 -74 -21 -50 90 122 18 -44 -10 9 293 -106 -61 105
4357A05q8J24j17J2q0j5Q6j46M5J94o7j22J87j17K09l4l51N9J8J38q9K6M7M3r1
$$ 105 17 141 24 36 -44 -59 27 -119 -74 120 53 -69 118 1 210 176 -175 -116 -98 40 -49 -23 24 67 -24
4382b4n9J51K4m7k06J97j47J95J05k1j15K6n0j2n5J2kR9k9k3J32K5k45K7M6J85
$$ -24 -83 68 92 45 -161 36 -111 84 189 168 53 79 29 17 -38 -26 -28 71 42 19 151 176 -69 -42 4 189
4408A89k87K01j6j13J67p2j47J33J6j7K7p9J0L2Ml71K80R5k38L60j45J23k91P9
$$ 189 -98 103 87 -26 141 69 -78 55 71 54 81 2 12 44 48 -323 -43 52 -186 174 29 152 -139 -60
4432f0j42M42k73k1J36K4k3j42N5p2J76j76L89k54j67P1j10J50J0MR1l3nk38J31
$$ -60 -202 240 -33 -54 82 106 83 -59 -4 -76 100 -76 313 59 -108 -37 -147 3 13 17 108 75 70 -168 -37
4457c7p6M3J77nk0M0Nj39p7Q0J25q9k55K18mN5k9R8K7j91O2J39j64J71j27K80
$$ -37 -113 -70 107 102 82 122 127 -12 -89 -9 116 27 -228 -10 -14 41 12 110 137 -54 8 147 -17 154 27 307
4483C07l17N4q5j25R1P2N8n7j18O5O2N9l52L08n8P3j53J15P9K5j87j0Q1R8K5j27
$$ 307 -10 44 -41 -166 -75 -3 55 -2 -120 -55 7 66 -286 22 -36 37 -116 -1 78 103 -84 -94 -13 85 110 -17
4509a7Q2q6q3RK45r5j52L25l04k4K73k76J9J52M9m0o2r3L4m5j3J9p7L6J21k2L4
$$ -17 65 -21 -104 -95 150 55 -97 228 -76 -100 173 -103 -84 68 117 77 15 -78 -44 -89 -102 -83 -160 -124 -3 -25 9
4536IO6j32k1K31l20J28K7k67M35j7j39N9j1j21n1J61l8L0N5R9j46J44pj76q4
$$ 9 75 -57 -78 153 -167 -39 -12 -279 156 139 0 59 48 -73 -124 37 -1 29 84 183 37 181 174 -2 -86
4561h6j03K49k10K83l53M16n6l2l03L45j36r0R9j36l9P9L0r3K88p2j33l1lm9J47
$$ -86 -189 60 -150 133 -220 196 140 108 -195 150 14 -76 23 -113 -152 -73 -43 -136 152 80 -53 -84 -87 -136 11
4586A1j2k0j24L11j29M4j39J11o5Q3M3j1l86M88k49K32k33J16r0j26J95J04P6
$$ 11 -1 -21 -145 166 37 81 -58 53 -12 71 114 103 -283 205 -44 188 -45 71 -19 -145 50 154 230
4609B30j57J00m5j72j56L45k37J83k18L4L2J15n8j02J59l37M86k29n6K65k5j79
$$ 230 73 173 128 -44 -200 145 -92 91 -127 -93 -61 54 -4 -106 53 -284 202 -27 -83 182 157 -22
4631b2J40j32J54k36O8J40j03M7oJ86l15O7k00PL74j57J98qj63o8J10n3Q9k32
$$ -22 118 -14 140 -96 -28 112 9 56 50 236 -79 -12 -212 -205 169 12 210 202 39 -29 81 28 117 -115
4655a15P4k3K00j53J30j60K0LK15n7Nj75K15k36L1N3K5k32K30J22l33K76m1J6
$$ -115 -41 -64 136 -17 113 -47 -27 -24 191 134 139 -36 179 -57 -26 27 52 -180 50 172 -161 115 74 90
4679I0k21J07Ok7K5J9P5j17K88j99O2l04N09m17L38l02J56j63P1j57J95N7j03
$$ 90 -131 -24 -18 -45 -20 -1 74 -43 245 46 108 -196 313 -104 234 -68 88 -75 -4 -161 34 91 -12
4702a2r9J55j50J08o2J76j9k28J55J07j15k31K87j11m5K62j6k41J23M3K3k94J18
$$ -12 -111 44 -106 2 -60 116 97 -131 24 131 16 -215 72 -39 -84 178 162 -79 44 87 110 -184 -66
4725f6j3J1j13L42j88n8K5M2K1QJ08R9n4l10K21Q4o8k2n1j10j31J95K0j71J66
$$ -66 -79 -68 -181 161 -27 -85 -60 -18 3 11 119 218 164 -146 75 159 91 69 18 -92 -223 -28 -8 -179 -13
4750a3O4J3rQ2p0jJ11J0p6j47KP4o9l2nK07ok80M73k88j29J15J65j35j62J78J01
$$ -13 51 64 55 137 67 66 177 187 111 -36 -34 40 -29 -61 -66 141 135 -145 328 40 -89 26 191 56 -106 72 173
4777A73k85J20j03J40p5J6J08k4j43K43l52J76Nj63J17N8Q6N3m8j14M6j8P9k28
$$ 173 -112 8 -95 45 -30 -14 94 70 -73 170 -182 -6 -1 -164 -47 11 97 150 102 -12 34 16 95 -133
4801a33Q7O9N4L9j56n2J01KN1j85L5M1k9P5K44k94K9n4J92j2j39k9j31J53J71
$$ -133 -46 23 77 116 -40 -92 9 11 62 -123 -88 -47 -76 -1 243 -51 -22 -76 116 104 -35 -64 -195 -42 129
4826A29j83K27q8o2r2q5J17j28J37M2o0J60l4pk95J37J16j97M35l98K20ok9n6
$$ 129 -54 173 85 23 -69 -154 -37 -165 -28 14 -46 114 80 73 -222 -85 31 -166 269 -129 91 85 56 0
4850@R9j17J54R9k05K99k57jj9j01l4J95oq8j7J59j47M2N0k33J42l1k02M12k84
$$ 0 99 -18 136 235 30 329 72 71 52 -49 -83 112 106 18 1 160 13 55 105 -128 14 -17 -219 193 -91
4875i1J68j95L2R4q1K34k00N5j06O8M1k6r2K31k03J13K0R4j47N6j08P8j53J75
$$ -91 77 -118 -86 8 -73 161 -39 16 -90 -22 19 -7 -99 132 -71 42 62 156 9 65 -43 35 -118 57
4899E7k38J14q7K10J0j81m3L16l40j91M94k38J45j61J25O9P7k68K69k48rJ68K9
$$ 57 -181 -67 -154 56 66 -115 -158 158 -182 -373 121 -117 28 -133 -8 61 138 -130 139 -109 -118 50 79
4922G9k3j97J5K09r4k00M80m00j71J22M16l19J37J7j27J27r4p9K5K93l40p4J14
$$ 79 56 -141 -126 83 -11 -211 269 -131 -302 -180 236 -83 54 71 -56 71 -23 -102 -77 216 -124 -198 -84
4945h4K16m7N1j63K19j38O5j36J46Kk80J06L1m8K73k66j0J86j9J21l65J66o0R
$$ -84 132 85 136 -27 192 54 119 -17 129 131 -149 -43 -12 -60 213 -53 -63 123 104 225 -140 26 -34 -25
4969b5K24j41O0q5M0K3o4n2l9LK64k73K15J60k55J81k51n4K49l07O6J34K53j81
$$ -25 199 58 118 33 73 96 32 -20 -59 -56 208 -65 150 310 55 236 -15 -69 180 -127 -61 73 326 145
4993A45k35J65J07j55J6n8p7J13j03Q3J11j18J03o4qM8m0k67J1L67r5k50K47j41
$$ 145 -90 75 182 27 43 -15 -92 21 -82 1 112 -6 97 33 25 73 33 -234 -223 144 49 -201 46 -95
5017i5l4J89l3M9k0l2l2j32M76l04n0L9J60m22K20j8J21n7J4J58l21K20j89j3
$$ -95 -129 60 27 76 56 24 -8 -140 336 32 -18 21 181 -241 -21 -39 82 25 39 197 -124 96 -93 -106
5041a06L18j21j75m6k7P9J24oj02J53j03J3k63K85J14j51q4K27j6m3j31l2K15
$$ -106 212 91 -84 -130 -157 -78 46 40 -62 91 -12 1 -262 23 137 -14 -98 129 113 70 -61 -93 122
5064A22j36r7K45k14K71j69K44l64M0J11p3mj09R1K30l26L93j68j27J97l02m6
$$ 122 -14 -111 134 -80 191 22 266 -98 -58 53 -20 -24 -133 -42 188 -138 255 87 -40 157 -145 -191
5086a91J85q9N1K05r7L0o3p7K04Nj15k14L06l69K37q8J88j1k72J15J68k29o0L17
$$ -191 -6 -95 -44 161 64 94 31 -46 158 163 48 -166 140 -229 8 -80 108 97 -175 -60 108 -121 -181 136
5110A36k04J52%M7l7P0K1k56K3P1n7R8j8R2k37J65p8J26m6j32J49k55K14p6n5
$$ 136 -68 84 84 131 94 164 185 -71 -48 23 -34 64 46 138 -99 66 -12 114 68 -64 85 -170 44 -32 -87
5135h7L17j58j67J23j31J78j8L4j71J41m3o5J18l9J13j45p2J11j00q9Q1R4j6j14
$$ -87 230 72 -95 28 -103 75 57 91 -80 61 18 -47 71 32 145 0 -72 39 -61 -150 -69 25 9 -105
5159a05K23k02k0p8K11j25j31M2L70l49J75J09j39p7j01M15l5k71k8K83l54K39
$$ -105 118 -84 -104 -182 29 -96 -227 -185 185 -164 11 120 -19 -96 -197 218 183 -88 -116 167 -187 52
5181E2n7L8r0j6j14N3K62k94J76n3N1n5J60j19K18j50l3o8Q1m0j2J48j29j03N3
$$ 52 -5 33 -57 -73 -187 -134 128 -166 10 -43 8 -47 113 -6 212 62 29 -39 42 2 -10 138 9 -94 -41
5206d1J01r1M1j00Nj20K13R3n0M3r1J39p8qL6j58L1K31m03K47L5q4Q0O6j70M5
$$ -41 60 -31 10 -90 -85 -205 8 101 51 94 3 142 64 56 92 -66 -35 196 -207 40 75 -9 71 137 -33 12
5232A2k99L65j37m8J31p0K31o5j0j78P2j04k13K67Q5j6m3k9R4Q7m53K60J45k05
$$ 12 -287 78 -59 -107 24 -46 185 120 110 -68 4 -100 -313 -46 39 23 -20 -49 45 132 -321 -61 84 -121
5256a21J95j45J41n4L0n6R3l0K88l25m6J65k03N3j45PR0J80j80J65j74L9m0J62
$$ -121 74 -71 70 16 46 -10 83 53 341 16 -30 135 -68 -15 -160 -153 -63 117 -63 102 -72 -33 -73 89
5280H9j17K8j08K57k8j90J00k24K7K26q7J80k72J59o1n0j73L69J04j64j56q7R9
$$ 89 -28 0 -108 149 121 -69 31 -193 -166 60 -27 153 -119 40 -21 -71 -244 125 229 65 -91 -178 -79
5303g9P1L7q9L4j08L04j75k9j1j18K77k23J17k3j66J87j12J92kN0m13L23j01J38
$$ -79 -8 29 -60 -26 -134 170 -5 -34 -45 -163 114 -109 8 -15 -181 6 -106 86 84 134 -279 44 -57 81
5327H1j14J93n7j39J96J17k27l0k9j79L35k28J58Kj33J91L4j91j5J63q4J86k21
$$ 81 -33 160 103 -36 160 277 50 20 -9 -188 147 -81 77 79 -54 137 171 -20 -35 128 44 230 9
5350Io8J90j85O9L23l70N5o4p8J93p5J41k05m7P4k8j19J9J81p7J79o9M4K8j2p1
$$ 9 -59 131 -54 15 338 -32 23 -41 -119 74 -1 140 -65 -112 -38 -66 -185 -166 15 -62 117 48 92 120 108 37
5376C7J02j66J33o4j34J44j11M4K2p9L8K6J3J75k19j98M9n0J62R2o5J39mk0m3
$$ 37 139 -27 106 42 -92 52 -59 -15 7 -72 -34 -8 5 180 -39 -237 -188 -238 -76 16 -49 90 86 66 23
5401B3o0P1n5K20j22q9j41L44k88j09L67j0k28K65j26N6k5q3j43J16P3L2l12K98
$$ 23 -37 34 -21 199 77 -12 -153 191 -97 -206 161 151 -77 188 62 118 93 10 -133 -17 56 88 -224 74
5425G4J21k85J56k61K35j89K04N5mnk59K26k88Q8L2L0p9J75J9j23K56j27q4J6
$$ 74 195 -90 66 -195 40 -149 55 110 106 101 -158 68 -220 -132 -100 -70 -149 26 45 -78 178 51 -33 -17
5449a7j17L21j77O4m4j6j68J28P8J4mp6nJ91k07m6J08k08J41P9l1K1K9k23J48
$$ -17 -134 187 10 74 30 14 -154 -26 52 66 62 -14 -19 172 -35 -81 27 -181 -40 39 8 29 58 -165 -17
5474a7p5M02l09j20J62j91K30k90J37R4m7j4r0J06K99k86R2q4j40K40j54r0L5
$$ -17 -92 310 1 -119 43 -148 82 -208 -71 23 -24 -38 -128 -22 277 -9 83 -1 -141 99 -55 -145 -110
5497a10mK35j68J30j04R5J62k30O8j63J3q4Q2l1K84j4j89Om2K28n3m9j09L3j0
$$ -110 -114 121 -47 83 -21 74 236 6 74 -89 -76 -160 -78 -109 175 161 -28 -22 -64 164 111 62 -47 -14 -24
5522b4J7J1O5O3n3kK3p2M9j02m0O1J6r9l7J97j91J99o0k6pJ02Ll9r7j42J83j21
$$ -24 -7 4 69 132 79 77 100 28 77 -25 -65 -4 12 -87 -124 73 -118 81 21 -5 -12 90 93 54 -43 -185 -2 -123
5550a23j38J76KJ21J75k84P1p5K01k94J42k08J24P3J41m2j27J58j67N2K2K4k5
$$ -123 -261 -85 -83 38 213 -71 0 -75 126 -168 -26 -234 -110 -37 104 62 -65 93 -74 -22 0 24 -1
5573ar4rK07l43M04j94K15k51K54j06K4j01k0Pj0q8k33L98R7j33k5m9K8qJ67j97
$$ -1 -95 -104 103 -240 164 -30 185 -66 188 82 106 5 -15 -8 -18 -106 -339 59 156 23 -2 -51 -23 -31 136 -61
5599f1P0J56l91K66j13Q8J23k65O6R4j51K44k56K61l32J45J41L8j23J46J56l73
$$ -61 9 165 -226 40 -73 15 138 -127 -61 33 -118 126 -130 131 -201 -56 85 123 0 146 302 -71
5621g1J34kk88J29K07k22K13r9OO8k28K55j4k20J07K21j29j09J35j41O5pM3J21
$$ -71 63 61 -227 -98 109 -113 100 1 7 75 -153 102 88 -132 -25 196 67 -42 93 -48 17 10 53 174
5645A74Rk70L50j91j98RM0m3J4k4O9P7jmJ42l5N8k32L09l28J31j46J3L17m65L17
$$ 174 183 -87 263 72 -126 -117 -77 -120 -106 -130 -61 16 15 11 153 118 176 -56 253 -75 56 -90 -77 240 -225 92
5671I2k00J7J77l4o7J86l81K77j68K75j14J40j03j19l2j34K28k76J39N6J15j14
$$ 92 -108 -91 86 52 -15 171 -210 67 -101 174 60 200 97 -22 -54 -188 40 -236 -97 -41 74 -40
5693d0J48j42j89J30l2N4J94qLj8j92J22k4j5k7j7j81J91M2o6m6k27L53J27m48
$$ -40 108 -34 -223 -93 -125 -71 123 115 118 100 -92 30 6 -9 -36 -53 -234 -43 -1 -67 -113 -340 13 140 -308
5718c08L89j16n4J08K9n2Q8k17j09O5K69j31L6o7nJ64J36j29k38K70r5n7P5l3
$$ -308 81 -35 -89 19 48 -4 84 -133 -242 -177 92 -39 -3 -70 -75 89 225 96 -142 128 33 -24 51 18
5742A8J28m7j03N1k60L35n2q6j47L76j89L1k12J72k02M22k61PM0j61J95L8j30
$$ 18 146 99 -4 47 -213 122 70 -16 -163 213 24 55 -157 15 -187 235 -26 -19 21 -140 55 93 -37
5765c7q4K52o3j46M1k7K49j45o0N4n2l3J4n9P5K6m8L45m00j26K63k33K16nJP0
$$ -37 -121 131 68 -78 -37 -64 185 40 -20 34 -18 -51 -37 -96 -21 5 -43 302 -98 -224 39 -194 22 17 18 88
5791H8j9k26P9J86k81P2J16L7j22J39j32P4J87j33j26q3J13K24j80L5k2P2k70
$$ 88 69 -157 -78 108 -173 -101 15 52 -70 69 -63 11 198 65 -61 -144 -31 193 13 48 26 98 -172
5814a72R6m8J20L33k18k25P9q4J80J69j41j10J20p9j63L6Q2J02J31k82L0j57L9
$$ -172 -76 -124 -4 329 111 -114 -35 -119 61 230 89 -21 99 20 -143 -107 -25 77 208 -74 -44 -201 -162
5837a62N9J78j83m7P2J10N4n1K8L0l0n0k77L56j31J10r3n3lJ09r8J90j25J75j71
$$ -162 -103 75 -108 -155 -83 27 81 30 58 88 58 8 -269 87 -44 66 -27 -80 -83 26 -72 118 -7 168 -3
5862cJ9MK2k2n4Q9K7k53O7L97l02j19O6K0j09J15MQ9r1K04j64o3k4j16L97j55
$$ -3 16 20 42 20 -34 55 82 -171 -104 293 -9 -128 -62 -42 -151 -36 -32 57 -34 170 6 -57 -81 -197 200 45
5888D5Q7k85m4L33k18NM0k4M9j33L49k15K6R8k13R4k11L54k39L14j74K2j41K78
$$ 45 132 -153 -197 136 -82 -77 -37 -61 -12 -145 204 -11 15 113 -100 -6 -217 137 -102 212 38 60 -81 197
5912A97j86N0k33R1k6o8J24J11j76MJ87j3o2j55K40j57k9R7J6q3o7J86Q2k44J36
$$ 197 11 61 -172 -81 -107 -175 -51 60 -116 -112 75 62 0 -155 85 -72 -101 -4 12 -71 -138 48 130 -114 22
5937B2q1J10n4qJ47M5k98J17J24j63O8j8j0j34K11k3j5j11O3O4j67J31m7m2n7
$$ 22 -59 51 -3 -11 136 181 -117 0 124 -39 29 11 1 -133 78 55 40 -71 -8 56 -111 20 -27 -69 -126
5962a26N0o8J92R1p0l6j54L46k16n0K55j77m1J06N7l48K09JKj76J70qJ7P4q7Q2
$$ -126 -76 -144 48 139 69 33 -121 225 9 -41 214 37 -4 102 159 -189 20 21 23 -153 17 9 26 100 13 95
5988I5q6k25J15K8J34J6j93J27J0J44k45J07K3j09j00K84k14J56M6l33L79j46
$$ 95 9 -216 -101 -73 61 77 -116 11 21 165 -80 27 50 -59 -159 125 -89 67 113 -220 159 13
6010A3Q9j00p3l6J16J61k95J11j01O7K10r0l28J79O9j82J82R4qj0k03n6J93J96
$$ 13 102 2 -71 -107 9 170 -125 -14 -115 -48 162 72 -256 -77 -8 -190 -8 86 78 68 -135 -191 2 198
6034A98m23L1K29M0n2p0K3Jr6J2O1J45K1q3k5Mj68K75r1j83K88p2J1p7j7j24J18
$$ 198 -225 -194 35 75 23 -47 -24 -23 -119 -107 -46 99 120 37 12 16 -152 123 32 -151 137 65 76 -1 -18 -142 -24
6061b4J46p3j66J87j16M8l3K92k09Kj47j1O2P6j59J84P7M4k54o2M45k62l0m1K16
$$ -24 122 49 -117 70 -46 2 -31 261 52 54 -93 -104 -42 34 -125 59 136 180 -74 -136 309 47 17 -24 192
6086A92j18M0k12KO0k2P6j6J04m5k60J49K42k24q7O5K46j83k52K66j19N9j00J67
$$ 192 74 114 -98 -96 -36 -58 18 2 106 61 -199 -50 192 -32 -119 -54 192 9 -243 23 -96 -37 -137 30
6110C0K91l08j26j4P3q2K34J01j32O0j83P3L8J2M8j89J35l04Q6Q9K1J09j26J19
$$ 30 321 13 -113 -127 -54 -136 98 199 67 127 -56 17 55 67 115 -74 61 -243 -157 -68 -47 62 -64 55
6134E5k10L6J39K82k79P5o8N9k4nj51K2j33L4m5J55J23j04J9N8q4N2m1l0n3n3
$$ 55 -155 -119 20 302 23 98 30 89 65 60 -91 -69 -202 -168 -213 -58 65 -39 -20 38 -46 6 -35 -65 -118 -171
6160a71J26j1K8K62p4k62K30p6j04L6R5k4j22MJ16j27J20j00J34o9n4q2o0Q9p4
$$ -171 -45 -56 -28 234 160 -102 128 52 -52 -16 79 55 -67 -63 53 -74 46 -54 80 11 -43 -125 -185 -96 -170
6185a70Q2R8r0J87n1J23O1m30L0K32o5kK55k86l2K8o8J59j29P4q0J04RO1k9j15
$$ -170 -88 10 -80 107 56 179 240 -190 -160 72 7 5 260 -26 -58 -30 -98 61 -68 6 -74 30 39 100 71 -44
6211d4K18m6j26j81L47K7j27j90J12p1L3N6n0rq0r2L49j50j02lJ90j31k7K15k55
$$ -44 174 128 2 -179 168 195 68 -122 -10 -81 -48 8 -42 -51 -131 -223 126 -24 -126 -129 61 -70 -97 118 -137
6236a37O0K6k0n0J26k3K98j89k21LN1J08j80J81N1p7k88N06l30o6J94n6L7J74
$$ -137 -77 -51 -71 -121 5 -18 280 91 -130 -127 -76 32 -148 33 84 7 -281 225 -105 -171 23 -33 4 178
6260A78l22J19J20j16K00j62M0N6j97M0j07J09J00op1J16j45M9n2q2J38J43k90
$$ 178 -144 -25 95 -21 179 17 57 113 -84 -44 -151 -42 58 52 -19 97 -48 1 -51 -133 5 148 -142
6283a42N0J99j35jJ38K4r9j45J22J58j46O2L5j70Q3N7q9K5j87R1N7m5N0j52J96
$$ -142 -92 107 -28 -29 109 133 34 -111 11 169 23 85 120 -50 33 90 1 26 -161 -70 -13 -58 -8 -160 36
6308C6O5j33r3R3q1K54K7k33Lm3M18l46P2m4M3P6j62jP1Q4m4l26J80M4J6j5K21
$$ 36 101 -32 -125 -32 -113 141 168 -65 -62 -105 313 -33 39 -5 38 114 -48 -49 22 106 62 -264 -84 -40 -24 -39 182
6335A82J38r5m06K95k79K27n3M1j82R0J42r3L2m5m34L28K97l53L25j79J5r5lj
$$ 182 320 225 -181 114 -165 62 9 50 -132 -42 100 7 39 -6 -440 -112 185 -168 157 -22 -7 -102 -105 -106
6359a06J42k30J16J55Ok41l2K59j00l7o8R8J12j6k51L17j94R7k93K83J6o2K48
$$ -106 36 -194 -78 77 83 -158 -190 69 -31 -68 -136 -38 74 58 -193 124 -70 27 -266 17 33 -29 219
6382B19j85J37p7j67N0J24J04o0l23n0J58Q4M5R5k86J20K7j8j5P9km5j40J02K51
$$ 219 34 171 94 -73 -23 101 205 145 -178 -228 -70 14 59 154 -132 -12 15 -3 -18 61 59 14 -126 -24 227
6407B27j31mo1K04k62J79j29j46J46Q4l9k44K4K13j16L07k40P6j68M3R0k0o7Q8
$$ 227 96 92 31 235 -27 152 23 -123 23 107 68 -176 -152 61 -55 252 12 88 -80 -37 53 33 -34 54
6431E4j5k38N8J43J10j07K8j18J57n1j05P2Q3J97k97K69k91K64j06j8l4o1lo5
$$ 54 39 -199 -141 2 112 5 33 -85 72 21 -84 -12 71 268 -29 240 -51 213 107 89 55 -6 -9 -74
6455g4K21r1P8j09j01J6K73k00Jn2L89m84K11k94J37K88k60O5J81j95P5j91l4
$$ -74 147 56 134 25 -76 -60 213 13 14 -38 351 -133 78 -216 -79 209 -51 14 195 0 75 -116 -150
6478a50O1J54j86J05j67J19p2NO2J00r9J55K3k47J65k09K43j95J77J97l30K42
$$ -150 -89 65 -121 -16 -183 -64 -136 -131 -69 31 -68 87 110 -137 28 -181 62 -133 44 241 -89 153
6500A53k88J81N0j0k05L75n4k25N2r9J05k31L78l24J35O2m1J2k4L2K4l27K20J35
$$ 153 -135 46 96 86 -119 256 202 -23 29 -70 35 -196 182 -142 -7 55 14 26 2 34 58 -269 -49 86
6524H6j16J77l5j35J8J22j02j07J85Opj43P7j32J83k17K22j98Q6l5j17K9JK11
$$ 86 -30 147 112 -23 -5 117 15 -92 93 99 92 -51 26 -106 77 -140 82 -116 -30 -65 -182 -153 -152 59
6548E9O4p4J9k38R6J82kl5l08J69o4L13j66j26K14n26M88j61j2R5O1j47J99jk53
$$ 59 123 49 68 -170 -74 108 106 71 -237 -68 -132 181 15 -111 103 -423 65 -96 -108 -13 48 -99 100 99 -154
6573a54J47l8j39L48M7l9l14o8L50j21l1N9j72K16j8om2N2N6j51qJ0K8o5j44L63
$$ -154 -7 -45 -184 164 211 172 -142 -210 140 19 -12 47 -125 91 73 67 25 77 133 -18 -26 -16 12 -53 -197 166
6599A66l34Q1J36j28J73o0J3p4J52k7Rj37J10k05J93k72K37P0j18j0L3J64j81
$$ 166 -168 -87 49 -79 94 34 47 -27 125 98 107 -30 80 -125 68 -204 33 103 -15 -25 8 172 -9
6622iO5n8RRM5j82J59r0O1R0j61o4N8K64m1j59j15RJ31j06m9K40p8Q6k21J77n2
$$ -9 56 -2 7 16 61 -121 38 -52 9 99 -62 -126 -68 196 155 -4 -119 -110 21 -85 -134 106 28 114 -107 70 18
6649A8Nq4p5J26J24j06L5k53J8O6J73m3J24j14K63j88k5q9J05J99j45r0J3p0n1
$$ 18 23 -61 -136 -10 114 8 43 -210 -192 -126 47 4 128 14 277 89 64 -25 80 279 134 44 57 -13 -64
6674f4O9J28m9k12k5J30j17K09k6pk15L3P7J95m9j27k5K13J6l46o2K87O0n9j18
$$ -64 5 133 84 -128 -153 -23 -140 69 43 36 -179 -146 -69 126 77 -50 -75 138 154 -192 -254 33 93 34 -84
6699h4J57j03O4k26L46J0M9k14j1l06M23j59O1J34k79J14m5R2j29J45m3K2l54
$$ -84 73 -30 34 -192 154 164 213 -1 -12 -318 105 -54 7 141 -138 -24 -69 23 -106 39 -4 18 -336
6722c36M41j62J6m7O8q1r3J65P0r5l1q2K06n0k9J03o2J0J21j20Q9J44m19K51L8
$$ -336 105 -57 -41 -88 -20 -101 -194 -29 41 -54 -85 -167 39 -11 -40 63 1 11 132 12 101 245 -174 77 115
6747A15j16O1k6l3oJ53L5j45R6k67O9J19n6k1K24m18K70j1M7O0k76K92j93J33
$$ 115 -1 60 34 1 -5 148 183 38 134 -133 -64 55 -1 -22 202 -216 54 43 90 150 -126 166 -27 106
6771A06J2j55J86r5l8j5J10J29l06J66j82q8J65l34L70r1L20j20j27n8j58K45
$$ 106 118 -37 149 54 16 1 111 240 -66 100 -82 -170 -5 -339 31 -60 260 140 13 -45 -203 42
6793D2mL2j03J55L9k38j2M3J03j03R6m1J4P1m0j23j6O6J92l22J56K0j65J91q6
$$ 42 38 70 -33 122 161 -77 -89 -46 57 -46 50 9 23 94 54 -69 -85 -19 173 -149 7 27 -138 53 -33
6818c3n8J94oo0k33K72qL1j28R6j78Q8J27k93J16P2k3o6l2PK16k05N5P0j28J10
$$ -33 -91 103 97 37 -196 76 68 99 -29 67 -111 -23 104 -189 -73 -1 -24 -90 -122 -115 101 -104 -49 21 -107 3
6844CJ57j93K75l30K21j74J66j02k15K43j16J45q7M4m4M9N3p8J46k50J70k71J43
$$ 3 160 -33 242 -88 133 -41 125 23 -192 51 -65 80 -7 37 -7 42 95 17 163 -87 83 -188 -45
6867d5J60j12j8m3kl31N16Q8l46K09rj86O2K85k28Q5n6L9J51o4j56n3K01kp6k01
$$ -45 115 3 -15 -58 -60 -391 125 213 -133 76 67 -119 -57 228 0 85 29 68 219 155 -1 -54 147 145 69 -132
6893a32J93j39J92j45j02M6M4J68k14L4l3M8j05P5K42j52K46k51j37K99o2k47
$$ -132 61 -78 114 -31 -133 -87 -43 125 -89 -55 -88 -40 -145 -70 172 20 266 15 -122 177 115 -132
6915a32L59j06j0l02K35j0Q5j26J2R4K7n3n4j98L19k37J27q7j78J86j4M8n0O8
$$ -132 227 121 111 -191 44 34 119 -7 5 99 126 73 19 -179 140 -97 30 -57 -235 -49 -63 -15 -65 3
6939Ck0j15j5J19j58J12J31K37m40K69l50K90J94l41P2q0J36K3R6p9k50J72m1
$$ 3 -17 -132 -147 -28 -186 -74 57 294 -146 123 -227 63 257 -84 -12 -92 44 67 163 84 -166 6 -35
6962c5R8P9K4m2J24n06L08O0j09j80J07O5p7M0J08o6m0j10k5J40o1J38l23K27
$$ -35 63 142 166 124 248 -258 50 110 1 -179 -72 -7 -84 -44 64 -2 -42 -152 -177 -37 -98 40 -283 -56
6986e6q8J69r7j04J62K23l16L2J19j87kM9L05j24l9j3M0k37K76j21k34L09n3J1
$$ -56 -144 25 -72 -176 -14 209 -107 -75 44 -143 -145 -96 209 85 46 33 73 -164 112 -9 -243 66 13 24
7010B4j05N8J21P0k5j65J43k37K76k41J16j48R2O5o1K56p0l96K87l2l8R4p0J85
$$ 24 -81 -23 98 168 143 -22 121 -116 160 -81 35 -113 -21 44 -17 239 169 -227 60 28 -10 84 14 199
7034A99j11P0k40J18j74O7J28J43j74j47J91q6Q0j26j75J84P4k46J19L9L36l26
$$ 199 88 158 -82 36 -138 -71 57 200 26 -121 70 -16 64 -62 -237 -53 21 -225 -106 -67 269 -57
7056e7j02P4O7l2j47K31j38J33j12K5Pm9J10l3j35J26o2P8K1k50M59m49J72J3
$$ -57 -159 -85 -18 -50 -197 34 -104 29 -83 -58 -51 -100 10 -23 -158 -32 -94 -16 5 -245 214 -235 -63 -50
7080e0l5J81k48K35m3k64J87J01k25J94l6J15j87P5Q6k11J02J93j11j81J57L6
$$ -50 -85 96 -152 83 40 -224 -37 64 -161 33 -3 112 -75 0 86 -125 -23 170 59 -122 35 71
7102G1Q3j72L2j4r3J02k50L98j96j28J84P1r4q1J36Q4k14K5J60k76J90j45P0R2
$$ 71 154 -18 14 0 -93 9 -241 157 -39 -167 17 88 -6 -87 49 133 -81 -56 104 -172 18 -127 -57 35
7126C5k01R5KJ60k03J88l75J56J53J50j46k00M3N7J08P0j38O9O7j25J55k39K64
$$ 35 -166 -71 -69 91 -112 76 -299 -143 10 160 14 -186 -143 -86 22 92 -46 23 90 -35 120 -119 145
7149A45R2k14L8k28J39r7J49K42k27r3M2J69j87o4N3n1O6m1n0K0J91Lj3M1j37
$$ 145 237 23 61 -167 -28 -125 24 266 39 -54 -12 157 -30 -94 -41 -92 -26 -67 -117 -97 94 97 84 125 -12
7174a2q8J34j70L64m44K49L3N6M5j24k42K30k8Q6j23m2m1K96j41r3J02j49J14
$$ -12 -100 34 -136 228 -216 33 66 122 167 43 -199 31 3 89 -34 -76 -117 179 38 -55 47 -102 12
7197A2k7j24L67j61J3n9k0R8q0J44k44J13l4J68r2j12l7q8Q2p0L65j24o5Kj39
$$ 12 -15 -139 228 67 80 21 1 99 19 163 -81 32 -2 166 74 -38 -75 -163 -81 -151 214 90 25 27 -112
7222a12K22l44K09q3k7K73m0l41K27P9N9l08K49j8j71J52O0k06R8J17j94K2J82
$$ -112 110 -234 -25 -108 -135 138 98 -243 -16 63 122 -186 63 45 -126 26 86 -120 -22 95 -99 -77 105
7245A05j13P4q4%j60K04K2J5j15r5J87O4n0j03K0q7K06j2n9k3j39J41j22K33k42
$$ 105 -8 66 -18 -18 -178 26 48 63 -52 -147 40 104 54 -49 -29 -116 90 78 19 -4 -143 -2 -124 109 -133
7270a33J3J23m4R6J11j93R4qJ81k31rk08L17j25L0P4J23l05Jj16J3J47K44q2k15
$$ -133 -120 3 -41 55 166 -27 67 59 240 9 0 -208 109 -16 14 88 211 -94 -93 -209 -196 -49 195 113 -102
7295a02P5kmJ31p9l72M30j01J23l83J41J35r3N7J03K40k95r8l8J61p8r6J01jk7
$$ -102 -27 -29 -33 98 19 -353 77 -24 99 -284 -143 -8 -101 -44 59 299 4 -94 -132 29 -49 -145 -44 -45 -72
7320g2Q4q9K65m5rn0j83J26J37j22nP6k38R7q3J88k42K15q2R3k7j27P9j20J52
$$ -72 12 -77 188 143 134 84 -99 27 164 42 37 113 -125 -28 -111 77 -165 50 -32 61 34 -93 -14 -134 18
7345A8M3R8p5Mk78L41q5Nj28o0J74j34O7M6Q2l2j25O6k5M7j4n7J23k36K01j90
$$ 18 61 159 84 88 -190 151 66 71 -57 -117 57 -77 -10 36 118 86 -39 27 2 49 35 -22 101 -135 66 -124
7371a24j18K72k69L38k00K20J4k19J57p4j23J61k9n6l2m8K49N5Pk2l04K3N0l0
$$ -124 -242 30 -239 99 -101 119 133 -86 71 -3 -126 35 6 -50 -82 -130 119 174 181 159 -145 -122 -72 -102
7395a02K8N3m5J05j20L8j79J3K44o8J53n5j55K28k31J37j68N6JQ5j0j28K18K9
$$ -102 -74 -21 -66 39 -81 -43 -222 -209 35 -33 120 65 -90 138 -93 44 -124 -68 -67 18 8 -120 98 127
7419A27j38O5l6p2J42j31m8Q0Rk00J83Q3l2Q9j32o4J3k12K93J50Rl02J78j4o6
$$ 127 -11 54 18 -54 88 -43 -91 -11 -2 -202 -19 64 32 121 -11 -75 -62 -274 19 169 178 -124 54 40 -26
7444b6M7k16L13j17J30q0O9j24R9k07J34JJ1O8q9k33K85p0j1p6J55m6n3j07P2
$$ -26 21 -195 118 1 131 51 120 -4 95 -112 22 23 34 102 13 -220 65 -5 -16 -92 63 17 -36 -143 -71
7469g1J53k67K28r8J36N5k0k66Q5M1n2J9Q7n0N4j09J87l73J71J64K1j67R4J81
$$ -71 82 -185 43 -55 81 136 116 -150 -65 -24 -76 -57 30 -20 34 -75 112 -261 -90 74 95 -72 22 203
7493B03Rl25K1J80P7j92K26j08m3j11J36j50P4J15l08L12m5k88J51l7J74l4k76
$$ 203 212 -113 -92 88 165 -27 199 91 48 -63 73 -77 -3 112 -196 116 71 -217 -66 -103 71 37 -239
7516b39K76j2l6J87k50P5J09k89J68R6k55K26j29J29j44K46j60o2j20L44j63J59
$$ -239 37 25 -11 176 -74 1 110 -179 -11 85 -170 56 -73 56 -88 158 -2 -64 -184 160 -3 156
7538A56n5j56J07r3k10L57K1j77O9j79K81k34K37k3j03l7R0orj26K30q0K7k70
$$ 156 101 -55 52 -41 -251 106 127 -50 19 -160 121 -113 124 101 -2 -39 51 45 36 -90 140 60 87 -183
7562a83L41l62J69J68k02n7K06j85J48k18R9M7q9K75k84J78l07L49R5mn8j97L
$$ -183 158 -204 -35 133 -69 -126 80 -105 43 -175 -76 -29 -118 157 -127 51 -256 93 188 184 126 -71 -68
7585f8J0N7q9P0K43k20o0L3Q6Kj93J71J00q8j7Q2k41p3K23J11k31J11K5j07K5
$$ -68 -58 -1 -90 -20 223 3 -57 -24 62 64 -129 42 142 54 37 119 -122 -195 28 139 -92 19 44 -63 -38
7610c8J12K2p3N9q0l0PJ32j70K30l4k53J13J2l2j2k54L35J3j74J21p3O0J85k26
$$ -38 74 96 23 82 2 -28 -21 111 -59 171 137 -116 -3 9 -23 -35 -289 46 59 -115 6 -67 -7 178 -48
7635d8K0PJ30l6k3j4N3j75K63k71K83k58o3J08r7mj8J97l0J50l55J02P4M5m5p9
$$ -48 -28 -21 109 73 50 36 89 -86 177 -94 189 -69 -132 -24 -121 -125 -143 54 24 174 -181 -79 -5 40 -5 -84
7661h4K05J7n6l01K38j07K49j15n6J1m7p1J99J56j89O3N5k05N0Qq9L6O2J47k46
$$ -84 121 138 82 -219 19 -88 161 46 -10 1 -46 -117 82 238 49 112 167 -38 12 20 -69 -33 29 176 -70
7686g0j9K02j69J28M4k2j6m9P7k4l61L29k7kL75n33K16M4j53j13J80j47J2M9L86
$$ -70 -89 113 -56 72 116 94 78 29 106 82 -279 50 23 21 396 -137 79 123 -30 -143 37 -110 -98 -49 337
7711C37m50J53J1p7J04M7M2j90K35k09o0M1j61J79j3o0J81r0j97L4P0%K17l05
$$ 337 -113 40 51 -26 78 125 167 -23 212 3 -57 -16 -177 2 -11 -71 110 20 -177 -143 -73 -73 144 -161
7735a61J65M8Kl08J95O3J4K2j30o8J63K10j4j66j27O2r8J7J53j08K47j57o2K32
$$ -161 4 52 54 -254 -59 4 18 40 -90 -158 5 215 201 35 -92 -30 -128 -111 42 -66 181 24 -38 194
7759A94l15K72j82k13K23k9J46j60k09L22j26J29Q4j49J15K19n26K74l89K71J53
$$ 194 -121 151 -31 -244 -21 -50 96 -64 -273 49 -77 52 136 -13 102 321 -205 69 -320 -49 104
7780A04J36l44K95k21R8p4j79L21j04k28Q8J86o7j54J64j20K59ok78J72j98L10
$$ 104 240 -104 191 -30 68 -6 -185 136 32 -196 -108 78 11 -143 21 -99 160 154 -124 48 -150 160
7802A60L1m27K75j2M1p5n1Q5q9N1P3j76L3J28rJ09p7O7M0k65PO5q0J61P4j04J31
$$ 160 191 -236 39 27 68 -7 -58 27 -62 -11 62 -114 -81 47 38 147 70 137 177 -88 -81 -16 -96 65 139 35 166
7829A66k21j9J29j05K27j89j15P8O3r6N5l5j02K21j52J88j03M7M1l3N7o7j65J02
$$ 166 -55 -74 55 -50 177 -12 -127 -49 14 -82 -27 -62 -164 57 -95 93 -10 37 78 45 102 35 -130 -28
7853b8k91L20Q9j37P2q6J32j11n1K4J85k50K76M2k60j17K50j50P4n7P6n3M9P3
$$ -28 -319 1 90 -47 25 -61 71 -40 -91 -67 118 -132 144 186 -74 -191 59 -91 -17 -74 2 -51 -2 71
7877G1J37k00kR9q8J1qJ0j45Q3m0Q3p6Q1j55O3L91l97K95Nl4k04K6j71J76J07
$$ 71 208 8 6 105 17 28 20 30 -115 -32 -72 11 -65 16 -139 -76 315 -82 213 218 184 -20 6 -165 11 118
7903A18L4q3r2K21l79L14j52j31K26l7j97R1J67k49O8J61m4n1kM8J0j1K81l39
$$ 118 152 69 -23 198 -181 133 -19 -150 76 39 -158 -67 100 -149 -81 80 36 -15 -17 31 41 30 311 -28
7927b8Q8j79K49j37J40j30J10j37k2J71l2N2j93Q2J85j15L7q9K8Oj45M7NJ02j36
$$ -28 60 -119 130 -7 133 3 113 -24 -46 125 93 145 -48 34 219 104 141 52 80 86 -59 -12 -7 95 -41
7952d1K18m0j16m7K71k13K5l9j33J56n1R9j21KJ15r1K3k03J71p0N0J78l19J04
$$ -41 177 137 21 -26 245 32 57 18 -115 41 -10 89 -32 -30 85 -6 17 -186 -15 -85 -35 143 -176 -72
7976g2N8J05J91k33j92J8K29k21L34k19r3M8j41J03M7R4l0k7J01o6o5M8J38J97
$$ -72 -14 91 282 49 -143 -125 104 -117 217 -2 -95 -47 -188 -85 -38 56 26 -1 100 34 -31 17 155 352
8000C52l87K02j3r8J1o9N5RJ37k11J71j00Q0k3j26K5M7j0j09j27L34k0l3k39Q1
$$ 352 -35 167 154 56 67 -2 53 62 199 -12 159 59 139 116 -10 15 62 52 -57 -184 150 130 97 -142 -61
8025f1q1J48J07o3Or8J25j67J07k29K16L4o5J36j96L78l54k8K83j89P2n4j32K87
$$ -61 -142 6 113 50 56 -42 83 -84 23 -206 10 44 -21 115 -81 297 -57 -85 198 9 81 27 -105 182
8049A82j42r4J09j76N5J08j35l9M00j57j98O4l6J73JM4l06J76j01O7k02R9K10
$$ 182 40 -54 55 -121 -66 42 -93 -132 268 111 -87 -23 -59 114 115 159 -147 29 -72 -5 -207 -108 102
8072A02j21J38k96O6J8M48n72K99j22N8K4Lm8k09L18j10Q0Mk9j74R2M8j89K30
$$ 102 -19 119 -177 -111 -93 355 -217 82 -40 18 42 45 -3 -212 106 -4 76 80 51 -123 -31 17 -172 58
8096E8oo9m1k7Q0n6k2J51j19K67m4j79J36j07j61Q0oK0K5LK14j07j94O7K7P8j9
$$ 58 52 -17 -58 -85 -5 -61 -83 68 -51 216 172 -7 129 22 -139 -59 -65 -45 -20 -17 197 90 -104 -37 -10 68 49
8123D9k77k8K90k13J43q7J92j24K61l96J73J71r2j8j05Q2O6l3N1k7o7j82K32N5
$$ 49 -228 -256 34 -179 -36 -123 69 -55 206 -190 -17 154 62 44 -61 21 87 54 105 78 11 -171 61 116
8147A16l46K41J68l20J59M4l5k07K07J61j92j40R0K02oj83J12k60j5Q6J02n1K43
$$ 116 -230 11 179 -141 18 62 27 -180 27 188 -4 -144 -54 148 142 -41 71 -189 -204 -118 -16 -67 176
8170A76q6m7J92k17Q1k08J99j66K48j77Q9k34K15j45K3k6J3l9K25j15j82
$$ 176 90 43 235 18 99 -109 90 -76 172 -5 84 -150 65 -80 -57 -83 -70 -109 116 1 -181
8191a81
$$ Imaginary data points
##PAGE= N=2
##DATA TABLE= (X++(I..I)), XYDATA
0@%%%%%%%%%qJ6j6J6k4M0m8N6p2Q8j04J26j50J76k08K46k86L30l86M48n13N87
$$ 0 0 0 0 0 0 0 0 0 0 -8 8 -8 8 -16 24 -24 32 -40 48 -56 70 -80 96 -112 134 -152 178 -208 240 -273 314
31C14o74P68q70R83j111J252j404J571j751J948k168K408k668K952l264L607l978
$$ 314 -360 408 -462 521 -590 662 -742 829 -922 1026 -1142 1266 -1402 1550 -1714 1893 -2085
48b085M384m830N319n861O461p127P870q704R648j0727J1976j3440J5180j7294
$$ -2085 2299 -2531 2788 -3073 3388 -3739 4131 -4573 5075 -5652 6324 -7116 8064 -9230
62i230J9926k3305K7833l4253M4137o1518J01082l58838n1605N39499q4760k13472
$$ -9230 10696 -12609 15224 -19029 25108 -36410 64672 -294166 -345771 193728 108968 -104504
74a04504j04903K66349J63922j27725k71006L0037K33472J23212k07902j94593
$$ -104504 -209407 56942 220864 93139 -177867 -147830 85642 208854 952 -193641
84a93641Q9702K46363J8430k08965j44184J55866K01676n0914k22042m9193J78202
$$ -193641 -103939 142424 160854 -48111 -192295 -36429 165247 114333 -107709 -156902 21300
95B1300J46591j14947j86289K0948J83092O8674j31663j40827O4003J60671J7917
$$ 21300 167891 52944 -133345 -112397 70695 139369 7706 -133121 -69118 91553 109470
106A09470j38897r0481Q5661J38291k3162j40568m4266J04758J00330m9332j28060
$$ 109470 -29427 -119908 -34247 104044 80882 -59686 -103952 806 101136 51804 -76256
117g6256p794J14573N9673p1261r5470J8160J03868L0201p7792o8622L0480R1357
$$ -76256 -84050 30523 90196 18935 -76535 -58375 45493 75694 -2098 -70720 -40240 51117
129E1117J7977q6390n5849N1046P9801j898q7532m0763P1691O7395l2825p9851
$$ 51117 69094 -17296 -73145 -22099 57702 55804 -31728 -72491 -800 66595 33770 -46081
141d6081j3075P7230M9068n4387o8162J2271P3632L1416o2907o0285L5289P1027
$$ -46081 -59156 18074 67142 12755 -55407 -43136 30496 61912 -995 -61280 -25991 45036
153D5036O382o9194m6843N5508O9846k6878p6477j3176P0899M9964n3030o8831
$$ 45036 51418 -17776 -64619 -9111 60735 33857 -42620 -55796 15103 65067 12037 -56794
165e6794K1514P0425J6615o1126m8717M3168O2974j2256o1529k4756N1758N4294
$$ -56794 -35280 35145 51760 -9366 -58083 -14915 48059 35803 -25726 -50482 1276 55570
177E5570l3076o6058L116O1063L0818m9466n4680L0700O1456k322n5476k8553
$$ 55570 22494 -43564 -40448 20615 51433 1967 -52713 -22013 39443 37121 -18355 -46908
189d6908M3794M8526k5180n0986k008M1871K9365k7621m4466J0826M2644J1889
$$ -46908 -3114 45412 20232 -30754 -32762 9109 38474 10853 -33613 -22787 19857 31746
201C1746l2066l4312J8169M4724j948l9151j8686K5527L5747j1911l8979j980
$$ 31746 -320 -34632 -16463 28261 26313 -12838 -31524 -5997 29750 17839 -21140 -23120
213b3120K8083J8288j2530l0180q5K9195J2164j4913k4715k289L0168J4908k2293
$$ -23120 4963 23251 10721 -19459 -19544 9651 21815 6902 -17813 -20102 10066 24974 2681
226B681k4046M529L0583J1973l0910k1057J8686K5692J208k8226j7175K3772K4545
$$ 2681 -21365 -16836 13747 25720 -5190 -26247 -7561 18131 19339 -8887 -26062 -2290 22255
239B2255p354k4698j3486K1991K6853j4172k9031k635K5881K0929k1230l0776
$$ 22255 14901 -9797 -23283 -1292 25561 11389 -17642 -20277 5604 26533 5303 -25473
251b5473J1956K9191M297k3306k0087J6876K4947q265j8888m029J1615J4901o620
$$ -25473 -13517 15674 19971 -3335 -23422 -6546 18401 10136 -8752 -12781 -1166 13735 7115
264G115j6038J409R617O475m588j2024K983R381k450j736j25p5K14n272L273J1938
$$ 7115 -8923 -7514 2103 8578 3990 -8034 -5051 4330 1880 144 19 -56 158 -5114 -1841 10097
280A0097p728j4841M853J7029P453k1524j8680K1463K6661j1102l0564r731L1833
$$ 10097 2369 -12472 -7619 9410 16863 -4661 -23341 -1878 24783 13681 -16883 -26614 5219
293E219K8516k5091l8538O304M0486K0417l7279m3009K4206N3419K391n3468l4970
$$ 5219 33735 8644 -29894 -23590 16896 37313 34 -42975 -18769 34650 37041 -16427 -51397
306e1397M4645N9266k2828o7375j0384O2257M4681m6473o7018J9000P1228J8487
$$ -51397 -6752 52514 29686 -37689 -48073 14184 58865 12392 -54626 -35626 35602 54089
318E4089o0984n4644L8201P5469n354p3995l4595N6347O7900k8006q1704q185
$$ 54089 -6895 -61539 -23338 52131 46777 -27218 -61813 -5466 62434 34428 -47276 -55461
330e5461P4352M7339n1502p6896J9568Q4858J7528o9125n4199M0177P6603n614
$$ -55461 18891 66230 14728 -62168 -42600 42258 59786 -9339 -63538 -23361 53242 47628
342D7628p6122l0366N4175O1298k2584p6558j1635O9080M4470m1441o9515P467
$$ 47628 -28494 -58860 -4685 56613 34029 -42529 -54164 14916 59386 17945 -51570 -44103
354d4103P5711K4957n9709n1282K8301O7894N452o6577l3010M4532N3342j1486
$$ -44103 31608 56565 -3144 -54426 -26125 41769 47221 -19356 -52366 -7834 45508 34022
366C4022o2355k1174N3279M4093k6385n6817p283N8204L5151m3418n1339J4049
$$ 34022 -28333 -49507 3772 47865 21480 -35337 -42620 15584 50735 7317 -44022 -29973
378b9973N8175J8144n3215m2306L3991N3356l083n2938k7603M2320M5835j9821
$$ -29973 28202 46346 -6869 -49175 -15184 38172 35089 -17849 -45452 -3132 42703 22882
390B2882n0957j1014M6286L7763l2364n1631Q457N2041K1729m2904m5250K5939
$$ 22882 -28075 -39089 7197 44960 12596 -39035 -30578 21463 43192 288 -44962 -19023
402a9023N3647j089m9156k5313L6828M4273j8776m9318n362M1573L0481k7697
$$ -19023 34624 33535 -15621 -40934 -4106 40167 21391 -27927 -33289 8284 38765 11068
414A1068m5968Q529M5938J5206l5503l6805K0513M8043j984m5626j9039L3235
$$ 11068 -34900 -26371 19567 34773 -730 -37535 -17022 31021 29037 -16589 -35628 -2393
426b393L9037j7044m7003j877M0401K2207k5839l8144Q466M2386Q976l2853k7692
$$ -2393 36644 19600 -27403 -29280 11121 33328 7489 -30655 -22189 20197 29173 -3680 -31372
439c1372J6667M1625Q87m2316j8853K9133L5294r785m4143q136M0323K4179k3770
$$ -31372 -14705 26920 27807 -14509 -33362 -4229 31065 21280 -22863 -30999 9324 33503 9733
452I733l7758L125M3017J4930l4565k9970J3168M0599R642l9988k7405K5652L8850
$$ 9733 -28025 -24900 18117 33047 -1518 -31488 -18320 22279 31921 -8067 -35472 -9820 29030
465B9030j954m4037k1096L8757L7040k0045m5078o381M5979K9189l4065m2718
$$ 29030 27076 -16961 -38057 700 37740 17695 -27383 -33764 12215 41404 7339 -35379
477c5379J0456M5482J7282m0190l8270K4112M7201J991m6158k9658L6277M8093
$$ -35379 -24923 20559 37841 -2349 -40619 -16507 30694 32685 -13473 -43131 -6854 41239
489D1239j5653n3107j2949M6979L9366l1865n3043Q658N2813J9401m1946m3444
$$ 41239 25586 -27521 -40470 6509 45875 14010 -39033 -30375 22438 41839 -107 -43551
501d3551K4116N3228Q25m8446k8402L3125M8765j2516n3730j1877M3972L6158
$$ -43551 -19435 33793 34618 -13828 -42230 -9105 39660 27144 -26586 -38463 5509 41667
513D1667k6585n1813O445N2103J6741l9133l8127K0541M8706l08m4136j9862K8633
$$ 41667 15082 -36731 -30286 21817 38558 -575 -38702 -18161 30545 30237 -13899 -33761 -5128
526e128L5997j0554m1769o964L4405K3566j9077l5778K407L7818J2100k7768k4075
$$ -5128 30869 20315 -21454 -28418 5987 29553 10476 -25302 -22895 14923 27023 -745 -24820
539b4820J2473L1731J249l1032j0557K0318J8688p013k3760l072K0841R646j0772
$$ -24820 -12347 19384 20633 -10399 -20956 -638 18050 11037 -12723 -15795 5046 14692 3920
552C920j4292n33J6008O770j2690r051M456J1035L510j2015n527R332M885k843
$$ 3920 -10372 -10905 5103 11873 -817 -9868 -5412 5623 9133 -2882 -8409 923 5808 2965
566B965n245j960N369J241l529J886q1k176R85M70K228q51n416K375N028j390
$$ 2965 -2280 -4240 1129 2370 -1159 727 646 -1530 -545 -75 2153 1302 -4114 -1739 3289 1899
582A899k150l718Q62P546M82o162l543J286Q628K197j1051m266P565P713j547
$$ 1899 -251 -3969 -3107 4439 4921 -1241 -4784 -3498 5130 7327 -3724 -7990 -425 7288 5741
597E741j2518k914J3707N373q585q889J037J2179M244j1022o241M138Q690L698
$$ 5741 -6777 -9691 4016 9389 804 -8085 -7048 5131 9375 -1647 -7888 -3750 4940 8638
611H638j0200q375Q061R678n68j1237p417J1596J0829p365j0684r24R917P813
$$ 8638 -1562 -9937 -1876 7802 7234 -4003 -11420 176 11005 3640 -7044 -7968 1949 9762
625I762r108q909M712P440K552n903q544M595Q899N31o155p600M162J1296k172
$$ 9762 654 -8255 -3543 3897 6449 546 -7998 -3403 5496 6027 -128 -7728 -3566 7730 5558
640E558r600k006N799P424m547r906K805P657J517l575o351J510P517K86l818
$$ 5558 -4042 -6048 -249 7175 2628 -7278 -4473 3184 4701 1126 -5225 -3715 3802 4088 270
655B70m162K51P518J606p948k648M506N768m17r667j327R081K372m781n104K89
$$ 270 -3892 -3641 3877 5483 -2465 -5113 -607 5161 4744 -4923 -6250 2831 5203 422 -4682 -4393
671d393Q017J251o940j751K493M739J680p541l634O018N225l86q144m356J0020
$$ -4393 3624 4875 -2065 -3816 -1323 3416 5096 -2445 -6079 -61 5164 4778 -3366 -7722 2298
686B298N738p386p084J253J0131L180j1173n768P614P417j51r911n108R608P390
$$ 2298 8036 650 -6434 -5181 4950 8130 -3043 -8811 -1197 6220 6069 -3842 -8950 658 8048
701H048m251q901l503J1084R376j0017j2375L409J3627N832j4028j2491J0580
$$ 8048 3797 -5104 -8607 2477 11853 1836 -10539 -7130 6497 12329 -1699 -14190 -3610
714c610J4501k157j4871p184J3485J3771q625j5042j992J4916J2539j1315j8835
$$ -3610 10891 8734 -6137 -13321 164 13935 5310 -9732 -11724 3192 15731 4416 -14419
727a4419M100J8562P521j5663j8120J0672K2517j680k1446j0386J6696K0723r327
$$ -14419 -10319 8243 15764 101 -18019 -7347 15170 13490 -7956 -18342 -1646 19077 9750
740I750k4025j518J9783J4640j2510k3223L118K4142Q265j7435k0423Q345K7652
$$ 9750 -14275 -15793 3990 18630 6120 -17103 -13985 10157 18422 987 -19436 -11091 16561
753A6561K103k5919j4650J6838K5837n833k9514n860K4138J7629j3077k6316L45
$$ 16561 18664 -7255 -21905 -5067 20770 14937 -14577 -20437 3701 21330 8253 -18063 -17718
766a7718K7872J1165j9880k1670O318K8371P770k6834j8111J5378K6548q75k9760
$$ -17718 10154 21319 1439 -20231 -13913 14458 22228 -4606 -22717 -7339 19209 18334 -11426
779a1426j2103K4694K1306j1922k7249l348K7620J5502k0089k2382N470K5007
$$ -11426 -23529 1165 22471 10549 -16700 -20048 7572 23074 2985 -19397 -13927 11080
791A1080R916k2731j9301J2777K3844J964k4458j5042J9510K2909q915k4503n975
$$ 11080 20996 -1735 -21036 -8259 15585 17549 -6909 -21951 -2441 20468 11553 -12950 -18925
804a8925K2412J7202j5725k1669M556K0719Q107j7106j6926R915J9831Q94j6968
$$ -18925 3487 20689 4964 -16705 -12149 8570 16677 -429 -17355 -7440 12391 13285 -3683
817c683j2453J1791J9012m602j8646m708J4233J4168r595j8560L587J6342N051
$$ -3683 -16136 -4345 14667 10065 -8581 -13289 944 15112 5517 -13043 -9456 6886 11937
830A1937j1676j2529O429J4984j248j1050o180O461J1611k318j1974k291Q949
$$ 11937 261 -12268 -5839 9145 7897 -3153 -9333 -2872 8739 6421 -5553 -7844 1105
843A105P257l999j2074P27J1900K709p672p370L438J0150r36q944j433M710M984
$$ 1105 8362 4363 -7711 -6984 4916 7625 -47 -7417 -3979 6171 5235 -3709 -5142 -432 4552
858D552j354p153l52N812K873j899n607j684P103K754n063l698Q07N881J767p432
$$ 4552 3198 -3955 -4307 1505 4378 2479 -3128 -4812 2291 5045 -18 -3716 -2909 2972 4739 -2693
874b693j991M863L054q69n004j543N046J831j693k065j965L499L561l111l576
$$ -2693 -4684 179 3233 2364 -2640 -4183 863 2694 1001 -1064 -3029 470 4031 920 -2656
889b656l3L913M039m746n906L952N098k95m279m117M603M512k938l256j234K746
$$ -2656 -2689 1224 5263 517 -5389 -1437 3661 3366 -913 -5030 -427 4085 1147 -2109 -3343 -597
905e97N354k888n530JM241M900k794q340J529Q043J363n661n654L517Q778k376
$$ -597 4757 1869 -3661 -3660 581 5481 2687 -5653 -4124 3919 5282 -379 -6033 -2516 6262 3886
921C886q116q65M876O037k279q572K75O744L489l094p794J53R781J840p156n729
$$ 3886 -4230 -5095 -219 5818 3539 -5033 -4758 1986 5475 2381 -5413 -5260 4521 6361 -795 -6524
937f524L250R965Jj0981k773P220O187k834r143j45Q897K655n382n360M14Q218
$$ -6524 -3274 6691 6692 -4289 -7062 158 6345 3511 -5632 -5777 3120 5775 393 -4967 -4553 3665
953C665K550p282m396K902O794J671q458l887P114M640k713o541r77P681K190
$$ 3665 6215 -1067 -5463 -2561 4233 5904 -2554 -6441 673 5313 2600 -3941 -4918 2763 4953
968D953n762l052K013L730J427m451j371K581J066K30j718j918K743J410j640
$$ 4953 -809 -3861 -1848 1882 3309 -1142 -2513 68 1134 1364 -354 -2272 471 1881 241
983B41o83n81J362J223k766N67K056j906j265Q84K227J325m274k244N165K159
$$ 241 -442 -1023 339 1562 -1204 -637 1419 -487 -1752 -868 1359 2684 -1590 -3834 1331 3490
999C490k949l477j9N761J564n784k633K858M650J583o991m257N487N790j390p352
$$ 3490 541 -2936 -2955 2806 4370 -1414 -4047 -1189 3461 5044 -1947 -6204 -717 5073 3683 -3669
1015c669l596Q934O600o791q141J269R811M218j0221p211O427Q706K54r299n985
$$ -3669 -7265 1669 8269 1478 -6663 -5394 4417 8635 -1586 -8797 -2370 6336 6590 -2709 -8694
1030h694Q662Q081m084r141k653Q914Q548p247j0749K071J0658M931r286r986
$$ -8694 -32 8049 3965 -5176 -7829 1085 9633 2386 -8363 -6292 4366 9297 11 -9975
1044i975O474J0868j103r419n479Q085R410m607r809r40P607O890m878j0045J310
$$ -9975 -3501 7367 6264 -3155 -8634 -549 8861 4254 -5555 -6495 1112 8002 3124 -6921 -5611
1059e611Q847L926o180q923L394J1005j71r045m669N360R514k748r658l79O345
$$ -5611 3236 7162 982 -7941 -4547 6458 6287 -2758 -7427 -2067 7447 4699 -4959 -5338 1007
1074A007M639k587q103L41P180K611l975n863J18Q097K373o656m660K624O972
$$ 1007 5646 3059 -5044 -4703 2477 5088 1113 -4750 -4632 3465 5838 -818 -5478 -2854 4118
1089D118J065q302k110N970L679j689o041j169O217K743l636l768q06M818L794
$$ 4118 5183 -3119 -5229 741 4420 2731 -3310 -4479 1738 4481 845 -2923 -3729 1089 4883
1104D883m498m354J772M276K428n428m420M749M597j352m827k319M968M203l675
$$ 4883 385 -3969 -2197 2079 4507 -921 -5341 -592 4005 2653 -2174 -4493 475 4678 1003
1119A003l736L35L028L044l088m074K023L464J378l105m855K882N772j282m623
$$ 1003 -2733 -2398 630 3674 586 -3488 -1465 1999 3377 272 -4583 -1701 4071 2789 -1834
1134a834k332L782M991l280n127J620M002J771k882n008K561M818j08l362l222
$$ -1834 -4166 -384 4607 1327 -3800 -2180 1822 3593 711 -4297 -1736 3082 2974 -388 -3610
1149c610J750N654q77n278j516L589N062k496p183J253O550J755m035n500K431
$$ -3610 -1860 3794 2917 -2361 -3877 -288 4774 2278 -4905 -3652 2898 4653 618 -4882 -2451
1164b451O632l33n544k383K611N679l25o904j735M793M758j287p982j385Q091
$$ -2451 4181 3848 -1696 -4079 -1468 4211 3886 -3018 -4753 40 4798 3511 -4471 -5856 2235
1179B235L644n184o290J325Q282J908p852l683M002O299K64p856l217O070N313
$$ 2235 5879 695 -5595 -4270 4012 5920 -1932 -5615 -1613 4686 4950 -2906 -6123 -53 5260
1194E260j424o975l247P298N535m844o814j8P927M480p494o663M379O995J067
$$ 5260 3836 -3139 -6386 912 6447 1603 -5211 -5229 2698 7178 -316 -6979 -2600 4395 5462
1209E462o972n101N846O154j858n976l031N311O627l981o824n76O014N392m751
$$ 5462 -1510 -6611 -765 5389 3531 -2445 -5476 -165 6462 2481 -4343 -4919 1095 6487 1736
1224A736q029K717P348J410n860n286M142P109j941n865j952L914N617k237o151
$$ 1736 -6293 -3576 3772 5182 -678 -5964 -1822 5287 3346 -2519 -4471 -557 5060 2823 -3328
1239c328n45M531L597k060o212K42O325J407l939m187J779O317n62n489j223L189
$$ -3328 -3873 658 4255 2195 -4017 -3775 2550 3957 18 -4169 -2390 3927 3365 -2124 -3347 -158
1255a58L111p38m561K2L464Q10o54k778q12L396R94k018j897j39L273J097l386
$$ -158 2953 2215 -2346 -2324 1140 1950 1296 -1482 -2294 1102 2096 78 -1819 -1958 1315 2412 -974
1272i74q13K225N48j87j894O7K259o35j293O94l28M02L77q16R87m81r07R92j23
$$ -974 -1787 438 986 799 -1095 -1028 1231 596 -697 -3 -331 71 448 -368 619 138 -769 223 100
1291A00l70Q59j066j43Q49J70J83j009j030K411Q38k399p15Q97K035M37l470n69
$$ 100 -270 589 -477 -620 229 399 582 -427 -1457 954 1792 -607 -1322 -425 1610 2047 -1423 -1992
1309a992K930M64p97j938l19L089J18k140o18l6K057J366k852j647J579K256N14
$$ -1992 938 1402 605 -1333 -1652 1437 1555 -585 -1203 -1239 818 2184 -668 -2315 -736 1520 2034
1326B034l024j577L242J724k040k113j12L159J167l178j374K034Q89N12j473j637
$$ 2034 -990 -2567 675 2399 359 -1754 -1866 1293 2460 -718 -2092 -58 831 1343 -130 -1767
1342a767J693J079l34j033j497J884K009j631j621J54J472J308k007j331J958
$$ -1767 -74 1005 671 -362 -1859 25 2034 403 -1218 -1064 408 1716 -291 -1622 336
1357C36M79q51l23j63J093l2j279O95l4m75Q01M1l60M85n91N04o3p70R42K30j337
$$ 336 815 -36 -359 -522 571 539 -740 -45 -79 -554 247 288 -72 413 -178 326 263 -507 435 665 -672
1378f72K49M67K64R4j293M32J503j065p26M90N22N14p72j043J338k3l63L87l84
$$ -672 -423 44 308 402 -891 -459 1044 -21 -747 -257 265 779 7 -1036 302 279 -84 303 -81
1397h1J39K56o25M31J63q04Q38M50j327P64q9q6J57o43P74J51j507N66J311k38
$$ -81 58 314 -311 120 283 -521 317 767 -560 204 115 29 186 -457 317 468 -1039 -473 838 600
1417F00q83n77R38J668k019j436J746J121j65j413j367J766J677j113j022r85
$$ 600 -283 -860 78 1746 -273 -1709 37 1158 993 -420 -1787 -21 1656 543 -479 -1464
1433a464J088K345j189k438J71J943K205k205l574J823L834l66l147k039K840
$$ -1464 -376 1969 780 -1658 -1487 456 2661 456 -3118 -1295 2539 2173 -974 -3013 -173
1448a73L477j903l564l8K725K501k418l712J318L433J265k432m129J927M846m26
$$ -173 3304 1401 -2163 -2201 524 3025 607 -3105 -1787 1646 2911 479 -3650 -1723 3123 2697
1464B697m196j904L087M336k294n162O17M349J922k738m475J781M419P1k933k668
$$ 2697 -1499 -3403 -316 4020 1726 -3436 -2819 1530 3452 714 -3761 -1980 2439 2510 -423 -3091
1480c091J272M852k36m772j377K966M008j064n645m93N025J983k667m067R79M772
$$ -3091 -1819 3033 2797 -1975 -3352 -386 3622 2558 -3087 -3580 1445 3428 761 -3306 -2327 2445
1496B445L50l898j753J943L206K50l994j315K454K637k31l483j654L625K075k122
$$ 2445 2795 -1103 -2856 -913 2293 2543 -1451 -2766 -312 2325 2094 -1389 -3043 582 2657 535
1512E35k311m16L548J453l115j719J281J824O85k371j378J746J109K46j011j753
$$ 535 -1776 -2192 1356 2809 -306 -2025 -744 1080 1765 -606 -1984 -238 871 1117 106 -1647
1528a647J240K039q76j520o02J210K311j643j855O28J328N69q21j581J186N61
$$ -1647 -407 1632 756 -764 -1366 -156 2155 512 -1343 -715 613 1182 361 -1220 -34 527
1544E27l31O8q59k10J467O1r38n30j61J558N70k089L4J369J39k14j398M20J377
$$ 527 196 264 -595 -805 662 723 -215 -745 -906 652 1222 -867 -833 536 675 461 -937 -517 860
1563H60l64q54J76j33O51J73p82n8Q8K18O20j040m55J196K78m99o29j82J527K21
$$ 860 496 -358 -182 -315 336 509 -273 -331 -243 -25 595 -445 -900 296 574 75 -554 -736 791 1012
1583A012j597j22J189K78m97j207O63R68n58k68q3m97J190K89p79n50m4Q96P32
$$ 1012 -585 -707 482 760 263 -944 -281 687 129 -139 -222 -719 471 760 -19 -569 -613 283 1015
1602A015j545m14J296N95l70j128o38K171k86j447L69J66M50M91j198j24M59p5
$$ 1015 -530 -944 352 947 577 -551 -1189 982 696 -751 -382 -216 234 725 -473 -597 -138 -213
1620b13Q50k65j551J114R29j88p40r17J332Q08j149p16N17K73P86r12p02N84N78
$$ -213 637 372 -1179 -65 864 676 -64 -981 351 1159 10 -706 -189 84 870 -42 -744 -160 418
1639D18J21r9j264M5J355R9p03r16N11J613n53j458J28O72R66n29j471N71J207
$$ 418 539 440 -824 -779 576 675 -28 -944 -433 1180 627 -831 -703 -31 935 406 -1065 -494 713
1658G13j5l85r03k12J181K75q47n89j2J560M61j836m84J299O83r0j646l23J885
$$ 713 698 313 -590 -802 379 654 -193 -782 -794 766 1227 -609 -1093 206 889 799 -847 -1170 715
1677G15r7r31Oj08Q97K65j039o5K30J59O56n34q21P38L48k00k42n86Q69L52r50
$$ 715 618 -313 -307 -415 482 747 -292 -357 -127 32 688 154 -667 71 419 219 -23 -609 260 612 -338
1698c38J4N25Kj4m33K52M98p53l91J134l26l44l37JR39j77m32q9J51M06L57j062
$$ -338 -324 201 203 189 -244 8 506 -247 -638 496 170 -174 -511 -510 429 252 -180 -269 -118 288 645 -417
1720d17k84Q70K54K22j223m46J563M10p76r06j00J297Q62j750p83J259Q06o1j530
$$ -417 -701 169 423 645 -578 -1024 539 949 173 -733 -833 464 1326 -424 -1207 52 858 797 -733
1739g33m99J302Q44l81n68j038J128J529j219j294j8J211J148j519j621J452J205
$$ -733 -1232 70 914 533 -35 -1073 55 1584 365 -929 -947 264 1412 -107 -1728 -276 929
1756I29p9j081j137J366J115q27o32l98O15J263n99j215n5R33Q95m11k106L93
$$ 929 850 -231 -1368 -2 1113 286 -346 -744 -129 1134 535 -680 -735 198 1093 682 -1424 -1031
1774a031J439L11p72j158O21J563m07j241J99K78J047k35j306L8P24O33k5j038
$$ -1031 408 719 -53 -1211 -590 973 566 -675 -476 -198 849 614 -692 -654 70 703 678 -360
1792c60l35J330P5q52o25Q1J534N9j659J50J048J52N9j267J57J046l51m02N1J71
$$ -360 -695 635 710 -142 -767 -686 848 907 -752 -602 446 598 657 -610 -453 593 242 -160 -109 62
1812F2N66J05j054rL65K94K78j189J25Q28J62o81j12K16Q47n82q62N29L25nk24
$$ 62 628 733 -321 -330 35 329 607 -582 -457 371 533 -148 -260 -44 803 221 -641 -112 213 208 -16
1833a6k79M24P1k94l0J01n5M42J7o84J92J33M7mn32J44P05m68k98L16J59J36n15
$$ -16 -295 129 200 -94 -124 -23 -78 364 381 -303 -111 22 69 65 -467 -323 382 -86 -384 -68 91 227 -288
1856b88j83R61m29k35J53m7M39m85l84N79k4m00J28J64j22L44n80J29N42j36R9
$$ -288 -471 490 61 -174 -21 -68 371 -114 -498 81 57 -343 -215 -51 -173 171 -409 -280 262 126 225
1877B25n02k96R30L00o04o43lJ141L44j359n63J137P85k21j517Q1J487L44j153
$$ 225 -277 -573 357 657 53 -590 -593 548 892 -467 -1030 107 892 671 -846 -765 722 1066 -87
1896h7q76J61J590L29j505p16R16J275j8j909n93J887J060j156j547j83K301O87
$$ -87 -963 -802 788 1117 -388 -1104 -188 1087 1069 -840 -1433 454 1514 358 -1189 -1372 929 1616
1914A616k218r33J195J653k87j952o01J958Q95j066j091n36J994O95j179r84J83
$$ 1616 -602 -1535 -340 1313 1026 -926 -1527 431 1326 260 -831 -1367 627 1322 143 -841 -658
1931f58J345O06j464j150J316J183n70j144m84J212Q70j322l22J43P80K91o42
$$ -658 687 1293 -171 -1321 -5 1178 608 -536 -1020 192 1062 -260 -582 -439 341 632 -10
1948a0o22P64O4J84l94m27M61J93o5j41k75K71K71m81J1L55j45p6O8j56N65n14
$$ -10 -632 132 196 380 -14 -441 20 213 148 7 -268 3 274 -207 -196 159 14 -62 6 -150 415 -99
1970i9j12O49j71l79k70K48N19n5m98kK86P8J05n64p9P82l71l25J00p0N28K40
$$ -99 -211 438 267 -112 -382 -134 385 330 -168 -170 116 194 299 -265 -344 438 67 -258 -158 -228 300 540
1992E40j168K83M83M15k90n65k88J156m6q56J23k9O23k09n98K05L45k20Q8j29
$$ 540 -628 -345 138 553 263 -302 -590 566 520 -336 -213 -242 381 172 -426 -221 124 -96 -8 -137
2012a37n2M86k89n3J09k76M84q7m39K68k1L4L5k07J71K79n36k8K73L4q2k91J41
$$ -137 -189 297 8 -45 64 -212 272 185 -254 14 -7 27 62 -145 26 305 -231 -259 14 48 -34 -325 -184
2035a84O80n46k98J29K64J98j74o04O16K73l69k2r1j56O03l06n67L62O9N67j05
$$ -184 496 -50 -348 -219 45 243 69 -535 81 354 -15 -37 -128 -284 319 13 -554 -192 -123 444 339
2056C39j140M73P50n0k09n58M27M44n53l20L10K61K09j09n67M27m9j64K35l28
$$ 339 -801 -328 422 372 163 -395 32 476 -77 -397 -87 174 383 274 -293 134 85 -79 156 -172
2076a72J38K31k85k05J51K17K75m14l63P95l2l96k6J4J92Pm65p4P28k17k93j72
$$ -172 -34 197 -88 -293 -142 75 350 -64 -427 368 336 -60 -86 -72 120 127 -338 -412 316 99 -194 -366
2098c66J96N84n65j48K43j9Q2J4m63K22K74qR8l39N6N72k32o01J85J95K71j03
$$ -366 -170 414 -151 -299 -56 -75 7 21 -442 -220 54 46 144 -195 -139 433 201 -400 -215 -20 251 148
2120A48n63L65J15j38L9k49K72K25n86N03L3l86K29j35M0Q6LJ15J76m37nL47m48
$$ 148 -415 -50 65 -73 -34 -283 -11 214 -372 131 164 -222 7 -128 -88 -2 1 116 292 -145 -150 197 -251
2143b51K09M50k57l73m1j8O39k76p20N31L74j40j58m67M96M16l39k70J4K32N20
$$ -251 -42 408 151 -222 -263 -281 358 82 -638 -107 267 127 -31 -498 -2 414 75 -195 -181 51 571
2164E71p66o3K59J43J41j25q19M02Q43l10l41m66J77J018l71p99L10L67L66k98
$$ 571 -195 -258 1 144 285 160 -659 -257 586 276 -65 -531 -354 664 293 -506 -196 171 537 239
2184B39q10N24M03j14l60l75J28J017m64o51J69R0N18J77r72Q3Q47Q7m41o54L54
$$ 239 -571 -47 356 242 -118 -493 -365 652 188 -463 -294 -204 314 491 -481 -398 449 536 95 -559 -205
2205b05O75j37n54r5qP36k00k85J6r8J08N34q70k1L80N03k28m35j88O42M9m63
$$ -205 470 333 -221 -316 -324 412 212 -73 -57 -155 -47 487 -383 -404 -24 479 251 -184 -372 270 319 -144
2227a44j5K9L21K72o81j21M67J7M08l07n14L62J46l4j76m01L57L54k54l08K64
$$ -144 -159 -130 191 463 -218 -339 128 145 553 246 -268 94 240 206 30 -371 -14 340 86 -222 42
2248D2L34k74j80k97M11J88j88P2l38j2L48j36j78J58oL48l65o4l8L32j57L8k15
$$ 42 376 102 -78 -375 36 224 36 108 -230 -242 106 -30 -208 -50 -56 292 -73 -137 -175 157 0 38 -177
2271a77J48K45m21qK23J72r6j40J92M51o27j19L46L4m26K20j61K46L2l13K25j88
$$ -177 -29 216 -205 -213 10 182 86 -54 138 589 -38 -157 189 223 -203 17 -144 102 134 -179 46 -142
2293a42P4L71l83Q2n2J00J58J7m01J69L07k84k54K16O0n0l8j29K20J05j78N1n9
$$ -142 -68 303 -80 2 -50 50 208 225 -176 -7 300 16 -238 -22 38 -12 -50 -179 41 146 -32 19 -40
2316d0K41j91k71L27j06J33J34l94J02J47o1K4m03J75N39k34m51j03K72M87J4
$$ -40 201 10 -261 66 -40 93 227 -167 -65 82 21 45 -358 -183 356 122 -329 -432 -160 327 341
2337C41p22L17M85k40k87k76M07O70o69j76K28k91N57k54m18K40L83O2n55l37
$$ 341 -381 -64 421 181 -106 -382 25 695 26 -150 78 -213 344 90 -328 -88 295 357 -198 -535
2357e35K21Q77l34m64J8N13N4k49o09M31L42j78q7l54L17K85j90k36R7j98P09
$$ -535 -314 563 229 -235 -217 296 350 101 -508 -77 265 87 0 -354 -37 248 58 -178 -81 -279 430
2378D30r3n01M3K50J35k76m29L44L93k46m22M70R6p2j2k52K51j03j26J91j56K05
$$ 430 337 -164 -121 129 264 -12 -441 -97 296 50 -372 98 194 122 110 -142 109 6 -120 71 -85 120
2400A20N1l02J95ok19L72k75j85K23L52l26m0j27L48R6n53L09J63j17%m06J99
$$ 120 171 -131 64 58 -161 211 -64 -249 -26 326 0 -40 -167 181 277 -276 33 196 79 79 -327 -128
2422a28N91n27k78M09M4o4Q1k13k53N91j19l9l46J13M73k46P5l83N4N43k41l52
$$ -128 463 -64 -342 67 111 47 128 -85 -338 253 134 95 -251 -138 335 89 164 -219 -165 378 137 -215
2444b15%K16K29l01m10M79J77j02n8N6k39M13L9l34r3j68L92K72l55o4L44j24
$$ -215 -215 1 230 -71 -481 -2 175 73 15 71 -168 245 284 -50 -143 -311 81 353 -2 -66 278 154
2466A54m0j15l10O39k60k3qj51j98M57j8j09k1j34K39nj81oJ65L6K7l90J80L24
$$ 154 114 -1 -311 328 68 45 37 -114 -312 145 127 18 -3 -137 102 97 -84 -90 75 111 138 -252 -72 252
2490B52k96k9K07l47j7M34l21J21k84O07Om94R3P6O3K93m51q9M41k13j82OK07
$$ 252 -44 -73 134 -213 -230 204 -117 4 -280 327 333 -161 -68 8 71 364 -87 -176 265 52 -130 -124 83
2513H3o2O0j56p3k7R5K81j97J5j2J46r0L8k88K23R6l29k6L58o9m4q2j12K19j42
$$ 83 21 81 -75 -148 -175 -80 201 4 19 7 153 63 101 -187 36 132 -197 -223 135 66 22 -60 -172 47 -95
2538i5j1K79j81J28j13j92K20q5j05J65l2l3Q7nQ5l3q0Qr6k40J83K49M9l93K5
$$ -95 -106 173 -8 120 7 -185 35 -50 -155 10 -22 -55 32 27 112 79 -1 7 -89 -329 -146 103 152 -241 -216
2563b16M38k9m73J83L06k42N9M9l25K24j23J53J50k72K16n2QJ22j47j43J15J56
$$ -216 222 193 -280 -97 209 -33 26 75 -250 -26 -149 4 154 -118 98 46 54 176 29 -114 1 157
2585A57j10k95K76m7k69J95k1P5p8P0J35k12K30j90L4l8j21L83J78m27k5rJ49
$$ 157 47 -248 28 -19 -288 -93 -114 -39 -117 -47 88 -124 106 -84 -50 -88 -209 174 352 -75 -100 -109 40
2608D0R9k26L1Q8p3M6K16j27j34j59J19J09j73R5K13Q8l25N7LJ37J35m12j18M05
$$ 40 139 -87 -56 32 -41 5 221 94 -40 -199 -80 29 -144 -49 164 252 -73 -16 -13 124 259 -153 -271 134
2632A34k05M5J97m37K46J98k64p1j62L85K15m31n3R8J98k4l24k17O35op7j26k79
$$ 134 -71 -26 171 -266 -20 178 -86 -157 -319 66 281 -150 -203 -105 93 69 -255 -472 163 157 80 -46 -325
2655c25L09J85l83O5J06K29k40J03k88J86p3K18k40k28M53N7j30l6j55J72P9j98
$$ -325 -16 169 -214 -149 -43 186 -54 49 -239 -53 -126 92 -148 -376 77 134 4 -32 -187 -15 64 -134
2677a34m4L34l0j46m5j09J38K71j88p0O2j54K90j30k75L18M6k31J71l55L37J85
$$ -134 -178 156 126 -20 -65 -174 -36 235 47 -23 39 -115 175 45 -230 88 134 -97 74 -281 56 241
2699B41l78K95j05J00Q4n52J80K79l14K6J69K64j63j41m3k4J10NM1k40J97J44
$$ 241 -137 158 53 153 237 -315 -135 144 -170 -144 25 289 126 -15 -58 -82 28 33 74 -166 31 175
2721A75j09j33r6J34K71l49K1J16J1p3J79j92R3K30j91q6r8J45R2k63M3J34j02
$$ 175 66 -67 -163 -29 242 -107 -86 30 41 -32 147 -45 48 278 87 1 -97 48 140 -123 -80 54 -48
2744d8K53O0m91K21K53k21Lj62J84L2P1j30J97j58r3l4m1L26j4m66M76j42k63
$$ -48 205 265 -226 -5 248 27 30 -132 52 84 155 25 222 64 -29 -63 -104 222 208 -258 218 76 -187
2767a87L39j43r0J46j53J23j73J31K53j63l51K98m6K00l6j49k86M46k41L13k76
$$ -187 152 9 -81 65 -88 35 -138 -7 246 83 -268 30 -16 184 148 -1 -287 159 -82 231 -45
2788d5J35Q3j13m77N23m27M19j03k52M38j16o0M6k96J10P9q0J25P2k38K24J62
$$ -45 90 173 60 -417 106 -321 98 -5 -257 181 65 5 51 -245 -135 -56 -136 -11 61 -177 47 209
2810B09n43K04K37L1l14Q1J59K43l28k01N37l01j17P0Q9p3q3J29J1j98J19L15
$$ 209 -334 -130 107 138 -176 -95 64 307 -21 -222 315 14 -103 -33 56 -17 -100 29 40 -158 -39 276
2832B76j81l38J53j27L15l8k60O9J85j72l1O9J38j08j85K13L23k77J32j17m2o5
$$ 276 95 -243 -90 -217 98 60 -200 -131 54 -118 -149 -80 58 -50 -235 -22 301 24 156 39 -3 -68
2854f8pR4p4J9p1L17l36O3l2K10Qj09j9J78j29j18l4N3J19q9O8J72j78j24Q6K
$$ -68 -75 19 -55 -36 -107 210 -126 -63 -95 115 123 14 -5 173 44 -74 -108 -55 64 -25 43 215 37 -87 -1 1
2880Aj01L23k08j87L34k91K54R3k39n4M7n0J85k75J6L67j99p4M2K27j63l2ORP
$$ 1 -100 223 15 -172 162 -129 125 218 -21 -75 -28 -78 107 -168 -152 215 16 -58 -16 211 48 16 22 31 38
2905C8k9J56j23q8q8J3o3K36j12j79K25j2R1q7K3M9j28q6J60j47M8J39L1j34J34
$$ 38 9 165 42 -46 -134 -121 -184 52 -60 -239 -14 -26 65 -22 1 50 -78 -164 -4 -151 -103 36 67 -67 67
2930F7l29M55k30N7j5r0R3J39k91J09J59k12J81j15j79K41K0j28K07j90Q4L55
$$ 67 -262 193 -37 20 5 -85 8 147 -144 -35 124 -88 93 -22 -201 40 60 -68 139 -51 33 388
2952C88o25K07L33m20J75j38M0Jr0j65N19k11r1P7o8l3J34O6j4k04J3L06k05o4
$$ 388 -237 -30 303 -117 58 -80 -40 -39 -129 -294 225 14 -77 0 -68 -101 33 99 85 -119 -106 200 -5 -69
2976f9K37j64K66j66j07k5R9k50L0J32k35K33j8K82j90l77L90p5nJ4j6R7J69k10
$$ -69 168 4 270 104 -3 -28 71 -179 -149 -17 -252 -19 -37 245 55 -322 68 -7 -12 2 -14 83 252 42
3000D2o0LK7j9K22l15J16j84J84J11k02j32j5J07Q0K18l92J10J33P2j81K39k40
$$ 42 -18 -15 12 -7 215 -100 16 -168 16 127 -75 -207 -222 -115 -35 183 -209 -99 34 106 -75 164 -76
3023g6J13N1j33J64k68J97m9J25j92J77j7p0Q1j7J10m30O6K64q0K48l99q1L18
$$ -76 37 88 -45 119 -149 48 -1 124 -68 109 92 22 103 86 196 -234 -168 96 16 264 -135 -216 102
3046A02j81j18K74j61J39m5l9J12J0l7j17l5Q2q6L31j34k3l9L3Mj79K22r8J72
$$ 102 -79 -197 77 -84 55 10 -29 83 93 56 -61 -96 -14 -100 231 97 74 35 68 72 -107 115 17 189
3070A89p3J8j06J1M4l97K91M1k5P3k02K4J97m7k4k50K17K1R4l39K97j53O7J19
$$ 189 116 134 28 39 83 -314 -23 18 -7 66 -136 -112 85 38 14 -236 -19 2 96 -243 54 -99 -32 87
3094H7m1j79L17n3j17K7J00j33O1k45K80j13L0J67j78J31j14J4j13L5j2j47K78
$$ 87 46 -133 184 131 14 41 141 8 69 -176 104 -9 21 188 10 141 27 41 -72 -37 -49 -196 82
3117H2O7j57Q8R8K4l77m6J24L5J44J26j12j34O6o9J12j3K21rn25K29p2J76Q0j98
$$ 82 149 -8 80 178 202 -175 -221 -97 -62 82 208 96 -38 28 -41 71 58 279 270 -255 -26 -98 78 158 -40
3142d0j1K71l27J72l56M74k20o5J67pj89J86O8k22K52m93K26J77j2l8J04j76r2
$$ -40 -51 220 -107 65 -291 183 -37 -102 65 58 -131 55 123 -99 153 -340 -114 63 51 13 117 -59 -151
3165a51J57k5J12L2l24L94j59n3l0K18k02q6k4J41K72l10n8j23K44L8J85l24J04
$$ -151 6 -19 93 125 -199 195 36 -17 -47 171 -31 -117 -141 0 272 -38 -96 -219 25 63 248 -76 28
3188B8j8m48Q29k20l32K43O4k80J52k18K77k94K06N3J11m9j87J10J10K32n12k6
$$ 28 10 -438 391 171 -161 82 146 -134 18 -200 77 -217 -11 42 153 104 -83 27 137 369 -143 -169
3210a69R4k0k62L59L3K0j65K60q5k03K78j38k2o7K37l04K34k70qK76l7%j87K0
$$ -169 -75 -95 -357 2 35 55 -110 150 65 -138 140 2 -20 -87 150 -154 80 -190 -198 78 41 41 -146 -126
3234a26m2J04J86k7k04R7%L7o3m0J40j15R1n2nL6j16J03J23K5N9m46J61J94k0
$$ -126 -168 -64 122 95 -109 -12 -12 25 -38 -78 62 -53 38 -14 -19 17 -99 4 127 152 211 -235 -74 120 100
3259A00K0k47J64J37k27j32K89k53J30O7r2J08p3pj14K44k44K22M8j30J93l03
$$ 100 120 -127 37 174 -53 -185 104 -149 -19 48 -44 64 -9 -16 -130 114 -130 92 140 10 203 -100
3281a00J19Or1K20k41n8J93j72K24o9k57J11J63m2q2Q3j09Q6j23J32J43k61rK99
$$ -100 19 25 -66 154 -87 -145 48 -124 100 31 -226 -115 48 6 -76 7 -102 -16 -139 -7 136 -125 -134 165
3305A65r0j74R2O1O7p2p5K07j64J00q1k39J18j4J71k28L27m8j22k42O5J53J17
$$ 165 75 -99 -7 54 121 49 -26 181 17 117 36 -203 -85 -99 72 -156 171 123 1 -241 -176 -23 94
3328I4p6N6m9j19J38j10K5j48J22J24j53N1J41J30l42L14j07q4kj65K01j94O1
$$ 94 18 74 25 -94 44 -66 -41 -189 -67 57 -96 -45 96 226 -116 198 91 7 5 -160 41 -153 -92
3351i2QM9j6J67k36jN6O6pJ31k77M24j03q4K2lJ66n3m8j53J22o7j02j13J63j08
$$ -92 -84 -35 -51 116 -120 -121 -65 1 -6 125 -152 272 169 85 107 104 270 217 169 16 138 71 -31 -144 19 -89
3377h9J56j9J28l02J17M7K11l87qK15k92K37j11O8J98k07kJ53j00J21p3l17P1
$$ -89 67 48 176 -126 -9 38 249 -138 -146 69 -223 14 -97 -29 169 -38 -40 113 13 134 61 -256 -185
3400a85J41J2l1M9K62l24K03J50l88N7J53n5j11M3j11J42l4j25K62j53K5J03l8
$$ -185 -44 -32 -63 -14 248 -76 127 277 -111 -54 99 44 -67 -24 -135 7 -27 -152 110 -43 -18 85 47
3423D7LO7j41O6J51j36j31P0j94J96Q4k55L44J23l16r7M9K47k80J61m9o0K16j09
$$ 47 50 117 -24 42 193 57 -74 -4 -198 -2 82 -173 171 294 -22 -119 -70 177 -103 58 9 -51 165 56
3447E6J4j20J73k13J06K2k03L92k59J70m94L64j71L7K88l77L17n2J0m0O5o8L9
$$ 56 70 -50 123 -90 16 38 -165 227 -32 138 -356 8 -163 -126 162 -215 102 50 60 20 85 17 56
3470E6j33M8J46k04RQ7J8J3k3l9OL8o1l4j99K58K3K07j3m60L78j21j9J15j94J00
$$ 56 -77 -29 117 -87 -78 9 27 40 17 -22 -16 22 -39 -73 -272 -14 9 216 203 -257 121 0 -19 96 -98 2
3496Bn7O0r6M12l81P6nl4r6J74K7j0k53J24K75k83r6J53J35k24m2J80J24l11J35
$$ 2 -55 5 -91 321 -60 16 11 -23 -119 55 82 72 -181 -57 218 -65 -161 -8 127 -97 -139 41 165 -146 -11
3521a1J73j88j4K44j91M0O9k85J39J16j71L71k33j44L19k90o0J20k40L18R6j46
$$ -11 162 -26 -40 204 13 53 122 -163 -24 92 -79 292 59 -85 234 -56 -116 4 -236 82 178 32
3543C2j09J67j53J45l15M03j26L9m1j31K57k71O2L85k99L6l51K88J90r0j56r1
$$ 32 -77 90 -63 82 -233 170 44 83 42 -89 168 -103 -41 344 45 81 -270 18 208 118 -38 -129
3565a29R7P7j28J10j36r0L73j19j04J50j03j52k5L25r7j2J4l8q3L2NP8J8N6k6
$$ -129 -32 45 -83 27 -109 -199 174 55 -49 101 -2 -154 -179 146 49 37 51 13 -70 -38 -33 45 63 119 93
3590I3k68K01k7k10J84j03J77j0j92K30j70J00j02K8J09r1Q1j20K29l30M0J70
$$ 93 -175 26 -1 -211 -27 -130 47 37 -155 75 -95 5 -97 -69 40 -51 30 -90 139 -191 -151 19
3612A9j25K7M4K9j68J67j1J85k23K59k54%K09k11J70j28Ol2K86l45Q5Q0r9L8k9
$$ 19 -106 -79 -35 -6 -174 -7 -18 167 -56 203 -51 -51 158 -53 117 -11 -5 -37 249 -96 -11 69 -30 8 -21
3637b1M3j26J43j46Q5L2r1J78n2M9J02j16j77ol9K29j45K00j79K3J41k02OK60
$$ -21 22 -104 39 -107 -22 10 -81 97 45 94 196 80 -97 -103 -142 87 -58 142 -37 -14 127 -75 -69 191
3661A91k26j9qK5K15j98RJ62j10j60J32L4O9k31J57j8q6L6J6J6pj29k3J80K02
$$ 191 -35 -54 -62 -37 178 -20 -11 151 41 -119 13 47 116 -115 42 24 -62 -26 -10 6 -1 -130 -153 27 229
3686B29k91j41J88J63m3j94l8M4K40k22J86r0j8J68j94M7j35p4R5l7K42J7k08
$$ 229 -62 -203 -15 148 105 -89 -127 -83 157 -65 121 31 13 181 -13 34 -101 -175 -80 -117 125 142 -66
3709f6J42k02J47P4k04J59l5K64k61n6K96m06N4R3j6L9j17J92j41m6J23l9J67
$$ -66 76 -126 21 95 -109 50 15 279 18 -38 258 -148 -94 -1 -17 22 -95 97 -44 -90 33 -6 161
3732A61k16J76j55Q3M5n1j09R3j61K51l63K30p7J27k30J82J0j84J72k12L51j29
$$ 161 -55 121 -34 49 94 43 -66 27 -134 117 -246 -16 -93 34 -196 -14 -4 -188 -16 -228 123 -6
3754fj03k7J63j88J42j1R3j77L59n7j86j94K28l4J44j53n3J1R1n1N9j27j06J22
$$ -6 -109 -136 27 -161 -19 -30 63 -114 245 188 2 -192 36 2 146 -7 -60 -49 42 -9 50 -77 -183 -61
3778f1J7k65L95j28k09L46k28J37N6qmq3J34J58k97JP5P7k81J80l2j95L28o7J71
$$ -61 -44 -309 86 -42 -251 95 -133 4 60 52 48 -35 99 257 -40 -39 36 113 -168 12 -20 -215 113 46 217
3803B17l53l5j4K33k72L55j57j52J64p7K43O7k05j85M02k25O3P8j70Q5q3P8L3
$$ 217 -136 -171 -185 48 -224 131 -26 -178 -14 -91 152 219 14 -171 231 6 69 147 -23 62 -21 57 90
3826I0j91K37j17P4j30K02r9j97J14n8P6n9O8J68j10Q3j10l6M9J28l17m1J97K
$$ 90 -101 136 19 93 -37 165 66 -131 -17 -75 1 -58 10 178 68 151 41 5 54 182 -135 -176 21 23
3850B3j36J18M8l4j61Q7j80K61K01l63O4J92o9o6K7R4O6k48P1K0j47J43K22r4
$$ 23 -113 5 53 19 -142 -55 -235 26 227 -136 -72 120 51 -15 12 106 172 -76 -5 15 -132 11 233 139
3874A39j38K2r2J68L7k07L19k84K28k7r1J1j41R6j08J36N2j17K61l64J64k78J21
$$ 139 1 23 -69 99 136 -71 248 -36 192 165 74 85 -56 40 -68 68 120 3 264 -100 64 -214 -93
3897i3Q5Qp8K12j45k03J39J07l3j42J01J9K06j82q3K1N4O5q4o2K03Q2j02q0J6
$$ -93 -8 0 -78 134 -11 -214 -75 32 -1 -143 -42 -23 183 1 -82 -61 -7 58 -26 -88 115 197 95 15 31
3922C1M2q3J75k71J60j53P4R8j8j61J17J9kk16K53l90K49J0k15J00J80j45K96
$$ 31 73 -10 165 -106 54 -99 -25 73 55 -106 11 30 28 -188 65 -325 -76 -66 -281 -181 -1 -146 150
3945A50q4l16L40j94N7J32K2O6j88Q9j16J52j56k5J49mk9L2j51J87k76K22Mj7
$$ 150 66 -250 90 -104 -47 85 107 173 -15 74 -42 110 -46 -71 78 74 45 77 -74 113 -163 59 63 46
3969D6o6J47j52KJ7O1l4K77k81J7r4J75q8j9J1r0J78l5l9k1m2o3K33k6j32J0Q1
$$ 46 -20 127 -25 -23 -6 55 21 298 17 34 -60 115 27 8 19 -71 107 72 33 12 -30 -93 140 114 -18 -8 73
3996G3r8K6P6r6J08j69J90j06L1o3j10J72M8P2j96Q8L6k67J30Jq2P2J19n4p5Q5
$$ 73 -25 1 77 -19 89 -80 110 4 35 -28 -138 34 82 154 -42 46 82 -185 -55 -54 -136 -64 55 1 -74 11
4022A1o7p0J21J45j41R8k90J91k62L23J1K1k94O5J46L0o0K1j34L18O2k48p5om7
$$ 11 -56 -126 -5 140 -1 97 -193 -2 -264 59 70 91 -203 -138 8 38 -22 -1 -135 183 245 -3 -78 -84 -131
4047a31Q3J33j47P7j19J60r0k7L41l82J25k6K57l11J93j28j45Q6P5k22K72p2j75
$$ -131 -48 85 -62 15 -104 56 -34 -61 280 -102 23 -3 254 -57 136 8 -137 -51 24 -198 74 2 -173
4070a73K47o1q1J25kj96J00M6J07P0q3r5j36K01j4j33N3J05j27J54j87J83K0k26
$$ -173 74 13 -68 57 55 -141 -41 5 112 182 99 4 -132 69 55 -78 -25 80 -47 107 -80 103 123 -103
4094a03P2j07R1J96j12j91P6J47j39N0j8Kp7K86j24J3k08L61j37o0Pm9Rr0J89
$$ -103 -31 -138 -47 149 37 -154 -78 69 -70 -20 -38 -36 -113 173 49 62 -146 215 78 18 25 -24 -15 -105 84
4119H4J86k61O3m5P3k19J30j69M2K31j08L8k37J38p2K30O6k31O3p3J39Q9k73M6
$$ 84 270 9 72 27 100 -119 11 -158 -116 115 7 45 -192 -54 -126 104 170 -61 2 -71 68 157 -116 -70
4143g0M2L2k2J94l84L31j73j6q2J31J43k63P1K02L5j91j50L24Q5j03k6p3Qk40
$$ -70 -28 4 -18 176 -208 123 -50 -66 -148 -17 126 -137 -66 136 171 -20 -170 154 239 136 110 37 45 -195
4167a95L67r1L7j09l1K00k20p0K14k8K6n6j40J64p2J0mo1RM1qo3J94k4q1J70l02
$$ -195 172 81 118 9 -22 178 -42 -112 102 74 100 44 -96 68 -4 6 2 -59 -50 -9 -17 -80 114 90 9 179 -123
4194a23J5J71J39k26J41j9m0j75R4J02j7j40j26J84L3J24j13m6Q4j30N1o3k9p8
$$ -123 -108 63 202 -24 117 98 58 -117 -23 79 62 -78 -204 -20 13 137 24 -22 62 -68 -17 -80 -109 -187
4218a87K49M7j79J36j10Qk1J05r7r5J25K5j42K30l0J0n7q4K4J72j69pq3K66L7
$$ -187 62 109 -70 66 -44 -36 -57 48 -49 -144 -19 6 -136 94 64 74 17 -67 -43 129 -40 -47 -130 136 173
4243A73j48J55j46J51r4l02K95p8P3K5K4j23j1J96k54K12J22l20Rj14J34k1J69
$$ 173 25 180 34 185 91 -211 84 6 79 104 128 5 -6 190 -64 148 270 -50 -41 -155 -21 -42 127
4266A27j89J03j00L6p1p3K14P1l37O6J90OLj41J29J1p0J19M2r4j51J22K50j94
$$ 127 -62 41 -59 -23 -94 -167 47 118 -219 -153 37 43 46 -95 34 45 -25 94 136 42 -109 13 263 69
4290F9l15L41k46L5K9J10J74k09J26k53L2o6j00N0L17j8mk23J4K16k35J12O8j24
$$ 69 -246 95 -151 -116 -87 23 197 -12 114 -139 -107 -173 -273 -223 94 76 72 -151 -137 79 -156 -44 24 -100
4314a00M1LJ77J01k82l1M8N8k5j11J57r7j9K13j71K31j03P2k31n3j3J94j65P8
$$ -100 -59 -56 121 222 -60 -91 -43 15 -10 -121 36 -61 -80 133 -38 193 90 162 -69 -122 -135 59 -106 -28
4338b8j08J94p0J6J97k35m3J24Rk03J1L10k39J40QP5r8j73J94J08M8k76K31k03
$$ -28 -136 58 -12 4 201 -34 -77 47 56 -147 -136 174 -65 75 83 158 60 -113 81 189 237 -39 192 -11
4362a1l1JJ5J23k06K26j36rK3J65l36J47j39K43q5J23K7j77P6j80L03k11JJ28
$$ -11 -42 -41 -26 97 -109 117 -19 -28 -5 160 -176 -29 -168 75 -10 113 140 -37 39 -141 162 -49 -48 80
4386H0o9K3K2Nq1O7j63K23j45o8J7k5K5P0R1k2j3r4J04QJ98k38r0j20K61K16j94
$$ 80 11 34 56 61 -20 47 -116 107 -38 -106 -89 -114 -89 -19 72 50 37 -57 47 55 253 15 -75 -195 66 282 88
4413H8j66M8P9Q9k76m2N1J37j9j19k7K59k73J89j8p7%j1pQ8J60j93o2n6K64o0
$$ 88 -78 -30 49 138 -138 -180 -129 8 -11 -130 -157 102 -171 18 0 -77 -77 -88 -95 -7 153 -40 -102 -158 106 46
4439D6m9M0l1k8K5o1j6o4M15m70K21N2j93K1J42P0L1m2q1j41M9K4MO3o9LQ9oj33
$$ 46 -3 37 6 -22 3 -58 -74 -138 277 -193 28 80 -113 -92 50 120 151 109 28 -113 -64 -40 -36 27 -42 -39 50 44 -89
4468h9J06j11K53j67K1j53J87K65j82q8O3J38k99J02O3r0l10K52lj00L14j60m0
$$ -89 17 -94 159 -8 13 -140 47 312 130 42 105 243 -56 46 109 19 -291 -39 -42 -142 172 12 -28
4491b8o8k4R3J63l83L10p4l8J07j88J30j4RkJ14J2o1J27k24k4k4L55k43k77J15
$$ -28 -96 -120 -27 136 -247 63 -11 -49 58 -130 0 -14 -5 -7 107 119 58 185 -39 -63 -87 268 25 -252 -137
4516a37K22j26r5J92J84j10j56k4J56j53Q5J0mJ36j67R9j00k9j2O9k36L47q4r
$$ -137 85 -41 -136 56 240 130 -26 -50 106 -47 38 48 44 180 13 112 12 -17 -29 40 -196 151 67 58
4540E8LL4k73J37N9k59J50L0K10j38P2j06m9O9L6J17k66J78j18P7m1L8R9p2j00
$$ 58 61 95 -178 -41 18 -241 -91 -61 149 11 83 -23 -72 -3 33 150 -116 62 -56 21 -20 18 117 45 -55
4565e5q1J2K36q3j2R3j9k44J60k4R6l87K87J36k27J48q8m2J10j07J37j14j04J64
$$ -55 -136 -124 112 29 17 110 91 -153 7 -17 79 -308 -21 115 -112 36 -52 -94 16 -91 46 -68 -172 -8
4589hp2O4K2j03J29O3K9j8m3j84k3J40L1m8m7j32O7N0J33q9Q0j9j89O4J19j18
$$ -8 -80 -16 6 -97 32 95 124 106 63 -121 -144 -4 27 -21 -68 -200 -133 -83 50 -39 41 22 -167 -103 16 -102
4615a02J58k37J41M6j39j0L46J4l94J3R9J63p0p9l4Q7N3L4j70q9M8J43j95K03
$$ -102 56 -181 -40 6 -133 -143 203 217 -177 -164 -65 98 28 -51 -85 2 55 89 -81 -170 -122 21 -174 29
4639B9J02j01Lp4j93R9J53K08j90O4k33J99M3l2q3J53L6j19j46k1M9J53l06N0
$$ 29 131 30 33 -41 -234 -135 18 226 36 100 -133 66 109 77 -6 147 183 64 -82 -103 -54 99 -207 -157
4663a57J50O8j0j34J18O7r6R0k61N9J8J27J6L1Q4k03K9mJ48j30Rk27K05j4M1P7
$$ -157 -7 61 51 -83 35 102 6 96 -165 -106 -88 39 55 86 170 -33 -4 -8 140 10 19 -208 -3 -17 24 101
4689A01p8O6Jk3p5m4L1J17k6L0J19j53j02J22O4j87L7L5j16J07o8k02M9L93l27
$$ 101 23 89 90 67 -8 -52 -21 96 70 100 219 66 -36 86 150 -37 0 35 -81 26 -42 -244 -195 198 -129
4714a29P9n4J69k9M4k8O5n2k7J37j0k24R0q0N3jJ08k09J18k7j26J12J40j19q5
$$ -129 -50 -104 65 36 80 52 117 65 38 175 165 -59 31 -49 4 3 111 -98 20 -7 -133 -21 119 0 -85
4739h5K3L30k61kJ02j37PK82k37p2j5K42k06j72J19J76K2k25N4J77j51J03J8k80
$$ -85 -62 268 7 5 107 -30 -23 259 22 -50 -65 177 -29 -201 -82 94 116 -109 -55 122 -29 74 92 -188
4763a88K45p0J11k57J07J62j29n7J32l6O9j81O2n2P5K9J36j73K5k6p7r1P7K94
$$ -188 57 -13 98 -159 -52 110 -19 -76 56 20 89 -92 -30 -82 -7 22 158 -15 10 -16 -93 -184 -107 187
4787A87n6j25r4l4R5J50k04M6n8M2jL2J29k27L48j28l2j77K65q3k4J52m71K76
$$ 187 131 6 -88 -122 -27 123 -81 -35 -93 -51 -52 -20 109 -118 230 102 70 -107 158 75 51 203 -268 8
4811HM0J48j39Qk84K41Nj16K30k53J13J33o8k09L49j42Q9J84k44j21j14Q9K57
$$ 8 48 196 57 65 -219 22 27 -89 141 -112 1 134 66 -143 206 64 153 337 93 -28 -142 -53 204
4834B04k46q4K10l18K42O0N1k25J72L9J09k63K3L4R7k69n0J20k8J72j5L5J16j92
$$ 204 -42 -126 84 -234 8 68 119 -106 66 105 214 -49 -26 8 105 -164 -214 -94 -122 50 35 70 186 -6
4858fRj18l3J09K99j91M7j8k56K75j63p0J55q8J00j77J12n2M09l15j69J85l2k24
$$ -6 3 -115 -148 -39 260 69 116 98 -158 117 -46 -116 39 -49 51 -126 -14 -66 343 28 -141 44 12 -212
4882b12J23L25q3j81k73L07Ro7J38K5k22J72j75K61k03q2K03J62k17J17l63L13
$$ -212 -89 236 153 -28 -301 6 15 -52 86 111 -111 61 -114 147 -56 -138 65 227 10 127 -236 77
4904G7k21J49J1j1r0L2j7J49q7L6p0m9R9l13L25m3J63j68P7q7PJ53j99N9j70K37
$$ 77 -144 5 16 5 -85 -53 -70 79 -8 28 -42 -91 8 -305 20 -23 140 -28 49 -38 -31 122 -77 -18 -188 49
4930D9J0l4Q6k08K9K13j68Q3L0k36J52l8r8Q7N2N6j66O9k1P7q9J62m8j48J74m5
$$ 49 59 25 111 -97 -68 145 -23 60 90 -146 6 -32 -130 -43 9 65 -101 -32 -53 24 -65 97 49 -99 75 30
4956C0L5p0J9j04k2N3Rk1j15L3J63J1k3m4K14j41j40%J91k5J6j35q2K80p1k11
$$ 30 65 -5 14 -90 -112 -59 -50 -71 -186 -153 10 21 -2 -46 168 27 -113 -113 78 53 69 -66 -148 132 61 -150
4982a50J06L0r5K16k28kJ37j14P8j67K63k33L95l84O4R2J17Pk40ML9J65j69L2
$$ -150 -44 -14 -109 107 -121 -123 14 -100 -22 -189 74 -159 236 -148 -84 8 125 132 -108 -104 -65 100 -69 -37
5006c7K43l38J28R3J42j98J8j34L0K1k5K71l89k9L20j49P5p3QN5k05J89J81j46
$$ -37 206 -132 -4 89 231 33 51 -83 -53 -32 -57 214 -175 -204 116 -33 42 -31 -23 32 -173 16 197 51
5030E1q2J01j11P7O3j53mm3M3j09J37J17p4j60K23J8j80J72j6K28l52R1r5P6j91
$$ 51 -31 70 -41 36 99 -54 -58 -101 -58 -167 -30 87 13 -147 76 94 -86 86 70 298 -54 37 -58 18 -173
5055a73K40o2J51j85nP3J95r2j60J26j92R7L7Q3k34k2K66j62J33k12j1J64J02
$$ -173 67 5 156 -29 -34 39 234 142 -18 108 -84 13 50 133 -101 -123 143 -19 114 -98 -109 55 157
5078A57K7q2k43Q2l9K5J38j40J49k38k9K2K94r7j68J79mJ28o9J80k50l4r7J63
$$ 157 184 102 -141 -59 -98 -73 65 -75 74 -164 -193 -171 123 26 -142 37 33 161 92 272 22 -12 -109 54
5102E4jj92K33k14NR2P3r1j53M17k68l6K95r8k3q7Qj9k2j49J40k14L05pj04J41
$$ 54 53 -139 94 -120 -115 -23 50 -41 -194 223 -45 -81 214 116 93 6 14 -5 -27 -176 -36 -250 55 48 -56 85
5128H5j86J30L6n3l8j42J35l4J80M7j11N2j8k37Q5O9j90J65J71j80pj23J58l6
$$ 85 -101 29 65 12 -26 -168 -33 -67 113 160 49 101 83 -154 -69 0 -190 -25 146 -34 -41 -164 -6 -42
5152d2J75n3j26k9J52m8J8j04j45L08k05K4KJ66P8L7l49K92j20j41m2P8K50p3
$$ -42 133 80 -46 -75 77 29 47 -57 -202 106 -99 -75 -73 93 171 208 -141 151 31 -110 -152 -74 176 103
5176A03j72J34l1r6R0j82N9K09l06k4K28Mj08K17J99j88k21l9l2J02J96j78l8
$$ 103 -69 65 34 -62 28 -154 -95 114 -192 -216 12 16 -92 125 324 136 -85 -124 -156 -54 142 -36 -74
5199g4j5o1K57k42K06kp4k2L4j97J12m6R8mj55K19m2J22j8l9l01J99k07L14R4
$$ -74 -89 -150 107 -135 71 69 -5 -27 7 -190 -78 -124 -26 -30 -185 34 -8 114 96 57 -244 -45 -252 62 156
5224A56l4pj92n4k00L90p8J73No2j00q8q1K22k31J57K15l20K56o1L9j17Q6k83
$$ 156 122 115 -77 -131 -331 59 -19 154 159 97 -3 -91 -172 50 -181 -24 191 -129 127 66 105 -12 74 -209
5248b09K45j90R8n2O2J82p0n8m4j4J66k08LN4L3q7J96r5N6q6j51K41J21j79o9
$$ -209 36 -154 -56 -108 -46 136 66 8 -36 -50 116 -92 -89 -35 -2 -89 107 12 68 -18 -169 72 193 14 -55
5273e5L28j99K53j57k43K03n2j15j43K93k20NO9J00j27RN9j70J07J5J6K21k17
$$ -55 273 74 327 170 -73 130 78 -37 -180 113 -107 -102 -33 67 -60 -51 8 -162 -55 -40 -24 197 -20
5296b0R3M0m8k01j01J99J38O2k65j54L80q4Q4k49M7k2P1J1k06K42l06L75j07L7
$$ -20 73 113 65 -136 -237 -38 100 162 -103 -257 123 39 123 -126 -79 -101 -30 -19 -225 17 -289 86 -21 16
5320A6r6N0k9K82l10L86k93j27k8k2K30oR3k24j20J9J92k25L03J20k37P6q7L76
$$ 16 -80 -30 -59 223 -87 299 6 -121 -149 -171 59 53 146 -78 -198 -179 13 -212 91 211 -26 50 -37 339
5344C39j82Kn4j98R0J50k01J05l0J8j74J59J30k00j7L68k84l44M67m9j75Q8m3
$$ 339 157 159 105 -93 -3 147 -54 51 21 39 -135 24 154 -46 -63 305 21 -323 144 95 -80 8 -35
5367c5J72n5jj73K2L39j75j82J09j4j68J60K69l19K2k03J21J69l08R0K81j55J25
$$ -35 137 82 81 -92 -70 269 94 -88 21 7 -161 -1 268 -51 -29 -232 -111 58 -250 -160 121 -34 91
5390I1n8O0M5l35J98j95L61k55P8O5k1j14j4qL8J07J96m14K09q5J79j13l4L4j20
$$ 91 33 93 138 -197 1 -194 167 -88 -10 55 34 -80 -94 -102 -64 43 239 -175 34 -51 128 15 -19 15 -105
5415a05j34J16Q5j00K29n9P4l02J72j73J14J18j32J27N0o3j7K78m80K15j23L15
$$ -105 -239 -123 -38 -138 91 32 106 -196 -24 -197 -83 35 -97 30 80 17 0 278 -202 13 -110 205
5437B05j22j49J8L7p8Q5M8J6R6p0J58l24L07k23K0k11J25M8M2L5m1j24J06k18
$$ 205 83 -66 -48 -11 -89 -4 44 60 156 86 244 -80 227 4 24 -187 -62 -14 28 63 22 -102 4 -214
5461b14P4J36J09j10n1r4R0qJ67j99l7K27j77l3n2J86r0J2K11n3Nj42J03k07K32
$$ -214 -140 -4 105 -5 -56 -150 -60 -68 99 -100 -137 90 -87 -120 -172 14 -76 -64 147 94 99 -43 60 -147 85
5486H5R3k43O9N1k90J34J66j27nK18l03K15r7O3kJ02j76k4Q2j58J89k4J24j61
$$ 85 178 -65 4 55 -235 -101 65 -62 -67 151 -152 63 -34 29 27 129 -47 -71 11 -147 42 18 142 -19
5510a9J62N6J6k83P9j89L32k22J66k31K90l6k13J10j24J4J38J58k62J3J7l0R3
$$ -19 143 199 215 -68 11 -178 154 -68 98 -133 157 121 -92 18 -106 -92 46 204 -58 -45 -28 -58 35
5533C5N6j12Q1o1j14J26l1j30P5m6J50J1j18N9N9m4J24o3n9j3K7j92R0R8J18j37
$$ 35 91 -21 60 -1 -115 11 -20 -150 -75 -121 29 40 -78 -19 40 -4 120 57 -2 -15 12 -180 -90 8 126 -11
5559a1j4J28qk74K63j70J41j26o4J84j30J60J5J2j71N0N3k44L43p0k55J30Q3o4
$$ -11 -25 103 95 -179 84 -86 55 -71 -135 49 -81 79 94 106 -65 -15 38 -206 137 67 -188 -58 25 -39
5583c9o4R1M0j26J79k8k40J21M7K00p4K7l44K71J17k53K55qQ3k32j72J47l8M9
$$ -39 -103 -12 28 -98 81 53 -187 -66 -19 181 107 134 -210 61 178 -75 180 172 255 23 -149 -2 -40 9
5607Im3K99j59N4k34K96l62J85N8j48J15J59l94n4K40j7J97k04M7j09j5K41m54
$$ 9 -34 265 106 160 -74 222 -140 45 103 -45 70 229 -165 -219 21 4 201 -3 44 -65 -80 161 -293
5630b93L11j04J49J1p2J0k5J11j02j23K11k7q1k4L7j8n1Q0j53K74M5j27rL2j05
$$ -293 18 -86 63 74 2 12 -13 98 -4 -127 84 57 -24 -48 -11 -29 -80 0 -153 121 166 39 30 62 -43
5655d3L5L3J67j14R1k99J99j42J36Q9n6k24jP6r7K94r8k00J70p8PK09pj64m6J00
$$ -43 -8 25 192 78 169 -130 69 -73 63 152 96 -128 -129 -53 -150 144 46 -154 16 -62 -55 154 147 -17 -63 37
5681C7K50k18j6p9J76k58J90j2p8Q4o0k7j38L61m37K49JJ19k86O5j80P9K47j29
$$ 37 287 69 53 -26 150 -108 82 70 -8 76 16 -11 -149 212 -225 24 25 144 -142 -77 -257 -178 69 -60
5705f0J12j28J9O5q1o5L65l97J20MK59j18m1k09J39J71m33K29J42j24k20L97l04
$$ -60 52 -76 -57 8 -73 -138 227 -170 -50 -46 213 95 54 -155 -16 155 -278 -49 93 -31 -251 146 -158
5728a58J94Mk45K87J05k06J29l39M20k64p2l7K75j64J61p0J8Rp3J30k23J3N0o5
$$ -158 36 40 -205 82 187 -19 110 -229 191 -73 -145 -182 93 -71 90 20 38 47 -26 104 -119 -106 -56 -121
$$ [...]
8191A42
##END NTUPLES=NMR FID
##END=
