##TITLE=1H_CA-9399-tg
 200.13MHz,DMSO-d6.
 8 sc
 
 19.2.2026
##JCAMPDX= 6.0         $$ Bruker NMR JCAMP-DX V2.0
##DATA TYPE= NMR SPECTRUM
##DATA CLASS= NTUPLES
##ORIGIN= UXNMR, Bruker Analytische Messtechnik GmbH
##OWNER= pz
$$ XWIN-NMR		Version 3.5
$$ Thu Feb 19 13:39:29 2026 Russian Standard Time (UT+4h)  she@DPX200
##.OBSERVE FREQUENCY= 200.1313
##.OBSERVE NUCLEUS= ^1H
##.ACQUISITION MODE= SIMULTANEOUS
##.ACQUISITION SCHEME= undefined
##.AVERAGES= 8
##.DIGITISER RES= 18
##SPECTROMETER/DATA SYSTEM= spect
##.PULSE SEQUENCE= zg30
##.SOLVENT NAME= DMSO
##.SHIFT REFERENCE= (INTERNAL, DMSO, 0, 15.4285)
##AUDIT TRAIL= $$ (NUMBER, WHEN, WHO, WHERE, WHAT)
$$ ##TITLE= Audit trail, XWIN-NMR		Version 3.5
$$ ##JCAMPDX= 5.01
$$ ##ORIGIN= Bruker BioSpin GmbH
$$ ##OWNER= she
$$ F:/spectra/data/she/nmr/H-C/1/pdata/1/auditp.txt
$$ ##AUDIT TRAIL=  $$ (NUMBER, WHEN, WHO, WHERE, WHAT)
(   1,<2026-02-19 13:37:32.68 +0400>,<she>,<DPX200>,
      <created by zg, POWCHK disabled, PULCHK disabled
       configuration hash MD5:
       00 E9 B6 7A A2 85 ED C7 34 08 36 98 17 FE 4E 26
       data hash MD5: 16K
       4B B5 84 6A 49 AB 4C 4F DF FC CE 38 CD A5 AD EA>)
(   2,<2026-02-19 13:37:45.46 +0400>,<she>,<DPX200>,
      <Start of raw data processing
       efp BC_mod = 2 LB = 0.25 FT_mod = 6 PKNL = 1 PHC0 = -3698.854 PHC1 = 9.592321 SI = 16K 
       data hash MD5: 16K
       BF DF 3F 29 F9 B7 E8 E2 87 E0 4C 34 92 E8 98 CA>)
(   3,<2026-02-19 13:38:25.14 +0400>,<she>,<DPX200>,
      <pk PHC0 = -1.628326 PHC1 = -0.4000009 
       data hash MD5: 16K
       D4 94 23 3E 49 20 AE FD 89 0E 54 09 77 CB 69 AC>)
(   4,<2026-02-19 13:38:28.92 +0400>,<she>,<DPX200>,
      <abs ABSG = 5 
       data hash MD5: 16K
       83 6D DC F0 05 81 8A 58 6E FC B5 93 7D 72 7B 49>)
$$ ##END=
$$ 
$$ hash MD5
$$ 86 58 48 C7 B2 B0 74 3E 3B 7C 69 4D 10 E9 60 6A
##$RELAX= 
##$RELAX= 
##$RELAX= 
##$RELAX= 
##$RELAX= 
##$RELAX= 
$$ Bruker specific parameters
$$ --------------------------
##$DU= <F:/spectra>
##$EXPNO= 1
##$NAME= <H-C>
##$PROCNO= 1
##$TYPE= <nmr>
##$USER= <she>
##$AMP= (0..31)
100 100 100 100 100 100 100 100 100 100 100 100 100 100 100 100 100 100 
100 100 100 100 100 100 100 100 100 100 100 100 100 100 
##$AQSEQ= 0
##$AQ_mod= 1
##$AUNM= <au_zg>
##$AUTOPOS= <>
##$BF1= 200.13
##$BF2= 200.13
##$BF3= 200.13
##$BF4= 200.13
##$BF5= 200.13
##$BF6= 200.13
##$BF7= 200.13
##$BF8= 200.13
##$BYTORDA= 1
##$CFDGTYP= 0
##$CFRGTYP= 5
##$CHEMSTR= <none>
##$CNST= (0..31)
1 1 145 1 1 1 1 1 1 1 1 1 1 1 1 1 1 1 1 1 1 1 1 1 1 1 1 1 1 1 1 1 
##$CPDPRG= <>
##$CPDPRG1= <>
##$CPDPRG2= <>
##$CPDPRG3= <>
##$CPDPRG4= <mlev>
##$CPDPRG5= <mlev>
##$CPDPRG6= <mlev>
##$CPDPRG7= <mlev>
##$CPDPRG8= <mlev>
##$CPDPRGB= <>
##$CPDPRGT= <>
##$D= (0..31)
0 0.7 0 0 0 0 0 0 0 0 0 0.03 0 0 0 0 0 0 0 0 0 0 0 0 0 0 0 0 0 0 0 0 
##$DATE= 1771493852
##$DBL= (0..7)
120 120 120 120 120 120 120 120 
##$DBP= (0..7)
150 150 150 150 150 150 150 150 
##$DBP07= 0
##$DBPNAM0= <>
##$DBPNAM1= <>
##$DBPNAM2= <>
##$DBPNAM3= <>
##$DBPNAM4= <>
$$ [...]
##$SUBNAM3= <"">
##$SUBNAM4= <"">
##$SUBNAM5= <"">
##$SUBNAM6= <"">
##$SUBNAM7= <"">
##$SUBNAM8= <"">
##$SUBNAM9= <"">
##$SW= 18.0517328524113
##$SWIBOX= (0..15)
0 0 2 0 0 0 0 0 0 0 0 0 0 0 0 0 
##$SW_h= 3612.71676300578
##$TD= 16384
##$TD0= 1
##$TE= 0
##$TE2= 300
##$TE3= 300
##$TEG= 300
##$TL= (0..7)
0 120 120 120 120 120 120 120 
##$TP= (0..7)
150 150 150 150 150 150 150 150 
##$TP07= 0
##$TPNAME0= <>
##$TPNAME1= <>
##$TPNAME2= <>
##$TPNAME3= <>
##$TPNAME4= <>
##$TPNAME5= <>
##$TPNAME6= <>
##$TPNAME7= <>
##$TPOAL= (0..7)
0.5 0.5 0.5 0.5 0.5 0.5 0.5 0.5 
##$TPOFFS= (0..7)
0 0 0 0 0 0 0 0 
##$TUNHIN= 0
##$TUNHOUT= 0
##$TUNXOUT= 0
##$USERA1= <user>
##$USERA2= <user>
##$USERA3= <user>
##$USERA4= <user>
##$USERA5= <user>
##$V9= 5
##$VALIST= <valist>
##$VCLIST= <CCCCCCCCCCCCCCC>
##$VD= 0
##$VDLIST= <DDDDDDDDDDDDDDD>
##$VPLIST= <PPPPPPPPPPPPPPP>
##$VTLIST= <TTTTTTTTTTTTTTT>
##$WBST= 1024
##$WBSW= 4
##$XGAIN= (0..3)
0 0 0 0 
##$XL= 0
##$YL= 0
##$YMAX_a= 494294
##$YMIN_a= -837098
##$ZGOPTNS= <>
##$ZL1= 120
##$ZL2= 120
##$ZL3= 120
##$ZL4= 120
##$ABSF1= 15.48577
##$ABSF2= -2.566079
##$ABSG= 5
##$ABSL= 3
##$ALPHA= 0
##$AQORDER= 0
##$ASSFAC= 0
##$ASSFACI= 0
##$ASSFACX= 0
##$ASSWID= 0
##$AUNMP= <proc_1d>
##$AZFE= 0.1
##$AZFW= 0.1
##$BCFW= 0
##$BC_mod= 2
##$BYTORDP= 0
##$COROFFS= 0
##$CY= -3
##$DATMOD= 1
##$DC= 0
##$DFILT= <>
##$DTYPP= 0
##$F1P= 0
##$F2P= 0
##$FCOR= 1
##$FTSIZE= 16384
##$FT_mod= 6
##$GAMMA= 0
##$GB= 0
##$INTBC= 1
##$INTSCL= 3.241238e-09
##$ISEN= 128
##$LB= 0.25
##$LEV0= 0
##$LPBIN= 0
##$MAXI= 10000
##$MC2= 0
##$MEAN= 0
##$ME_mod= 0
##$MI= 1.114404
##$NCOEF= 0
##$NC_proc= -5
##$NLEV= 6
##$NOISF1= 3.799351
##$NOISF2= 2.8
##$NSP= 0
##$NTH_PI= 0
##$NZP= 0
##$OFFSET= 15.42847
##$PC= 1
##$PHC0= -3700.482
##$PHC1= 9.192321
##$PH_mod= 1
##$PKNL= yes
##$PPARMOD= 0
##$PSCAL= 0
##$PSIGN= 0
##$REVERSE= no
##$SF= 200.130018659441
##$SI= 16384
##$SIGF1= 3
##$SIGF2= 2
##$SINO= 0.751879
##$SIOLD= 32768
##$SREGLST= <19F.Aceton>
##$SSB= 0
##$STSI= 16384
##$STSR= 0
##$SW_p= 3612.71676300578
##$SYMM= 0
##$S_DEV= 0
##$TDeff= 16384
##$TDoff= 0
##$TI= <>
##$TILT= no
##$TM1= 0
##$TM2= 0
##$TOPLEV= 0
##$USERP1= <user>
##$USERP2= <user>
##$USERP3= <user>
##$USERP4= <user>
##$USERP5= <user>
##$WDW= 1
##$XDIM= 16384
##$YMAX_p= 354073021
##$YMIN_p= -273873
$$ End of Bruker specific parameters
$$ ---------------------------------
##NTUPLES= NMR SPECTRUM
##VAR_NAME=  FREQUENCY,     SPECTRUM/REAL,   SPECTRUM/IMAG
##SYMBOL=    X,             R,               I
##VAR_TYPE=  INDEPENDENT,   DEPENDENT,       DEPENDENT
##VAR_FORM=  AFFN,          ASDF,            ASDF
##VAR_DIM=   16384,         16384,           16384
##UNITS=     HZ,            ARBITRARY UNITS, ARBITRARY UNITS
##FACTOR=    0.220516191357247, 1,           1
##FIRST=     3087.69992052174, 0,            0
##LAST=      -525.016842484044, 0,           0
##MIN=       -525.016842484044, -273873,     0
##MAX=       3087.69992052174, 354073021,    0
$$ Real data points
##PAGE= N=1
##DATA TABLE= (X++(R..R)), XYDATA
$$ [...]
$$ plain form
10205 1092878 1084604 1069933 1110323 1169299 1274685 1359768 1341698 1438426 1538554 1588505 1632354
10194 1632354 1729429 1798925 1923473 2073481 2161479 2102796 2212823 2338431 2444866 2508325
10184 2508325 2463910 2384401 2290211 2259715 2098950 1987915 1817312 1699517 1639850 1638808 1550700
10173 1550700 1440021 1335763 1322835 1292498 1259847 1214876 1208430 1209033 1135894 1127983 1115310 1076361
10161 1076361 1072229 1080456 1110176 1121280 1170206 1119976 1103167 1149651 1113742 1162724 1160850 1144886
10149 1144886 1160587 1176464 1241135 1226764 1222895 1206502 1191292 1225734 1221035 1216994 1254736 1305676
10137 1305676 1289468 1254366 1218964 1226377 1295352 1423719 1467007 1413414 1469141 1516022 1488071
10126 1488071 1506956 1476282 1483499 1490208 1467276 1424599 1333449 1300422 1319355 1266403 1214679 1167569
$$ packed form
10205A092878q274j4671M0390N8976J05386Q5083j8070R6728J00128M9951M3849
10194A632354R7075O9496J24548J50008Q7998n8683J10027J25608J06435O3459
10184B508325m4415p9509r4190l0496j60765j11035j70603j17795n9667j042q8108
10173A550700j10679j04258j2928l0337l2651m4971o446O03p3139p911j2673l8949
10161A076361m132Q227K9720J1104M8926n0230j6809M6484l5909M8982j874j5964
10149A144886J5701J5877O4671j4371l869j6393j5210L4442m699m041L7742N0940
10137A305676j6208l5102l5402P413O8975J28367M3288n3593N5727M6881k7951
10126A488071J8885l0674P217O709k2932m2677r1150l3027J8933n2952n1724m7110
$$ plain form
10114 1167569 1118266 1099448 1038035 1019118 930324 870019 927896 915367 843494 783439 729389
10103 729389 684864 716961 729072 674225 685603 642971 607480 683516 722187 710176 619149
10092 619149 600272 543578 526586 562789 535183 571279 569889 567333 550882 496476 494059 490727
10080 490727 512750 502259 430025 352693 302859 359852 370158 400380 413732 390936 411836
10069 411836 388513 393610 408562 452535 373940 376333 390908 347488 323480 323563 367483 376373 292578
10056 292578 317928 345719 350644 362763 395174 435536 428330 471065 432870 427607 402730 392764
10044 392764 423790 452633 397680 372422 370462 422401 449791 428809 404529 425272 423233 406381
10032 406381 382025 392919 366604 316584 404696 405418 377132 368597 360293 394961 408110 382490
$$ packed form
10114A167569m9303j8818o1413j8917q8794o0305N7877j2529p1873o0055n4050
10103G29389m4525L2097J2111n4847J1378m2632l5491P6036L8671j2011r1027
10092F19149j8877n6694j6992L6203k7606L6096j390k556j6451n4406k417l332
10080D90727K2023j0491p2234p7332m9834N6993J0306L0222J3352k2796K0900
10069D11836k3323N097J4952M3973p8595K393J4575m3420k4008Q3M3920Q890q3795
10056B92578K5350K7791M925J2119L2411M0362p206M2735l8195n263k4877r966
10044C92764L1026K8843n4953k5258j960N1939K7390k0982k4280K0743k039j6852
10032D06381k4356J0894k6315n0020Q8112P22k8286q535q304L4668J3149k5620
$$ plain form
10020 382490 316980 313305 334252 368126 350966 300766 262000 277789 388258 347340 288756
10009 288756 266148 294411 298220 290818 257752 201993 237460 217200 276108 242386 271677 327066
9997 327066 287311 299489 251282 257054 245163 305738 338612 332302 308930 343044 297830 220389
9985 220389 284692 326396 283981 337713 316251 262133 236795 234741 296432 306159 365083 319329
9973 319329 324517 369531 371148 386291 378038 367864 280711 230197 281914 321118 280538 303728
9961 303728 333914 292716 284192 292913 256047 290248 365487 300821 205870 228244 297257 266287
9949 266287 292971 324979 235697 208444 256183 245643 263194 307292 362603 296992 274111 296265
9937 296265 245901 244997 339280 338282 190463 201535 279974 288309 272787 283572 253278 195431
$$ packed form
10020C82490o5510l675K0947L3874j7160n0200l8766J5789J10469m0918n8584
10009B88756k2608K8263L809p402l3066n5759L5467k0260N8908l3722K9291N5389
9997C27066l9755J2178m8207N772j1891O0575L2874o310k3372L4114m5214p7441
9985B20389O4303M1704m2415N3732k1462n4118k5338k054O1691R727N8924m5754
9973C19329N188M5014J617J5143q253j0174q7153n0514N1717L9204m0580K3190
9961C03728L0186m1198q524Q721l6866L4201P5239o4666r4951K2374O9013l0970
9949B66287K6684L2008q9282k7253M7739j0540J7551M4098N5311o5611k2881K2154
9937B96265n0364r04R4283r98j47819J1072P8439Q335j5522J0785l0294n7847
$$ plain form
9925 195431 258306 324892 310058 334527 347404 233698 258480 333788 324451 348971 353437 364969
9913 364969 387819 383807 357355 346977 356977 428256 478088 503181 465888 459021 522618 489203
9901 489203 478593 502535 435355 513964 553578 558736 540239 585364 702532 622432 623238 644842
9889 644842 639493 648829 754164 772236 745651 790495 880350 939049 881694 939073 1002867 998609
9877 998609 1123808 1237750 1216687 1181871 1336118 1462265 1467813 1565294 1694878 1788881 1905633
9866 1905633 2103798 2191790 2271492 2475280 2639683 2915275 3236229 3550694 3904887 4299257
9856 4299257 4686221 5004279 5313121 5556221 5697784 5754688 5635000 5421409 5141113 4811512
9846 4811512 4407046 4052003 3652991 3276325 2940530 2607162 2381492 2194842 1986349 1794044
$$ packed form
9925A95431O2875O6586j4834K4469J2877j13706K4782P5308r337K4520M466J1532
9913C64969K2850m012k6452j0378J0000P1279M9832K5093l7293o867O3597l3415
9901D89203j0610K3942o7180P8609L9614N158j8497M5125J17168q0100Q06K1604
9889F44842n349R336J05335J8072k6585M4844Q9855N8699n7355N7379O3794m258
9877I98609J25199J13942k1063l4816J54247J26147N548R7481J29584R4003J16752
9866A905633J98165Q7992P9702K03788J64403K75592L20954L14465L54193L94370
9856D299257L86964L18058L08842K43100J41563N6904j19688k13591k80296l29601
9846D811512m04466l55043l99012l76666l35795l33368k25670j86650k08493j92305
$$ plain form
9836 1794044 1650904 1483277 1352848 1269288 1184539 1089510 1063378 991750 943495 895804 852129
9825 852129 814241 831693 767052 697017 677981 773564 758312 658770 630653 594178 610694 696547
9813 696547 660082 625718 620287 592017 644888 663258 651314 575849 539574 573999 629272 549367
9801 549367 479164 478742 524503 547536 643768 592347 479810 486658 526724 582667 603848 678801
9789 678801 589324 552115 617414 594074 537827 549162 639678 683856 677857 653229 600633 621025
9777 621025 613529 670537 674666 710438 701748 691683 723734 803485 805000 692908 708648 742428
9765 742428 775163 698259 676498 685269 727435 794516 776491 673979 728818 720066 688358 659509
9753 659509 527787 505721 458302 524508 536914 486419 471541 441232 449124 460155 464876 521738
$$ packed form
9836A794044j43140j67627j30429q3560q4749r5029k6132p1628m8255m7691m3675
9825H52129l7888J7452o4641p0035j9036R5583j5252r9542k8117l6475J6516Q5853
9813F96547l6465l4364n431k8270N2871J8370j1944p5465l6275L4425N5273p9905
9801E49367p0203m22M5761K3033R6232n1421j12537O848M0066N5943K1181P4953
9789F78801q9477l7209O5299k3340n6247J1335R0516M4178n999k4628n2596K0392
9777F21025p496N7008M129L5772q690j0065L2051P9751J515j12092J5740L3780
9765G42428L2735p6904k1761Q771M2166O7081j8025j02512N4839q752l1708k8849
9753F59509j31722k2066m7419O6206J2406n0495j4878l0309P892J1031M721N6862
$$ plain form
9741 521738 491773 506628 601042 591556 575875 632010 657702 727839 831871 861604 864790 846184
9729 846184 820895 774075 752363 740338 776385 809011 823457 827578 780871 789568 754829 714731
9717 714731 678027 703951 724377 621039 647267 743040 723182 727815 768555 762627 792786 801201
9705 801201 758061 732850 886879 903537 901960 860045 892908 868906 817114 872108 780426 787656
9693 787656 839961 779776 794343 775613 804718 881526 923391 861575 882441 845444 864827 943806
9681 943806 868379 909684 933276 853889 833032 890532 884135 825162 832008 913894 900091 897360
9669 897360 888436 874157 972114 973253 966565 1015703 1029268 1042866 1076825 1073202 1032840 980446
9657 980446 938440 965359 966163 986939 939587 892497 961701 998713 959358 945362 953163 981306
$$ packed form
9741E21738k9965J4855R4414r486j5681N6135K5692P0137J04032K9733L186j8606
9729H46184k5289m6820k1712j2025L6047L2626J4446M121m6707Q697l4739m0098
9717G14731l6704K5924K0426j03338K6228R5773j9858M633M0740n928L0159Q415
9705H01201m3140k5211J54029J6658j577m1915L2863k4002n1792N4994r1682P230
9693G87656N2305o0185J4567j8730K9105P6808M1865o1816K0866l6997J9383P8979
9681I43806p5427M1305K3592p9387k0857N7500o397n8973O846Q1886j3803k731
9669H97360q924j4279R7957J139o688M9138J3565J3598L3959l623m0362n2394
9657I80446m2006K6919Q04K0776m7352m7090O9204L7012l9355j3996P801K8143
$$ plain form
9645 981306 963786 882358 866130 964250 947517 1010957 1100141 1117805 1057665 1117751 1175731 1238454
9633 1238454 1352689 1424870 1483388 1504944 1515183 1452105 1481139 1557908 1602233 1646750 1652176
9622 1652176 1741299 1727862 1685113 1715148 1700223 1713916 1804102 1889651 1989348 2156516 2239350
9611 2239350 2360354 2512717 2571465 2585773 2570902 2596177 2537509 2497820 2491544 2488460 2527748
9600 2527748 2507513 2566044 2713540 2848889 2991528 3126159 3250184 3344037 3417289 3403418
9590 3403418 3390906 3422668 3433776 3510500 3576268 3703438 3803579 3931055 4042805 4044685 4119924
9579 4119924 4236266 4153385 4138625 4145724 4103926 4094879 4179393 4326666 4522667 4774758 5147364
9568 5147364 5654653 6239029 6773011 7193465 7440127 7411200 7283502 7161049 6977743 6593735
$$ packed form
9645I81306j7520q1428j6228R8120j6733O3440Q9184J7664o0140O0086N7980O2723
9633A238454J14235P2181N8518K1556J0239o3078K9034P6769M4325M4517N426
9622A652176Q9123j3437m2749L0035j4925J3693R0186Q5549R9697J67168Q2834
9611B239350J21004J52363N8748J4308j4871K5275n8668l9689o276l084L9288
9600B527748k0235N8531J47496J35349J42639J34631J24025R3853P3252j3871
9590C403418j2512L1762J1108P6724O5768J27170J00141J27476J11750J880P5239
9579D119924J16342q2881j4760P099m1798r047Q4514J47273J96001K52091L72606
9568E147364N07289N84376N33982M20454K46662k8927j27698j22453j83306l84008
$$ plain form
9558 6593735 6144544 5711295 5200935 4819609 4509282 4303324 4259136 4231723 4208593 4210073
9548 4210073 4336303 4417646 4468330 4573230 4685376 4857261 5139176 5521898 6025357 6526311
9538 6526311 6971593 7252064 7277582 7193405 6996608 6726154 6442239 6227149 6042462 5730394
9528 5730394 5502305 5272520 4967801 4735915 4573603 4417269 4314270 4272589 4228360 4198835
9518 4198835 4228922 4224473 4280813 4447351 4562674 4726329 4911250 5136834 5419301 5726254
9508 5726254 5989054 6239647 6529935 6768269 7103530 7531253 7971626 8404464 8673124 8673806
9498 8673806 8382754 7973509 7462182 7108840 6844057 6544226 6345854 6084227 5895928 5667118
9488 5667118 5437424 5334780 5166810 5039511 5064312 5188803 5324699 5429405 5507681 5510207
$$ packed form
9558F593735m49191m33249n10360l81326l10327k05958m4188k7413k3130J480
9548D210073J26230Q1343N0684J04900J12146J71885K81915L82722N03459N00954
9538F526311M45282K80471K5518q4177j96797k70454k83915k15090j84687l12068
9528E730394k28089k29785l04719k31886j62312j56334j02999m1681m4229k9525
9518D198835L0087m449N6340J66538J15323J63655J84921K25584K82467L06953
9508E726254K62800K50593K90288K38334L35261M27723M40373M32838K68660O82
9498H673806k91052m09245n11327l53342k64783k99831j98372k61627j88299k28810
9488E667118k29694j02644j67970j27299K4801J24491J35896J04706P8276K526
$$ plain form
9478 5510207 5474571 5468088 5470416 5429103 5403840 5410836 5319205 5196744 5142325 5064741 5020457 5021694
9466 5021694 4986866 4951515 4979878 5062960 5126721 5199639 5350707 5395612 5495142 5637827 5718608
9455 5718608 5841437 5925402 6000853 5988698 6037639 6048972 6060544 6013861 6011823 6131772 6183332
9444 6183332 6288142 6346458 6442513 6610081 6682385 6697906 6723439 6922608 7177372 7448250
9434 7448250 7747318 7934245 8252483 8565211 8970516 9426987 9788646 10191560 10621658 11033642
9424 11033642 11550307 12011081 12472865 13118976 13862239 14473660 15220486 16209972 17473515
9415 17473515 19146149 20873967 22525817 23895762 24987180 25850108 26789934 28010938
9407 28010938 29512405 31446280 33732285 36004604 38118550 40294685 43090129 47399304
$$ packed form
9478E510207l5636o483K328m1313k5263O996r1631j22461n4419p7584m4284J237
9466E021694l4828l5351K8363Q3082O3761P2918J51068M4905R9530J42685Q0781
9455E718608J22829Q3965P5451j2155M8941J1333J1572m6683k038J19949N1560
9444F183332J04810N8316R6055J67568P2304J5521K5533J99169K54764K70878
9434G448250K99068J86927L18238L12728M05305M56471L61659M02914M30098M11984
9424A1033642N16665M60774M61784O46111P43263O11421P46826R89486J263543
9415A7473515J672634J727818J651850J369945J091418Q62928R39826J221004
9407B8010938J501467J933875K286005K272319K113946K176135K795444M309175
$$ plain form
9399 47399304 54088365 63860807 76448044 89911376 101126963 107400972 107707189 102875322
9391 102875322 95015611 86346986 78552792 72515389 67874560 63701780 59324846 54672775
9383 54672775 49965356 45643463 42054767 39469088 38040064 37460657 37623355 38255057 39026469
9374 39026469 39660511 40225786 41000598 42141300 43989594 46821912 50620953 55197279 59748295
9365 59748295 63828201 67362469 71102737 76298409 84015219 94685029 107318434 119346502
9357 119346502 127281988 128448705 122213246 110622924 96578215 82760115 71002007
9350 71002007 61924827 55252573 50225956 46161322 42341507 38604048 35111349 31861719
9342 31861719 29057492 26791708 24894793 23437657 22397229 21702176 21301295 21077260 20794908
$$ packed form
9399D7399304O689061R772442J2587237J3463332J1215587O274009L06217m831867
9391A02875322p859711q668625p794194o037403m640829m172780m376934m652071
9383E4672775m707419m321893l588696k585679j429024n79407J62698O31702P71412
9374C9026469O34042N65275P74812J140702J848294K832318L799041M576326M551016
9365E9748295M079906L534268L740268N195672P716810J0669810J2633405J2028068
9357A19346502P935486J166717o235459j1590322j4044709j3818100j1758108
9350G1002007r077180o672254n026617m064634l819815l737459l492699l249630
9342C1861719k804227k265784j896915j457136j040428o95053m00881k24035k82352
$$ plain form
9333 20794908 20423485 19859586 19092909 18341635 17663879 16974588 16372183 15897470 15445953
9324 15445953 15069825 14897794 14702572 14489043 14477284 14510994 14679376 14951150 15254683 15574408
9314 15574408 15838612 15984014 16022014 16167498 16539239 16978071 17267526 17480458 17387230 17027756
9304 17027756 16567815 16070520 15700203 15458210 15515931 15778461 16316460 16792464 17125153 17116759
9294 17116759 16719653 16082556 15223929 14326133 13581202 12921921 12415973 12001769 11670885
9285 11670885 11270354 10749405 10414292 10051164 9610680 9283531 9112040 8853308 8659688
9276 8659688 8604190 8545348 8470455 8523995 8609325 8702474 8895450 9158259 9377550 9683748 9976295
9265 9976295 10113963 10327784 10543702 10984049 11552064 12300111 13178730 13959236 14338965 14321603
$$ packed form
9333B0794908l71423n63899p66677p51274o77756o89291o02405m74713m51517
9324A5445953l76128j72031j95222k13529j1759L3710J68382K71774L03533L19725
9314A5574408K64204J45402L8000J45484L71741M38832K89455K12932r3228l59474
9304A7027756m59941m97295l70317k41993N7721K62530N37999M76004L32689q394
9294A7116759l97106o37097q58627q97796p44931o59281n05948m14204l30884
9285A1670885m00531n20949l35113l63128m40484l27149j71491k58732j93620
9276H659688n5498n8842p4893N3540Q5330R3149J92976K62809K19291L06198K92547
9265I976295J37668K13821K15918M40347N68015P48047Q78619P80506L79729j7362
$$ plain form
9255 14321603 13966412 13356408 12754504 12260880 11861199 11655422 11610271 11519059 11329089 11119894
9245 11119894 10823679 10470991 10247141 10019969 9732368 9459876 9253945 9049240 8874809
9236 8874809 8753538 8693770 8670658 8785038 8827178 8790916 8837840 8980431 9134376 9277472
9226 9277472 9512693 9809982 10196053 10610091 11197066 11974621 12812037 13717085 14698704 15678743
9216 15678743 16575919 17382217 18069819 18751326 19342678 19864445 20334234 20772594 20951665
9207 20951665 20760556 20166900 19213726 17991254 16781297 15714180 14634948 13696906 12909184
9198 12909184 12199411 11559648 11084126 10644783 10259717 10027564 9766999 9558643 9550418 9549903
9188 9549903 9607090 9800158 9947729 10045680 10318248 10691529 11115450 11742486 12427345 13196394
$$ packed form
9255A4321603l55191o10004o01904m93624l99681k05777m5151r1212j89970k09195
9245A1119894k96215l52688k23850k27172k87601k72492k05931k04705j74431
9236H874809j21271n9768k3112J14380M2140l6262M6924J42591J53945J43096
9226I277472K35221K97289L86071M14038N86975P77555Q37416R05048R81619R80039
9216A5678743Q97176Q06298O87602O81507N91352N21767M69789M38360J79071
9207B0951665j91109n93656r53174j222472j209957j067117j079232r38042p87722
9198A2909184p09773o39763m75522m39343l85066k32153k60565k08356q225n15
9188I549903N7187J93068J47571R7951K72568L73281M23921O27036O84859P69049
$$ plain form
9178 13196394 14012443 14787793 15476285 16201803 16961642 17693304 18488992 19048109 19174590
9169 19174590 18880050 18083510 16879404 15574657 14311589 13129364 12192521 11430735 10725015
9160 10725015 10232914 9862702 9570889 9349264 9102814 8959674 8786732 8609847 8372458
9151 8372458 8218489 8043123 7842127 7644911 7493805 7376424 7341155 7442165 7441022 7497136
9141 7497136 7651953 7687585 7784932 7862774 7820062 7795202 7840151 7721608 7629458 7638209 7615702
9130 7615702 7710709 7726944 7738556 7758873 7748197 7598690 7509118 7470879 7401968 7291451 7274891
9119 7274891 7258453 7260307 7341669 7359549 7476664 7670283 7882717 8048380 8181113 8209535 8268254
9108 8268254 8357398 8351538 8404690 8498866 8501875 8537784 8637704 8613454 8590295 8671261 8628170 8492419
$$ packed form
9178A3196394Q16049P75350O88492P25518P59839P31662P95688N59117J26481
9169A9174590k94540p96540j204106j304747j263068j182225r36843p61786p05720
9160A0725015m92101l70212k91813k21625k46450j43140j72942j76885k37389
9151H372458j53969j75366k00996j97216j51106j17381l5269J01010j143N6114
9141G497136J54817L5632R7347P7842m2712k4860M4949j18543r2150Q751k2507
9130G615702R5007J6235J1612K0317j0676j49507q9572l8239o8911j10517j6560
9119G274891j6438J854Q1362J7880J17115J93619K12434J65663J32733K8422N8719
9108H268254Q9144n860N3152R4176L009L5909R9920k4250k3159Q0966m3091j35751
$$ plain form
9096 8492419 8509967 8326598 8173959 8089801 8010975 7879490 7858276 7859945 7775443 7777485 7918555
9085 7918555 7990470 8118527 8330345 8479338 8806111 9043797 9170790 9475215 9770408 10156895
9075 10156895 10655604 11074541 11543981 12122809 12738326 13384500 14060499 14694369 15231323
9066 15231323 15906480 16744289 17518666 18328386 19276698 20123903 21110447 22366328 23788161
9057 23788161 25836723 28511064 31744327 35542074 39360369 42686925 45408696 47131924
9049 47131924 47487745 46672124 44861890 42231268 39328576 36475596 33697241 31219639
9041 31219639 29147196 27150046 25279902 23602142 22173618 20972073 19983093 19140219
9033 19140219 18616094 18353442 18321479 18398301 18645009 19044779 19601005 20417197 21429029 22551086
$$ packed form
9096H492419J7548j83369j52639q4158p8826j31485k1214J669q4502K042J41070
9085G918555P1915J28057K11818J48993L26773K37686J26993L04425K95193L86487
9075A0156895M98709M18937M69440N78828O15517O46174O75999O33870N36954
9066A5231323O75157Q37809P74377Q09720R48312Q47205R86544J255881J421833
9057B3788161K048562K674341L233263L797747L818295L326556K721771J723228
9049D7131924L55821q15621j810234k630622k902692k852980k778355k477602
9041C1219639k072443j997150j870144j677760j428524j201545r88980q42874
9033A9140219n24125k62652l1963P6822K46708L99770N56226Q16192J011832J122057
$$ plain form
9023 22551086 23904926 25430338 27104680 29034615 31094276 33295344 35809220 38419535
9015 38419535 40836422 42736868 43933655 44342108 43733938 42186582 39756911 36911144
9007 36911144 34089537 31421569 29118863 27510668 26350558 25515472 25069779 24947523 24849578
8998 24849578 24800167 24833760 24918397 24904910 24852444 24764532 24669249 24623707 24593632 24502676 24364593
8987 24364593 24145241 23951016 23688323 23378821 23245960 23176447 23185595 23476353 23858423 24225560
8977 24225560 24760516 25266307 25733366 26141768 26676587 27204687 27786789 28526252 29284476
8968 29284476 30130372 31103519 32030432 32945819 33996784 35259855 36502976 37906772 39367937
8959 39367937 40837487 42372771 43918315 45467523 47114791 49052454 51342850 54407328
$$ packed form
9023B2551086J353840J525412J674342J929935K059661K201068K513876K610315
9015C8419535K416887J900446J196787M08453o08170j547356k429671k845767
9007C6911144k821607k667968k302706j608195j160110q35086m45693j22256r7945
8998B4849578m9411L3593Q4637j3487n2466q7912r5283m5542l0075r0956j38083
8987B4364593k19352j94225k62693l09502j32861o9513R148K90758L82070L67137
8977B4225560N34956N05791M67059M08402N34819N28100N82102P39463P58224
8968B9284476Q45896R73147R26913R15387J050965J263071J243121J403796J461165
8959C9367937J469550J535284J545544J549208J647268J937663K290396L064478
$$ plain form
8951 54407328 58341756 63189811 68776736 74325463 79298725 83462360 86245856 87020481
8943 87020481 85946900 83292299 79456933 75108754 70580038 66152129 62123446 58439057
8935 58439057 55068797 51923465 48977106 46249273 43814998 41785152 40043310 38648620
8927 38648620 37709343 37138958 36950855 37089525 37503842 38220143 39231262 40447019 41919246
8918 41919246 43715538 45586747 47766371 50340632 53294690 56545275 60171466 63832079
8910 63832079 67362785 70301195 71929371 72175856 70943845 68154403 64091264 59430273
8902 59430273 54637986 49930046 45670938 42125966 39192966 36751585 34609020 32697646
8894 32697646 31133517 29741267 28512946 27615367 26827531 26293010 26157174 26223780 26381687
$$ packed form
8951E4407328L934428M848055N586925N548727M973262M163635K783496P74625
8943H7020481j073581k654601l835366m348179m528716m427909m028683l684389
8935E8439057l370260l145332k946359k727833k434275k029846j741842j394690
8927C8648620r39277n70385j88103J38670M14317P16301J011119J215757J472227
8918D1919246J796292J871209K179624K574261K954058L250585L626191L660613
8910F3832079L530706K938410J628176K46485j232011k789442m063139m660991
8902E9430273m792287m707940m259108l544972k933000k441381k142565j911374
8894C2697646j564129j392250j228321q97579p87836n34521j35836O6606J57907
$$ plain form
8885 26381687 26566677 26604569 26357436 26069667 25821009 25588138 25541477 25552554 25290977 24839266
8875 24839266 24272325 23613211 23016054 22618474 22377142 22219084 22145854 22042622 22048415 22156650
8865 22156650 22278997 22405083 22564841 22756621 22969635 23293740 23583125 23967253 24291194
8856 24291194 24615817 25259804 26050213 27097250 28442107 29774516 30755131 31274938 31594130
8847 31594130 31758685 31827282 31868217 31769271 31677210 31810229 31871654 31693904 31323126 30641260
8837 30641260 29868607 29231814 28917662 28923492 29288315 30020385 31112670 32652899 34556585
8828 34556585 36532081 37954332 38599350 38835202 38864264 38990187 39401830 40240894 41415378
8819 41415378 42460219 43143586 43159834 42584570 41666402 40664909 39831441 39490026 39754220
$$ packed form
8885B6381687J84990L7892k47133k87769k48658k32871m6661J1077k61577m51711
8875B4839266n66941o59114n97157l97580k41332j58058p3230j03232N793J08235
8865B2156650J22347J26086J59758J91780K13014L24105K89385L84128L23941
8856B4291194L24623O43987P90409J047037J344857J332409R80615N19807L19192
8847C1594130J64555O8597M0935r8946r2061J33019O1425j77750l70778o81866
8837C0641260p72653o36793l14152N830L64823P32070J092285J540229J903686
8828C4556585J975496J422251O45018K35852K9062J25923M11643Q39064J174484
8819D1415378J044841O83367J6248n75264r18168j001493q33468l41415K64194
$$ plain form
8810 39754220 40444954 41225079 41677376 41624141 41179333 40781426 40498846 40448827 40654545 40878676
8800 40878676 41465573 42469157 43773191 45603448 47954550 50898987 54508642 58761693
8792 58761693 63576131 68403453 71887094 73609840 74353884 74875424 75932822 77684259
8784 77684259 79893555 81747126 82490179 82124130 81184915 80284229 79849909 80109792 81227476
8775 81227476 82986293 85243584 87932354 91101315 94861398 99413036 104520180 109882307
8767 109882307 115351866 120272713 123859242 125492718 125297593 123416596 120236576 116215967
8759 116215967 111733340 106940327 101935670 96867396 92186896 87818203 83908297 80095239
8751 80095239 76208079 72367528 68995998 66300482 64257788 62927941 61928444 61098108
$$ packed form
8810C9754220O90734P80125M52297n3235m44808l97907k82580n0019K05718K24131
8800D0878676N86897J003584J304034J830257K351102K944437L609655M253051
8792E8761693M814438M827322L483641J722746P44044N21540J057398J751437
8784G7684259K209296J853571P43053l66049r39215r00686m34320K59883J117684
8775H1227476J758817K257291K688770L168961L760083M551638N107144N362127
8767A09882307N469559M920847L586529J633476j95125j880997l180020m020609
8759A16215967m482627m793013n004657n068274m680500m368693l909906l813058
8751H0095239l887160l840551l371530k695516k042694j329847r99497q30336
$$ plain form
8743 61098108 60258301 59455460 58726683 58137534 57867443 57882956 57950330 58025953 58228202 58577120
8733 58577120 58977507 59570453 60138582 60220110 59940125 59398027 58592615 57561190 56456033
8724 56456033 55153039 53585985 52084279 50679486 49479771 48459361 47648781 46955525
8716 46955525 46364732 45845025 45507755 45145945 44882181 44577049 44235462 43864944 43503172
8707 43503172 43261187 43118690 43028881 43060203 43271023 43723038 44400977 45155106 45783018 46109374
8697 46109374 46186202 45869091 45365273 44776252 44108883 43335352 42533452 41826471 41227630 40609157
8687 40609157 39939774 39151903 38098284 36995768 35955196 35079779 34334905 33860821 33689834
8678 33689834 33633310 33795488 34229257 34830088 35623939 36611914 37527367 38477093 39653072
$$ packed form
8743F1098108q39807q02841p28777n89149k70091J5513O7374P5623K02249L48918
8733E8577120M00387N92946N68129Q1528k79985n42098q05412j031425j105157
8724E6456033j302994j567054j501706j404793j199715j020410q10580o93256
8716D6955525n90793n19707l37270l61810k63764l05132l41587l70518l61772
8707D3503172k41985j42497q9809L1322K10820M52015O77939P54129O27912L26356
8697D6109374P6828l17111n03818n89021o67369p73531q01900p06981n98841o18473
8687D0609157o69383p87871j053619j102516j040572q75417p44874m74084j70987
8678C3689834n6524J62178M33769O00831P93851R87975R15453R49726J175979
$$ plain form
8669 39653072 41211220 43036881 45016215 46593338 47572346 48233942 48842295 49447985 50131772
8660 50131772 50851004 51363071 51663290 51770138 51761378 51395639 50577896 49588693 48442999 47093905
8650 47093905 45806524 44734166 43798687 43156449 42819867 42529468 42150439 42002937 42156990
8641 42156990 42634065 43928849 45923464 48037191 50006051 51787106 53118125 53841881
8633 53841881 54176971 53869898 52971768 51973185 51003529 50111639 49717628 49765392 50173413 50759410
8623 50759410 51425264 52106883 52516653 52664839 52470393 52057428 51593426 51274982 51024468
8614 51024468 50786226 50533486 50167409 49576911 48947804 48208088 47457147 46741891 46282647
8605 46282647 46170705 46304725 46438588 46212717 45685099 44791331 43805008 42904854 42010066
$$ packed form
8669C9653072J558148J825661J979334J577123R79008O61596O08353O05690O83787
8660E0131772P19232N12067L00219J06848q760l65739q17743r89203j145694j349094
8650D7093905j287381j072358r35479o42238l36582k90399l79029j47502J54053
8641D2156990M77075J294784J994615K113727J968860J781055J331019P23756
8633E3841881L35090l07073q98130r98583r69656q91890l94011M7764M08021N85997
8623E0759410O65854O81619M09770J48186j94446m12965m64002l18444k50514
8614E1024468k38242k52740l66077n90498o29107p39716p50941p15256m59244
8605D6282647j11942J34020J33863k25871n27618q93768r86323r00154q94788
$$ plain form
8596 42010066 41178396 40221923 39242872 38210191 37286332 36529293 35938151 35354122 34717493
8587 34717493 34262967 34027040 34090111 34613759 35407648 36355285 37239626 38205712 39202333 40019317
8577 40019317 40726918 41100193 41175396 41149465 40994540 40814082 40812716 40843752 40555208 39888181
8567 39888181 39139732 38385594 37783161 37359086 37087560 36632725 36081289 35595241 35393482
8558 35393482 35400961 35531579 35594460 35423054 34996508 34489191 33998389 33572922 33621121 33929031
8548 33929031 34470097 34988822 35028869 34655691 33992362 33197549 32458380 31813057 31256804 30751057
8538 30751057 30239545 29705478 29163550 28666426 28241440 27977290 27805278 27803518 27846166 27881890
8528 27881890 27820192 27637762 27565237 27651451 27795086 28236019 29113478 30294963 31542412 32683246
$$ packed form
8596D2010066q31670r56473r79051j032681r23859p57039n91142n84029o36629
8587C4717493m54526k35927O3071N23648P93889R47637Q84341R66086R96621Q16984
8577D0019317P07601L73275P5203k5931j54925j80458j366L1036k88544o67027
8567C9888181p48449p54138o02433m24075k71526m54835n51436m86048k01759
8558C5393482P479J30618O2881j71406m26546n07317m90802m25467M8199L07910
8548C3929031N41066N18725M0047l73178o63329p94813p39169o45323n56253n05747
8538C0751057n11512n34067n41928m97124m24986k64150j72012j760M2648L5724
8528B7881890o1698j82430p2525Q6214J43635M40933Q77459J181485J247449J140834
$$ plain form
8518 32683246 33440337 33767264 33926253 34117614 34642857 35264666 35661113 35404669 34404235
8509 34404235 33006282 31503622 29920749 28350796 26929196 25591348 24379989 23441262
8501 23441262 22731800 22062604 21493892 21008216 20437722 19868245 19416460 18852143 18383096
8492 18383096 18192636 17978125 17743808 17764515 17907434 18181144 18547049 18741899 18845268 18932624
8482 18932624 19090069 19201227 19339146 19330781 19268454 19102837 18907684 18719030 18525217 18268038
8472 18268038 18011890 17824813 17416835 16886130 16419156 15953136 15416230 15031165 14590412
8463 14590412 14155806 13837608 13672639 13417787 13283521 13203722 13094362 13019100 12994731 13002752
8453 13002752 12996483 13175281 13378749 13572463 13997123 14591903 15098084 15535058 15704189 15740812
$$ packed form
8518C2683246P57091L26927J58989J91361N25243O21809L96447k56444j000434
8509C4404235j397953j502660j582873j569953j421600j337848j211359r38727
8501B3441262p09462o69196n68712m85676n70494n69477m51785n64317m69047
8492A8383096j90460k14511k34317K0707J42919K73710L65905J94850J03369Q7356
8482A8932624J57445J11158J37919q365o2327j65617j95153j88654j93813k57179
8472A8268038k56148j87077m07978n30705m66974m66020n36906l85065m40753
8463A4590412m34606l18198j64969k54852j34266p9799j09360p5262k4369Q021
8453A3002752o269J78798K03468J93714M24660N94780N06181M36974J69131L6623
$$ plain form
8443 15740812 15882059 16261531 16743392 17031952 16804754 15998874 14990725 13931522 13104764
8434 13104764 12446391 11906538 11517738 11248341 11048268 10838705 10700409 10736696 10751970 10856540
8424 10856540 11137511 11550058 12222334 13171033 14375712 15382582 16037014 16517486 17094293
8415 17094293 18154147 19687552 20870141 21175732 20873064 20352860 19670936 18751439 17551301
8406 17551301 16187871 14744104 13465499 12340074 11412434 10610602 9972958 9402860 9002062
8397 9002062 8734544 8424573 8154009 8000925 7948835 7825069 7737610 7765339 7833713 7953857
8387 7953857 8294175 8715894 9257715 9984287 10596612 10887549 11158789 11627880 12316170 13166911
8377 13166911 13594285 13248262 12283770 11112114 9960088 8918574 8121754 7439443 6880041
$$ packed form
8443A5740812J41247L79472M81861K88560k27198q05880j008149j059203q26758
8434A3104764o58373n39853l88800k69397k00073k09563j38296L6287J5274J04570
8424A0856540K80971M12547O72276R48699J204679J006870O54432M80472N76807
8415A7094293J059854J533405J182589L05591l02668n20204o81924r19497j200138
8406A7551301j363430j443767j278605j125425r27640q01832o37644n70098m00798
8397I002062k67518l09971k70564j53084n2090j23766q7459K7729O8374J20144
8387G953857L40318M21719N41821P26572O12325K90937K71240M69091O88290Q50741
8377A3166911M27374l46023r64492j171656j152026j041514p96820o82311n59402
$$ plain form
8368 6880041 6358052 5957491 5650007 5391188 5150912 4967406 4866071 4765565 4715150 4589155
8358 4589155 4444931 4430680 4515470 4448077 4351918 4354129 4212527 4153703 4244255 4262426 4189962
8347 4189962 4206022 4197023 4093262 4059344 4019094 3923700 3860935 3838926 3842446 3864197 3962588 3994234
8335 3994234 4006216 4096412 4129078 4179786 4170079 4152381 4136677 4058453 3978329 3857814 3708908
8324 3708908 3585546 3537353 3548920 3440042 3329221 3265795 3292683 3295571 3349502 3434673 3464775
8313 3464775 3595454 3750791 3946758 4164735 4312913 4397058 4397303 4283272 4062702 3790297
8303 3790297 3671571 3585064 3466985 3425480 3340358 3248004 3288108 3331578 3325646 3380782 3415391
8292 3415391 3431399 3483544 3469419 3489911 3506725 3444461 3440519 3451340 3404548 3258250 3177411
$$ packed form
8368F880041n21989m00561l07484k58819k40276j83506j01335j00506n0415j25995
8358D589155j44224j4251Q4790o7393r6159K211j41602n8824R0552J8171p2464
8347D189962J6060q999j03761l3918m0250r5394o2765k2009L520K1751R8391L1646
8335C994234J1982R0196L2666N0708r707j7698j5704p8224q0124j20515j48906
8324C708908j23362m8193J1567j08878j10821o3426K6888K888N3931Q5171L0102
8313C464775J30679J55337J95967K17977J48178Q4145K45j14031k20570k72405
8303C790297j18726q6507j18079m1505q5122r2354M0104M3470n932N5136L4609
8292C415391J6008N2145j4125K0492J6814o2264l942J0821m6792j46298q0839
$$ plain form
8281 3177411 3104731 3058276 3105686 3081925 3031413 3047355 3121417 3204722 3305357 3352285 3473792
8270 3473792 3607787 3718556 3785524 3738712 3524839 3391254 3331888 3273541 3207976 3179790 3160402
8259 3160402 3090657 3050112 3036796 2956673 2970270 3022038 3057298 3106384 3139903 3205104 3239598
8248 3239598 3262119 3297301 3260801 3163002 3057663 2973499 2789348 2747050 2763925 2670125 2527389
8237 2527389 2554381 2546380 2428600 2397195 2391560 2433324 2425538 2479180 2425615 2472150 2549545 2466781
8225 2466781 2402994 2495599 2470230 2460777 2410655 2388904 2339282 2337040 2276716 2151665 2205754 2154344
8213 2154344 2122114 2016237 2008585 2018837 2057189 2030714 1993247 2036210 2027696 2117998 2275279
8202 2275279 2438055 2494596 2588584 2550735 2472219 2447954 2405420 2282097 2259678 2006793 2633337
$$ packed form
8281C177411p2680m6455M7410k3761n0512J5942P4062Q3305J00635M6928J21507
8270C473792J33995J10769O6968m6812k13873j33585n9366n8347o5565k8186j9388
8259C160402o9745m0545j3316q0123J3597N1768L5260M9086L3519O5201L4494
8248C239598K2521L5182l6500r7799j05339q4164j84151m2298J6875r3800j42736
8237B527389K6992q001j17780l1405n635M1764p786N3642n3565M6535P7395q2764
8225B466781o3787R2605k5369r453n0122k1751m9622k242o0324j25051N4089n1410
8213B154344l2230j05877p652J0252L8352k6475l7467M2963q514R0302J57281
8202B275279J62776N6541R3988l7849p8516k4265m2534j23323k2419k52885O26544
$$ plain form
8191 2633337 2988541 2660051 2631035 2567418 2726670 2748677 2772543 2779844 2772260 2861435 2965262
8180 2965262 2946331 2928044 2943934 2972778 2925238 2984587 3042475 3154878 3212255 3326539 3637488
8169 3637488 3954730 4122749 4171230 4148822 4038697 3890644 3741826 3583874 3479702 3350163
8159 3350163 3291947 3238955 3197300 3118534 3117382 3240073 3282698 3255982 3302763 3321442 3393545
8148 3393545 3513713 3546526 3548097 3614008 3703797 3803961 3946375 4010534 3977878 3885291 3958296
8137 3958296 4051873 4110432 4181454 4240347 4303562 4359644 4358826 4260162 4305252 4484543 4529627 4588165
8125 4588165 4658348 4725966 4773339 5011070 5358309 5563870 5794489 5932585 6058080 6117867
8115 6117867 6192732 6335039 6471907 6527837 6475655 6468095 6375506 6369119 6376551 6352390 6283198 6185290
$$ packed form
8191B633337L55204l28490k9016o3617J59252K2007K3866P301p584Q9175J03827
8180B965262j8931j8287J5890K8844m7540N9349N7888J12403N7377J14284L10949
8169C637488L17242J68019M8481k2408j10125j48053j48818j57952j04172j29539
8159C350163n8216n2992m1655p8766j152J22691M2625k6716M6781J8679P2103
8148C393545J20168L2813J571O5911Q9789J00164J42414O4159l2656r2587P3005
8137C958296R3577N8559P1022N8893O3215N6082q18r8664M5090J79291M5084N8538
8125D588165P0183O7618M7373K37731L47239K05561K30619J38096J25495N9787
8115F117867P4865J42307J36868N5930n2182p560r2589o387P432k4161o9192r7908
$$ plain form
8103 6185290 5993222 5749119 5560110 5414060 5294721 5261553 5133589 5098496 5053643 4997068
8093 4997068 4916957 4893971 4872192 4863304 5070808 5304057 5453900 5729244 5955606 6129788
8083 6129788 6356250 6566735 6743110 6958563 7285933 7527703 7705323 7782336 7746503 7613287
8073 7613287 7426792 7351862 7441711 7476722 7579934 7672527 7742535 7801126 7784498 7740796 7702642
8062 7702642 7648554 7697927 7831494 8008862 8024335 7876213 7731455 7599000 7467286 7390472
8052 7390472 7312311 7181479 7148681 7161636 7045883 6914152 6894978 6868379 6704040 6663722 6606564
8041 6606564 6507682 6424045 6386634 6283844 6277135 6360919 6485304 6824238 7300477 7717753 8072850
8030 8072850 8347017 8512930 8575799 8645329 8590741 8326507 8129036 7846958 7437132 6958709
$$ packed form
8103F185290j92068k44103j89009j46050j19339l3168j27964l5093m4853n6575
8093D997068q0111k2986k1779q888K07504K33249J49843K75344K26362J74182
8083F129788K26462K10485J76375K15453L27370K41770J77620P7013l5833j33216
8073G613287j86495p4930Q9849L5011J03212R2593P0008N8591j6628m3702l8154
8062G702642n4088M9373J33567J77368J5473j48122j44758j32455j31714p6814
8052G390472p8161j30832l2798J2955j15753j31731j9174k6599j64339m0318n7158
8041F606564r8882q3637l7411j02790o709Q3784J24385L38934M76239M17276L55097
8030H072850K74167J65913O2869O9530n4588k64234j97471k82078m09826m78423
$$ plain form
8020 6958709 6482068 6077314 5742755 5478644 5132416 4760096 4403716 4159592 4002134 3775404
8010 3775404 3650791 3516190 3365379 3187493 3074631 3012934 2912785 2850404 2744239 2655331
8000 2655331 2659826 2609344 2540954 2474129 2482038 2462933 2418643 2332982 2254678 2179829 2145609 2128084
7988 2128084 2040179 1982963 1959962 1950839 1945138 1952829 1916135 1837265 1806809 1848868 1797133 1737861
7976 1737861 1657730 1642216 1647103 1655922 1641662 1579632 1620973 1589582 1631904 1643436 1668256 1610045
7964 1610045 1606495 1737833 1696471 1618211 1609287 1623724 1680093 1795122 1840410 1865061 1986756
7953 1986756 2132590 2260743 2353274 2388617 2353699 2291495 2274966 2151492 2091297 1936693 1816773
7942 1816773 1747661 1644462 1530029 1413871 1376890 1304513 1357503 1336333 1305165 1297818 1185620
$$ packed form
8020F958709m76641m04754l34559k64111l46228l72320l56380k44124j57458k26730
8010C775404j24613j34601j50811j77886j12862o1697j00149o2381j06165q8908
8000B655331M495n0482o8390o6825P909j9105m4290q5661p8304p4849l4220j7525
7988B128084q7905n7216k3001r123n701P691l6694p8870l0456M2059n1735n9272
7976A737861q0131j5514M887Q819j4260o2030M1341l1391M2322J1532K4820n8211
7964A610045l550J31338m1362p8260q924J4437N6369J15029M5288K4651J21695
7953A986756J45834J28153R2531L5343l4918o2204j6529j23474o0195j54604j19920
7942A816773o9112j03199j14433j16158l6981p2377N2990k1170l1168p347j12198
$$ plain form
7931 1185620 1139740 1098555 1090396 1076240 1135109 1162946 1122385 1119861 1127473 1206216 1238211 1249019
7919 1249019 1214255 1201014 1186526 1162053 1155114 1127183 1138737 1112157 1070997 1088657 1048986 1036602
7907 1036602 1022386 989722 961741 993915 965220 891029 916962 983255 885781 929611 991122
7896 991122 942129 958041 961920 972280 979401 1001322 908065 836285 811479 781139 820041 822003
7884 822003 805554 800467 789540 868355 928633 942972 885723 873042 845670 775558 807516 822153
7872 822153 811633 809800 837439 757973 775218 884059 773077 800242 817569 706851 719250
7861 719250 700179 657856 679899 742953 770319 701011 715130 700126 714304 757067 753661 742671
7849 742671 728270 701637 652575 695388 673205 652096 700041 690012 681485 703832 645932 615229
$$ packed form
7931A185620m5880m1185q159j4156N8869K7837m0561k524P612P8743L1995J0808
7919A249019l4764j3241j4488k4473o939k7931J1554k6580m1160J7660l9671j2384
7907A036602j4216l2664k7981L2174k8695p4191K5933O6293r7474M3830O1511
7896I91122m8993J5912L879J0360P121K1921r3257p1780k4806l0340L8902J962
7884H22003j6449n087j0927P8815O0278J4339n7249j2681k7372p0112L1958J4637
7872H22153j0520j833K7639p9466J7245J08841j10982K7165J7327j10718J2399
7861G19250j9071m2323K2043O3054K7366o9308J4119j5004J4178M2763l406j0990
7849G42671j4401k6633m9062M2813k2183k1109M7945j0029q527K2347n7900l0703
$$ plain form
7837 615229 604713 602586 577421 597884 520790 469372 523953 479493 466315 538954 560666 544390
7825 544390 596878 655927 642767 677386 677800 644644 640552 633246 575618 572048 590476 603898 687933
7812 687933 699200 661323 671454 603012 608672 589129 689070 657406 566536 599594 561514 613350
7800 613350 562129 626630 691820 801339 758571 777968 750235 756467 724878 706225 703711 731197
7788 731197 692662 663032 676359 629946 590142 644695 670030 700346 698250 577467 593282 612521
7776 612521 589562 542957 568914 511901 472216 609010 647267 648911 738230 765912 768764 810276
7764 810276 828680 907269 1001694 984332 987091 932783 785616 737208 717314 648760 669670 755943
7752 755943 655261 560476 652191 648358 635870 735753 685128 629618 745919 736674 654473 717083
$$ packed form
7837F15229j0516k127k5165K0463p7094n1418N4581m4460j3178P2639K1712j6276
7825E44390N2488N9049j3160L4619M14l3156m092p306n7628l570J8428J3422Q4035
7812F87933J1267l7877J0131o8442N660j9543R9941l1664r0870L3058l8080N1836
7800F13350n1221O4501O5190J09519m2768J9397k7733O232l1589j8653k514K7486
7788G31197l8535k9630J3327m6413l9804N4553K5335L0316k096j20783J5815J9239
7776F12521k2959m6605K5957n7013l9685J36794L8257J644Q9319K7682K852M1512
7764H10276J8404P8589R4425j7362K759n4308j47167m8408j9894o8554K0910Q6273
7752G55943j00682r4785R1715l833j2488R9883n0625n5510J16301r245q2201O2610
$$ plain form
7740 717083 800324 816807 888880 893758 828962 814043 880551 899112 1004172 1101920 1068722 1039507
7728 1039507 912312 791432 791865 797259 713625 710846 674991 567689 576319 638547 674116 666939
7716 666939 696752 697613 715531 825282 766252 778657 879778 911592 986937 1055225 1229128
7705 1229128 1489326 1905915 2272471 2511362 2549949 2488061 2441395 2250771 1887838 1673561
7695 1673561 1452972 1257730 1088070 1008492 854289 798201 822493 702458 700658 679040 602278
7684 602278 599200 666164 676591 581875 596096 632777 685003 729158 729386 731628 730091 723927 752660
7671 752660 755136 676902 684205 708134 660348 764945 809701 732856 740768 846395 815309 772234
7659 772234 775074 745269 807236 763611 759284 743932 779116 802648 900244 979742 897121 780114
$$ packed form
7740G17083Q3241J6483P2073M878o4796j4919O6508J8561J05060R7748l3198k9215
7728A039507j27195j20880M33N394q3634k779l5855j07302Q630O2228L5569p177
7716F66939K9813Q61J7918J09751n9030J2405J01121L1814P5345O8288J73903
7705A229128K60198M16589L66556K38891L8587o1888m6666j90624l62933k14277
7695A673561k20589j95242j69660p9578j54203n6088K4292j20035j800k1618p6762
7684F02278l078O6964J0427r4716J4221L6681N2226M4155K28K242j537o164K8733
7671G52660K476p8234P303K3929m7786J04597M4756p6845P912J05627l1086m3075
7659G72234K840k9805O1967m3625m327j5352L5184K3532R7596P9498q2621j17007
$$ plain form
7647 780114 751111 793186 914067 891962 820630 852839 922110 907848 940275 957810 913125
7636 913125 956609 948444 910056 864996 799168 762223 834641 890500 879895 883296 872558 949274
7624 949274 1022417 1023011 1044071 1055001 1161536 1074844 981663 981162 974359 1002954 1020265 1034169
7612 1034169 1000812 1102438 1062442 1093042 1168912 1153740 1151104 1178034 1222625 1168201 1123508
7601 1123508 1037995 1047708 1163109 1138547 1128686 1147286 1124904 1163096 1229183 1239358 1178355 1047698
7589 1047698 971639 952536 844484 844939 853177 875822 899972 837537 887208 906386 946928 1043647
7577 1043647 1048596 1067227 1078622 975172 904382 966821 959888 897649 851318 864469 913309 941926
7565 941926 914441 920743 932313 905326 895158 865409 817521 804219 756913 669491 770664 855808
$$ packed form
7647G80114k9003M2075J20881k2105p1332L2209O9271j4262L2427J7535m4685
7636I13125M3484q165l8388m5060o5828l6945P2418N5859j0605L401j0738P6716
7624I49274P3143N94K1060J0930J06535q6692r3181n01o803K8595J7311J3904
7612A034169l3357J01626l9996L0600P5870j5172k636K6930M4591n4424m4693
7601A123508q5513R713J15401k4562r861J8600k2382L8192O6087J0175o1003j30657
7589A047698p6059j9103j08052M55Q238K2645K4150o2435M9671J9178M0542R6719
7577A043647M949J8631J1395j03450p0790O2439o933o2239m6331J3151M8840K8617
7565I41926k7485O302J1570k6987j0168k9749m7888j3302m7306q7422J01173Q5144
$$ plain form
7553 855808 850638 894122 957105 957263 905017 944067 975317 947533 917137 902594 903669 891814
7541 891814 1002823 987862 1018594 1026824 1045390 997015 994278 1055614 1122704 1115196 1163316 1277142
7529 1277142 1210353 1116009 1111527 1085890 1166897 1203665 1153843 1082300 1075763 1088939 1091465 1223383
7517 1223383 1298650 1234706 1229639 1230481 1203665 1310141 1398795 1399188 1440995 1431747 1333467 1406054
7505 1406054 1487651 1490034 1443503 1509568 1645341 1835169 1948994 2163133 2562415 2881015
7495 2881015 3119281 3285686 3370465 3406679 3470853 3488224 3304154 3037235 2768144 2496269
7485 2496269 2263129 2055327 1847659 1724046 1600307 1523335 1461418 1386178 1324887 1321709 1399987
7474 1399987 1424777 1504352 1571032 1522980 1542234 1589370 1586984 1464999 1443101 1474598 1486734
$$ packed form
7553H55808n170M3484O2983J58n2246L9050L1250k7784l0396j4543J075j1855
7541H91814J11009j4961L0732Q230J8566m8375k737O1336O7090p508M8120J13826
7529A277142o6789r4344m482k5637Q1007L6768m9822p1543o537J3176K526J31918
7517A223383P5267o3944n067Q42k6816J06476Q8654L93M1807r248r8280P2587
7505A406054Q1597K383m6531O6065J35773J89828J13825K14139L99282L18600
7495B881015K38266J66405Q4779L6214O4174J7371j84070k66919k69091k71875
7485B496269k33140k07802k07668j23613j23739p6972o1917p5240o1291l178P8278
7474A399987K4790P9575O6680m8052J9254M7136k386j21985k1898L1497J2136
$$ plain form
7463 1486734 1489701 1519300 1435487 1357199 1343751 1407383 1441511 1440793 1439620 1376717 1439403 1608129
7451 1608129 1690358 1789438 1950074 2131615 2318018 2569627 2659284 2608451 2622792 2752213
7441 2752213 2761645 2591517 2402192 2100866 1859303 1735040 1542518 1327871 1076106 927066
7431 927066 771306 652108 681517 731555 793625 911474 1159598 1322117 1388969 1479931 1523618
7420 1523618 1510299 1444848 1388590 1317224 1282985 1325479 1272843 1215317 1213949 1150743 1131954 1096875
7408 1096875 1127066 1093028 1118092 1172150 1323383 1526291 1741696 1920251 2163588 2422939
7398 2422939 2601363 2715635 2937032 3130354 3316848 3349676 3379423 3340936 3226147 3099103
7388 3099103 2957904 2885525 2885148 2911264 2858052 2882236 2892400 2854567 2817776 2795779 2725043 2680572
$$ packed form
7463A486734K967K9599q3813p8288j3448O3632L4128p18j173o2903O2686J68726
7451A608129Q2229R9080J60636J81541J86403K51609Q9657n0833J4341J29421
7441B752213R432j70128j89325l01326k41563j24263j92522k14647k51765j49040
7431I27066j55760j19198K9409N0038O2070J17849K48124J62519O6852R0962M3687
7420A523618j3319o5451n6258p1366l4239M2494n2636n7526j368o3206j8789l5079
7408A096875L0191l4038K5064N4058J51233K02908K15405J78555K43337K59351
7398B422939J78424J14272K21397J93322J86494L2828K9747l8487j14789j27044
7388C099103j41199p2379l77K6116n3212K4184J0164l7833l6791k1997p0736m4471
$$ plain form
7376 2680572 2707015 2746495 2732176 2779991 2790777 2887696 2982862 3093626 3222912 3441462 3668864
7365 3668864 3815824 3858404 3968997 4052069 4157845 4370650 4555162 4483114 4384727 4194759
7355 4194759 4008107 3838721 3752398 3685389 3746246 3917436 4177173 4290842 4440697 4520204
7345 4520204 4507234 4401281 4392067 4434530 4641410 4918137 5399313 5944830 6619569 7247958
7335 7247958 7942083 8691288 9388881 9860822 10290265 10660050 11208865 11690096 12240606 12889811
7325 12889811 13726656 14502441 15410562 16349548 17528829 18939990 20853511 22885749 25118980
7316 25118980 27361089 30000585 32709826 35558591 38194003 41061214 43963099 47414509
7308 47414509 51053579 55724654 62127161 71678135 86158778 110053493 147818338 205701268
$$ packed form
7376B680572K6443L9480j4319M7815J0786R6919R5166J10764J29286K18550K27402
7365C668864J46960M2580J10593Q3072J05776K12805J84512p2048r8387j89968
7355D194759j86652j69386q6323o7009O0857J71190K59737J13669J49855P9507
7345D520204j2970j05953r214M2463K06880K76727M81176N45517O74739O28389
7335G247958O94125P49205O97593M71941M29443L69785N48815M81231N50510O49205
7325A2889811Q36845P75785R08121R38986J179281J411161J913521K032238K233231
7316B5118980K242109K639496K709241K848765K635412K867211K901885L451410
7308D7414509L639070M671075O402507R550974J4480643K3894715L7764845N7882930
$$ plain form
7300 205701268 275391484 330886897 354073021 348474725 326048083 285069054 232291562
7293 232291562 177851783 133585920 100139017 76717539 60647553 49053315 39953327
7286 39953327 32526991 26464011 21448251 17475649 14512111 12458819 11221691 10642596
7278 10642596 10321741 10226236 10280696 10409501 10348672 10275608 10106597 9740460 9384321 9118663
7268 9118663 8792796 8449975 8095144 7858928 7702586 7663087 7709428 7840638 7978786 8196285
7258 8196285 8381683 8652147 8715083 8644259 8454964 8229967 7997187 7729124 7234088 6882919
7248 6882919 6694530 6555308 6428462 6356490 6211942 6006316 5700182 5278965 4779279 4401857
7238 4401857 4064130 3861484 3753311 3726292 3517419 3468724 3442570 3324266 3311186 3346400
$$ packed form
7300B05701268O9690216N5495413K3186124n598296k2426642m0979029n2777492
7293B32291562n4439779m4265863l3446903k3421478j6069986j1594238r099988
7286C9953327p426336o062980n015760l972602k963538k053292j237128n79095
7278A0642596l20855r5505N4460J28805o0829p3064j69011l66137l56139k65658
7268I118663l25867l42821l54831k36216j56342l9499M6341J31210J38148K17499
7258H196285J85398K70464O2936p0824j89295k24997k32780k68063m95036l51169
7248F882919j88389j39222j26846p1972j44548k05626l06134m21217m99686l77422
7238D401857l37727k02646j08173k7019k08873m8695k6154j18304j3080L5214
$$ plain form
7228 3346400 3270328 3285452 3293781 3300384 3167849 3159524 3146383 3133220 2972893 2820351 2681680
7217 2681680 2505507 2320586 2217674 2088198 1979288 1963947 2059990 2039395 2070121 1983729
7207 1983729 1875517 1676477 1535671 1249100 978412 841948 757698 691587 774899 765362
7197 765362 707878 738835 799473 785756 933576 1114526 1282869 1419985 1501578 1562951 1478901
7186 1478901 1428470 1296792 1225770 1174812 1034463 946473 851183 701892 514761 387229
7176 387229 185356 56507 -44186 -174580 -151432 -128646 -80090 144299 295170 263474
7166 263474 301434 370542 330124 301652 311046 312398 303838 336608 395200 438714 551913 621255
7154 621255 648850 701250 659254 544399 420939 330922 346340 373808 405946 353903 420275
$$ packed form
7228C346400p6072J5124Q329O603j32535q325j3141j3163j60327j52542j38671
7217B681680j76173j84921j02912j29476j08910j5341R6043k0595L0726q6392
7207A983729j08212j99040j40806k86571k70688j36464q4250o6111Q3312r537
7197G65362n7484L0957O0638j3717J47820J80950J68343J37116Q1593O1373q4050
7186A478901n0431j31678p1022n0958j40349q7990r5290j49291j87131j27532
7176C87229k01873j28849j00693j30394K3148K2786M8556K24389J50871l1696
7166B63474L7960O9108m0418k8472R394J352q560L2770N8592M3514J13199O9342
7154F21255K7595N2400m1996j14855j23460r0017J5418K7468L2138n2043O6372
$$ plain form
7143 420275 497366 506967 515344 492625 520484 590071 566665 540087 586539 614187 586384 628359
7131 628359 607920 574749 506980 425559 414892 436402 348214 287732 267030 309577 264148 267591
7119 267591 293150 289635 254168 315416 300026 203577 128979 34992 -6954 50957 45051 19447
7107 19447 -28391 9718 -47636 37504 87345 47550 90452 85230 43694 4088 -19136 -6186
7095 -6186 13313 59973 35061 -25031 -5012 101596 164108 125562 144301 170767 164668 131628
7083 131628 148656 172438 148451 160661 253687 335852 326414 308108 256783 201958 195600 159861
7071 159861 100370 70389 -40417 -151371 -192207 -193590 -207926 -206228 -207170 -182223 -94424 -40432
7059 -40432 -69765 -27497 46433 9842 -18602 -53053 -64667 -38993 38316 100956 10371 -1431
$$ packed form
7143D20275P7091R601Q377k2719K7859O9587k3406k6578M6452K7648k7803M1975
7131F28359k0439l3171o7769q1421j0667K1510q8188o0482k0702M2547m5429L443
7119B67591K5559l515l5467O1248j5390r6449p4598r3987m1946N7911n906k5604
7107A9447m7838L8109n7354Q5140M9841l9795M2902n222m1536l9606k3224J2950
7095f186J9499M6660k4912o0092K0019J06608O2512l8546J8739K6466o099l3040
7083A31628J7028K3782k3987J2210R3026Q2165r438j8306n1325n4825o358l5739
7071A59861n9491k9981j10806j10954m0836j383j4336J698r42K4947Q7799N3992
7059d0432k9333M2268P3930l6591k8444l4451j1614K5674P7309O2640r0585j1802
$$ plain form
7047 -1431 21909 -48708 -48479 -110006 -176968 -203173 -185892 -150165 -100706 -84075 -33789 4323
7035 4323 -417 57335 31744 36015 92874 90065 82620 71283 59588 13420 -18428 -103 -60992
7022 -60992 -143333 -125667 -129563 -71564 -24873 -59895 -114271 -138038 -161316 -147737 -81412 -28831
7010 -28831 -103607 -80842 26996 21553 10500 5985 39199 131573 123060 84174 16051 -93947
6998 -93947 -144373 -68959 -114349 -171654 -149340 -136285 -100949 -29024 -32146 -95284 -115738 -108360
6986 -108360 -90150 -54661 -87473 -70742 -79447 33467 61113 96612 192481 234073 271339 192546
6974 192546 152101 118988 76079 46089 47776 54689 7107 63093 106204 73507 138579 118530
6962 118530 12024 -3625 17861 -90364 -118132 -59895 -129824 -189391 -103816 -128338 -158905
$$ packed form
7047a431K3340p0617K29o1527o6962k6205J7281L5727M9459J6631N0286L8112
7035D323m740N7752k5591M271N6859k809p445j1337j1695m6168l1848J8325o0889
7022f0992q2341J7666l896N7999M6691l5022n4376k3767k3278J3579O6325N2581
7010b8831p4776K2765J07838n443j1053m515L3214R2374q513l8886o8123j09998
6998i3947n0426P5414m5390n7305K2314J3055L5336P1925l122o3138k0454P378
6986a08360J8210L5489l2812J6731q705J12914K7646L5499R5869M1592L7266p8793
6974A92546m0445l3113m2909k9990J687O913m7582N5986M3111l2697O5072k0049
6962A18530j06506j5649K1486j08225k7768N8237o9929n9567Q5575k4522l0567
$$ plain form
6951 -158905 -45824 -27206 -18611 61986 52492 59799 70171 -649 -27747 -69686 -76621 -99704
6939 -99704 -69151 -109252 -120523 -11953 5332 -828 54032 12973 -38681 9036 19178 557
6927 557 37531 11671 2100 -6454 28619 980 -37326 -29192 -84080 -59062 -104912 -177339 -155373
6914 -155373 -101681 -111938 -41022 -48444 -140743 -132436 -97598 -95745 -144888 -216610 -200565 -189689
6902 -189689 -117346 -168254 -200571 -166792 -125336 -66793 -16509 46807 125577 396822 766208
6891 766208 1231947 1517358 1574519 1570693 1446338 1256660 960821 630605 358296 180706
6881 180706 95857 93789 29477 54762 -37689 -86189 -36001 18356 -44761 -55545 -30326 -86299
6869 -86299 -104060 -147336 -167135 -179988 -186339 -169192 -199146 -170387 -148816 -154910 -151238 -132992
$$ packed form
6951a58905J13081J8618Q595Q0597r494P307J0372p0820k7098m1939o935k3083
6939i9704L0553m0101j1271J08570J7285o160N4860m1059n1654M7717J0142j8621
6927E57L6974k5860r571q554L5073k7639l8306Q134n4888K5018m5850p2427K1966
6914a55373N3692j0257P0916p422r2299Q307L4838J853m9143p1722J6045J0876
6902a89689P2343n0908l2317L3779M1456N8543N0284O3316P8770K71245L69386
6891G66208M65739K85411N7161l826j24355j89678k95839l30216k72309j77590
6881A80706q4849k068o4312K5285r2451m8500N0188N4357o3117j0784K5219n5973
6869h6299j7761m3276j9799j2853o351J7147k9954K8759K1571o094L672J8246
$$ plain form
6857 -132992 -196478 -273403 -226333 -206031 -150821 -120498 -154799 -171969 -107584 -80691 -145856 -125381
6845 -125381 -40318 27204 -5679 -74020 -94547 -123654 -205326 -219680 -192152 -212028 -235991 -200758
6833 -200758 -129891 -156636 -123907 -155631 -205765 -172572 -78030 -84429 -45816 -41959 -112872 -161117
6821 -161117 -81966 -22582 -45012 -1089 -18827 -21563 -57641 -49033 -52448 -90058 -110052 -191346
6809 -191346 -160424 -146630 -150869 -96887 -35320 59300 -10497 -19739 12277 51995 30840 30672
6797 30672 96834 34244 -77093 -68110 -40762 -77064 1108 25482 -35632 26406 73105 -27761
6785 -27761 -36416 1390 6794 -25878 -64658 -84054 -111857 -122801 -61463 15267 86448 40028
6773 40028 -67360 -74335 60977 19159 -1938 -20825 -7330 -41359 -125845 -79176 -30341 -19781
$$ packed form
6857a32992o3486p6925M7070K0302N5210L0323l4301j7170O4385K6893o5165K0475
6845a25381Q5063O7522l2883o8341k0527k9107q1672j4354K7528j9876k3963L5233
6833b00758P0867k6745L2729l1724n0134L3193R4542o399L8613L857p0913m8245
6821a61117P9151N9384k2430M3923j7738k736l6078Q608l415l7610j9994q1294
6809a91346L0922J3794m239N3982O1567R4620o9797r242L2016L9718k1155j68
6797C0672O6162o2590j11337Q983K7348l6302P8172K4374o1114O2038M6699j00866
6785b7761q655L7806N404l2672l8780j9396k7803j0944O1338P6730P1181m6420
6773D0028j07388o975J35312m1818k1097j8887J3495l4029q4486M6669M8835J0560
$$ plain form
6761 -19781 24806 79341 5680 -23360 -42671 -65238 2843 34699 -42700 -118693 -112123 -25566
6749 -25566 -86655 -87078 -20535 -52957 -69445 -54313 -14656 38297 13780 -36865 -9292 -8337 -54531
6736 -54531 -102518 -122686 -20346 13252 -62169 -81607 -16801 -5410 8655 -29596 -83872 -174401
6724 -174401 -224785 -161697 -98429 -142388 -210750 -260218 -272145 -227943 -187914 -163801 -159900 -107608
6712 -107608 -165049 -199796 -187142 -166905 -149451 -114952 -182672 -201578 -215350 -199936 -186430 -114614
6700 -114614 -66019 -138561 -151976 -155531 -158348 -98397 -81546 -174596 -162396 -160715 -73195 -42758
6688 -42758 -61706 -69053 -69983 -49035 -156219 -176350 -184665 -156438 -191334 -197981 -122751 -142829 -197618
6675 -197618 -155202 -61621 -47907 -83980 -124633 -122729 -78887 -34306 -91643 -154791 -126015 -141555
$$ packed form
6761a9781M4587N4535p3661k9040j9311k2567O8081L1856p7399p5993O570Q6557
6749b5566o1089m23O6543l2422j6488J5132L9657N2953k4517n0645K7573R55m6194
6736e4531m7987k0168J02340L3598p5421j9438O4806J1391J4065l8251n4276r0529
6724a74401n0384O3088O3268m3959o8362m9468j1927M4202M0029K4113L901N2292
6712a07608n7441l4747J2654K0237J7454L4499o7720j8906j3772J5414J3506P1816
6700a14614M8595p2542j3415l555k817N9951J6851r3050J2200J681Q7520L0437
6688d2758j8948p347r30K0948j07184k0131q315K8227l4896o647P5230k0078n4789
6675a97618M2416R3581J3714l6073m0653J904M3842M4581n7337o3148K8776j5540
$$ plain form
6663 -141555 -132956 -141587 -134146 -164795 -185825 -137668 -90853 -93175 -107656 -104253 -158021 -79154 -73702
6650 -73702 -159774 -179304 -81364 -61809 -122266 -119573 -107220 -163630 -180600 -109542 -133204 -261437
6638 -261437 -247739 -255700 -273873 -209135 -150324 -161437 -161870 -103803 -129800 -110922 -85973 -98929
6626 -98929 -123921 -98324 -44156 -119082 -163914 -129890 -66215 32559 82625 48065 -37797 -43959
6614 -43959 -72222 -77950 -2547 -161 22655 23113 13095 -47188 -97249 -60855 21432 67635 15391
6601 15391 -47011 -108504 -79663 -302 5390 23541 32474 -38424 -91082 994 16624 -22954
6589 -22954 19793 63784 17268 50551 80869 99494 134546 108544 27399 49008 48446 33333
6577 33333 11988 86450 77745 11699 49037 22174 30188 -47227 20908 40825 5208 7296
$$ packed form
6663a41555Q599q631P441l0649k1030M8157M6815k322j4481L403n3768P8867N452
6650g3702q6072j9530R7940J9555o0457K693J2353n6410j6970P1058k3662j28233
6638b61437J3698p961j8173O4738N8811j1113m33N8067k5997J8878K4949j2956
6626i8929k4992K5597N4168p4926m4832L4024O3675R8774N0066l4560q5862o162
6614d3959k8263n728P5403K386K2816M58j0018o0283n0061L6394Q2287M6203n2244
6601A5391o2402o1493K8841P9361N692J8151Q933p0898n2658R2076J5630l9578
6589b2954M2747M3991m6516L3283L0318J8625L5052k6002q1145K1609n62j5113
6577C3333k1345P4462q705o6046L7338k6863Q014p7415O8135J9917l5617K088
$$ plain form
6565 7296 -26948 -46446 8290 62001 -5637 2311 47745 5997 -22 38300 80918 82445 86796
6552 86796 40367 -56976 -2611 18977 14879 44282 27829 -8434 -29185 82041 81269 31986
6540 31986 -10053 -57330 -27536 -44117 -58297 -65498 -60325 -30554 2155 8057 -24390 48337
6528 48337 55086 22599 31801 9693 -45465 -7648 -15268 -63025 -73489 -18264 -76130 -45872
6516 -45872 1855 21029 97673 100477 91385 85494 130803 65123 27655 85537 118249 101515
6504 101515 116143 132667 121747 163197 201572 128874 125371 145989 144989 132417 146882 229921
6492 229921 263565 155316 100141 180310 235287 264124 312766 279861 204231 265137 280572
6481 280572 281050 287408 307759 263977 285142 307787 250584 253633 382228 408818 391222 383746
$$ packed form
6565G296l4244j9498N4736N3711o7638P948M5434m1748o019L8322M2618J527M351
6552H6796m6429r7343N4365K1588m098K9403j6453l6263k0751J11226p72m9283
6540C1986m2039m7277K9794j6581j4180p201N173K9771L2709N902l2447P2727
6528D8337O749l2487R202k2108n5158L7817p620m7757j0464N5225n7866L0258
6516d5872M7727J9174P6644K804r092n891M5309o5680l7468N7882L2712j6734
6504A01515J4628J6524j0920M1450L8375p2698l503K0618j000j2572J4465Q3039
6492B29921L3644j08249n5175Q0169N4977K8837M8642l2905p5630O0906J5435
6481B80572M78O358K0351m3782K1165K2645n7203L049J28595K6590j7596p476
$$ plain form
6469 383746 339822 238389 215250 243730 249416 190499 195989 217022 221007 276170 273142 236465
6457 236465 205096 248139 192181 124260 100677 133540 124166 127272 121241 89852 90570 121987 243123
6444 243123 271770 222127 185660 90842 167281 256787 202343 129820 136929 140079 183059 177715
6432 177715 166632 187148 147478 178244 255763 242719 288734 199032 181156 247718 190133 155183
6420 155183 176079 206857 196140 256164 180944 165512 226452 221350 267514 257805 199572 112809
6408 112809 155939 269676 229476 255151 262642 284586 260277 236031 295047 293754 372897 398399
6396 398399 390841 326198 342769 319244 275797 325249 404462 353606 277013 364482 454969 396431
6384 396431 449108 393086 317484 352036 328764 325743 390781 504663 534639 528697 534404 591287
$$ packed form
6469C83746m3924j01433k3139K8480N686n8917N490K1033L985N5163l028l6677
6457B36465l1369M3043n5958o7921k3583L2863r374L106o031l1389P18L1417J21136
6444B43123K8647m9643l6467r4818P6439Q9506n4444p2523P109L150M2980n344
6432A77715j1083K0516l9670L0766P7519j3044M6015q9702j7876O6562n7585l4950
6420A55183K0896L0778j0717O0024p5220j5432O0940n102M6164r709n8233q6763
6408A12809M3130J13737m0200K5675P491K1944k4309k4246N9016j293P9143K5502
6396C98399p558o4643J6571k3525m3447M9452P9213n0856p6593Q7469R0487n8538
6384C96431N2677n6022p5602L4552k3272l021O5038J13882K9976n942N707N6883
$$ plain form
6372 591287 571911 647038 751299 781798 799572 834682 853599 841839 795602 810850 817855 885267
6360 885267 901569 918334 942094 980045 991385 1032777 1080116 1115334 1068925 1173154 1359522
6349 1359522 1493327 1543616 1635303 1803664 1844164 1908229 1927779 2009612 1921066 1969058 1940239
6338 1940239 1874412 1920616 1988006 2035451 2106771 2201989 2158530 2065775 1941616 1811152 1727348
6327 1727348 1603172 1527428 1489206 1380463 1340245 1274252 1200924 1193298 1218996 1246496 1256350
6316 1256350 1310010 1365127 1376870 1454825 1480099 1545313 1599901 1622650 1640255 1702563 1844340
6305 1844340 1896465 1858136 1790027 1827072 1838784 1866163 1789480 1718951 1640446 1575936 1568876 1525369
6293 1525369 1480287 1487811 1529809 1513830 1491698 1502680 1560240 1498623 1490558 1613125 1659773 1604906
$$ packed form
6372E91287j9376P5127J04261L0499J7774L5110J8917j1760m6237J5248P005O7412
6360H85267J6302J6765K3760L7951J1340M1392M7339L5218m6409J04229J86368
6349A359522J33805N0289R1687J68361M0500O4065J9550Q1833q8546M7992k8819
6338A940239o5827M6204O7390M7445P1320R5218m3459r2755j24159j30464q3804
6327A727348j24176p5744l8222j08743m0218o5993p3328p626K5698K7500R854
6316A256350N3660N5117J1743P7955K5274O5214N4588K2749J7605O2308J41777
6305A844340N2125l8329o8109L7045J1712K7379p6683p0529p8505o4510p060m3507
6293A525369m5082P524M1998j5979k2132J0982N7560o1617q065J22567M6648n4867
$$ plain form
6281 1604906 1716915 1801834 1920974 2065254 2173173 2279356 2460403 2617825 2705439 2664061
6271 2664061 2607107 2491828 2353989 2357723 2310287 2215488 2194731 2309649 2406167 2374604 2331894
6260 2331894 2312354 2213951 2164291 2074565 1833079 1655666 1587826 1535515 1510810 1420040 1280717
6249 1280717 1200503 1202433 1242644 1254129 1217005 1211694 1222518 1160774 1137385 1145730 1073075 1090495
6237 1090495 1188161 1210419 1238734 1187737 1132262 1154648 1228617 1282431 1251482 1232916 1237190 1250347
6225 1250347 1340952 1342048 1369623 1343883 1353840 1457205 1502408 1519907 1540022 1626659 1670834 1649909
6213 1649909 1658124 1647681 1697165 1744732 1833622 1876976 1936310 1996639 2115948 2301738 2343004
6202 2343004 2403755 2477493 2564735 2739589 2932938 3034491 3225213 3452636 3759583 4020467
$$ packed form
6281A604906J12009Q4919J19140J44280J07919J06183J81047J57422Q7614m1378
6271B664061n6954j15279j37839L734m7436r4799k0757J14918R6518l1563m2710
6260B331894j9540r8403m9660q9726k41486j77413o7840n2311k4705r0770j39323
6249A280717q0214J930M0211J1485l7124n311J0824o1744k3389Q345p2655J7420
6237A090495R7666K2258K8315n0997n5475K2386P3969N3814l0949j8566M274J3157
6225A250347R0605J096K7575k5740R957J03365M5203J7499K0115Q6637M4175k0925
6213A649909Q215j0443M9484M7567Q8890M3354N9334O0329J19309J85790M1266
6202B343004O0751P3738Q7242J74854J93349J01553J90722K27423L06947K60884
$$ plain form
6192 4020467 4422437 4901938 5429822 6095304 6702737 7262239 7708298 7950930 8018797 8013241
6182 8013241 7825566 7436551 7070906 6718174 6265620 5885579 5585390 5291359 5187921 5154467
6172 5154467 5205638 5241852 5275575 5362330 5539627 5729812 5994705 6308927 6716010 7219346
6162 7219346 7787304 8501418 9504649 10634382 11864757 13110440 14328418 15214640 15734404
6153 15734404 15808181 15396605 14642984 13606108 12438329 11148961 10032974 9101639 8267948
6144 8267948 7572868 7116997 6726890 6387705 6108469 5846338 5758943 5766827 5726178 5735355 5887005
6133 5887005 6077453 6261547 6532523 6909642 7368794 7873864 8469247 9132092 9669112 9984967
6123 9984967 10164411 10112512 9889474 9540639 9029884 8394434 7819936 7353761 7009556 6640175
$$ packed form
6192D020467M01970M79501N27884O65482O07433N59502M46059K42632O7867n556
6182H013241j87675l89015l65645l52732m52554l80041l00189k94031j03438l3454
6172E154467N1171L6214L3723Q6755J77297J90185K64893L14222M07083N03336
6162G219346N67958P14114J003231J129733J230375J245683J217978Q86222N19764
6153A5734404P3777m11576p53621j036876j167779j289368j115987r31335q33691
6144H267948o95080m55871l90107l39185k79236k62131q7395P884m0649R177J51650
6133E887005J90448J84094K70976L77119M59152N05070N95383O62845N37020L15855
6123I984967J79444n1899k23038l48835n10755o35450n74498m66175l44205l69381
$$ plain form
6113 6640175 6414216 6231414 6088850 6026228 5925022 5888392 5921999 6016985 6063615 6004468 6033808
6102 6033808 6079965 6117554 6165787 6214558 6217141 6167841 6240779 6234416 6187902 6178432 6156114 6075477
6090 6075477 6071110 6106615 6151557 6141592 6172139 6290109 6526336 6703650 6838065 7019570 7331174
6079 7331174 7602693 7837119 8088472 8272349 8563451 8774689 8991453 9330259 9781418 10201084
6069 10201084 10815940 11680403 12775860 14292115 16417845 19132513 21684835 22792635
6061 22792635 22278665 20702042 18586929 16490217 14625084 13105589 11910350 11081637
6053 11081637 10424237 9957963 9594866 9422148 9400729 9445945 9652615 9881805 10126765 10470994
6043 10470994 10867672 11302257 11939173 12669154 13565609 14582101 15903603 17782898 20439533
$$ packed form
6113F640175k25959j82802j42564o2622j01206l6630L3607R4986M6630n9147K9340
6102F033808M6157L7589M8233M8771K583m9300P2938o363m6514r470k2318q0637
6090F075477m367L5505M4942r965L0547J17970K36227J77314J34415J81505L11604
6079G331174K71519K34426K51353J83877K91102K11238K16764L38806M51159M19666
6069A0201084O14856Q64463J095457J516255K125730K714668K552322J107800
6061B2792635n13970j576623k115113k096712j865133j519495j195239q28713
6053A1081637o57400m66274l63097j72718k1419M5216K06670K29190K44960L44229
6043A0470994L96678M34585O36916P29981Q96455J016492J321502J879295K656635
$$ plain form
6034 20439533 24254907 29945919 37812850 46498138 51247596 50232907 45404822 38592190
6026 38592190 31725085 25972215 21582545 18303873 15891076 14071544 12689777 11637709
6018 11637709 10867569 10387340 10030605 9884020 9934874 10047950 10284166 10550378 10899652 11321278
6008 11321278 11665761 12169762 12808638 13745424 15176197 17417566 20870155 26188479 33747519
5999 33747519 42663649 48487246 48435178 44170619 37334286 30267106 24243640 19625575
5991 19625575 16203254 13665528 11781158 10350579 9302228 8454108 7672510 7095347 6642562
5982 6642562 6364396 6209060 6142911 6045613 6121575 6207365 6338949 6585363 6770648 7063812
5972 7063812 7510075 8198725 9260137 10941648 13380973 16231547 18159690 18421440 17272085
$$ packed form
6034B0439533L815374N691012P866931Q685288M749458j014689m828085o812632
6026C8592190o867105n752870m389670l278672k412797j819532j381767j052068
6018A1637709p70140m80229l56735j46585N0854J13076K36216K66212L49274M21626
6008A1321278L44483N04001O38876R36786J430773K241369L452589N318324P559040
5999C3747519Q916130N823597n2068m264559o836333p067180o023466m618065
5991A9625575l422321k537726j884370j430579j048351q48120p81598n77163m52785
5982F642562k78166j55336o6149r7298P5962Q5790J31584K46414J85285K93164
5972G063812M46263O88650J061412J681511K439325K850574J928143K61750j149355
$$ plain form
5963 17272085 15244113 12965347 10973379 9400981 8174269 7233884 6443866 5887688 5386489
5954 5386489 5050770 4657183 4407312 4186522 3930128 3698545 3546750 3487746 3448098 3512454
5944 3512454 3469725 3516301 3552591 3535448 3424506 3384674 3399466 3252627 3161047 3037182 2819672
5933 2819672 2772639 2736203 2585474 2531740 2489853 2490869 2437944 2450276 2424131 2385654 2405105
5922 2405105 2420142 2392211 2362935 2289807 2241976 2158019 2070021 2029028 2011991 1959495 1946369
5911 1946369 1968193 1904180 1816622 1792939 1779931 1715486 1644740 1586062 1536677 1524249 1571086
5900 1571086 1544386 1538146 1535526 1532367 1542890 1517687 1453614 1447957 1540535 1600725 1636501 1717648
5888 1717648 1663955 1619664 1621470 1650346 1612341 1576061 1481354 1467653 1575685 1545459 1506336
$$ packed form
5963A7272085k027972k278766j991968j572398j226712r40385p90018n56178n01199
5954E386489l35719l93587k49871k20790k56394k31583j51795n9004l9648O4356
5944C512454m2729M6576L6290j7143j10942l9832J4792j46839r1580j23865k17510
5933B819672m7033l6436j50729n3734m1887J016n2925J2332k6145l8477J9451
5922B405105J5037k7931k9276p3128m7831q3957q7998m0993j7037n2496j3126
5911A946369K1824o4013q7558k3683j3008o4445p0746n8678m9385j2428M6837
5900A571086k6700o240k620l159J0523k5203o4073n657R2578O0190L5776Q1147
5888A717648n3693m4291J806K8876l8005l6280r4707j3701J08032l0226l9123
$$ plain form
5877 1506336 1515719 1479414 1458245 1463550 1398280 1283088 1396311 1403572 1366431 1422923 1440787 1348836
5865 1348836 1415336 1477935 1438927 1442755 1561231 1480695 1511285 1514919 1481235 1533107 1481285 1464126
5853 1464126 1490306 1534412 1517227 1466011 1433879 1383593 1425538 1474755 1385325 1400479 1394366 1351001
5841 1351001 1393575 1424686 1384964 1368428 1417608 1389588 1410657 1455691 1393048 1433526 1552899
5830 1552899 1502687 1391813 1423331 1428655 1474312 1509559 1512707 1455562 1455182 1458980 1415426 1452398
5818 1452398 1523348 1417486 1438852 1512566 1439113 1467461 1465917 1483915 1558458 1603553 1579935
5807 1579935 1519506 1536997 1576985 1577248 1650826 1635926 1691240 1736894 1759470 1777803 1817565 1841914
5795 1841914 1893583 1929993 1850203 1838226 1874908 1889713 1949996 2066830 2087429 2136203 2220388
$$ packed form
5877A506336R383l6305k1169N305o5270j15192J13223P261l7141N6492J7864r1951
5865A348836O6500O2599l9008L828J18476q0536L0590L634l3684N1872n1822j7159
5853A464126K6180M4106j7185n1216l2132n0286M1945M9217q9430J5154o113m3365
5841A351001M2574L1111l9722j6536M9180k8020K1069M5034o2643M0478J19373
5830A552899n0212j10874L1518N324M5657L5247L148n7145l80L798m3554L6972
5818A452398P0950j05862K1366P3714p3453K8348j544J7998P4543M5095k3618
5807A579935o0429J7491L9988K63P3578j4900N5314M5654K2576J8333L9762K4349
5795A841914N1669L6410p9790j1977L6682J4805O0283J16834K0599M8774Q4185
$$ plain form
5784 2220388 2283919 2240675 2389976 2532135 2658416 2752755 2901557 3023527 3088741 3143769
5774 3143769 3289428 3399641 3604532 3807107 3942794 4140888 4489428 4967774 5745151 7142032
5764 7142032 9371594 12645034 15832114 17155481 16825657 15270443 12877283 10381575
5756 10381575 8245877 6600971 5402147 4574432 4030096 3682800 3434457 3140336 2873770
5747 2873770 2725563 2572314 2441806 2368023 2417461 2388057 2367443 2421715 2395280 2351487 2373218
5736 2373218 2322028 2348270 2298675 2276556 2246072 2206956 2242497 2271043 2295537 2333800 2312905
5725 2312905 2276421 2276232 2355252 2340513 2335096 2400394 2421333 2398855 2303422 2255373 2246055 2273219
5713 2273219 2251768 2263456 2296918 2331357 2276403 2210586 2293476 2341259 2293675 2246366 2223467
$$ packed form
5784B220388O3531m3244J49301J42159J26281R4339J48802J21970O5214N5028
5774C143769J45659J10213K04891K02575J35687J98094L48540M78346P77377J396881
5764G142032K229562L273440L187080J323367l29824j555214k393160k495708
5756A0381575k135698j644906j198824q27715n44336l47296k48343k94121k66566
5747B873770j48207j53249j30508p3783M9438k9404k0614N4272k6435m3793K1731
5736B373218n1190K6242m9595k2119l0484l9116L5541K8546K4494L8263k0895
5725B312905l6484j89P9020j4739n417O5298K0939k2478r5433m8049r318K7164
5713B273219k1451J1688L3462L4439n4954o5817Q2890M7783m7584m7309k2899
$$ plain form
5702 2223467 2194541 2138203 2069042 2107345 2148952 2174801 2157953 2148148 2137421 2175844 2102235 2154234
5690 2154234 2191148 2198110 2173394 2176534 2146779 2078709 2035589 1954828 1933307 1967175 1966787 1946611
5678 1946611 1910569 1922442 1955052 1942130 1943899 1975134 1970843 1899622 1966153 1979002 1891265 1933378
5666 1933378 1977982 1942808 1927593 1982614 1929673 1983601 2055229 2002818 2021250 2071005 2104148
5655 2104148 2076998 2136796 2064921 2005974 1975215 1971540 1949226 1929022 1896609 1899407 1907152 1898817
5643 1898817 1870024 1848690 1850246 1862451 1872451 1858661 1808708 1787470 1732434 1756828 1783247 1765561
5631 1765561 1704446 1676957 1697372 1731085 1741547 1726653 1703977 1776826 1822787 1776397 1811271
5620 1811271 1768323 1745265 1798062 1817392 1736370 1667359 1758319 1750907 1738766 1723540 1725604 1701925
$$ packed form
5702B223467k8926n6338o9161L8303M1607K5849j6848r805j0727L8423p3609N1999
5690B154234L6914O962k4716L140k9755o8070m3120q0761k1521L3868l88k0176
5678A946611l6042J1873L2610j2922J769L1235m291p1221O6531J2849q7737M2113
5666A933378M4604l5174j5215N5021n2941N3928P1628n2411J8432M9755L3143
5655B104148k7150N9798p1875n8947l0759l675k2314k0204l2413K798P745q335
5643A898817k8793k1334J556J2205J0000j3790m9953k1238n5036K4394K6419j7686
5631A765561o1115k7489K0415L3713J0462j4894k2676P2849M5961m6390L4874
5620A811271m2948k3058N2797J9330q1022o9011R0960p412j2141j5226K064k3679
$$ plain form
5608 1701925 1718574 1863045 1880288 1777357 1775135 1758766 1735288 1820621 1879665 1876610 1873458 1902596
5596 1902596 1848885 1908314 1884969 1831763 1854083 1933819 1958975 1966311 1906338 1913583 1968103 1968249
5584 1968249 1946619 1946144 1916141 1916825 2012945 1984242 1920302 1965554 2010322 2094118 2203389 2285551
5572 2285551 2314942 2426669 2710188 2929754 3074341 3068327 2871142 2742788 2665072 2555237
5562 2555237 2408319 2354202 2201654 2140712 2086114 1978438 2021217 2133884 2167468 2147320 2221602
5551 2221602 2204194 2124759 2191973 2230644 2252980 2398958 2411757 2500221 2676731 2941337 3137998
5540 3137998 3533536 4082556 4717000 5417959 5761001 5611789 5151485 4626148 4082333 3723260
5530 3723260 3362369 3160139 3028927 2893525 2744669 2677562 2615989 2514456 2567843 2600233
$$ packed form
5608A701925J6649J44471J7243j02931k222j6369k3478Q5333N9044l055l152K9138
5596A902596n3711N9429k3345n3206K2320P9736K5156P336n9973P245N4520J46
5584A968249k1630m75l0003O84R6120k8703o3940M5252M4768Q3796J09271Q2162
5572B285551K9391J11727K83519K19566J44587o014j97185j28354p7716j09835
5562B555237j46918n4117j52548o0942n4598j07676M2779J12667L3584k0148P4282
5551B221602j7408p9435O7214L8671K2336J45978J2799Q8464J76510K64606J96661
5540C137998L95538N49020O34444P00959L43042j49212m60304n25337n43815l59073
5530C723260l60891k02230j31212j35402j48856o7107o1573j01533N3387L2390
$$ plain form
5520 2600233 2563875 2588971 2610973 2593014 2689009 2750269 2782500 2870718 3031391 3109791 3274927
5509 3274927 3592548 3996599 4578551 5289155 5802850 6018014 5784597 5266891 4645675 4168589
5499 4168589 3749506 3452868 3317493 3110173 2927385 2855137 2793621 2613138 2536719 2516926
5489 2516926 2535139 2536300 2505395 2514609 2506010 2443835 2430374 2516522 2544578 2615380 2647244 2636791
5477 2636791 2728801 2963392 3157568 3350094 3550280 3591966 3380852 3299879 3155963 2935822
5467 2935822 2797485 2731104 2662376 2611699 2592563 2512496 2466080 2520264 2509700 2396040 2417531
5456 2417531 2417878 2361759 2302418 2319510 2178645 2185530 2229890 2260814 2282876 2187956 2175825 2208165
5444 2208165 2205236 2212964 2174067 2136784 2146563 2143070 2091039 2093090 2136618 2077559 2034146 2063585
$$ packed form
5520B600233l6358K5096K2002j7959R5995O1260L2231Q8218J60673P8400J65136
5509C274927L17621M04051N81952P10604N13695K15164k33417n17706o21216m77086
5499D168589m19083k96638j35375k07320j82788p2248o1516j80483p6419j9793
5489B516926J8213J161l0905R214q599o2175j3461Q6148K8056P0802L1864j0453
5477B636791R2010K34591J94176J92526K00186M1686k11114q0973j43916k20141
5467B935822j38337o6381o8728n0677j9136q0067m6416N4184j0564j13660K1491
5456B417531L47n6119n9341J7092j40865O885M4360L0924K2062r4920j2131L2340
5444B208165k929P728l8897l7283R779l493n2031K051M3528n9059m3413K9439
$$ plain form
5432 2063585 2041008 2069995 2052209 2082347 2067100 2074182 1948174 1928199 1972989 2043661 2072981
5421 2072981 2075216 2050798 1982659 1982350 2004465 2015555 2057713 2054416 2059508 2074407 2061372 2062557 2055753
5408 2055753 2090286 2166549 2248039 2204387 2247792 2224102 2201997 2193227 2212658 2217933 2226102 2212580
5396 2212580 2216550 2251847 2267505 2249267 2301159 2306236 2290702 2261752 2309783 2335701 2310489 2309794
5384 2309794 2289411 2357732 2443757 2423555 2360861 2374270 2458282 2410709 2436469 2484542 2517260
5373 2517260 2592120 2553167 2538396 2639929 2707999 2666595 2686511 2769587 2830243 2893250 2958482
5362 2958482 3061283 3117813 3157534 3217649 3242313 3389689 3520601 3588229 3611947 3588049 3632008
5351 3632008 3743340 3798336 3802546 3865730 3852463 3847575 3931320 3853588 3877424 3958670 3977655 4052796
$$ packed form
5432B063585k2577K8987j7786L0138j5247P082j26008j9975M4790P0672K9320
5421B072981K235k4418o8139l09K2115J1090M2158l297N092J4899j3035J185o804
5408B055753L4533P6263Q1490m3652M3405k3690k2105q770J9431N275Q169j3522
5396B212580L970L5297J5658j8238N1892N077j5534k8950M8031K5918k5212o95
5384B309794k0383O8321Q6025k0202o2694J3409Q4012m7573K5760M8073L2718
5373B517260P4860l8953j4771J01533O8070m1404J9916Q3076O0656O3007O5232
5362B958482J02801N6530L9721O0115K4664J47376J30912O7628K3718k3898M3959
5351C632008J11332N4996M210O3184j3267m888Q3745p7732K3836Q1246J8985P5141
$$ plain form
5339 4052796 4168689 4217761 4223727 4365236 4442352 4501461 4686224 4869234 4914298 5034648 5233223
5328 5233223 5370087 5549423 5729265 5869730 5966606 6115625 6231379 6273378 6341732 6342466 6364184
5317 6364184 6277155 6141687 6075828 5969491 5881065 5860226 5828458 5767468 5807678 5801476 5699112
5306 5699112 5687471 5736718 5783230 5843665 6038714 6168403 6199334 6314223 6426555 6555645
5296 6555645 6684521 6732035 6809543 6876173 6886362 6779621 6702815 6635999 6510088 6401091 6183733
5285 6183733 6078361 5950693 5843085 5731730 5648280 5560834 5409002 5348806 5329850 5317786
5275 5317786 5310090 5199443 5222063 5283508 5309706 5313733 5252208 5320909 5391711 5443814 5499375 5587274
5263 5587274 5608141 5683477 5791541 5930313 6107684 6277240 6570737 6719828 6779956 6710936
$$ packed form
5339D052796J15893M9072N966J41509P7116N9109J84763J83010M5064J20350J98575
5328E233223J36864J79336J79842J40465R6876J49019J15754M1999O8354P34K1718
5317F364184q7029j35468o5859j06337q8426k0839l1768o0990M0210o202j02364
5306E699112j1641M9247M6512O0435J95049J29689L0931J14889J12332J29090
5296F555645J28876M7514P7508O6630J0189j06741p6806o6816j25911j08997k17358
5285F183733j05372j27668j07608j11355q3450q7446j51832o0196j8956j2064
5275E317786p696j10647K2620O1445K6198M027o1525O8701P0802N2103N5561Q7899
5263E587274K0867P5336J08064J38772J77371J69556K93497J49091O0128o9020
$$ plain form
5253 6710936 6571015 6348682 6000103 5745573 5472001 5215833 5054432 4967950 4924636 4939590
5243 4939590 4999768 4905808 4872142 4905227 4854523 4808663 4852674 4928098 4942536 4920542 4985564
5232 4985564 5077038 5260108 5531810 5779655 6204702 6854621 7742229 8765214 9939933
5223 9939933 10917580 11179132 10826801 10138012 9223645 8288186 7550925 6961161 6583684 6281151
5213 6281151 6095247 6015621 6006513 6081095 6137739 6099810 6063758 5989832 5864611 5826589 5795531
5202 5795531 5838096 5898084 5990424 6168416 6380157 6632915 7024703 7560548 8445335 9495835
5192 9495835 10705208 11810314 12412747 12282220 11630312 10722534 9638481 8746837 8013609
5183 8013609 7491722 7153155 6892534 6764246 6758700 6825186 6753332 6637102 6550103 6384190
$$ packed form
5253F710936j39921k22333l48579k54530k73572k56168j61401q6482m3314J4954
5243D939590O0178r3960l3666L3085n0704m5860M4011P5424J4438k1994O5022
5232D985564R1474J83070K71702K47845M25047O49919Q87608J022985J174719
5223I939933R77647K61552l52331o88789r14367r35459p37261n89764l77477l02533
5213F281151j85904p9626r108P4582N6644l7929l6052p3926j25221l8022l1058
5202E795531M2565N9988R2340J77992K11741K52758L91788N35845Q84787J050500
5192I495835J209373J105106O02433j30527o51908r07778j084053q91644p33228
5183H013609n21887l38567k60621j28288n546O6486p1854j16230q6999j65913
$$ plain form
5173 6384190 6217120 6014348 5852513 5747140 5678152 5582327 5530172 5592305 5659377 5756846 5858086
5162 5858086 6069001 6336682 6593969 6695845 6801041 6751743 6545019 6216980 5913071 5589097
5152 5589097 5436511 5365405 5272339 5213935 5143584 5007690 4895991 4910630 4793079 4682436
5142 4682436 4478261 4429299 4393001 4353434 4320952 4266460 4312529 4348601 4408667 4494049 4490217
5131 4490217 4500035 4529305 4485224 4384726 4346847 4341365 4328211 4364253 4295035 4292359 4331965 4447547
5119 4447547 4530462 4528672 4474207 4396661 4314761 4200985 4130719 4061291 3987290 3859968 3791808
5108 3791808 3710071 3647148 3629149 3671900 3677715 3684027 3680865 3657581 3648403 3693067 3725373 3755235
5096 3755235 3772705 3773881 3832445 3926381 3945173 3912673 3908146 3943771 3965084 3993356 4114623 4214519
$$ packed form
5173F384190j67070k02772j61835j05373o8988r5825n2155O2133O7072R7469J01240
5162E858086K10915K67681K57287J01876J05196m9298k06724l28039l03909l23974
5152E589097j52586p1106r3066n8404p0351j35894j11699J4639j17551j10643
5142D682436k04175m8962l6298l9567l2482n4492M6069L6072O0066Q5382l832
5131D490217R818K9270m4081j00498l7879n482j3154L6042o9218k676L9606J15582
5119D447547Q2915j790n4465p7546q1900j13776p0266o9428p4001j27322o8160
5108C791808q1737o2923j7999M2751N815O312l162k3284r178M4664L2306K9862
5096C755235J7470J176N8564R3936J8792l2500m527L5625K1313K8272J21267R9896
$$ plain form
5084 4214519 4211579 4243788 4239675 4176469 4041124 4017343 3954294 3937370 3915158 3785823 3747765
5073 3747765 3788006 3769954 3812396 3817605 3766968 3781516 3878093 3941737 3934343 3898739 3881138 3909808
5061 3909808 3946828 3958032 3987546 3950349 3881778 3930737 3906725 3970931 3946601 3933647 3984533
5050 3984533 4002323 3991037 3858471 3843970 3792231 3740234 3808673 3795354 3764496 3850367 3918622
5039 3918622 3899098 3914858 3953979 3954424 3982284 4028514 4015384 3987480 3914953 3909112 3896345 3931864
5027 3931864 3804639 3743735 3776499 3763697 3728555 3746854 3727675 3741750 3767975 3673673 3640918
5016 3640918 3667099 3698275 3717474 3707679 3707738 3757069 3811580 3795567 3856030 3947846 3902782 3839398
5004 3839398 3869174 3874719 3860330 3936415 3933700 3838652 3863123 3838544 3820221 3814998 3827983 3818963
$$ packed form
5084D214519k940L2209m113o3206j35345k3781o3049j6924k2212j29335l8058
5073C747765M0241j8052M2442N209n0637J4548R6577O3644p394l5604j7601K8670
5061C909808L7020J1204K9514l7197o8571M8959k4012O4206k4330j2954N0886
5050C984533J7790j1286j32566j4501n1739n1997O8439j3319l0858Q5871O8255
5039C918622j9524J5760L9121M45K7860M6230j3130k7904p2527n841j2767L5519
5027C931864j27225o0904L2764j2802l5142J8299j9179J4075K6225r4302l2755
5016C640918K6181L1176J9199r795N9M9331N4511j6013O0463R1816m5064o3384
5004C839398K9776N545j4389P6085k715r5048K4471k4579j8323n223J2985r020
$$ plain form
4992 3818963 3865258 3952699 3923187 3905623 3946273 3979338 3912890 3901808 3966252 4025317 4068548
4981 4068548 4016257 4123286 4279031 4360525 4473930 4560963 4693829 4873823 5043507 5170319
4971 5170319 5377311 5559040 5639682 5739633 5880102 5979422 6142299 6361059 6677684 7022841
4961 7022841 7420261 7912850 8575605 9373550 10169992 10947397 11585574 11912710 11998392 11792888
4951 11792888 11371614 10890444 10321726 9808605 9399222 9048789 8747011 8556111 8387091
4942 8387091 8269647 8274921 8294749 8337325 8444890 8568723 8687169 8929383 9228799 9524838
4932 9524838 9974279 10676223 11667603 12799515 14142710 15728752 17512883 19109435 20264437
4923 20264437 20747015 20415666 19599584 18395353 16956624 15587741 14464023 13419714 12625107
$$ packed form
4992C818963M6295Q7441k9512j7564M0650L3065o6448j1082O4444N9065M3231
4981D068548n2291J07029J55745Q1494J13405Q7033J32866J79994J69684J26812
4971E170319K06992J81729Q0642R9951J40469R9320J62877K18760L16625L45157
4961G022841L97420M92589O62755P97945P96442P77405O38177L27136Q5682k05504
4951A1792888m21274m81170n68718n13121m09383l50433l01778j90900j69020
4942H387091j17444N274J9828M2576J07565J23833J18446K42214K99416K96039
4932I524838M49441P01944R91380J131912J343195J586042J784131J596552J155002
4923B0264437M82578l31349q16082j204231j438729j368883j123718j044309p94607
$$ plain form
4914 12625107 12161020 11788050 11303222 10920075 10675418 10445189 10303705 10100819 9991529
4905 9991529 9988060 10094834 10137572 10285807 10467995 10531562 10828545 11205790 11752984 12324919
4895 12324919 12870991 13328961 13669641 13817025 13645829 13337166 12969588 12539249 12012441
4886 12012441 11416028 10929325 10481156 10208032 10132674 10041711 9967570 9805819 9595722 9608248
4876 9608248 9520912 9436907 9447635 9525135 9679251 9780324 9819742 9794718 9811761 9852666 9764199
4865 9764199 9717579 9650092 9558288 9540124 9489472 9513791 9509999 9468535 9486349 9637522 9836105
4854 9836105 9928757 9974461 10044871 10029215 10188178 10452515 10892884 11568277 12764954 14695244
4844 14695244 17378174 19035863 18887899 17874554 16170066 14373652 12890060 11811169
$$ packed form
4914A2625107m64087l72970m84828l83147k44657k30229j41484k02886j09290
4905I991529l469J06774M2738J48235J82188O3567K96983L77245N47194N71935
4895A2324919N46072M57970L40680J47384j71196l08663l67578m30339n26808
4886A2012441n96413m86703m48169k73124p5358r0963p4141j61751k10097J2526
4876I608248q7336q4005J0728P7500J54116J01073L9418k5024J7043M0905q8467
4865I764199m6620o7487r1804j8164n0652K4319l792m1464J7814J51173J98583
4854I836105R2652M5704P0410j5656J58963K64337M40369O75393J196677J930290
4844A4695244K682930J657689j47964j013345j704488j796414j483592j078891
$$ plain form
4836 11811169 11042768 10528622 10145861 9975352 9849686 9602423 9329439 9170344 9046349
4827 9046349 8945972 8843039 8750529 8648972 8599253 8611784 8522883 8379656 8338393 8290714 8175188
4816 8175188 8078483 8132775 8091176 8051759 8136120 8193987 8268338 8337186 8471661 8600192 8758667
4805 8758667 8949906 9105398 9218869 9320721 9420292 9467487 9500715 9513930 9402766 9221604
4795 9221604 9103222 8967392 8802039 8684575 8677751 8712625 8669423 8686881 8543232 8323478
4785 8323478 8094768 7947452 7857838 7739470 7653383 7636858 7664091 7830303 7920234 7964347 8100890
4774 8100890 8270624 8478364 8785410 9043352 9172494 9310421 9497076 9662448 9784943 9732230
4764 9732230 9673630 9595513 9495006 9406119 9314807 9286976 9338155 9382758 9431104 9512323 9490635
$$ packed form
4836A1811169p68401n14146l82761j70509j25666k47263k72984j59095j23995
4827I046349j00377j02933r2510j01557m9719J2531q8901j43227m1263m7679j15526
4816H175188r6705N4292m1599l9417Q4361N7867P4351O8848J34475J28531J58475
4805H758667J91239J55492J13471J01852R9571M7195L3228J3215j11164j81162
4795I221604j18382j35830j65353j17464o824L4874m3202J7458j43649k19754
4785H323478k28710j47316q9614j18368q6087j6525K7233J66212Q9931M4113J36543
4774H100890J69734K07740L07046K57942J29142J37927J86655J65372J22495n2713
4764I732230n8600p8117j00507q8887r1312k7831N1179M4603M8346Q1219k1688
$$ plain form
4753 9490635 9570101 9663090 9825246 9982041 10168053 10328467 10433533 10507197 10441027 10371186
4743 10371186 10503164 10511722 10614396 10898231 11016740 11141907 11346778 11517477 11620998 11705850
4733 11705850 11762299 11782940 11783507 11844657 11722484 11557713 11457491 11330531 11189478 11130149 11059278
4722 11059278 10961158 10939916 10991153 11004540 11026645 11030165 11160804 11247637 11327548 11589556 11792840
4711 11792840 11848421 11991702 12212574 12200226 12153736 12007492 11721912 11481684 11221281 10824678
4701 10824678 10395841 10007253 9568277 9137002 8857835 8518942 8266853 8133906 8031055
4692 8031055 7978671 7968922 7986089 8034682 8040413 8112825 8106032 8076990 7962380 7837862 7791091 7679973
4680 7679973 7531605 7488423 7422742 7386004 7294065 7089812 6992772 6982612 6823776 6611989 6496393
$$ packed form
4753I490635P9466R2989J62156J56795J86012J60414J05066P3664o6170o9841
4743A0371186J31978Q558J02674K83835J18509J25167K04871J70699J03521Q4852
4733A1705850N6449K0641N67O1150j22173j64771j00222j26960j41053n9329p0871
4722A1059278r8120k1242N1237J3387K2105L520J30639Q6833P9911K62008K03284
4711A1792840N5581J43281K20872j2348m6490j46244k85580k40228k60403l96603
4701A0824678m28837l88588m38976m31275k79167l38893k52089j32947j02851
4692H031055n2384r749J7167M8593N731P2412o793k9042j14610j24518m6771j11118
4680G679973j48368m3182o5681l6738r1939k04253r7040j0160j58836k11787j15596
$$ plain form
4669 6496393 6326015 6209890 6178217 6181976 6176318 6162504 6182374 6091806 6104470 6078362 6058968
4658 6058968 6101277 6102516 6026182 5976913 5879490 5768998 5790896 5749026 5689295 5690636 5727785 5654581
4646 5654581 5674172 5798612 5822335 5781279 5858370 5967453 6073581 6196471 6382342 6557481
4636 6557481 6748038 6820148 6902980 7091514 7306380 7462232 7772583 8130876 8610570 9218495
4626 9218495 9680909 9780699 9714896 9518280 9271403 9048150 8901037 8977688 9024022 9091305
4616 9091305 9275606 9650430 9948454 10308294 10727040 11159055 11597558 12034925 12372059 12682498
4606 12682498 13062971 13483035 14023839 14692884 15310095 15838504 16353638 16851138 17321042
4597 17321042 17799246 18458697 19106574 19837974 20456903 20910883 21328575 21778318 22275133
$$ packed form
4669F496393j70378j16125l1673L759n658j3814J9870r0568J2664k6108j9394
4658F058968M2309J239p6334m9269r7423j10492K1898m1870n9731J341L7149p3204
4646E654581J9591J24440K3723m1056P7091J09083J06128J22890J85871J75139
4636F557481J90557P2110Q2832J88534K14866J55852L10351L58293M79694O07925
4626I218495M62414R9790o5803j96616k46877k23253j47113P6651M6334O7283
4616I091305J84301L74824K98024L59840M18746M32015M38503M37367L37134L10439
4606A2682498L80473M20064N40804O69045O17211N28409N15134M97500M69904
4597A7321042M78204O59451O47877P31400O18929M53980M17692M49743M96815
$$ plain form
4588 22275133 22869788 23626153 24500828 25445367 26476360 27586835 28598320 29761903 31095889
4579 31095889 32614280 34409062 36433176 38514315 40677461 43053692 45756769 48893070
4571 48893070 52884512 58298950 65644432 75576805 88359301 103325600 119404722 135128020
4563 135128020 148475795 157471144 160500002 157442673 149012558 136547772 121877480 106852866
4555 106852866 93054778 81437993 72300288 65681072 61151648 58363164 56974571 56782778
4547 56782778 57622356 59418033 61963264 64906808 68151794 71252487 73736019 75360977
4539 75360977 75921108 75500688 74430164 72937253 71221893 69596821 68344025 67407757 66785184
4530 66785184 66627809 66876655 67441239 68508332 70053349 72153684 74918053 78317951 82794910
$$ packed form
4588B2275133N94655P56365Q74675R44539J030993J110475J011485J163583J333986
4579C1095889J518391J794782K024114K081139K163146K376231K703077L136301
4571D8893070L991442N414438P345482R932373J2782496J4966299J6079122J5723298
4563A35128020J3347775Q995349L028858l057329q430115j2464786j4670292j5024614
4555A06852866j3798088j1616785r137705o619216m529424k788484j388593j91793
4547E6782778Q39578J795677K545231K943544L244986L100693K483532J624958
4539G5360977N60131m20420j070524j492911j715360j625072j252796r36268o22573
4530F6785184j57375K48846N64584J067093J545017K100335K764369L399898M476959
$$ plain form
4521 82794910 88567193 96230490 106334889 119437387 135608208 154015517 173422566
4514 173422566 191898102 207197497 217073679 220106248 215927167 205130484 189047714
4507 189047714 169627045 149190820 129506015 111748826 96543441 83786785 73482491
4500 73482491 65207225 58361191 52733716 48156896 44435089 41362855 38975997 37047227
4492 37047227 35449696 34242258 33340332 32560189 31887035 31412352 30824236 30223997 29684153
4483 29684153 29097796 28431232 27716389 26915117 26153504 25522413 24976630 24391997 23937532
4474 23937532 23554293 23224717 22914765 22683612 22310676 21851168 21421533 21061319 20592831
4465 20592831 20111300 19759337 19467296 19193685 18994086 18831873 18704740 18647508 18547359 18484887
$$ packed form
4521H2794910N772283P663297J0104399J3102498J6170821J8407309J9407049
4514A73422566J8475536J5299395R876182L032569m179081j0796683j6082770
4507A89047714j9420669k0436225j9684805j7757189j5205385j2756656j0304294
4500G3482491q275266o846034n627475m576820l721807l072234k386858j928770
4492C7047227j597531j207438r01926p80143o73154m74683n88116o00239n39844
4483B9684153n86357o66564p14843q01272p61613o31091n45783n84633m54465
4474B3937532l83239l29576l09952k31153l72936m59508m29635l60214m68488
4465B0592831m81531l51963k92041k73611j99599j62213j27133n7232j00149o2472
$$ plain form
4455 18484887 18436501 18470768 18518629 18587023 18734944 19001261 19339018 19796524 20399623 21057121
4445 21057121 21896612 23066427 24521069 26107736 27998068 29863914 31496820 32731438
4437 32731438 33440616 33614151 32890491 31513111 29619107 27466122 25165520 22920149 20862328
4428 20862328 18987431 17278495 15820520 14571935 13550513 12638417 11844104 11134448 10564609
4419 10564609 10025670 9583329 9118109 8725313 8394352 8012331 7724570 7525855 7306831
4410 7306831 7168987 7079247 6947059 6847798 6728271 6740620 6601942 6576069 6562494 6487834 6344864
4399 6344864 6219890 6081957 5897791 5905042 5842194 5786515 5755310 5708275 5456687 5127247 4978998
4388 4978998 4785511 4462755 4227905 4159383 4059862 3951785 3948576 3893772 3804741 3747206 3616460
$$ packed form
4455A8484887m8386L4267M7861O8394J47921K66317L37757M57506O03099O57498
4445B1057121Q39491J169815J454642J586667J890332J865846J632906J234618
4437C2731438P09178J73535p23660j377380j894004k152985k300602k245371k057821
4428B0862328j874897j708936j457975j248585j021422r12096p94313p09656n69839
4419A0564609n38939m42341m65220l92796l30961l82021k87761j98715k19024
4410G306831j37844q9740j32188r9261j19527J2349j38678k5873j3575p4660j42970
4399F344864j24974j37933j84166P251o2848n5679l1205m7035k51588l29440j48249
4388D978998j93487l22756k34850o8522r9521j08077l209n4804q9031n7535j30746
$$ plain form
4377 3616460 3469371 3442020 3492631 3466015 3435031 3397425 3363416 3291598 3292220 3276797 3199532 3172928
4365 3172928 3144501 3033581 2967976 2954233 2834174 2802565 2754853 2684785 2617100 2545796 2618967
4354 2618967 2620980 2576225 2566897 2527888 2503258 2499249 2517065 2527163 2423534 2364468 2375964 2346343
4342 2346343 2312334 2275896 2229728 2121369 2091746 1973518 1898614 1897035 1870264 1800947 1697187
4331 1697187 1685274 1612543 1591272 1653164 1646112 1651265 1508354 1473314 1490077 1502187 1508124 1452964
4319 1452964 1394485 1418922 1510406 1440515 1338854 1347247 1363981 1368719 1334155 1276283 1214855 1251082
4307 1251082 1325578 1304503 1297314 1214313 1208512 1231746 1266981 1344294 1335706 1308837 1351251 1342599
4295 1342599 1387472 1400971 1356466 1365687 1418335 1375768 1320285 1365275 1350874 1341810 1296808 1324624
$$ packed form
4377C616460j47089k7351N0611k6616l0984l7606l4009p1818O22j5423p7265k6604
4365C172928k8427j10920o5605j3743j20059l1609m7712p0068o7685p1304P3171
4354B618967K013m4755r328l9009k4630m009J7816J0098j03629n9066J1496k9621
4342B346343l4009l6438m6168j08359k9623j18228p4904j579k6771o9317j03760
4331A697187j1913p2731k1271O1892p052N153j42911l5040J6763J2110N937n5160
4319A452964n8479K4437R1484o9891j01661Q393J6734M738l4564n7872o1428L6227
4307A251082P4496k1075p189q3001n801K3234L5235P7313q588k6869M2414q652
4295A342599M4873J3499m4505R221N2648m2567n5483M4990j4401r064m5002K7816
$$ plain form
4283 1324624 1238287 1184676 1228072 1187779 1278454 1338030 1389895 1425283 1578748 1715654 1752650
4272 1752650 1768958 1777065 1796822 1723151 1681756 1600379 1486202 1425455 1375552 1363234 1309766
4261 1309766 1277880 1219665 1143730 1197120 1190715 1125885 1152894 1189028 1152953 1167380 1269126
4250 1269126 1249541 1284510 1361057 1377626 1387301 1390897 1369530 1281146 1298447 1340770 1270833 1196429
$$ packed form
4283A324624q6337n3611M3396m0293R0675N9576N1865L5388J53465J36906L6996
4272A752650J6308Q107J9757p3671m1395q1377j14177o0747m9903j2318n3468
4261A309766l1886n8215p5935N3390o405o4830K7009L6134l6075J4427J01746
4250A269126j9585L4969P6547J6569R675L596k1367q8384J7301M2323o9937p4404
$$ [...]
##END NTUPLES=NMR SPECTRUM
##END=
