##TITLE=1H_CA-9388-1
 200.13MHz, CDCl3,
 8 sc
 
 22.10.2025
##JCAMPDX= 6.0         $$ Bruker NMR JCAMP-DX V2.0
##DATA TYPE= NMR SPECTRUM
##DATA CLASS= NTUPLES
##ORIGIN= UXNMR, Bruker Analytische Messtechnik GmbH
##OWNER= pz
$$ XWIN-NMR		Version 3.5
$$ Wed Oct 22 14:51:52 2025 Russian Standard Time (UT+4h)  she@DPX200
##.OBSERVE FREQUENCY= 200.1313
##.OBSERVE NUCLEUS= ^1H
##.ACQUISITION MODE= SIMULTANEOUS
##.ACQUISITION SCHEME= undefined
##.AVERAGES= 8
##.DIGITISER RES= 18
##SPECTROMETER/DATA SYSTEM= spect
##.PULSE SEQUENCE= zg30
##.SOLVENT NAME= CDCl3
##.SHIFT REFERENCE= (INTERNAL, CDCl3, 0, 15.0012)
##AUDIT TRAIL= $$ (NUMBER, WHEN, WHO, WHERE, WHAT)
$$ ##TITLE= Audit trail, XWIN-NMR		Version 3.5
$$ ##JCAMPDX= 5.01
$$ ##ORIGIN= Bruker BioSpin GmbH
$$ ##OWNER= she
$$ F:/spectra/data/she/nmr/H-C/1/pdata/1/auditp.txt
$$ ##AUDIT TRAIL=  $$ (NUMBER, WHEN, WHO, WHERE, WHAT)
(   1,<2025-10-22 14:50:26.14 +0400>,<she>,<DPX200>,
      <created by zg, POWCHK disabled, PULCHK disabled
       configuration hash MD5:
       00 E9 B6 7A A2 85 ED C7 34 08 36 98 17 FE 4E 26
       data hash MD5: 16K
       1F 39 EB F0 CB 0C 04 1A CD C9 A2 D0 A5 EC EC F1>)
(   2,<2025-10-22 14:50:28.48 +0400>,<she>,<DPX200>,
      <Start of raw data processing
       efp BC_mod = 2 LB = 0.25 FT_mod = 6 PKNL = 1 PHC0 = -2372.625 PHC1 = -62.80768 SI = 16K 
       data hash MD5: 16K
       E6 36 46 E7 E0 77 E7 F4 27 96 5B BA B1 80 53 32>)
(   3,<2025-10-22 14:51:10.53 +0400>,<she>,<DPX200>,
      <pk PHC0 = -130.1989 PHC1 = 25.6 
       data hash MD5: 16K
       06 DD A2 37 87 64 0C 62 5C 8E 12 61 46 79 35 E6>)
(   4,<2025-10-22 14:51:14.46 +0400>,<she>,<DPX200>,
      <abs ABSG = 5 
       data hash MD5: 16K
       AD 08 96 EC E9 F4 80 E9 F7 41 35 F0 01 66 1E EE>)
$$ ##END=
$$ 
$$ hash MD5
$$ 08 9C 4B 64 7A 1B AA 0C 71 5C 84 8D BC AA 56 29
##$RELAX= 
##$RELAX= 
##$RELAX= 
##$RELAX= 
##$RELAX= 
##$RELAX= 
$$ Bruker specific parameters
$$ --------------------------
##$DU= <F:/spectra>
##$EXPNO= 1
##$NAME= <H-C>
##$PROCNO= 1
##$TYPE= <nmr>
##$USER= <she>
##$AMP= (0..31)
100 100 100 100 100 100 100 100 100 100 100 100 100 100 100 100 100 100 
100 100 100 100 100 100 100 100 100 100 100 100 100 100 
##$AQSEQ= 0
##$AQ_mod= 1
##$AUNM= <au_zg>
##$AUTOPOS= <>
##$BF1= 200.13
##$BF2= 200.13
##$BF3= 200.13
##$BF4= 200.13
##$BF5= 200.13
##$BF6= 200.13
##$BF7= 200.13
##$BF8= 200.13
##$BYTORDA= 1
##$CFDGTYP= 0
##$CFRGTYP= 5
##$CHEMSTR= <none>
##$CNST= (0..31)
1 1 145 1 1 1 1 1 1 1 1 1 1 1 1 1 1 1 1 1 1 1 1 1 1 1 1 1 1 1 1 1 
##$CPDPRG= <>
##$CPDPRG1= <>
##$CPDPRG2= <>
##$CPDPRG3= <>
##$CPDPRG4= <mlev>
##$CPDPRG5= <mlev>
##$CPDPRG6= <mlev>
##$CPDPRG7= <mlev>
##$CPDPRG8= <mlev>
##$CPDPRGB= <>
##$CPDPRGT= <>
##$D= (0..31)
0 0.7 0 0 0 0 0 0 0 0 0 0.03 0 0 0 0 0 0 0 0 0 0 0 0 0 0 0 0 0 0 0 0 
##$DATE= 1761130225
##$DBL= (0..7)
120 120 120 120 120 120 120 120 
##$DBP= (0..7)
150 150 150 150 150 150 150 150 
##$DBP07= 0
##$DBPNAM0= <>
##$DBPNAM1= <>
##$DBPNAM2= <>
##$DBPNAM3= <>
##$DBPNAM4= <>
$$ [...]
##$SUBNAM3= <"">
##$SUBNAM4= <"">
##$SUBNAM5= <"">
##$SUBNAM6= <"">
##$SUBNAM7= <"">
##$SUBNAM8= <"">
##$SUBNAM9= <"">
##$SW= 18.0517328524113
##$SWIBOX= (0..15)
0 0 2 0 0 0 0 0 0 0 0 0 0 0 0 0 
##$SW_h= 3612.71676300578
##$TD= 16384
##$TD0= 1
##$TE= 0
##$TE2= 300
##$TE3= 300
##$TEG= 300
##$TL= (0..7)
0 120 120 120 120 120 120 120 
##$TP= (0..7)
150 150 150 150 150 150 150 150 
##$TP07= 0
##$TPNAME0= <>
##$TPNAME1= <>
##$TPNAME2= <>
##$TPNAME3= <>
##$TPNAME4= <>
##$TPNAME5= <>
##$TPNAME6= <>
##$TPNAME7= <>
##$TPOAL= (0..7)
0.5 0.5 0.5 0.5 0.5 0.5 0.5 0.5 
##$TPOFFS= (0..7)
0 0 0 0 0 0 0 0 
##$TUNHIN= 0
##$TUNHOUT= 0
##$TUNXOUT= 0
##$USERA1= <user>
##$USERA2= <user>
##$USERA3= <user>
##$USERA4= <user>
##$USERA5= <user>
##$V9= 5
##$VALIST= <valist>
##$VCLIST= <CCCCCCCCCCCCCCC>
##$VD= 0
##$VDLIST= <DDDDDDDDDDDDDDD>
##$VPLIST= <PPPPPPPPPPPPPPP>
##$VTLIST= <TTTTTTTTTTTTTTT>
##$WBST= 1024
##$WBSW= 4
##$XGAIN= (0..3)
0 0 0 0 
##$XL= 0
##$YL= 0
##$YMAX_a= 84220
##$YMIN_a= -166054
##$ZGOPTNS= <>
##$ZL1= 120
##$ZL2= 120
##$ZL3= 120
##$ZL4= 120
##$ABSF1= 15.00121
##$ABSF2= -3.05063
##$ABSG= 5
##$ABSL= 3
##$ALPHA= 0
##$AQORDER= 0
##$ASSFAC= 0
##$ASSFACI= 0
##$ASSFACX= 0
##$ASSWID= 0
##$AUNMP= <proc_1d>
##$AZFE= 0.1
##$AZFW= 0.1
##$BCFW= 0
##$BC_mod= 2
##$BYTORDP= 0
##$COROFFS= 0
##$CY= -3
##$DATMOD= 1
##$DC= 0
##$DFILT= <>
##$DTYPP= 0
##$F1P= 0
##$F2P= 0
##$FCOR= 1
##$FTSIZE= 16384
##$FT_mod= 6
##$GAMMA= 0
##$GB= 0
##$INTBC= 1
##$INTSCL= 3.241238e-09
##$ISEN= 128
##$LB= 0.25
##$LEV0= 0
##$LPBIN= 0
##$MAXI= 10000
##$MC2= 0
##$MEAN= 0
##$ME_mod= 0
##$MI= 1.114404
##$NCOEF= 0
##$NC_proc= -10
##$NLEV= 6
##$NOISF1= 3.799351
##$NOISF2= 2.8
##$NSP= 0
##$NTH_PI= 0
##$NZP= 0
##$OFFSET= 15.00121
##$PC= 1
##$PHC0= -2502.824
##$PHC1= -37.20768
##$PH_mod= 1
##$PKNL= yes
##$PPARMOD= 0
##$PSCAL= 0
##$PSIGN= 0
##$REVERSE= no
##$SF= 200.130104165609
##$SI= 16384
##$SIGF1= 3
##$SIGF2= 2
##$SINO= 0.751879
##$SIOLD= 32768
##$SREGLST= <19F.Aceton>
##$SSB= 0
##$STSI= 16384
##$STSR= 0
##$SW_p= 3612.71676300578
##$SYMM= 0
##$S_DEV= 0
##$TDeff= 16384
##$TDoff= 0
##$TI= <>
##$TILT= no
##$TM1= 0
##$TM2= 0
##$TOPLEV= 0
##$USERP1= <user>
##$USERP2= <user>
##$USERP3= <user>
##$USERP4= <user>
##$USERP5= <user>
##$WDW= 1
##$XDIM= 16384
##$YMAX_p= 353947792
##$YMIN_p= -7762692
$$ End of Bruker specific parameters
$$ ---------------------------------
##NTUPLES= NMR SPECTRUM
##VAR_NAME=  FREQUENCY,     SPECTRUM/REAL,   SPECTRUM/IMAG
##SYMBOL=    X,             R,               I
##VAR_TYPE=  INDEPENDENT,   DEPENDENT,       DEPENDENT
##VAR_FORM=  AFFN,          ASDF,            ASDF
##VAR_DIM=   16384,         16384,           16384
##UNITS=     HZ,            ARBITRARY UNITS, ARBITRARY UNITS
##FACTOR=    0.220516191357247, 1,           1
##FIRST=     3002.19376247935, 0,            0
##LAST=      -610.523000526427, 0,           0
##MIN=       -610.523000526427, -7762692,    0
##MAX=       3002.19376247935, 353947792,    0
$$ Real data points
##PAGE= N=1
##DATA TABLE= (X++(R..R)), XYDATA
$$ [...]
$$ plain form
7280 2191773 2376929 2190063 2243859 2115543 2407521 2185006 2192268 2114719 2078713 2039946 2215803
7269 2215803 1965126 2153521 2056809 1710816 1945636 1961127 1798634 1648382 1432389 1542780
7259 1542780 1651745 1839303 1995010 1869887 1960275 1763345 2081032 2086690 1872806 1854657
7249 1854657 1794552 1518231 1491108 1545074 1703873 1533305 1276188 1482693 1546596 1440838
7239 1440838 1390415 1568390 1811573 1537746 1664123 1868111 2137701 2155499 2193023 2035616
7229 2035616 1987959 1983718 1829953 1681813 1863220 2141994 2195128 2316401 2078861 2218045
7219 2218045 2339056 2427269 2405829 2265622 2419567 2257451 2223781 2355146 2632770 2602624
7209 2602624 2808387 2887140 2936088 3022884 3188266 3074854 2733247 2686898 2771548 2684674 2674606
$$ packed form
7280B191773J85156j86866N3796j28316K91978k22515P262p7549l6006l8767J75857
7269B215803k50677J88395r6712l45993K34820J5491j62493j50252k15993J10391
7259A542780J08965J87558J55707j25123R0388j96930L17687N658k13884j8149
7249A854657o0105k76321k7123N3966J58799j70568k57117K06505O3903j05758
7239A440838n0423J77975K43183k73827J26377K03988K69590J7798L7524j57407
7229B035616m7657m241j53765j48140J81407K78774N3134J21273k37540J39184
7219B218045J21011Q8213k1440j40207J53945j62116l3670J31365K77624l0146
7209B602624K05763P8753M8948Q6796J65382j13412l41607m6349Q4650q6874j0068
$$ plain form
7198 2674606 3122741 2933738 2927965 3141021 3146858 3347778 3158814 3376687 3453536 3548608 3365786
7187 3365786 3479675 4157970 4470818 4377301 4408692 4390559 4172522 3964240 4072304 4246628
7177 4246628 4336244 4532962 4366086 4454697 4391962 4537276 4699129 4734712 4758666 5087604
7167 5087604 5078619 5003879 5103249 5379771 5299883 5555871 5530849 5480106 5639649 5785272 5664476
7156 5664476 5765030 6217324 6184340 6177818 6326401 6633620 6502821 6544011 6486843 6585771 6631887
7145 6631887 6888950 6927090 6746340 7022400 7407161 7480078 7380625 7681025 8029361 8185723
7135 8185723 8423746 8996829 9135242 9119917 9555495 9718272 9871351 10468813 10858867 11348863
7125 11348863 11804261 12149287 12512809 12671997 12911969 13135369 13234135 13457705 13762904 14324811
$$ packed form
7198B674606M48135j89003n773K13056N837K00920j88964K17873P6849R5072j82822
7187C365786J13889O78295L12848r3517L1391j8133k18037k08282J08064J74324
7177D246628Q9616J96718j66876Q8611o2735J45314J61853L5583K3954L28938
7167E087604q985p4740R9370K76522p9888K55988k5022n0743J59543J45623j20796
7156E664476J00554M52294l2984o522J48583L07219j30799M1190n7168R8928M6116
7145F631887K57063L8140j80750K76060L84761P2917r9453L00400L48336J56362
7135H185723K38023N73083J38413j5325M35578J62777J53079N97462L90054M89996
7125A1348863M55398L45026L63522J59188K39972K23400R8766K23570L05199N61907
$$ plain form
7115 14324811 14364318 14634618 15054363 15449326 15636940 15746662 15919047 16235524 16814257 17527991
7105 17527991 18114147 18651172 19070855 19798756 20628810 21651337 22930730 24225344 26152374
7096 26152374 28544001 31543029 34370306 37309718 40195657 41088260 40384174 39954937 39440290
7087 39440290 38525700 37509397 36972872 36766612 36584798 36224704 35505075 34755470 34391095
7078 34391095 33415095 32276970 30998070 30157480 29340433 28254877 27284445 26284514 25386334
7069 25386334 24533866 23569541 22748258 21954393 20889781 19969972 19265993 18376069 17712404
7060 17712404 17053135 16484827 15872089 14792675 14389036 13902392 13250583 12553264 12079811
7051 12079811 11914240 11520045 11165674 10687103 10071181 9795947 9624558 9375310 9071992
$$ packed form
7115A4324811L9507K70300M19745L94963J87614J09722J72385L16477N78733P13734
7105A7527991N86156N37025M19683P27901Q30054J022527J279393J294614J927030
7096B6152374K391627K999028K827277K939412K885939Q92603p04086m29237n14647
7087C9440290r14590j016303n36525k06260j81814l60094p19629p49605l64375
7078C4391095r76000j138125j278900q40590q17047j085556r70432r99931q98180
7069B5386334q52468r64325q21283p93865j064612r19809p03979q89924o63665
7060A7712404o59269n68308o12738j079414m03639m86644o51809o97319m73453
7051A2079811j65571l94195l54371m78571o15922k75234j71389k49248l03318
$$ plain form
7042 9071992 8708130 8621253 8685697 8291666 8005506 7800749 7745499 7624615 7255910 7194178
7032 7194178 7338319 7143523 7106747 7096713 7021353 6718762 6649046 6618947 6635460 6819951 6444366
7021 6444366 6148678 6133162 6253058 6110834 5999995 5837537 5859750 5930053 5355336 5072138
7011 5072138 5112630 5178115 5169482 5075702 5097432 4839084 4801405 4518306 4268055 4350254 4532738
7000 4532738 4572838 4521902 4125555 4359056 4616771 4280210 3836151 4071304 4156859 4162287
6990 4162287 4119118 3967870 4174113 4153201 3958785 3693882 3844999 4053246 4160284 3866778
6980 3866778 3677496 3887200 3765964 3680787 3748407 3802070 4024400 3904850 3623757 3569650
6970 3569650 4069867 4107712 3944921 3839337 3903236 3964928 3742250 3522764 3580346 3650819
$$ packed form
7042I071992l63862q6877O4444l94031k86160k04757n5250j20884l68705o1732
7032G194178J44141j94796l6776j0034p5360l02591o9716l0099J6513J84491l75585
7021F444366k95688j5516J19896j42224j10839j62458K2213P0303n74717k83198
7011E072138M0492O5485q633r3780K1730k58348l7679k83099k50251Q2199J82484
7000D532738M0100n0936l96347K33501K57715l36561m44059K35153Q5555N428
6990D162287m3169j51248K06243k0912j94416k64903J51117K08247J07038k93506
6980C866778j89282K09704j21236q5177O7620N3663K22330j19550k81093n4107
6970C569650N00217L7845j62791j05584O3899O1692k22678k19486N7582P0473
$$ plain form
6960 3650819 3399046 3626718 3745620 4090512 3866017 3411283 3646176 3832158 3938627 3686771
6950 3686771 3578123 3560398 3738344 3686654 3414695 3624638 3934392 3716918 3445819 3599890
6940 3599890 3514407 3519666 3930145 3872418 3568121 3720064 3570068 3533854 3534087 3494243 3699488
6929 3699488 3810565 3892018 4114552 4231760 4002708 3808282 3959538 4381798 4039013 3901603
6919 3901603 4103783 4336655 4321065 4309669 4173831 4472729 4622009 4520602 4409465 4569436
6909 4569436 4710786 4384865 4160060 4346586 4435048 4717067 4608396 4568531 4760043 4893173
6899 4893173 5069031 4676135 4785926 5134423 5187811 5218750 5370684 5225993 5278085 5188611
6889 5188611 4840650 4960742 5284167 5444521 5376106 5453542 5624829 5581274 5468129 5485506
$$ packed form
6960C650819k51773K27672J18902L44892k24495m54734K34893J85982J06469k51856
6950C686771j08648j7725J77946n1690k71959K09943L09754k17474k71099J54071
6940C599890q5483N259M10479n7727l04297J51943j49996l6214K33l9844K05245
6929C699488J11077Q1453K22534J17208k29052j94426J51256M22260l42785j37410
6919C901603K02180K32872j5590j1396j35838K98898J49280j01407j11137J59971
6909D569436J41350l25921k24805J86526Q8462K82019j08671l9865J91512J33130
6899D893173J75858l92896J09791L48497N3388L0939J51934j44691N2092q9474
6889E188611l47961J20092L23425J60354o8415P7436J71287m3555j13145J7377
$$ plain form
6879 5485506 5880778 6010904 5857021 5714083 5783097 5887846 5979204 5732585 5584304 5735334
6869 5735334 5935524 5795623 5843886 5813691 5940385 5900695 5571703 5902727 6173454 6563625
6859 6563625 6005479 5855054 6044652 6270721 6589037 6025293 6138553 6633482 6719235 6294391
6849 6294391 6165859 6247375 6477373 6468010 6220627 6402137 6639506 6613821 6615846 6617394 6637165
6838 6637165 6734721 6480591 6401829 6902670 7078518 6881559 6691184 6909260 7185688 7067665
6828 7067665 7042746 6976758 7068601 7312634 7525046 7551975 7414565 7568356 7632566 7756672
6818 7756672 7837862 7746118 7707139 7841166 7711181 8024101 7971037 7674780 7639388 7943798
6808 7943798 8098443 8067460 8083778 8118895 8300965 8501843 8472927 8108907 8227662 8532189
$$ packed form
6879E485506L95272J30126j53883j42938O9014J04749R1358k46619j48281J51030
6869E735334K00190j39901M8263l0195J26694l9690l28992L31024K70727L90171
6859F563625n58146j50425J89598K26069L18316n63744J13260M94929Q5753m24844
6849F294391j28532Q1516K29998r363k47383J81510K37369k5685K025J548J9771
6838F637165R7556k54130p8762N00841J75848j96959j90375K18076K76428j18023
6828G067665k4919o5988R1843K44033K12412K6929j37410J53791O4210J24106
6818G756672Q1190r1744l8979J34027j29985L12920n3064k96257l5392L04410
6808G943798J54645l0983J6318L5117J82070K00878k8916l64020J18755L04527
$$ plain form
6798 8532189 8423272 8134936 8464134 8781778 8783008 9013634 8663361 8685403 8894520 8835586
6788 8835586 8671435 8811029 9068490 9294576 9131837 8922292 9240346 9425871 9410062 9002777
6778 9002777 9067909 9247734 9479460 9508056 9646780 9925971 10208218 10451750 10124923 10091809
6768 10091809 10387291 10414735 10372513 10312109 10204118 10395353 10515735 10135592 10449916 10681844
6758 10681844 10719498 10346698 10581058 10577895 10678105 10595155 10728714 10888388 10915564 11307986
6748 11307986 11006404 11276168 11379117 11501762 11262231 11312394 11564380 11486799 11341946 11180029
6738 11180029 11479590 11494267 11701333 11663472 11921112 11697644 11895482 11968689 11836944 12026140
6728 12026140 12044831 12206359 12211943 12443087 12681623 12688830 12381739 12769701 13005369 12771175
$$ packed form
6798H532189j08917k88336L29198L17644J230K30626l50273K2042K09117n8934
6788H835586j64151J39594K57461K26086j62739k09545L18054J85525j5809m07285
6778I002777O5132J79825K31726K8596J38724K79191K82247K43532l26827l3114
6768A0091809K95482K7444m2222o0404j07991J91235J20382l80143L14324K31928
6758A0681844L7654l72800K34360l163J00210q2950J33559J59674K7176L92422
6748A1307986l01582K69764J02949J22645k39531N0163K51986p7581j44853j61917
6738A1180029K99561J4677K07066l7861K57640k23468J97838P3207j31745J89196
6728A2026140J8691J61528N584K31144K38536P207l07091L87962K35668k34194
$$ plain form
6718 12771175 12856257 12828570 13089452 13120864 13467470 13483211 13650576 14068097 13816332 13745694
6708 13745694 13563662 13597839 13724797 14291860 14295855 14337429 14582170 14741773 14393287 14365662
6698 14365662 14932229 14981170 14957134 15146260 15446465 15858788 15841917 15934612 15951237 16228045
6688 16228045 16436667 16366195 16900793 17358339 17586453 17666988 17323173 17817431 18260875 18487688
6678 18487688 18712447 18692693 19109732 18905003 19241656 19273658 19808003 20162355 20396850 20669812
6668 20669812 20642149 21190463 21401153 21557408 21598994 21801827 21969133 22136459 22459403 22897062
6658 22897062 22980539 22964174 23546402 23787617 24097265 24306229 24185658 24370274 24841538 25628324
6648 25628324 25818911 25706244 25888042 26549927 26761547 26806406 26951199 27184036 27219664 27407503
$$ packed form
6718A2771175Q5082k7687K60882L1412L46606J5741J67365M17521k51765p0638
6708A3745694j82032L4177J26958N67063L995M1574K44741J59603l48486k7625
6698A4365662N66567M8941k4036J89126L00205M12323j6871R2695J6625K76808
6688A6228045K08622p0472N34598M57546K28114Q0535l43815M94258M43444K26813
6678A8487688K24759j9754M17039k04729L36653L2002N34345L54352K34495K72962
6668B0669812k7663N48314K10690J56255M1586K02833J67306J67326L22944M37659
6658B2897062Q3477j6365N82228K41215L09648K08964j20571J84616M71264P86786
6648B5628324J90587j12667J81798O61885K11620M4859J44793K32837L5628J87839
$$ plain form
6638 27407503 27909982 28416718 28596176 28829842 29087900 29308503 29850507 30158029 30207098 30415730
6628 30415730 30780714 31495244 32002197 31915231 32296464 32768239 33045957 33371244 33878914 34399565
6618 34399565 35103865 35638797 35840030 36235374 36563960 36974883 37572016 37691368 38334809
6609 38334809 39227119 39781962 40273703 40702432 41549080 42004641 42386712 43259502 43796260
6600 43796260 44450382 45239494 45695670 46243422 46955363 48000723 49387363 50423434 51583910
6591 51583910 52722748 53965129 54786998 56110296 57625186 58788702 60216497 61884674
6583 61884674 63016021 63834941 65000997 66097394 67864925 69152054 70497553 72335656
6575 72335656 74051715 75482765 77308464 79031171 80855787 83088662 85229615 87625012
$$ packed form
6638B7407503N02479N06736J79458K33666K58058K20603N42004L07522M9069K08632
6628C0415730L64984P14530N06953q6966L81233M71775K77718L25287N07670N20651
6618C4399565P04300N34932K01233L95344L28586M10923N97133J19352O43441
6609C8334809Q92310N54843M91741M28729Q46648M55561L82071Q72790N36758
6600D3796260O54122P89112M56176N47752P11941J045360J386640J036071J160476
6591E1583910J138838J242381Q21869J323298J514890J163516J427795J668177
6583F1884674J131347Q18920J166056J096397J767531J287129J345499J838103
6575G2335656J716059J431050J825699J722707J824616K232875K140953K395397
$$ plain form
6567 87625012 90294471 92936237 96150302 99595879 103173874 107388971 112238233 117049540
6559 117049540 122513773 128432896 134815195 141238308 147582263 153442066 158463382 162370758
6551 162370758 165018220 166570136 167332222 167516135 166926548 166462711 165445580 164411565 163077900
6542 163077900 161487593 159409928 157115340 154743889 151751240 148575589 145297350 142358928
6534 142358928 139400662 135834783 132423777 129577031 126482234 123525088 120198787 116738230
6526 116738230 113725284 110575760 107271216 103977863 101081690 97625430 94380296 91412598
6518 91412598 88977812 86500938 83835226 81246329 78606560 76300043 73921348 71520651
6510 71520651 69118684 67154960 65441002 63492719 61805051 60057387 58522224 56661682
$$ packed form
6567H7625012K669459K641766L214065L445577L577995M215097M849262M811307
6559A17049540N464233N919123O382299O423113O343955N859803N021316L907376
6551A62370758K647462J551916P62086J83913n89587m63837j017131j034015j333665
6542A63077900j590307k077665k294588k371451k992649l175651l278239k938422
6534A42358928k958266l565879l411006k846746l094797k957146l326301l460557
6526A16738230l012946l149524l304544l293353k896173l456260l245134k967698
6518I1412598k434786k476874k665712k588897k639769k306517k378695k400697
6510G1520651k401967j963724j713958j948283j687668j747664j535163j860542
$$ plain form
6502 56661682 55131387 53875810 52575060 51280212 50195669 48771282 47632827 46738076
6494 46738076 45694429 44707318 43598679 42983720 42211696 41291626 40164739 39645377 39118018
6485 39118018 38376945 37348959 36759391 36798366 36591656 36008501 35099263 34625335 33912558
6476 33912558 33373678 32938511 32488497 32196199 31790606 31343380 31239583 31093180 30809941
6467 30809941 30294312 29822323 29803913 29858258 29409664 29200659 29073462 28775189 28543325 28131043
6457 28131043 27837397 27682151 27735305 27677934 27332459 27429351 27723615 27454818 27155429 26792434
6447 26792434 26929903 26862811 26538651 26304045 26239178 26198707 26294606 26209237 25883818 26123448
6437 26123448 26360318 26170150 26094068 26068045 25953684 25786339 25874613 25702561 25912510 26040833
$$ packed form
6502E6661682j530295j255577j300750j294848j084543j424387j138455q94751
6494D6738076j043647r87111j108639o14959p72024r20070j126887n19362n27359
6485C9118018p41073j027986n89568L8975k06710n83155r09238m73928p12777
6476C3912558n38880m35167m50014k92298m05593m47226j03797j46403k83239
6467C0809941n15629m71989j8410N4345m48594k09005j27197k98273k31864m12282
6457B8131043k93646j55246N3154n7371l45475R6892K94264k68797k99389l62995
6447B6792434J37469o7092l24160k34606o4867m0471R5899q5369l25419K39630
6437B6123448K36870j90168p6082k6023j14361j67345Q8274j72052K09949J28323
$$ plain form
6427 26040833 26356439 26224023 26257682 26376320 26519531 26696400 26742063 27176780 27415457 27722519
6417 27722519 28223213 28735902 28749457 28712008 28476506 28266095 28246067 28197619 28092453 28038154
6407 28038154 28458957 28631758 28391749 28836039 28943868 28671215 28640563 28599230 28758767 28984823
6397 28984823 28549490 28267058 28234984 28231107 27788892 27214649 27008548 26887076 27012304 26745185
6387 26745185 26407010 26295457 26113939 25770182 25157361 25080113 25146170 25022249 25036874 24775064
6377 24775064 24580508 24692195 24322043 23858160 23760010 23856215 23381541 22877261 22696467 23011087
6367 23011087 22946701 22533370 22111073 22132358 22424641 22267776 22003550 22080078 22144925 21856868
6357 21856868 21741543 21582302 21904796 21659754 21313090 21208585 21323353 21523262 21612056 21458802
$$ packed form
6427B6040833L15606j32416L3659J18638J43211J76869M5663M34717K38677L07062
6417B7722519N00694N12689J3555l7449k35502k10411k0028m8448j05166n4299
6407B8038154M20803J72801k40009M44290J07829k72653l0652m1333J59537K26056
6397B8984823m35333k82432l2074l877m42215n74243k06101j21472J25228k67119
6387B6745185l38175j11553j81518l43757o12821p7248O6057j23921J4625k61810
6377B4775064j94556J11687l70152m63883r8150R6205m74674n04280j80794L14620
6367B3011087o4386m13331m22297K1285K92283j56865k64226P6528O4847k88057
6357B1856868j15325j59241L22494k45042l46664j04505J14768J99909Q8794j53254
$$ plain form
6347 21458802 21489558 21638721 21599263 21160564 20890790 21182487 21540843 21310344 21028755 21211640
6337 21211640 21413574 21195350 21319674 21477621 21428349 21451861 21328196 21422852 21488201 21510944
6327 21510944 21344859 21184743 21530037 21604893 21348673 21234959 21290962 21375468 21530330 21747328
6317 21747328 21875309 21728293 21678843 21782299 21765349 21808116 22055120 22196072 21971971 21939599
6307 21939599 22224467 22246973 22227580 22146078 22165635 22475256 22508957 22097616 22517410 22903931
6297 22903931 22796454 22521304 22566998 23114549 23313066 23487537 23391714 23511020 23875586 24111663
6287 24111663 23510717 23625515 24005696 24171086 24367198 24417337 24413458 24311305 24404154 24530985
6277 24530985 24515563 24709101 24966752 25169162 25347444 25465339 25097672 25217305 25284890 25479386
$$ packed form
6347B1458802L0756J49163l9458m38699k69774K91697L58356k30499k81589J82885
6337B1211640K01934k18224J24324J57947m9272K3512j23665R4656O5349K2743
6327B1510944j66085j60116L45294P4856k56220j13714N6003Q4506J54862K16998
6317B1747328J27981j47016m9450J03456j6950M2767K47004J40952k24101l2372
6307B1939599K84868K2506j9393q1502J9557L09621L3701m11341M19794L86521
6297B2903931j07477k75150M5694N47551J98517J74471r5823J19306L64566K36077
6287B4111663o00946J14798L80181J65390J96112N0139l879j02153R2849J26831
6277B4530985j5422J93538K57651K02410J78282J17895l67667J19633O7585J94496
$$ plain form
6267 25479386 25735538 25676974 25841950 26106600 26572270 26735637 26524507 26784882 27107027 27364945
6257 27364945 27318100 27075760 27360639 27771331 27755844 27795282 27949254 28277957 28715139 28629856
6247 28629856 28595758 29006354 28969140 29083205 29073771 29274755 29805713 29897407 30064944 30532953
6237 30532953 30815532 31281607 31274168 31255524 31452291 31811214 31833269 31585698 32064967 32278023
6227 32278023 32537020 32729927 33085787 33354292 33240767 33422060 33737887 33382027 33489640
6218 33489640 33728681 33842490 34223700 34357939 34256551 33863769 33962032 34043546 34015823 34280344
6208 34280344 34431870 34550490 34395969 34580644 34578508 34770963 34954802 34767218 34894920 35181689
6198 35181689 35132013 35574961 36037500 36138588 35992793 35933711 35957875 36518921 36814095 37138138
$$ packed form
6267B5479386K56152n8564J64976K64650M65670J63367k11130K60375L22145K57918
6257B7364945m6845k42340K84879M10692j5487L9438J53972L28703M37182q5283
6247B8629856l4098M10596l7214J14065r434K00984N30958R1694J67537M68009
6237C0532953K82579M66075p439j8644J96767L58923K2055k47571M79269K13056
6227C2278023K58997J92907L55860K68505j13525J81293L15827l55860J07613
6218C3489640K39041J13809L81210J34239j01388l92782R8263Q1514k7723K64521
6208C4280344J51526J18620j54521J84675k136J92455J83839j87584J27702K86769
6198C5181689m9676M42948M62539J01088j45795n9082K4164N61046K95174L24043
$$ plain form
6188 37138138 37074003 36988738 37175629 37495646 37678364 37621160 37715416 37642588 37848613 38004481
6178 38004481 38175774 38558707 38670987 38907394 39263251 39450571 39645214 39912823 40220691
6169 40220691 40380353 40839421 41184312 41274795 41283749 41497606 41903990 42019805 42175334 42439536
6159 42439536 42569689 42693211 42969484 43137925 43436385 43649228 43554971 43634246 43939240 44371561
6149 44371561 44523956 44819669 44951829 44913338 45082735 45546548 45845603 46080206 46254619 46396113
6139 46396113 46853853 46887315 47323522 47521827 47724499 48291986 48675800 48903226 49068955 49413676
6129 49413676 49768710 50109859 50365230 50629819 50757745 50935863 51005847 50883516 50939878 51471089
6119 51471089 51647176 51754631 51929607 52151646 52318464 52612473 52779849 52725948 53054373 53087476
$$ packed form
6188C7138138o4135q5265J86891L20017J82718n7204R4256p2828K06025J55868
6178C8004481J71293L82933J12280K36407L55857J87320J94643K67609L07868
6169D0220691J59662M59068L44891R0483Q954K13857M06384J15815J55529K64202
6159D2439536J30153J23522K76273J68441K98460K12843r4257P9275L04994M32321
6149D4371561J52395K95713J32160l8491J69397M63813K99055K34603J74413J41494
6139D6396113M57740L3462M36207J98305K02672N67487L83814K27426J65729L44721
6129D9413676L55034L41149K55371K64589J27926J78118O9984j22331N6362N31211
6119E1471089J76087J07455J74976K22039J66818K94009J67376n3901L28425L3103
$$ plain form
6109 53087476 52843568 53166915 53357590 53580463 53488840 53788927 54112513 54342478 54507777 54558254
6099 54558254 55054369 55607685 56307662 56502581 56793955 57077423 57534652 57992822 58514835
6090 58514835 59120003 59492227 59938232 60419628 60774872 61568330 62133430 62727778 63550543
6081 63550543 64070994 65011964 65780283 66577321 67683703 68740328 69681825 70826816 72404225
6072 72404225 74017559 75542001 77187302 79223492 81506279 84022248 86140864 88591130
6064 88591130 91745577 94631716 97342495 99679915 101345008 103192333 104127238 104027698 103868998
6055 103868998 103711320 102951382 102139617 101398351 100316024 99267792 97871713 96507807 94774128
6046 94774128 93352345 91545857 89771958 87825270 85962413 83906088 81881329 79979184
$$ packed form
6109E3087476k43908L23347J90675K22873r1623L00087L23586K29965J65299N0477
6099E4558254M96115N53316O99977J94919K91374K83468M57229M58170N22013
6090E8514835O05168L72224M46005M81396L55244P93458N65100N94348Q22765
6081F3550543N20451R40970P68319P97038J106382J056625R41497J144991J577409
6072G2404225J613334J524442J645301K036190K282787K515969K118616K450266
6064H8591130L154447K886139K710779K337420J665093J847325R34905r9540j58700
6055A03868998j57678p59938q11765p41266j082327j048232j396079j363906j733679
6046I4774128j421783j806488j773899j946688j862857k056325k024759j902145
$$ plain form
6038 79979184 78122731 76540316 74841720 72778238 71207803 69476052 67782921 66113716
6030 66113716 64319417 62994998 61798568 60285334 58885000 57618437 56358428 55279890
6022 55279890 53991147 52792974 51831588 50620558 49713863 49125012 48236775 47640492 47046608
6013 47046608 46287356 45443507 44971064 44397251 43798762 43142794 42588953 42464455 41870403
6004 41870403 41580986 41250367 40840772 40548138 40163772 39728610 39719709 39678915 39114173 38767237
5994 38767237 38370555 38367123 37957136 37738537 37155952 37251924 37062437 36875994 36699373 36473729
5984 36473729 36182214 36195313 36063970 35626173 35839277 35761426 35341550 35018048 34993027 35466713
5974 35466713 35577937 35082407 34834756 34767219 34745049 34612501 34647015 34722483 34511863 34226002
$$ packed form
6038G9979184j856453j582415j698596k063482j570435j731751j693131j669205
6030F6113716j794299j324419j196430j513234j400334j266563j260009j078538
6022E5279890j288743j198173r61386j211030r06695n88851q88237n96283n93884
6013D7046608p59252q43849m72443n73813n98489o55968n53841j24498n94052
6004D1870403k89417l30619m09595k92634l84366m35162q901m0794n64742l46936
5994C8767237l96682l432m09987k18599n82585R5972j89487j86443j76621k25644
5984C6473729k91515J3099j31343m37797K13104p7851m19876l23502k5021M73686
5974C5466713J11224m95530k47651o7537k2170j32548L4514P5468k10620k85861
$$ plain form
5964 34226002 34011811 34230067 34169149 33895076 33865807 33801392 33980471 34086212 33870516 33701236
5954 33701236 33643821 33366655 33499334 33418495 33459872 33709153 33798703 33825470 33583672 33709212
5944 33709212 33738658 33775750 33487018 33422523 33846207 33656797 33373476 33265164 33603677 33657264
5934 33657264 33562133 33390357 33607106 33548977 33615339 33419421 33401602 33549073 33443824 33709085
5924 33709085 33730164 33899261 34013732 34248457 34146929 34066900 34421136 34305355 34282851 33901498
5914 33901498 34002770 34363629 34489813 34419534 34485018 34670480 34778527 34715866 34467304 34578681
5904 34578681 34673714 35098948 34984148 35473071 35368145 35263187 35367522 35392365 35162146 35158689
5894 35158689 35351323 35389689 35543769 35608566 35526799 35743067 35998511 35734702 35664057 35701685
$$ packed form
5964C4226002k14191K18256o0918k74073k9269o4415J79079J05741k15696j69280
5954C3701236n7415k77166J32679q0839M1377K49281Q9550K6767k41798J25540
5944C3709212K9446L7092k88732o4495M23684j89410k83321j08312L38513N3587
5934C3657264r5131j71776K16749n8129O6362j95918j7819J47471j05249K65261
5924C3709085K1079J69097J14471K34725j01528q0029L54236j15781k2504l81353
5914C3901498J01272L60859J26184p0279O5484J85462J08047o2661k48562J11377
5904C4578681R5033M25234j14800M88923j04926j04958J04335K4843k30219l457
5894C5158689J92634L8366J54080O4797q1767K16268K55444k63809p0645L7628
$$ plain form
5884 35701685 35932169 36061876 35949862 36003514 35615023 35942623 35999511 35970261 35787525 35676027
5874 35676027 35987564 35806304 35954701 35784237 36059350 36246062 36279183 36266787 36827576 36704763
5864 36704763 36623476 36623388 36607626 36979030 37043545 36920525 36784231 37171917 37361329 37331826 37552386
5853 37552386 37382645 37592947 37435475 37595859 37839774 37877069 37808289 37982133 37866393 38109751
5843 38109751 38732498 38602486 38450444 38184009 38544975 38689850 38932433 38977311 39123501 39221929
5833 39221929 39288953 39292931 39296830 39766070 39938382 39813177 39618278 39878542 40154862 40011497
5823 40011497 40204956 40497435 40387107 40395825 40693613 40849232 41076650 40978340 41068965 41130056
5813 41130056 41498998 41753191 41543862 41722776 41755795 41995782 41989794 42169637 42619899 42874664
$$ packed form
5884C5701685K30484J29707j12014N3652l88491L27600N6888k9250j82736j11498
5874C5676027L11537j81260J48397j70464K75113J86712L3121j2396N60789j22813
5864C6704763q1287q8j5762L71404O4515j23020j36294L87686J89412k9503K20560
5853C7552386j69741K10302j57472J60384K43915L7295o8780J73844j15740K43358
5843C8109751O22747j30012j52042k66435L60966J44875K42583M4878J46190R8428
5833C9221929O7024L978L899M69240J72312j25205j94899K60264K76320j43365
5823D0011497J93459K92479j10328Q718K97788J55619K27418r8310R0625O1091
5813D1130056L68942K54193k09329J78914L3019K39987n988J79843M50262K54765
$$ plain form
5803 42874664 42881833 42822422 42687516 43023174 43223629 43118004 43384248 43824298 44139328 43879771
5793 43879771 43724481 43878119 44144129 44282376 44332951 44394724 44700236 44943452 44780773 44927311
5783 44927311 44978821 45149713 45073608 45241760 45402213 45680856 45799010 45664438 45481189 45685037
5773 45685037 46089504 46215468 46147599 46217737 46651735 46326604 46049709 46406043 46424428 46503177
5763 46503177 46340394 46289723 46311090 46634905 46576482 46258866 46490191 46427733 46502068 46407573
5753 46407573 46472097 46612112 46434121 46346635 46547786 46598940 46354076 46411958 46559556 46609479
5743 46609479 46713465 46496414 46472792 46404701 46604007 46766313 46878582 46381073 46250914 46365989
5733 46365989 46519390 46316299 46403944 46596337 46713335 46505992 46306356 46416610 46538405 46455020
$$ packed form
5803D2874664P169n9411j34906L35658K00455j05625K66244M40050L15030k59557
5793D3879771j55290J53638K66010J38247N0575O1773L05512K43216j62679J46538
5783D4927311N1510J70892p6105J68152J60453K78643J18154j34572j83249K03848
5773D5685037M04467J25964o7869P0138M33998l25131k76895L56334J8385P8749
5763D6503177j62783n0671K1367L23815n8423l17616K31325o2458P4335r4495
5753D6407573O4524J40015j77991q7486K01151N1154k44864N7882J47598M9923
5743D6609479J03986k17051k3622o8091J99306J62306J12269m97509j30159J15075
5733D6365989J53401k03091Q7645J92393J16998k07343j99636J10254J21795q3385
$$ plain form
5723 46455020 46788154 46526580 46335297 46545381 46418980 46235296 46257083 46340657 46041036 45927217
5713 45927217 45942983 46136466 46162217 45863630 45701867 45992563 46137234 45706357 45712228 45869022
5703 45869022 45747304 45831731 45719187 45772788 45742381 45261987 45094158 45453879 45770248 45616905
5693 45616905 45513833 45574322 45447369 45156822 45323227 45450324 45638834 45678670 45721080 45788213
5683 45788213 45987159 45944359 45746453 46284095 46209976 46280337 45992158 46184479 46429360 46370271
5673 46370271 46467494 46467625 46849817 47242364 47231970 47359636 47592045 47780944 48197968 48222094
5663 48222094 48061896 48326144 48486264 48576091 48395866 48603878 48881059 49117455 48977087 48986309
5653 48986309 49157445 49482620 49608079 49573228 49653147 49889599 50097980 49887244 50126337 50491209
$$ packed form
5723D6455020L33134k61574j91283K10084j26401j83684K1787Q3574k99621j13819
5713D5927217J5766J93483K5751k98587j61763K90696J44671m30877N871J56794
5703D5869022j21718Q4427j12544N3601l0407m80394j67829L59721L16369j53343
5693D5616905j03072O0489j26953k90547J66405J27097J88510L9836M2410O7133
5683D5788213J98946m2800j97906N37642p4119P0361k88179J92321K44881n9089
5673D6370271R7223J31L82192L92547j0394J27666K32409J88899M17024K4126
5663D8222094j60198K64248J60120Q9827j80225K08012K77181K36396j40368R222
5653D8986309J71136L25175J25459l4851P9919K36452K08381k10736K39093L64872
$$ plain form
5643 50491209 50452696 50346368 50481395 50798270 51187796 51608683 51742213 51678737 51757267 52174929
5633 52174929 52330100 52625432 52557173 52465498 52556788 53050546 53286667 53544299 53633396 53501599
5623 53501599 53805794 53847258 54172004 54120591 54356442 54825465 54767680 54893280 55029447 55227636
5613 55227636 55512450 55873400 55985292 56388350 56824674 57197993 57392675 57372421 57814023 57731024
5603 57731024 57728660 57860305 58086482 58166543 58412244 58347815 58364965 58487247 58447001 58575082
5593 58575082 58766517 58983183 59120706 59400824 59498242 59666987 59936008 60476720 60632894 60669254
5583 60669254 61136811 61169738 61441742 61617670 61479949 61569187 61630085 61475357 61588644 61664697
5573 61664697 61964623 62088763 62181272 62384422 62510093 63081911 63218354 63354989 63690704 63936750
$$ packed form
5643E0491209l8513j06328J35027L16875L89526M20887J33530o3476P8530M17662
5633E2174929J55171K95332o8259r1675R1290M93758K36121K57632Q9097j31797
5623E3501599L04195M1464L24746n1413K35851M69023n7785J25600J36167J98189
5613E5227636K84814L60950J11892M03058M36324L73319J94682k0254M41602q2999
5603E7731024k364J31645K26177Q0061K45701o4429J7150J22282m0246J28081
5593E8575082J91435K16666J37523K80118R7418J68745K69021N40712J56174L6360
5583F0669254M67557L2927K72004J75928j37721Q9238O0898j54728J13287P6053
5573F1664697K99926J24140R2509K03150J25671N71818J36443J36635L35715K46046
$$ plain form
5563 63936750 64090241 64150886 64434269 64428617 64725937 64761427 64850950 64852479 65202632 65528251 65493918
5552 65493918 65576881 65677453 65982346 66182362 66358693 66328250 66447556 66328387 66477395 66666616
5542 66666616 66742000 67045514 67412109 67854270 67973633 68114980 68170225 68729111 69058176 69377709
5532 69377709 69663242 69988095 70211706 70270824 70556307 70698413 70764947 70658541 70667467 70543121
5522 70543121 70519255 70374891 70176841 70039042 69990999 69690615 69484749 69409951 69101168 68885257
5512 68885257 68538510 68147124 67863222 67741138 67284396 66826154 66518441 66174214 65839730
5503 65839730 65415297 64783272 64636458 64611369 64327204 63796183 63197088 62663417 62143386 61683921
5493 61683921 61463744 61125291 60398467 59913307 59557171 59201949 58844139 58794002 58436947 58218499
$$ packed form
5563F3936750J53491O0645K83383n652K97320L5490Q9523J529L50153L25619l4333
5552F5493918Q2963J00572L04893K00016J76331l0443J19306j19169J49008J89221
5542F6666616P5384L03514L66595M42161J19363J41347N5245N58886L29065L19533
5532F9377709K85533L24853K23611N9118K85483J42106O6534j06406Q926j24346
5522G0543121k3866j44364j98050j37799m8043l00384k05866p4798l08783k15911
5512F8885257l46747l91386k83902j22084m56742m58242l07713l44227l34484
5503F5839730m24433o32025j46814k5089k84165n31021n99095n33671n20031m59465
5493F1683921k20177l38453p26824m85160l56136l55222l57810n0137l57055k18448
$$ plain form
5483 58218499 57814646 57436367 56916368 56443910 56040957 55886339 55836659 55531165 55257985 55109175
5473 55109175 54844370 54551794 54540964 54357477 54059595 53974644 53778463 53881316 53386181 52914881
5463 52914881 52685238 52857890 53043537 52785125 52818819 53086982 52803793 52664886 52485327 52223180
5453 52223180 52351644 52327676 52181487 51858805 51930075 51793701 51858634 51952837 52292729 52049404
5443 52049404 51915489 52159053 52060793 52145476 52019895 52195703 52284486 52309265 52264484 52537097
5433 52537097 52572048 52486873 52682651 52813846 53131827 52996836 53041322 53226683 53176755 53296818
5423 53296818 53499186 53904640 54175985 54184617 54380118 54975251 55227995 55794568 56613071 57228023
5413 57228023 57658245 58443260 59373601 59726144 60023214 59925909 59927681 59538554 59494868 59114354
$$ packed form
5483E8218499m03853l78279n19999m72458m02953j54618m9680l05494k73180j48810
5473E5109175k64805k92576j0830j83487k97882q4951j96181J02853m95135m71300
5463E2914881k29643J72652J85647k58412L3694K68163k83189j38907j79559k62147
5453E2223180J28464k3968j46189l22682P1270j36374O4933R4203L39892k43325
5443E2049404j33915K43564r8260Q4683j25581J75808Q8783K4779m4781K72613
5433E2537097L4951q5175J95778J31195L17981j34991M4486J85361m9928J20063
5423E3296818K02368M05454K71345Q632J95501N95133K52744N66573Q18503O14952
5413E7228023M30222P85015R30341L52543K97070r7305J772l89127m3686l80514
$$ plain form
5403 59114354 58911340 58915584 58818504 58573584 58371295 58150650 57883169 57485302 57247077 57089764
5393 57089764 56796326 56552085 56387752 56249506 55791492 55074875 55145463 54794249 54498228 54259816
5383 54259816 54166937 54033661 53944349 54026895 53868516 53601826 53046644 53297489 53360907 53223548
5373 53223548 52883091 52933976 52990878 53035467 52807175 52772996 52948940 52740265 52684371 52660640
5363 52660640 52941959 52995346 52894633 52733277 52898045 52754150 52886029 52851940 52766633 52928036
5353 52928036 52693911 53120444 53317694 53148260 53229252 53574942 53443420 53641067 53630337 53647236
5343 53647236 53864747 53936022 54227667 54150754 54270148 54697524 54973097 55192955 55241922 55656665
5333 55656665 55759308 55880694 55896693 56201437 56097264 56197949 56244422 56599503 56813239 56946460
$$ packed form
5403E9114354k03014M244r7080k44920k02289k20645k67481l97867k38225j57313
5393E7089764k93438k44241j64333j38246m58014p16617P0588l51214k96021k38412
5383E4259816r2879j33276q9312Q2546j58379k66690n55182K50845O3418j37359
5373E3223548l40457N0885N6902M4589k28292l4179J75944k08675n5894k3731
5363E2660640K81319N3387j00713j61356J64768j43895J31879l4089q5307J61403
5353E2928036k34125M26533J97250j69434Q0992L45690j31522J97647j0730J6899
5343E3647236K17511P1275K91645p6913J19394M27376K75573K19858M8967M14743
5333E5656665J02643J21386J5999L04744j04173J00685M6473L55081K13736J33221
$$ plain form
5323 56946460 57238525 56925310 56973955 57180590 57329736 57289761 57319073 57513994 57517932 57454897
5313 57454897 57365391 57608133 57890977 58239916 58549641 58799141 58909238 58924224 59096349 59431955
5303 59431955 59798193 59859420 59839978 59836570 59948931 60104821 60416945 60547701 60737506 60633946
5293 60633946 60725907 61104156 61270074 61561144 61833021 62070764 62222302 62531737 63003930 63206497
5283 63206497 62870220 62866632 62958701 62883670 63146867 63221311 63249835 63277363 63626369 63827967 63808027
5272 63808027 63670700 63763376 63757539 63705117 64108742 64282401 64728718 64779370 64664868 64861117
5262 64861117 64901896 64889549 65140813 65771060 65797223 65907462 65935512 66119066 66354401 66613159
5252 66613159 66773666 66871798 66948581 66905914 66710984 66661492 66982654 67331427 66929135 66847541
$$ packed form
5323E6946460K92065l13215M8645K06635J49146l9975K9312J94921L938o3035
5313E7454897q9506K42742K82844L48939L09725K49500J10097J4986J72125L35606
5303E9431955L66238O1227j9442l408J12361J55890L12124J30756J89805j03560
5293F0633946R1961L78249J65918K91070K71877K37743J51538L09435M72193K02567
5283F3206497l36277l588R2069p5031K63197P4444K8524K7528L49006K01598j9940
5272F3808027j37327R2676n837n2422M03625J73659M46317N0652j14502J96249
5262F4861117M0779j2347K51264O30247K6163J10239K8050J83554K35335K58758
5252F6613159J60507R8132P6783m2667j94930m9492L21162L48773m02292q1594
$$ plain form
5242 66847541 66890846 67087434 67054097 66874472 67134142 67525742 67313272 67461478 67565333 67904334
5232 67904334 67870621 67503464 67782266 68035380 68251218 68230836 68232083 68327264 68764245 68911938
5222 68911938 68944197 69141458 69480606 69636304 69367880 69300135 69638074 70145477 70118252 69986079
5212 69986079 70216881 70586462 70800917 70971570 71059448 71391133 71568298 71525798 71621680 71725586
5202 71725586 72149093 72230613 72275348 72393234 72877297 73250322 73162820 72923766 73309294 74095006
5192 74095006 73949495 73983065 74484954 75033961 75053955 75025939 75413873 75771512 76187524 76030516
5182 76030516 76338781 76688858 77210750 77345042 77480421 77574479 78050218 78213303 78226207 78510410
5172 78510410 78974412 79262940 79311499 79446735 79846093 80173464 80029788 80012952 80468797 80796195
$$ packed form
5242F6847541M3305J96588l3337j79625K59670L91600k12470J48206J03855L39001
5232F7904334l3713l67157K78802K53114K15838k0382J247R5181M36981J47693
5222F8911938L2259J97261L39148J55698k68424o7745L37939N07403k7225j32173
5212F9986079K30802L69581K14455J70653Q7878L31685J77165m2500R5882J03906
5202G1725586M23507Q1520M4735J17886M84063L73025q7502k39054L85528P85712
5192G4095006j45511L3570N01889N49007J9994k8016L87934L57639M16012j57008
5182G6030516L08265L50077N21892J34292J35379R4058M75739J63085J2904K84203
5172G8510410M64002K88528M8559J35236L99358L27371j43676j6836M55845L27398
$$ plain form
5162 80796195 81005209 81077594 81188122 81506503 82131545 82050874 82052544 82278422 82455480 82563539
5152 82563539 82496423 82582200 82741020 83377642 83344926 83266857 83559520 83976964 84062728 84064722 84243827
5141 84243827 84406156 84648919 84617468 84951637 85306990 85788435 85531131 85529867 85884862 86249844
5131 86249844 86093040 85994354 86615120 86802757 87115262 87265088 87535568 88066203 88220497 87947885
5121 87947885 88108223 88500534 88926725 88984750 89181020 89521874 89811821 90188630 90319252 90546787
5111 90546787 91026061 91292132 91309383 91296568 91922952 92073926 92378832 92468698 92917695 93343770
5101 93343770 93464980 93562922 93636488 94331484 94576947 94583631 94505468 94944669 95523460 95870020
5091 95870020 96052174 95938456 96356792 97030363 97262042 97338692 97896630 97808654 98250628 98203843
$$ packed form
5162H0796195K09014P2385J10528L18381O25042q0671J670K25878J77058J08059
5152H2563539o7116Q5777J58820O36622l2716p8069K92663M17444Q5764J994J79105
5141H4243827J62329K42763l1451L34169L55353M81445k57304j264L54995L64982
5131H6249844j56804r8686O20766J87637L12505J49826K70480N30635J54294k72612
5121H7947885J60338L92311M26191N8025J96270L40854K89947L76809J30622K27535
5111I0546787M79274K66071J7251j2815O26384J50974L04906Q9866M48997M26075
5101I3343770J21210R7942P3566O94996K45463O684p8163M39201N78791L46560
5091I5870020J82154j13718M18336O73571K31679P6650N57938q7976M41974m6785
$$ plain form
5081 98203843 98633866 99115513 99356599 99675426 99887018 100378327 100538212 100625765 101047696 101673197
5071 101673197 102149262 102503052 102709684 103302970 103538752 103972847 104170984 104679304 105235841
5062 105235841 105340350 105718145 106047812 106799035 107415589 107658734 107996985 108510406 109412201
5053 109412201 110122052 110387831 110651955 111283461 111686655 112292673 113038418 113524071 114433645
5044 114433645 114807194 115024838 115825913 116488663 117139220 117500108 118044549 118926148 119762205
5035 119762205 120101660 120524303 121619914 122699584 123382580 124132993 124911081 125615417 126202132
5026 126202132 126688786 127014925 128108878 129016633 129874281 130208032 131027028 132135633 132920041
5017 132920041 133748372 134447857 135533969 136263361 136881349 137792064 138789905 139543156 140376280
$$ packed form
5081I8203843M30023M81647K41086L18827K11592M91309J59885Q7553M21931O25501
5071A01673197M76065L53790K06632N93286K35782M34095J98137N08320N56537
5062A05235841J04509L77795L29667P51223O16554K43145L38251N13421R01795
5053A09412201P09851K65779K64124O31506M03194O06018P45745M85653R09574
5044A14433645L73549K17644Q01075O62750O50557L60888N44441Q81599Q36057
5035A19762205L39455M22643J095611J079670O82996P50413P78088P04336N86715
5026A26202132M86654L26139J093953R07755Q57648L33751Q18996J108605P84408
5017A32920041Q28331O99485J086112P29392O17988R10715R97841P53251Q33124
$$ plain form
5008 140376280 141438062 142500714 143383745 144007100 144847682 145686818 146648352 147727934 148709473
4999 148709473 149800556 150934852 152386897 153578554 154923447 156219167 157815982 159415587
4991 159415587 161253363 162699082 164424353 166119523 167881417 169353725 171004014 173069575
4983 173069575 174940630 177147603 178938787 180840343 182907854 184770135 186787506 188859827
4975 188859827 190984466 193275272 195852109 198328986 200970715 203611553 206514849 209714521
4967 209714521 212794265 216430095 219998015 224025256 228076247 233003932 238525226 244531620
4959 244531620 250832238 257949288 265327673 271787723 277443443 282099955 286337597 290405137
4951 290405137 294709424 299321655 304288516 308260205 311501881 313699925 314274157 314843342
$$ packed form
5008A40376280J061782J062652Q83031O23355Q40582Q39136R61534J079582R81539
4999A48709473J091083J134296J452045J191657J344893J295720J596815J599605
4991A59415587J837776J445719J725271J695170J761894J472308J650289K065561
4983A73069575J871055K206973J791184J901556K067511J862281K017371K072321
4975A88859827K124639K290806K576837K476877K641729K640838K903296L199672
4967B09714521L079744L635830L567920M027241M050991M927685N521294O006394
4959B44531620O300618P117050P378385O460050N655720M656512M237642M067540
4951B90405137M304287M612231M966861L971689L241676K198044N74232N69185
$$ plain form
4943 314843342 314955646 315332828 315730636 316041774 316630020 317164738 317601042 318348722 318871992
4934 318871992 318879240 318524046 317910218 317519276 316828523 316225046 315990523 316219107 316562097 317143988
4924 317143988 317798916 318738801 320022796 321127435 322151858 323054319 324265801 325008614 325658133
4915 325658133 325996053 326389658 326945655 326852800 326817160 326092311 325370542 324694697 322925572
4906 322925572 320810984 319279221 317169438 314640942 311722719 308832438 306273086 303469563
4898 303469563 300369440 297454758 294741075 291823632 289192597 285820492 282231180 278662876
4890 278662876 274772894 270755881 266636870 262909900 258871360 254874820 250770242 246777393
4882 246777393 242982145 239218792 235191420 231526343 228228318 225034842 221440992 218172694
$$ packed form
4943C14843342J12304L77182L97808L11138N88246N34718M36304P47680N23270
4934C18871992P248l55194o13828l90942o90753o03477k34523K28584L42990N81891
4924C17143988O54928R39885J283995J104639J024423R02461J211482P42813O49519
4915C25658133L37920L93605N55997r2855l5640p24849p21769o75845j769125
4906C22925572k114588j531763k109783k528496k918223k890281k559352k803523
4898C03469563l100123k914682k713683k917443k631035l372105l589312l568304
4890B78662876l889982m017013m119011l726970m038540l996540m104578l992849
4882B46777393l795248l763353m027372l665077l298025l193476l593850l268298
$$ plain form
4874 218172694 215494333 212554811 209593854 206510273 203514296 200836756 198169205 195460387
4866 195460387 192929417 190716139 188403554 185915965 183651467 181634529 179502408 177008771
4858 177008771 174844435 172984256 171295706 169370302 167550378 165590999 163888022 161777696
4850 161777696 159858162 158139642 156450316 154795258 153179768 151510282 149824607 148768702
4842 148768702 147144208 145359654 143865493 142758851 141610758 140206188 138800873 137698918
4834 137698918 136834674 135351702 134092554 133126730 132751719 131741733 130552255 129780315 129259509
4825 129259509 128407778 127293257 126353330 125470492 124868153 124085691 123156441 121920713 121612643
4816 121612643 121244036 120402403 119683374 119100231 118955397 118198602 117723554 117208624 116715444
$$ packed form
4874B18172694k678361k939522k960957l083581k995977k677540k667551k708818
4866A95460387k530970k213278k312585k487589k264498k016938k132121k493637
4858A77008771k164336j860179j688550j925404j819924j959379j702977k110326
4850A61777696j919534j718520j689326j655058j615490j669486j685675j055905
4842A48768702j624494j784554j494161j106642j148093j404570j405315j101955
4834A37698918q64244j482972j259148r65824l75011j009986j189478p71940n20806
4825A29259509q51731j114521r39927q82838o02339p82462r29250j235728l08070
4816A21612643l68607q41633p19029n83143j44834p56795m75048n14930m93180
$$ plain form
4807 116715444 116549012 115891665 115365328 115078297 114952956 114303339 114027545 113703700 113649107
4798 113649107 113635975 113463098 113139677 112853737 112923280 112454513 112027545 112045201 111783472 111353239
4788 111353239 111316181 111502428 111720047 111417987 111209930 111268837 111465749 111669935 111405662 111362128
4778 111362128 111453715 111769956 111599114 111681370 111912368 112029115 112068645 112316265 112480009 112499777
4768 112499777 112940621 112736356 113298564 113705175 113849616 113888602 113791853 114219806 114385461 114942191
4758 114942191 115036842 115245988 115428129 115878783 116098750 116253008 116683972 116971323 117361301
4749 117361301 117364310 117694638 117905430 118297200 118525224 118920114 119113140 119916352 120457925 120586787
4739 120586787 121048610 121513642 121879883 122094223 122716684 122911612 123392090 124010401 124445076
$$ packed form
4807A16715444j66432o57347n26337k87031j25341o49617k75794l23845n4593
4798A13649107j3132j72877l23421k85940O9543m68767m26968J7656k61729m30233
4788A11353239l7058J86247K17619l02060k08057N8907J96912K04186k64273m3534
4778A11362128R1587L16241j70842Q2256K30998J16747L9530K47620J63744J9768
4768A12499777M40844k04265N62208M06611J44441L8986r6749M27953J65655N56730
4758A14942191R4651K09146J82141M50654K19967J54258M30964K87351L89978
4749A17361301L009L30328K10792L91770K28024L94890J93026Q03212N41573J28862
4739A20586787M61823M65032L66241K14340O22461J94928M80478O18311M34675
$$ plain form
4730 124445076 124840963 125653627 126230943 126901829 127316317 127223076 127582426 127997127 128969172
4721 128969172 129822950 130144798 130431208 131026253 131639682 132086509 132838153 133323314 134304635
4712 134304635 134599942 135570203 136847399 137332134 138156387 138744330 139592886 140207367 140983617
4703 140983617 141768394 143053255 143963288 144873335 145837948 147014094 148065829 148789227 149580522
4694 149580522 150202998 151146190 152109308 153050941 153929486 155057366 156087024 157457090 158653192
4685 158653192 159388985 160599890 162177190 164003638 165296843 167077235 169234867 171344782
4677 171344782 173396090 175657670 177960342 180142022 182816132 185183995 187572185 189871319
4669 189871319 192020578 193866461 196163458 198358283 200334613 202411945 204506251 207038706
$$ packed form
4730A24445076L95887Q12664N77316O70886M14488r3241L59350M14701R72045
4721A28969172Q53778L21848K86410N95045O13429M46827P51644M85161R81321
4712A34304635K95307R70261J277196M84735Q24253N87943Q48556O14481P76250
4703A40983617P84777J284861R10033R10047R64613J176146J051735P23398P91295
4694A49580522O22476R43192R63118R41633Q78545J127880J029658J370066J196102
4685A58653192P35793J210905J577300J826448J293205J780392K157632K109915
4677A71344782K051308K261580K302672K181680K674110K367863K388190K299134
4669A89871319K149259J845883K296997K194825J976330K077332K094306K532455
$$ plain form
4661 207038706 209660484 212404505 214828358 217997655 220777874 223716549 227070775 230233383
4653 230233383 234000686 238014706 242589807 246869072 252025420 257539342 263745513 270810470
4645 270810470 278213598 286686601 295929394 305963198 316619759 327143615 336848676 345157333
4637 345157333 350539590 353368607 353947792 353289162 351556980 349510512 347262438 344778123
4629 344778123 342159971 339089972 336068929 332473342 328572356 324318776 319580822 314896527
4621 314896527 309821226 304809960 300066420 295754313 291272164 286783334 282002539 277525372
4613 277525372 273101616 268219219 263792731 259634323 255977190 252417644 249245757 246489042
4605 246489042 244224112 242090954 240108648 238393246 236795057 235597003 234383143 233383795
$$ packed form
4661B07038706K621778K744021K423853L169297K780219K938675L354226L162608
4653B30233383L767303M014020M575101M279265N156348N513922O206171P064957
4645B70810470P403128Q473003R242793J0033804J0656561J0523856R705061Q308657
4637C45157333N382257K829017N79185o58630j732182k046468k248074k484315
4629C44778123k618152l069999l021043l595587l900986m253580m737954m684295
4621C14896527n075301n011266m743540m312107m482149m488830m780795m477167
4613B77525372m423756m882397m426488m158408l657133l559546l171887k756715
4605B46489042k264930k133158j982306j715402j598189j198054j213860r99348
$$ plain form
4597 233383795 232492063 231811732 231084180 229787881 228858344 228532766 228322313 228036401 228071576
4588 228071576 228124305 228991038 229410626 230355358 231251227 232452826 233909691 235365083 237122373
4579 237122373 239378299 242139258 244567456 247928670 251568229 255892920 260348915 265804050
4571 265804050 272570011 280189940 288818745 297592524 307319039 317150303 326753053 334889359
4563 334889359 340933901 344945659 346773276 346340538 344039951 341030510 337051669 332614118
4555 332614118 327777736 322691212 317818690 312800836 306901262 300959769 294272294 287668420
4547 287668420 280897040 273456652 266003758 258981699 252380923 245240820 238572361 232159484
4539 232159484 225535290 218889553 212111905 205699044 199809963 193886070 187857793 182578715
$$ packed form
4597B33383795q91732o80331p27552j296299r29537l25578k10453k85912L5175
4588B28071576N2729Q66733M19588R44732Q95869J201599J456865J455392J757290
4579B37122373K255926K760959K428198L361214L639559M324691M455995N455135
4571B65804050O765961P619929Q628805Q773779R726515R831264R602750Q136306
4563C34889359O044542M011758J827617m32738k300587l009441l978841m437551
4555C32614118m836382n086524m872522n017854n899574n941493o687475o603874
4547B87668420o771380p440388p452894p022059o600776p140103o668459o412877
4539B32159484o624194o645737o777648o412861n889081n923893o028277n279078
$$ plain form
4531 182578715 177361192 172629907 168011861 163426093 159133155 155022146 151401256 147604811
4523 147604811 144340620 140982305 137977497 134705995 131874047 129251565 126836410 124337327
4515 124337327 122106121 120375202 118580650 116785105 114817025 113345770 111833521 110618173
4507 110618173 108909837 107287194 106286049 105327847 104174049 102945679 101845406 100789340
4499 100789340 100256446 99358716 98516572 97556005 96919862 96452304 95085205 94179436 93534178
4490 93534178 92809446 91732408 91004585 90185366 89361127 88569443 87498812 86836242 86064683
4481 86064683 85436500 84738922 84380019 83938032 83445612 82552114 81625523 80866818 80231711
4472 80231711 79514355 78867107 78495081 77839161 77305530 76473979 75855931 75301680 74482110
$$ packed form
4531A82578715n217523m731285m618046m585768m292938m111009l620890l796445
4523A47604811l264191l358315l004808l271502k831948k622482k415155k499083
4515A24337327k231206j730919j794552j795545j968080j471255j512249j215348
4507A10618173j708336j622643j001145r58202j153798j228370j100273j056066
4499A00789340n32894q97730q42144r60567o36143m67558j367099r05769o45258
4490I3534178p24732j077038p27823q19219q24239p91684j070631o62570p71559
4481H6064683o28183o97578l58903m41987m92420q93498r26591p58705o35107
4472H0231711p17356o47248l72026o55920n33631q31551o18048n54251q19570
$$ plain form
4463 74482110 73943304 73463279 73145458 72618628 72072534 71650876 71126810 70801313 70281824
4454 70281824 70019363 69738990 69615300 69209099 68737732 68019647 67859028 67217176 66683890
4445 66683890 66157294 65978886 65639190 64991765 64787065 64418988 64343767 64131104 63804016 63603400
4435 63603400 63415820 62901658 62847763 62630169 62350285 62351670 61972667 61948702 61729722 61644425
4425 61644425 61618462 61805152 61802733 61528692 61378569 61061778 61074877 60967988 60783002 60541726
4415 60541726 60446676 60164721 60272690 60246502 59721818 59579915 59404744 59188353 59049816 59318571
4405 59318571 58840420 58570660 58473918 58403701 58283240 58110846 58156182 57925277 57655212 57439141
4395 57439141 57441712 57074855 57030216 57017092 57073617 56918468 56953932 56570203 56535592 56530671 56597218
$$ packed form
4463G4482110n38806m80025l17821n26830n46094m21658n24066l25497n19489
4454G0281824k62461k80373j23690m06201m71367p18085j60619o41852n33286
4445F6683890n26596j78408l39696o47425k04700l68077p5221k12663l27088k00616
4435F3603400j87580n14162n3895k17594k79884J385l79003k3965k18980q5297
4425F1644425k5963J86690k419k74041j50123l16791J3099j06889j84986k41276
4415F0541726r5050k81955J07969k6188n24684j41903j75171k16391j38537K68755
4405E9318571m78151k69760r6742p0217j20461j72394M5336k30905k70065k16071
4395E7439141K571l66857m4639j3124N6525j55149L5464l83729l4611m921O6547
$$ plain form
4384 56597218 56637933 56623221 56676138 56483319 56385701 56486033 56901007 57062711 57083731 57092505 57011018
4373 57011018 57287197 57140696 57283626 57398406 57460260 57638065 57674320 57697927 57624410 57817268
4363 57817268 58156832 58380417 58513618 58784339 58999026 59228216 59196047 59215807 59418477 59494073
4353 59494073 59629645 59821157 59889056 59917912 60407716 60679450 60452840 60725640 60925260 60882390
4343 60882390 60864523 61102929 61422407 61720231 61452532 61666614 61676185 61671031 61755258 62036604
4333 62036604 62301773 62341179 62518253 62293916 62360858 62240438 62385798 62259155 62095110 61994680
4323 61994680 61913699 61851261 61489691 61574356 61438300 61049578 60515324 60215829 60167881 59696944
4313 59696944 59389163 58984982 59037258 58759863 58051445 57250763 56897461 56607140 56090740 55519058
$$ packed form
4384E6597218M0715j4712N2917j92819r7618J00332M14974J61704K1020Q774q1487
4373E7011018K76179j46501J42930J14780O1854J77805L6255K3607p3517J92858
4363E7817268L39564K23585J33201K70721K14687K29190l2169J9760K02670P5596
4353E9494073J35572J91512O7899K8856M89804K71734k26610K72800J99620m2870
4343F0882390j7867K38406L19478K97824k67699K14082R571n154Q4227K81346
4333F2036604K65169L9406J77074k24337O6942j20420J45360j26643j64045j00430
4323F1994680q0981o2438l61570Q4665j36056l88722n34254k99495m7948m70937
4313E9696944l07781m04181N2276k77395p08418q00682l53302k90321n16400n71682
$$ plain form
4303 55519058 55387364 55036926 54555596 54084674 53524095 53092462 52357699 52094186 51660083
4294 51660083 51180706 50976948 50381778 49728545 49266368 49093448 48717002 48353281 48049081
4285 48049081 47720213 47598237 47137846 46606365 46078604 45915419 45708436 45666301 45547519 45090610
4275 45090610 44635265 44309218 44044019 43664993 43642748 43432870 42631304 42563970 42184345 41898200
4265 41898200 41829487 41467379 40978803 40878689 40689281 40038961 40041980 40145299 40077252 39647729
4255 39647729 39526149 39461848 39207903 38939206 38859515 39040328 38855873 38731802 38083019 37722204
4245 37722204 37948280 38006206 37704278 37513442 37695478 37556852 37361925 37150449 37139284 37318907
4235 37318907 37183538 36905074 36790167 36848709 36607404 36582233 36309486 36362584 36150271 36043625
$$ packed form
4303E5519058j31694l50438m81330m70922n60579m31633p34763k63513m34103
4294E1660083m79377k03758n95170o53233m62177j72920l76446l63721l04200
4285D8049081l28868j21976m60391n31481n27761j63185k06983m2135j18782m56909
4275D5090610m55345l26047k65199l79026k2245k09878q01566o7334l79625k86145
4265D1898200o8713l62108m88576j00114j89408o50320L019J03319o8047m29523
4255C9647729j21580o4301k53945k68697p9691J80813j84455j24071o48783l60815
4245C7722204K26076N7926l01928j90836J82036j38626j94927k11476j1165J79623
4235C7318907j35369k78464j14907N8542k41305k5171k72747N3098k12313j06646
$$ plain form
4225 36043625 36011748 35903162 36337532 36239445 35597911 35533110 35763831 35833556 35746430 35450318
4215 35450318 35644710 35930986 35284363 35144872 35386588 35571593 35750786 35354643 35316134 35422003
4205 35422003 35728088 35555080 35456137 35482286 35537618 35212181 34890905 34871135 35123282 34919989
4195 34919989 34608484 34807976 35098858 34910971 34694482 34521646 34471750 34901112 35002174 34838922
4185 34838922 34846670 34968982 34661977 34630889 34860815 35189753 35035418 34952565 34719062 34842238
4175 34842238 35061896 34680755 34443337 34476522 34750458 34718637 34617953 34602737 34600197 34717695
4165 34717695 34855965 34842193 34723040 34609393 34683659 34443646 34301099 34565093 34801986 34659394
4155 34659394 34434322 34576453 34572246 34533648 34748551 34737598 34745619 34729156 34773982 34575330 34569067
$$ packed form
4225C6043625l1877j08586M34370r8087o41534o4801K30721O9725q7126k96112
4215C5450318J94392K86276o46623j39491K41716J85005J79193l96143l8509J05869
4205C5422003L06085j73008r8943K6149N5332l25437l21276j9770K52147k03293
4195C4919989l11505J99492K90882j87887k16489j72836m9896M29362J01062j63252
4185C4838922P748J22312l07005l1088K29926L28938j54335q2853k33503J23176
4175C4842238K19658l81141k37418L3185K73936l1821j00684j5216k540J17498
4165C4717695J38270j3772j19153j13647P4266k40013j42547K63994K36893j42592
4155C4659394k25072J42131m207l8598K14903j0953Q021j6463M4826j98652o263
$$ plain form
4144 34569067 34595690 34484531 34393971 34351378 34279710 34104942 34255803 34398239 34707050 34863777
4134 34863777 34534716 34645023 34576950 34605999 34387160 34366660 34912459 35151558 34985401 34695920
4124 34695920 34528431 34500627 34767301 34699674 34602086 34940312 35228306 34884121 34879649 34944173
4114 34944173 34982125 34820515 34524880 34712039 35053249 35033336 34842484 34871878 34938823 34888874
4104 34888874 34885717 34773113 35117125 35309851 35065171 34829478 34753018 35050457 35072241 35013520
4094 35013520 34900877 35057888 35058852 35347699 35596205 35637882 35730178 35656520 35289478 35200328 35411875
4083 35411875 35279445 35349923 35282607 35427188 35689653 35551320 35269159 35292697 35417295 35531547
4073 35531547 35516153 35707702 35865456 35627612 35862870 35899029 36145985 36210272 36238524 36139969
$$ packed form
4144C4569067K6623j11159r0560m2593p1668j74768J50861J42436L08811J56727
4134C4863777l29061J10307o8073K9049k18839k0500N45799K39099j66157k89481
4124C4695920j67489k7804K66674o7627r7588L38226K87994l44185m472O4524
4114C4944173L7952j61610k95635J87159L41210j9913j90852K9394O6945m9949
4104C4888874l157j12604L44012J92726k44680k35693p6460K97439K1784n8721
4094C5013520j12643J57011R64K88847K48506M1677R2296p3658l67042q9150K11547
4083C5411875j32430P0478o7316J44581K62465j38333k82161K3538J24598J14252
4073C5531547j5394J91549J57754k37844K35258L6159K46956O4287K8252r8555
$$ plain form
4063 36139969 36106660 36273387 36086404 35980462 36136529 36075181 35895696 36013775 36206293 36482185
4053 36482185 36736820 36915558 36847717 36666402 36745102 36809627 36910905 36868656 37075356 37070703
4043 37070703 37198954 37323873 37102506 37129162 37042227 37054312 37050435 37275507 37147168 37005478
4033 37005478 36843502 37077376 37600906 37720859 37526068 37646481 37570869 37471559 37475370 37482671
4023 37482671 37680552 37907775 38157534 38135634 38062587 37932535 38060304 38191375 38161711 38284687
4013 38284687 38199302 38395559 38321428 38344941 38630946 38725470 38599382 38821555 38713215 38953206
4003 38953206 38873846 38767900 38914878 38882389 38948955 38892213 38749639 38734543 38862894 39090005
3993 39090005 39355692 39316335 39375811 39498118 39382387 39602478 39901391 39900575 39868591 39966169 39891541
$$ packed form
4063C6139969l3309J66727j86983j05942J56067o1348j79485J18079J92518K75892
4053C6482185K54635J78738o7841j81315P8700O4525J01278m2249K06700m653
4043C7070703J28251J24919k21367K6656q6935J2085l877K25072j28339j41690
4033C7005478j61976K33874N23530J19953j94791J20413p5612r9310L811P301
4023C7482671J97881K27223K49759k1900p3047j30052J27769J31071k9664J22976
4013C8284687q5385J96257p4131K3513K86005R4524j26088K22173j08340K39991
4003C8953206p9360j05946J46978l2489O6566n6742j42574j5096J28351K27111
3993C9090005K65687l9357N9476J22307j15731K20091K98913q16l1984R7578p4628
$$ plain form
3982 39891541 40006276 40258919 40102028 40161782 40149816 40351040 40614575 40789420 40708035 40756670
3972 40756670 40770575 40811394 40712295 40951310 41008003 40875453 40895948 41100313 41228423 41128453
3962 41128453 40946694 41102265 41333863 41333370 41416491 41850082 41962564 41830258 41799564 41833974
3952 41833974 42160788 42194633 41900533 41985775 42287644 42534916 42573676 42777289 43005757 42983052
3942 42983052 43119473 43100908 43222564 43287236 43123955 42869977 42875777 43500329 43862393 43735770
3932 43735770 43751466 43813523 44103195 44296898 44371382 44169056 44082782 44269758 44354734 44414782
3922 44414782 44787941 44876158 45015873 45280602 45413789 45472131 45646245 45709067 45745846 45880390
3912 45880390 45876143 46283944 46607504 46762758 47093352 47238611 46924430 46887701 47244490 47473860
$$ packed form
3982C9891541J14735K52643j56891N9754j1966K01224K63535J74845q1385M8635
3972D0756670J3905M0819r9099K39015N6693j32550K0495K04365J28110r9970
3962D1128453j81759J55571K31598m93Q3121M33591J12482j32306l0694L4410
3952D1833974L26814L3845k94100Q5242L01869K47272L8760K03613K28468k2705
3942D2983052J36421j8565J21656O4672j63281k53978N800O24552L62064j26623
3932D3735770J5696O2057K89672J93703P4484k02326q6274J86976Q4976O0048
3922D4414782L73159Q8217J39715K64729J33187N8342J74114O2822L6779J34544
3912D5880390m247M07801L23560J55254L30594J45259l14181l6729L56789K29370
$$ plain form
3902 47473860 47577816 47818918 47708459 48376580 48807367 48287873 48227182 48733069 48765125 48886697
3892 48886697 48891445 48968924 49294248 49350382 49185615 49362673 49753421 49640245 49820346 49829737
3882 49829737 50093138 50337588 50206194 50316134 50604992 50917663 50843959 50772116 50943156 51144832
3872 51144832 51258876 51305652 51317410 51576366 51668052 51862881 51792109 51999532 52507711 52650313
3862 52650313 52794492 52568524 53100763 53310162 53579365 53655847 53842091 54052233 54069951 54373510
3852 54373510 54521144 54741907 54859690 54969793 54884980 55341383 55939233 56023693 55889515 56358219
3842 56358219 56664782 56779843 56831370 56974028 57259907 57228932 57246987 57739040 57649692 57841072
3832 57841072 58497123 58947419 58951736 59167653 59642579 59722600 59771651 60076255 60429859 60516842
$$ packed form
3902D7473860J03956K41102j10459O68121M30787n19494o0691N05887L2056J21572
3892D8886697M748P7479L25324N6134j64767J77058L90748j13176J80101R391
3882D9829737K63401K44450j31394J09940K88858L12671p3704p1843J71040K01676
3872E1144832J14044M6776J1758K58956R1686J94829p0772K07423N08179J42602
3862E2650313J44179k25968N32239K09399K69203P6482J86244K10142J7718L03559
3852E4373510J47634K20763J17783J10103q4813M56403N97850Q4460j34178M68704
3842E6358219L06563J15061N1527J42658K85879l0975J8055M92053q9348J91380
3832E7841072O56051M50296M317K15917M74926Q0021M9051L04604L53604Q6983
$$ plain form
3822 60516842 60843107 61113198 61450403 61551737 61600212 61639779 62159353 62228440 62090578 62528812
3812 62528812 63049361 63064094 63381670 63739603 64383952 64591984 64527892 64871593 65281960 65440950
3802 65440950 65649820 65789060 66192155 66670696 67065549 67498752 67486403 67912086 68572458 69011731
3792 69011731 69246168 69607562 70155826 70166838 70395059 70909966 71368753 72136960 72636190 72942363
3782 72942363 73339806 74170234 74607074 75207062 75704938 76182200 76857989 77361446 77873013
3773 77873013 78552017 79331298 79978966 80452744 80841382 81489480 81832735 82403907 82758513
3764 82758513 83112204 83778327 83851473 83943499 84377534 84643716 84722417 84895978 85366319 85607372
3754 85607372 85460265 85487624 85574400 85559916 85309581 85202203 85002129 85012486 84639518 84236355
$$ packed form
3822F0516842L26265K70091L37205J01334M8475L9567N19574O9087j37862M38234
3812F2528812N20549J4733L17576L57933O44349K08032o4092L43701M10367J58990
3802F5440950K08870J39240M03095M78541L94853M33203j2349M25683O60372M39273
3792F9011731K34437L61394N48264J1012K28221N14907M58787P68207M99230L06173
3782G2942363L97443Q30428M36840N99988M97876M77262O75789N03457N11567
3773G7873013O79004P79281O47668M73778L88638O48098L43255N71172L54606
3764H2758513L53691O66123P3146R2026M34035K66182P8701J73561M70341K41053
3754H5607372j47107K7359Q6776j4484k50335j07378k00074J0357l72968m03163
$$ plain form
3744 84236355 84179035 83622804 83207766 83220019 82901073 82633456 82176040 81802450 81640613 81436822
3734 81436822 81327218 81263356 81225267 81069690 80939109 81002126 80896078 80724381 80693204 80559026
3724 80559026 80693232 80781591 80736742 80740348 80947493 81013057 81064470 81279357 81556956 81653122 81632104
3713 81632104 81658204 81693261 81997472 81747755 81604288 81844587 81882411 82081983 82569049 82613390
3703 82613390 82465840 82647376 82348769 82372423 82454159 82760262 82810155 82688293 82586363 82547020
3693 82547020 82782405 82841921 82771149 82514127 82526000 82708259 82560770 82652845 82652603 82575553 82099751
3682 82099751 82005750 82114213 82239574 82082283 82331823 82414841 82437616 82255692 82280132 82716409
3672 82716409 82752356 82634614 82661403 83051848 82869412 83020073 83225439 83600246 83747162 84050825
$$ packed form
3744H4236355n7320n56231m15038J2253l18946k67617m57416l73590j61837k03791
3734H1436822j09604o3862l8089j55577j30581O3017j06048j71697l1177j34178
3724H0559026J34206Q8359m4849L606K07145O5564N1413K14887K77599R6166k1018
3713H1632104K6100L5057L04211k49717j43467K40299L7824J99572M87066M4341
3703H2613390j47550J81536k98607K3654Q1736L06103M9893j21862j01930l9343
3693H2547020K35385N9516p0772k57022J1873J82259j47489R2075k42p7050m75802
3682H2099751r4001J08463J25361j57291K49540Q3018K2775j81924K4440M36277
3672H2716409L5947j17742K6789L90445j82436J50661K05366L74807J46916L03663
$$ plain form
3662 84050825 84042737 84300264 84722043 85272408 85457507 85496057 85743110 85858742 86098596 86593840
3652 86593840 87051010 87585432 87826101 87948356 88303207 89082572 89500963 89657026 89821686
3643 89821686 90116609 90681236 90997603 91389288 91894282 92173632 92428139 92822018 93541398
3634 93541398 94126850 94338021 94514362 94800734 95395950 96076039 96345526 97103388 97692604
3625 97692604 98166127 98644742 98930516 99474081 100217830 100718956 101028892 101491091 102028729
3616 102028729 102722169 103055567 103622715 104514508 105486715 106516380 107318540 107903411 108838375
3607 108838375 109762925 110261944 111464497 112439765 113636087 114566270 115672811 117022765 118103086
3598 118103086 119461440 120502994 121722679 122999831 124776043 126147645 127397713 128715830
$$ packed form
3662H4050825q088K57527M21779N50365J85099L8550K47053J15632K39854M95244
3652H6593840M57170N34422K40669J22255L54851P79365M18391J56063J64660
3643H9821686K94923N64627L16367L91685N04994K79350K54507L93879P19380
3634I3541398N85452K11171J76341K86372N95216O80089K69487P57862N89216
3625I7692604M73523M78615K85774N43565P43749N01126L09936M62199N37638
3616A02028729O93440L33398N67148Q91793R72207J029665Q02160N84871R34964
3607A08838375R24550M99019J202553R75268J196322R30183J106541J349954J080321
3598A18103086J358354J041554J219685J277152J776212J371602J250068J318117
$$ plain form
3590 128715830 130370546 132030101 133812405 135458554 137327868 139047009 140510172 142377897
3582 142377897 144045689 145845226 148014007 150080387 152274239 154868893 157316149 159621011
3574 159621011 161930814 164124298 166411836 168691483 171199939 173147116 175171171 176765587
3566 176765587 178270645 179941057 181367780 182852337 184082605 185204740 186779179 188068353
3558 188068353 188833632 189380898 190226576 191088609 191538365 191639869 191840411 191826959 191587945
3549 191587945 191253711 190915279 190474011 189542363 188299812 187369200 186243998 184988845 183989815
3540 183989815 182437373 181142368 179690486 178354188 176858135 175152965 173586536 171900823
3532 171900823 170072926 167883458 166179381 164383587 162814884 161262590 159320345 157686282
$$ packed form
3590A28715830J654716J659555J782304J646149J869314J719141J463163J867725
3582A42377897J667792J799537K168781K066380K193852K594654K447256K304862
3574A59621011K309803K193484K287538K279647K508456J947177K024055J594416
3566A76765587J505058J670412J426723J484557J230268J122135J574439J289174
3558A88068353P65279N47266Q45678Q62033M49756J01504K00542j3452k39014
3549A91587945l34234l38432m41268r31648j242551r30612j125202j255153r99030
3540A83989815j552442j295005j451882j336298j496053j705170j566429j685713
3532A71900823j827897k189468j704077j795794j568703j552294j942245j634063
$$ plain form
3524 157686282 156185662 154220693 152314714 150804122 149055010 147406534 145488617 143729072
3516 143729072 142168894 140638206 138775394 137270402 135716380 134309206 132595725 130718275
3508 130718275 129276177 127300907 125655900 124105811 122279292 120536253 118878906 117357171
3500 117357171 115440480 113647531 112246455 110854816 109213641 107782221 106511501 104805585
3492 104805585 103074394 101851141 100611889 99315842 97910766 96547762 95382101 94415197
3484 94415197 93164565 91788607 90843215 90235041 89359488 88018782 87284590 86741995 85981007
3475 85981007 85198476 84333549 83817504 83099928 82263294 81547317 80759451 80236046 79732255
3466 79732255 79383542 78701103 78056169 77711072 77462890 76948241 76591185 76264154 75991295
$$ packed form
3524A57686282j500620j964969j905979j510592j749112j648476j917917j759545
3516A43729072j560178j530688j862812j504992j554022j407174j713481j877450
3508A30718275j442098j975270j645007j550089j826519j743039j657347j521735
3500A17357171j916691j792949j401076j391639j641175j431420j270720j705916
3492A04805585j731191j223253j239252j296047j405076j363004j165661r66904
3484I4415197j250632j375958r45392o08174q75553j340706p34192n42595p60988
3475H5981007p82531q64927n16045p17576q36634p15977p87866n23405n03791
3466G9732255l48713o82439o44934l45097k48182n14649l57056l27031k72859
$$ plain form
3457 75991295 75596080 75102103 75003707 75029132 74884430 74411578 74103116 74146696 73996266 73794719
3447 73794719 73660509 73882008 74116665 73981363 74155889 74032404 74108881 74182964 73815190 73799622
3437 73799622 73951443 73665898 73663575 73373444 73414551 73682519 73593358 73507410 73553266 73690477
3427 73690477 73897696 73661302 73472802 73499842 73944723 74230363 74225389 74418661 74709793 74579911
3417 74579911 74445607 74469621 74938071 75415012 75809268 76262672 76758714 77013377 77276452 77651709
3407 77651709 78090269 78942894 79405574 79764170 80119024 80789258 81009704 81320392 81793535
3398 81793535 82403608 82789941 83059264 83154806 83482804 84243768 84337724 84458429 84503096 84659911
3388 84659911 84947260 84641541 84416121 84400590 84420839 84283192 84256224 83929390 83963336 83636985
$$ packed form
3457G5991295l95215m93977r8396K5425j44702m72852l08462M3580j50430k01547
3447G3794719j34210K21499K34657j35302J74526j23485P6477P4083l67774j5568
3437G3799622J51821k85545k323k90131M1107K67968q9161q5948M5856J37211
3427G3690477K07219k36394j88500K7040M44881K85640m974J93272K91132j29882
3417G4579911j34304K4014M68450M76941L94256M53404M96042K54663K63075L75257
3407G7651709M38560Q52625M62680L58596L54854O70234K20446L10688M73143
3398H1793535O10073L86333K69323R5542L27998P60964R3956J20705M4667J56815
3388H4659911K87349l05719k25420j5531K0249j37647k6968l26834L3946l26351
$$ plain form
3378 83636985 83089294 82491467 82028793 81687745 81251502 80829013 80508767 80444310 79879203 79164786
3368 79164786 78678042 78242054 77458443 76755583 76032560 75430134 75158479 74433218 73488346
3359 73488346 72911993 72602811 72136352 71346187 70700387 70271024 69875084 69557876 68763952
3350 68763952 68309000 67908940 67481516 67325932 66821381 66657223 66162312 65479013 64863240
3341 64863240 64745590 64716230 64291983 63678705 63276886 63210336 62659747 62148751 61841878 61988502
3331 61988502 61767669 61320982 61124196 60886655 61006803 60738086 60477982 60519837 60857024 60872338
3321 60872338 60676677 60488911 60655567 60942621 60893502 61008397 60986901 61706490 62043469 61940274
3311 61940274 62029950 62699439 62842909 62768162 62910977 63150286 63874250 63759586 63338762 63223216
$$ packed form
3378H3636985n47691n97827m62674l41048m36243m22489l20246o4457n65107p14417
3368G9164786m86744m35988p83611p02860p23023o02426k71655p25261r44872
3359G3488346n76353l09182m66459p90165o45800m29363l95940l17208p93924
3350F8763952m54952m00060m27424j55584n04551j64158m94911o83299o15773
3341F4863240j17650k9360m24247o13278m01819o6550n50589n10996l06873J46624
3331F1988502k20833m46687j96786k37541J20148k68717k60104M1855L37187J5314
3321F0872338j95661j87766J66656K87054m9119J14895k1496P19589L36979j03195
3311F1940274Q9676O69489J43470p4747J42815K39309P23964j14664m20824j15546
$$ plain form
3301 63223216 63519212 63790370 63790172 63820596 63872388 64064950 64027440 64081680 64411141 64612739 64683556
3290 64683556 65013393 65225140 65826777 66149992 66262055 66572221 67065344 67390151 67781747
3281 67781747 68007905 68409103 69112256 69632509 70199388 70757700 71332861 71403461 71469090 71401915
3271 71401915 71385880 71778521 71696859 71519133 71700305 71666218 71710059 71304535 71156504 71103157
3261 71103157 71241074 70993000 70665939 70506059 70690533 70689049 70218427 70196718 70098541 70255251
3251 70255251 69998037 69886156 69891798 70058809 70177109 70324066 70583367 70730671 71032004 70495678
3241 70495678 70798748 71136045 71592560 71545997 71540765 71874004 71992527 72221816 71922120 72032672
3231 72032672 72505580 72768099 72654279 72598834 72815600 72887171 73080575 73297629 73508385 73630638
$$ packed form
3301F3223216K95996K71158j98L0424N1792J92562l7510N4240L29461K01598P0817
3290F4683556L29837K11747O01637L23215J12063L10166M93123L24807L91596
3281F7781747K26158M01198P03153N20253N66879N58312N75161P0600O5629o7175
3271G1401915j6035L92641q1662j77726J81172l4087M3841m05524j48031n3347
3261G1103157J37917k48074l27061j59880J84474j484m70622k1709r8177J56710
3251G0255251k57214j11881N642J67011J18300J46957K59301J47304L01333n36326
3241G0495678L03070L37297M56515m6563n232L33239J18523K29289k99696J10552
3231G2032672M72908K62519j13820n5445K16766P1571J93404K17054K10756J22253
$$ plain form
3221 73630638 73916988 73947173 74233566 74406036 74914701 75334827 75710008 76345700 76821751 77461364
3211 77461364 77953597 78858885 79838582 80561481 81251244 82457360 83727597 84826690 85689309
3202 85689309 86666776 88038137 89336205 90787222 91917541 93413277 94770120 96341598
3194 96341598 97473169 98920517 100700452 102319841 103834778 105550438 107770590 109547781
3186 109547781 111641506 113721498 116170659 118381460 121082880 124182631 126981616 129964398
3178 129964398 133551687 137328450 141219062 145068375 149194311 153865713 158465503 163285687
3170 163285687 168110373 172927261 177573346 181203466 183767029 184965742 185645852 185864689
3162 185864689 186126982 186128082 185856246 185261539 184011680 182528407 180877890 178537863 175916340
$$ packed form
3221G3630638K86350L0185K86393J72470N08665M20126L75181O35692M76051O39613
3211G7461364M92233R05288R79697P22899O89763J206116J270237J099093Q62619
3202H5689309R77467J371361J298068J451017J130319J495736J356843J571478
3194I6341598J131571J447348J779935J619389J514937J715660K220152J777191
3186A09547781K093725K079992K449161K210801K701420L099751K798985K982782
3178A29964398L587289L776763L890612L849313M125936M671402M599790M820184
3170A63285687M824686M816888M646085L630120K563563J198713O80110K18837
3162A85864689K62293J100k71836n94707j249859j483273j650517k340027k621523
$$ plain form
3153 175916340 172931463 169164130 165131140 161128635 157099203 153129330 148947999 144767772
3145 144767772 140585533 136342883 132009320 127809623 123357688 119083079 114628861 110480882
3137 110480882 106404926 102324970 98404543 94825172 91482440 87875404 84278790 81049665
3129 81049665 78055456 75029954 72246244 69463834 66665363 63865446 61408174 59294194
3121 59294194 57046360 55115488 53033933 51210307 49562092 47898009 46486921 45073337
3113 45073337 43597129 42267600 41135782 39724155 38564944 37138493 36390879 35377532
3105 35377532 34114043 33320019 32373722 31605337 31025727 30246521 29538455 28920716 28107172
3096 28107172 27499058 26980675 26377124 25937691 25156474 24653861 24086925 23650715 23184363
$$ packed form
3153A75916340k984877l767333m032990m002505m029432l969873m181331m180227
3145A44767772m182239m242650m333563m199697m451935m274609m454218m147979
3137A10480882m075956m079956l920427l579371l342732l607036l596614l229125
3129H1049665k994209l025502k783710k782410k798471k799917k457272k113980
3121E9294194k247834j930872k081555j823626j648215j664083j411088j413584
3113D5073337j476208j329529j131818j411627j159211j426451p47614j013347
3105C5377532j263489p94024r46297p68385n79610p79206p08066o17739q13544
3096B8107172o08114n18383o03551m39433p81217n02613n66936m36210m66352
$$ plain form
3087 23184363 22616490 22435699 22052085 21475571 21224758 20800940 20501919 20248554 19956467
3078 19956467 19651275 18918051 18706840 18491593 18298249 17790105 17660005 17622497 17020695 16588540
3068 16588540 16538769 16488850 16225728 16108223 15766573 15731752 15695907 15514125 15158628 14698758
3058 14698758 14434927 14067594 14259427 14144255 13679113 13582882 13352320 13248947 13102237 13296402
3048 13296402 13120153 13124911 12918002 12805668 12544608 12284038 12114825 12218341 12271189 12300675
3038 12300675 12324802 12011714 11839304 11765266 11836402 11879622 11774933 11667879 11441090 11190898
3028 11190898 11302009 11295761 11209227 11139085 11129980 11190386 11076034 11210341 11168271 11154678 11160827
3017 11160827 10663253 10880794 11050656 11024704 10949833 10911792 10725252 10921438 11262395 11070575
$$ packed form
3087B3184363n67873j80791l83614n76514k50813m23818k99021k53365k92087
3078A9956467l05192p33224k11211k15247j93344n08144j30100l7508o01802m32155
3068A6588540m9771m9919k63122j17505l41650l4821l5845j81782l55497m59870
3058A4698758k63831l67333J91833j15172m65142r6231k30562j03373j46710J94165
3048A3296402j76249M758k06909j12334k61060k60570j69213J03516N2848K9486
3038A2300675K4127l13088j72410p4038P1136M3220j04689j07054k26789k50192
3028A1190898J11111o248q6534p0142r105O0406j14352J34307m2070j3593O149
3017A1160827m97574K17541J69862k5952p4871l8041j86540J96186L40957j91820
$$ plain form
3007 11070575 10833718 11006873 10690437 10523455 10715367 10745842 10848699 10839102 10777309 10634090
2997 10634090 10693146 11169700 10939117 10605496 10489896 10738726 10804004 10609186 10678080 10805276
2987 10805276 11012291 10861101 10801144 11023018 11083554 10834777 11172087 11357055 11065674 10784226
2977 10784226 10867305 11066637 11167545 11185000 11443723 11684662 11773736 12023680 12024386 12005597 12106303
2966 12106303 12220546 12138727 11956368 11873054 11946201 11899136 11987548 12358563 12605468 12497884
2956 12497884 12172861 12101940 12229924 12491117 12439193 12405116 12533903 12319755 12565853 12676522
2946 12676522 12815453 13031805 13123049 13366434 13502324 13724840 13846399 14009182 13698688 13549471
2936 13549471 13737024 13910775 13842927 13694245 13879250 14078881 14104349 13961830 14064311 13843096
$$ packed form
3007A1070575k36857J73155l16436j66982J91912L0475J02857r597o1793j43219
2997A0634090N9056M76554k30583l33621j15600K48830O5278j94818O8894J27196
2987A0805276K07015j51190n9957K21874O0536k48777L37310J84968k91381k81448
2977A0784226Q3079J99332J00908J7455K58723K40939Q9074K49944P06j8789J00706
2966A2106303J14243q1819j82359q3314P3147m7065Q8412L71015K46905j07584
2956A2497884l25023p0921J27984K61193n1924l4077J28787k14148K46098J10669
2946A2676522J38931K16352R1244K43385J35890K22516J21559J62783l10494j49217
2936A3549471J87553J73751o7848j48682J85005J99631K5468j42519J02481k21215
$$ plain form
2926 13843096 13966540 13942148 13974625 13934986 14014008 14082057 13828747 13876153 14055055 14376960
2916 14376960 14287557 14663691 14687213 14518004 14800586 15019043 15141815 15361193 15512524 15467753
2906 15467753 15486723 15477501 15442120 15283908 15201965 15267097 15050119 15093234 15020122 15039886 14959504
2895 14959504 14740945 14436857 14216451 14092164 14115043 14006762 13878794 13768069 13603845 13555868
2885 13555868 12845257 13168363 13389429 13121639 12803847 12429349 12528526 12492109 12341803 12384255
2875 12384255 12663318 12817551 12859222 12808268 12763929 12527750 12303996 12026666 11700400 11603617
2865 11603617 11548396 11444278 10996551 10704824 10480632 10417963 10256921 9901108 9841581 9263319
2855 9263319 9062458 8708752 8387399 8318487 8232818 8241801 7885479 7690762 7417007 7293660
$$ packed form
2926A3843096J23444k4392L2477l9639P9022O8049k53310M7406J78902L21905
2916A4376960q9403L76134K3522j69209K82582K18457J22772K19378J51331m4771
2906A5467753J8970r222l5381j58212q1943O5132k16978M3115p3112J9764q0382
2895A4959504k18559l04088k20406j24287K2879j08281j27968j10725j64224m7977
2885A3555868p10611L23106K21066k67790l17792l74498R9177l6417j50306M2452
2875A2384255K79063J54233M1671n0954m4339k36179k23754k77330l26266r6783
2865A1603617n5221j04118m47727k91727k24192o2669j61042l55813n9527n78262
2855I263319k00861l53706l21353o8912q5669Q983l56322j94717k73755j23347
$$ plain form
2845 7293660 6940896 6807369 6544878 6369364 5915464 5735506 5571183 5625934 5818092 5534927
2835 5534927 5583444 5557622 5150910 4942499 5015347 4647358 4079127 3854613 3973407 3805080
2825 3805080 3716808 3659033 3384955 3407033 3305038 3231974 2974752 2882022 2855431 2611416 2578446
2814 2578446 2453154 2727317 2736218 2463163 2180025 2136788 1956111 1746241 1718091 1513549
2804 1513549 1360521 1341726 1378981 1098730 1013792 1090501 864466 869730 958883 1273828 1112426
2793 1112426 657926 578400 645590 771066 726873 536046 641120 1111040 918914 351873
2783 351873 238000 625038 185702 -24495 113545 129526 569575 119799 -214628 46033
2773 46033 455003 5160 -220219 -373214 -216882 -239344 -126212 -8958 29204 34019 -112817
$$ packed form
2845G293660l52764j33527k62491j75514m53900j79958j64323N4751J92158k83165
2835E534927M8517k5822m06712k08411P2848l67989n68231k24514J18794j68327
2825C805080q8272n7775k74078K2078j01995p3064k57222r2730k6591k44015l2970
2814B578446j25292K74163Q901k73055k83138m3237j80677k09870k8150k04542
2804A513549j53028j8795L7255k80251q4938P6709k26035N264Q9153L14945j61402
2793A112426m54500p9526O7190J25476m4193j90827J05074M69920j92126n67041
2783C51873j13873L87038m39336k10197J38040J5981M40049m49776l34427K60661
2773D6033M08970m49843k25379j52995J56332k2462J13132J17254L8162M815j46836
$$ plain form
2762 -112817 -118039 -265894 -358766 -189031 -246039 -437361 -389908 -307338 -499795 -624538 -308094
2751 -308094 -127111 -350102 -422878 -498670 -457163 -246990 -442773 -371301 -276040 -58056 -474539
2740 -474539 -580237 -604663 -388422 -674650 -895369 -985861 -693842 -390012 -801271 -638843
2730 -638843 -532285 -707265 -838261 -748857 -651682 -574934 -475154 -531329 -902098 -721370 -469159
2719 -469159 -882961 -913904 -858386 -787444 -943241 -959980 -930392 -621737 -463856 -679175 -614949
2708 -614949 -740258 -812391 -1016712 -1246846 -991149 -512872 -630241 -893848 -631728 -622756
2698 -622756 -418621 -549901 -712745 -612868 -843238 -916434 -972786 -1031432 -845167 -750109 -930385
2687 -930385 -944058 -904361 -771992 -731951 -965922 -804817 -601086 -744801 -972740 -980173 -600780
$$ packed form
2762a12817n222j47855r2872J69735n7008j91322M7453Q2570j92457j24743L16444
2751c08094J80983k22991p2776p5792M1507K10173j95783P1472R5261K17984m16483
2740d74539j05698k4426K16241k86228k20719r0492K92019L03830m11259J62428
2730f38843J06558j74980j30996Q9404R7175P6748R9780n6175l70769J80728K52211
2719d69159m13802l0943N5518P0942j55797j6739K9588L08655J57881k15319O4226
2708f14949j25309p2133k04321k30134K55697M78277j17369k63607K62120Q972
2698f22756K04135j31280j62844R9877k30370p3196n6352n8646J86265R5058j80276
2687i30385j3673L9697J32369M0041k33971J61105K03731j43715k27939p433L79393
$$ plain form
2676 -600780 -318147 -491274 -649702 -650680 -646879 -695452 -881366 -584221 -903091 -1101307 -1018250
2665 -1018250 -997406 -804890 -714090 -808664 -894700 -1058718 -919615 -1023680 -1074065 -748577
2655 -748577 -798777 -958255 -1379975 -1212024 -928744 -1060877 -1074277 -1410675 -1163022 -1024832
2645 -1024832 -1278999 -1355817 -987769 -886522 -917503 -974981 -1090773 -1181281 -1079927 -1141219
2635 -1141219 -1320261 -1091537 -1327406 -1273750 -1124456 -752908 -665736 -693606 -894337 -1113651
2625 -1113651 -1081711 -944396 -997728 -1118131 -970624 -780818 -1109225 -1108189 -817125 -689456
2615 -689456 -981808 -811241 -1041811 -689101 -650635 -1038766 -914405 -783276 -631798 -1014715
2605 -1014715 -1058909 -941714 -1016807 -1043109 -888377 -809147 -685584 -898651 -1008102 -1076233
$$ packed form
2676f00780K82633j73127j58428r78L801m8573j85914K97145l18870j98216Q3057
2665a018250K0844J92516R0800r4574q6036j64018J39103j04065n0385L25488
2655g48577n0200j59478m21720J67951K83280j32133j3400l36398K47653J38190
2645a024832k54167p6818L68048J01247l0981n7478j15792r0508J01354o1292
2635a141219j79042K28724k35869N3656J49294L71548Q7172k7870k00731k19314
2625a113651L1940J37315n3332j20403J47507J89806l28407J036K91064J27669
2615f89456k92352J70567k30570L52710L8466l88131J24361J31129J51478l82917
2605a014715m4194J17195p5093k6302J54732P9230J23563k13067j09451o8131
$$ plain form
2595 -1076233 -777805 -831409 -918963 -1168151 -1057831 -664962 -726454 -1058425 -1321953 -1142507
2585 -1142507 -1129506 -1205623 -1260060 -1004791 -690176 -951269 -1043844 -1446205 -1223356 -943667
2575 -943667 -901587 -972600 -1035894 -1016667 -901249 -957948 -1116095 -1012566 -921085 -946226 -1147085
2564 -1147085 -1156316 -889125 -1050725 -1639245 -1499338 -1299573 -931523 -937784 -1101619 -1297146
2554 -1297146 -1195854 -1229495 -1300119 -1069047 -1116649 -1455253 -1285811 -873083 -870980 -834310 -991185
2543 -991185 -1028150 -855556 -895259 -1206548 -1050515 -1219718 -1000322 -914452 -964992 -1247099
2533 -1247099 -1090210 -887787 -744525 -636198 -912421 -373450 -520418 -623448 -404200 -291232
2523 -291232 -866384 -1058221 -996356 -979699 -708402 -728429 -823124 -790873 -725733 -794609 -828956
$$ packed form
2595a076233K98428n3604q7554k49188J10320L92869o1492l31971k63528J79446
2585a142507J3001p6117n4437K55269L14615k61093r2575m02361K22849K79689
2575i43667M2080p1013o3294J9227J15418n6699j58147J03529R1481k5141k00859
2564a147085r231K67191j61600n88520J39907J99765L68050o261j63835j95527
2554a297146J01292l3641p0624K31072m7602l38604J69442M12728K103L6670j56875
2543i91185l6965J72594l9703l11289J56033j69203K19396Q5870n0540k82107
2533a247099J56889K02423J43262J08327k76223N38971j46968j03030K19248J12968
2523b91232n75152j91837O1865J6657K71297k0027r4695L2251O5140o8876l4347
$$ plain form
2512 -828956 -735444 -688265 -946408 -877905 -496316 -435849 -252498 -757870 -690126 -447904 -567450
2501 -567450 -383111 -444845 -673785 -706248 -534693 -613466 -654531 -477831 -449747 -711829 -1084860
2490 -1084860 -972187 -809570 -768526 -619807 -794433 -1020948 -820229 -662241 -569746 -402360
2480 -402360 -392863 -521430 -682613 -683668 -394000 -112730 -220507 2865 -320502 -342741 -291951
2469 -291951 -356742 -173727 -230003 -148014 -218099 -320659 -515212 -405859 -523302 -457392 -234410
2458 -234410 -454898 -470363 -123669 -71020 -169956 97151 339702 576130 497467 468916 296596
2447 296596 516770 460161 404141 621207 763183 646914 629098 839447 681702 774168
2437 774168 877945 1022115 949811 822594 1149951 1249550 1194634 1308227 1419994 1589135
$$ packed form
2512h28956R3512M7179k58143O8503L81589O0467J83351n05372O7744K42222j19546
2501e67450J84339o1734k28940l2463J71555p8773m1065J76700K8084k62082l73031
2490a084860J12673J62617M1044J48719j74626k26515K00719J57988R2495J67386
2480d02360R497j28567j61183j055K89668K81270j07777K23372l23367k2239N0790
2469b91951o4791J83015n6276Q1989p0085j02560j94553J09353j17443O5910K22982
2458b34410k20488j5465L46694N2649r8936K67107K42551K36428p8663k8551j72320
2447B96596K20174n6609n6020K17066J41976j16269j7816K10349j57745R2466
2437G74168J03777J44170p2304j27217L27357R9599n4916J13593J11767J69141
$$ plain form
2427 1589135 1913022 1539841 1493312 1880151 2026285 2124648 1997833 2172123 2447216 2805056
2417 2805056 2931354 2902075 3152350 3517581 4086142 4621228 5377434 5810897 5744321 5333197
2407 5333197 5229673 5208846 5014967 4708115 4619042 4655700 4277107 4300234 3917813 3784385
2397 3784385 3593780 3514463 3106920 2944758 2596337 2638569 2386224 2063902 2071670 1856532
2387 1856532 1436993 1257690 1386501 1074960 1205248 971714 776367 374203 270134 224675
2377 224675 -151405 -257543 -460901 -481709 -496962 -435138 -416957 -494599 -532500 -532071 -476794
2366 -476794 -562716 -769429 -1076587 -981645 -1022995 -1221535 -1292449 -1376372 -1411551 -1120959 -1277983
2355 -1277983 -1390539 -1502760 -1332878 -922035 -1121854 -1548253 -1741512 -1540111 -1523047 -1641502
$$ packed form
2427A589135L23887l73181m6529L86839J46134R8363j26815J74290K75093L57840
2417B805056J26298k9279K50275L65231N68561N35086P56206M33463o6576m11124
2407E333197j03524k0827j93879l06852q9073L6658l78593K3127l82421j33428
2397C784385j90605p9317m07543j62162l48421M2232k52345l22322P768k15138
2387A856532m19539j79303J28811l11541J30288k33534j95347m02164j04069m5459
2377B24675l76080j06138k03358k0808j5253O1824J8181p7642l7901M29N5277
2366d76794q5922k06713l07158R4942m1350j98540p0914q3923l5179K90592j57024
2355a277983j12556j12221J69882M10843j99819m26399j93259K01401J7064j18455
$$ plain form
2345 -1641502 -1621987 -1533861 -1372680 -1709304 -1306334 -1286271 -1747564 -1658003 -2007947 -1979372
2335 -1979372 -1808324 -1619194 -1857648 -1727660 -1716723 -1802603 -1504147 -1459976 -1330820 -1730699
2325 -1730699 -1778557 -1578292 -1527754 -1781686 -1818492 -1761706 -1828651 -1763643 -1690321 -1741527 -1774410
2314 -1774410 -1869960 -2172077 -1901329 -1887574 -1571813 -1661516 -1870569 -1884216 -1814097 -1580770
2304 -1580770 -1498450 -1752017 -1927260 -1765971 -1752042 -2118390 -2175989 -1811811 -1776672 -1965882
2294 -1965882 -1848050 -1878513 -1795416 -1841898 -1933303 -1990509 -1917758 -1898730 -1567519 -1546056 -1717550
2283 -1717550 -1661005 -1845115 -1514689 -1810408 -1905097 -1702371 -1789562 -1936208 -1707496 -1804741
2273 -1804741 -1828780 -1756601 -1505395 -1262753 -1715738 -1947032 -1822644 -1570988 -1661446 -1765919
$$ packed form
2345a641502J9515Q8126J61181l36624M02970K0063m61293Q9561l49944K8575
2335a979372J71048J89130k38454J29988J0937q5880K98456M4171J29156l99879
2325a730699m7858K00265N0538k53932l6806N6786o6945O5008P3322n1206l2883
2314a774410r5550l02117K70748J3755L15761q9703k09053j3647P0119K33327
2304a580770Q2320k53567j75243J61289J3929l66348n7599L64178L5139j89210
2294a965882J17832l0463Q3097m6482r1405n7206P2751J9028L31211K1463j71494
2283a717550N6545j84110L30426k95719r4689K02726q7191j46646K28712r7245
2273a804741k4039P2179K51206K42642m52985k31294J24388K51656r0458j04473
$$ plain form
2263 -1765919 -1768543 -1857002 -1788093 -1802660 -1693496 -1888758 -1748702 -1660413 -1692873 -1762403 -1734786
2252 -1734786 -1799060 -1961790 -2047937 -2035755 -2008876 -2234928 -1948518 -1409843 -1295240 -1611130
2242 -1611130 -1779104 -1941301 -1828049 -1912608 -1802291 -1754659 -1898589 -1615709 -1627130 -1624544
2232 -1624544 -1547817 -1624450 -1641341 -1763266 -2254477 -1942062 -1498199 -1691628 -1688460 -1764658 -1712509
2221 -1712509 -1608148 -1891556 -1813110 -1833519 -1797761 -1731489 -1823970 -1909354 -1810229 -1880299 -1842207
2210 -1842207 -1908385 -1831213 -1669648 -1728409 -1404758 -1541527 -1712587 -1852353 -1872579 -1905026
2200 -1905026 -1675067 -1976163 -2193166 -1941500 -2012549 -2028409 -1738713 -1832737 -1987234 -1806320
2190 -1806320 -2023312 -1884791 -1760541 -1657710 -1780415 -1748877 -1752084 -1965150 -1697663 -1797225
$$ packed form
2263a765919k624q8459O8909j4567J09164j95262J40056Q8289l2460o9530K7617
2252a734786o4274j62730q6147J2182K6879k26052K86410N38675J14603l15890
2242a611130j67974j62197J13252q4559J10317M7632j43930K82880j1421K586
2232a624544P6727p6633j6891j21925m91211L12415M43863j93429L168p6198N2149
2221a712509J04361k83408P8446k0409L5758O6272r2481q5384R9125p0070L8092
2210a842207o6178P7172J61565n8761L23651j36769j71060j39766k0226l2447
2200a905026K29959l01096k17003K51666p1049j5860K89696r4024j54497J80914
2190a806320k16992J38521J24250J02831j22705L1538l207k13066K67487r9562
$$ plain form
2180 -1797225 -1654857 -1676765 -1998462 -1996876 -1797066 -1819057 -2149507 -2166991 -2029058 -1617612
2170 -1617612 -1743373 -1536856 -1401592 -1674497 -1662853 -1578217 -1528898 -1574924 -1261134 -1231304
2160 -1231304 -1460251 -1478247 -1329825 -1481815 -1397149 -1654190 -1537303 -1728576 -1988847 -1712975
2150 -1712975 -1518143 -1446506 -1595951 -1568636 -1633146 -1882775 -1612311 -1479147 -1774835 -1941456
2140 -1941456 -1561549 -1546032 -1455856 -1334509 -1546973 -1494840 -1396588 -1492061 -1842778 -1572171
2130 -1572171 -1556202 -1672140 -1693029 -1620277 -1797754 -1693001 -1437150 -1406307 -1392218 -1558789
2120 -1558789 -1472069 -1764740 -1324539 -1495132 -1741545 -1555743 -1541825 -1692739 -1674554 -1662639
2110 -1662639 -1774769 -1367997 -1452573 -1656205 -2072055 -1840797 -1525408 -1441724 -1749843 -1625699
$$ packed form
2180a797225J42368k1908l21697J586J99810k1991l30450j7484J37933M11446
2170a617612j25761K06517J35264k72905J1644Q4636M9319m6026L13790K9830
2160a231304k28947j7996J48422j51990Q4666k57041J16887j91273k60271K75872
2150a712975J94832P1637j49445K7315o4510k49629K70464J33164k95688j66621
2140a941456L79907J5517R0176J21347k12464N2133R8252r5473l50717K70607
2130a572171J5969j15938k0889P2752j77477J04753K55851L0843J4089j66571
2120a558789Q6720k92671M40201j70593k46413J85802J3918j50914J8185J1915
2110a662639j12130M06772q4576k03632m15850K31258L15389Q3684l08119J24144
$$ plain form
2100 -1625699 -1419993 -1712626 -1799607 -2004389 -1804969 -1763046 -2044637 -2097122 -1641145 -1614406
2090 -1614406 -1752746 -1674994 -1705156 -1744284 -1731726 -1613600 -1823733 -1487663 -1211669 -1340661
2080 -1340661 -1498780 -1386927 -1225722 -1178444 -1410117 -1302613 -1079045 -1452136 -1604731 -1600088
2070 -1600088 -1573355 -1611577 -1778859 -1578469 -1655177 -1628354 -1602698 -1505603 -1619097 -1364113 -1259461
2059 -1259461 -1179863 -1141336 -1490795 -1479509 -1477149 -1316424 -1355173 -1255558 -1640310 -1889486 -1651068
2048 -1651068 -1249912 -1339646 -1855900 -1919414 -1818542 -1628861 -1714174 -1716553 -1674667 -1328763 -1661041
2037 -1661041 -1943446 -1725998 -1412728 -1109239 -1483776 -1331355 -1193869 -1020949 -1145495 -1218300
2027 -1218300 -1209660 -1381197 -1394187 -1350693 -1131101 -1374969 -1529518 -1628566 -1727521 -1585678 -1674234
$$ packed form
2100a625699K05706k92633q6981k04782J99420M1923k81591n2485M55977K6739
2090a614406j38340P7752l0162l9128J2558J18126k10133L36070K75994j28992
2080a340661j58119J11853J61205M7278k31673J07504K23568l73091j52595M643
2070a600088K6733l8222j67282K00390p6708K6823K5656R7095j13494K54984J04652
2059a259461P9598L8527l49459J1286K360J60725l8749R9615l84752k49176K38418
2048a651068M01156q9734n16254o3514J00872J89681q5313k379M1886L45904l32278
2037a661041k82405K17448L13270L03489l74537J52421J37486J72920j24546p2805
2027a218300Q640j71537j2990M3494K19592k43868j54549r9048r8955J41843q8556
$$ plain form
2016 -1674234 -1776958 -1576066 -1360242 -1317072 -1341313 -1640894 -1415928 -1312881 -1305911 -1435792
2006 -1435792 -1610616 -1366040 -997001 -1207913 -1299499 -1183159 -1121202 -1379552 -1668593 -1476582
1996 -1476582 -1277425 -1240261 -1428957 -1393565 -1250971 -1246858 -1133111 -1376650 -1337406 -1221574
1986 -1221574 -1340228 -1402392 -1291879 -1021433 -1162701 -1250561 -1459432 -1471888 -1635539 -1314011
1976 -1314011 -1494002 -1538043 -1317978 -1253930 -1317771 -1475731 -1529150 -1236345 -1041016 -1280288
1966 -1280288 -1181148 -1014756 -1132075 -1432701 -1479200 -1348296 -1267117 -1245228 -1617510 -1367703
1956 -1367703 -1430940 -1442535 -1477861 -1574664 -1317771 -1382888 -1487578 -1358334 -1191776 -1379979
1946 -1379979 -1206400 -1418856 -1261497 -1264938 -1413250 -1420872 -1370672 -1309629 -1368042 -1414879 -1257375
$$ packed form
2016a674234j02724K00892K15824M3170k4241k99581K24966J03047O970j29881
2006a435792j74824K44576L69039k10912r1586J16340O1957k58350k89041J92011
1996a476582J99157L7164j88696L5392J42594M113J13747k43539L9244J15832
1986a221574j18654o2164J10513K70446j41268q7860k08871j2456j63651L21528
1976a314011j79991m4041K20065O4048o3841j57960n3419K92805J95329k39272
1966a280288R9140J66392j17319l00626m6499J30904Q1179K1889l72282K49807
1956a367703o3237j1595l5326r6803K56893o5117j04690J29244J66558j88203
1946a379979J73579k12456J57359l441j48312p622N0200O1043n8413m6837J57504
$$ [...]
##END NTUPLES=NMR SPECTRUM
##END=
