##TITLE=1H_CA-9387-0
 200.13MHz, CDCl3,
 8 sc
 
 10.10.2025
##JCAMPDX= 6.0         $$ Bruker NMR JCAMP-DX V2.0
##DATA TYPE= NMR SPECTRUM
##DATA CLASS= NTUPLES
##ORIGIN= UXNMR, Bruker Analytische Messtechnik GmbH
##OWNER= pz
$$ XWIN-NMR		Version 3.5
$$ Fri Oct 10 15:56:44 2025 Russian Standard Time (UT+4h)  she@DPX200
##.OBSERVE FREQUENCY= 200.1308
##.OBSERVE NUCLEUS= ^1H
##.ACQUISITION MODE= SIMULTANEOUS
##.ACQUISITION SCHEME= undefined
##.AVERAGES= 8
##.DIGITISER RES= 18
##SPECTROMETER/DATA SYSTEM= spect
##.PULSE SEQUENCE= zg30
##.SOLVENT NAME= CDCl3
##.SHIFT REFERENCE= (INTERNAL, CDCl3, 0, 15.4461)
##AUDIT TRAIL= $$ (NUMBER, WHEN, WHO, WHERE, WHAT)
$$ ##TITLE= Audit trail, XWIN-NMR		Version 3.5
$$ ##JCAMPDX= 5.01
$$ ##ORIGIN= Bruker BioSpin GmbH
$$ ##OWNER= she
$$ F:/spectra/data/she/nmr/H-C/1/pdata/1/auditp.txt
$$ ##AUDIT TRAIL=  $$ (NUMBER, WHEN, WHO, WHERE, WHAT)
(   1,<2025-10-10 15:53:24.21 +0400>,<she>,<DPX200>,
      <created by zg, POWCHK disabled, PULCHK disabled
       configuration hash MD5:
       00 E9 B6 7A A2 85 ED C7 34 08 36 98 17 FE 4E 26
       data hash MD5: 16K
       78 83 DF 56 03 0A BA 38 34 54 5E 80 90 43 72 67>)
(   2,<2025-10-10 15:53:26.64 +0400>,<she>,<DPX200>,
      <Start of raw data processing
       efp BC_mod = 2 LB = 0.25 FT_mod = 6 PKNL = 1 PHC0 = -2267.139 PHC1 = -4.207747 SI = 16K 
       data hash MD5: 16K
       31 90 E7 94 5E 65 59 21 79 E4 55 35 96 D5 1F FD>)
(   3,<2025-10-10 15:53:48.54 +0400>,<she>,<DPX200>,
      <pk PHC0 = -13.75012 PHC1 = 17.8 
       data hash MD5: 16K
       9F FF 55 81 4C 4F A9 92 68 7D 53 EB 1F 1A 4B 79>)
(   4,<2025-10-10 15:53:52.34 +0400>,<she>,<DPX200>,
      <abs ABSG = 5 
       data hash MD5: 16K
       D4 2D 64 1F 58 4F 95 3C 1E 5D 6A 76 BA A8 9C D1>)
$$ ##END=
$$ 
$$ hash MD5
$$ 02 A7 34 FF 01 CF 13 A2 C8 0C 13 E3 3B FE 7D 11
##$RELAX= 
##$RELAX= 
##$RELAX= 
##$RELAX= 
##$RELAX= 
##$RELAX= 
$$ Bruker specific parameters
$$ --------------------------
##$DU= <F:/spectra>
##$EXPNO= 1
##$NAME= <H-C>
##$PROCNO= 1
##$TYPE= <nmr>
##$USER= <she>
##$AMP= (0..31)
100 100 100 100 100 100 100 100 100 100 100 100 100 100 100 100 100 100 
100 100 100 100 100 100 100 100 100 100 100 100 100 100 
##$AQSEQ= 0
##$AQ_mod= 1
##$AUNM= <au_zg>
##$AUTOPOS= <>
##$BF1= 200.13
##$BF2= 200.13
##$BF3= 200.13
##$BF4= 200.13
##$BF5= 200.13
##$BF6= 200.13
##$BF7= 200.13
##$BF8= 200.13
##$BYTORDA= 1
##$CFDGTYP= 0
##$CFRGTYP= 5
##$CHEMSTR= <none>
##$CNST= (0..31)
1 1 145 1 1 1 1 1 1 1 1 1 1 1 1 1 1 1 1 1 1 1 1 1 1 1 1 1 1 1 1 1 
##$CPDPRG= <>
##$CPDPRG1= <>
##$CPDPRG2= <>
##$CPDPRG3= <>
##$CPDPRG4= <mlev>
##$CPDPRG5= <mlev>
##$CPDPRG6= <mlev>
##$CPDPRG7= <mlev>
##$CPDPRG8= <mlev>
##$CPDPRGB= <>
##$CPDPRGT= <>
##$D= (0..31)
0 0.7 0 0 0 0 0 0 0 0 0 0.03 0 0 0 0 0 0 0 0 0 0 0 0 0 0 0 0 0 0 0 0 
##$DATE= 1760097203
##$DBL= (0..7)
120 120 120 120 120 120 120 120 
##$DBP= (0..7)
150 150 150 150 150 150 150 150 
##$DBP07= 0
##$DBPNAM0= <>
##$DBPNAM1= <>
##$DBPNAM2= <>
##$DBPNAM3= <>
##$DBPNAM4= <>
$$ [...]
##$SUBNAM3= <"">
##$SUBNAM4= <"">
##$SUBNAM5= <"">
##$SUBNAM6= <"">
##$SUBNAM7= <"">
##$SUBNAM8= <"">
##$SUBNAM9= <"">
##$SW= 18.0517779522481
##$SWIBOX= (0..15)
0 0 2 0 0 0 0 0 0 0 0 0 0 0 0 0 
##$SW_h= 3612.71676300578
##$TD= 16384
##$TD0= 1
##$TE= 0
##$TE2= 300
##$TE3= 300
##$TEG= 300
##$TL= (0..7)
0 120 120 120 120 120 120 120 
##$TP= (0..7)
150 150 150 150 150 150 150 150 
##$TP07= 0
##$TPNAME0= <>
##$TPNAME1= <>
##$TPNAME2= <>
##$TPNAME3= <>
##$TPNAME4= <>
##$TPNAME5= <>
##$TPNAME6= <>
##$TPNAME7= <>
##$TPOAL= (0..7)
0.5 0.5 0.5 0.5 0.5 0.5 0.5 0.5 
##$TPOFFS= (0..7)
0 0 0 0 0 0 0 0 
##$TUNHIN= 0
##$TUNHOUT= 0
##$TUNXOUT= 0
##$USERA1= <user>
##$USERA2= <user>
##$USERA3= <user>
##$USERA4= <user>
##$USERA5= <user>
##$V9= 5
##$VALIST= <valist>
##$VCLIST= <CCCCCCCCCCCCCCC>
##$VD= 0
##$VDLIST= <DDDDDDDDDDDDDDD>
##$VPLIST= <PPPPPPPPPPPPPPP>
##$VTLIST= <TTTTTTTTTTTTTTT>
##$WBST= 1024
##$WBSW= 4
##$XGAIN= (0..3)
0 0 0 0 
##$XL= 0
##$YL= 0
##$YMAX_a= 764935
##$YMIN_a= -937123
##$ZGOPTNS= <>
##$ZL1= 120
##$ZL2= 120
##$ZL3= 120
##$ZL4= 120
##$ABSF1= 15.47037
##$ABSF2= -2.581525
##$ABSG= 5
##$ABSL= 3
##$ALPHA= 0
##$AQORDER= 0
##$ASSFAC= 0
##$ASSFACI= 0
##$ASSFACX= 0
##$ASSWID= 0
##$AUNMP= <proc_1d>
##$AZFE= 0.1
##$AZFW= 0.1
##$BCFW= 0
##$BC_mod= 2
##$BYTORDP= 0
##$COROFFS= 0
##$CY= -3
##$DATMOD= 1
##$DC= 0
##$DFILT= <>
##$DTYPP= 0
##$F1P= 0
##$F2P= 0
##$FCOR= 1
##$FTSIZE= 16384
##$FT_mod= 6
##$GAMMA= 0
##$GB= 0
##$INTBC= 1
##$INTSCL= 3.241238e-09
##$ISEN= 128
##$LB= 0.25
##$LEV0= 0
##$LPBIN= 0
##$MAXI= 10000
##$MC2= 0
##$MEAN= 0
##$ME_mod= 0
##$MI= 1.114404
##$NCOEF= 0
##$NC_proc= -5
##$NLEV= 6
##$NOISF1= 3.799351
##$NOISF2= 2.8
##$NSP= 0
##$NTH_PI= 0
##$NZP= 0
##$OFFSET= 15.44614
##$PC= 1
##$PHC0= -2280.889
##$PHC1= 13.59225
##$PH_mod= 1
##$PKNL= yes
##$PPARMOD= 0
##$PSCAL= 0
##$PSIGN= 0
##$REVERSE= no
##$SF= 200.129515129779
##$SI= 16384
##$SIGF1= 3
##$SIGF2= 2
##$SINO= 0.751879
##$SIOLD= 32768
##$SREGLST= <19F.Aceton>
##$SSB= 0
##$STSI= 16384
##$STSR= 0
##$SW_p= 3612.71676300577
##$SYMM= 0
##$S_DEV= 0
##$TDeff= 16384
##$TDoff= 0
##$TI= <>
##$TILT= no
##$TM1= 0
##$TM2= 0
##$TOPLEV= 0
##$USERP1= <user>
##$USERP2= <user>
##$USERP3= <user>
##$USERP4= <user>
##$USERP5= <user>
##$WDW= 1
##$XDIM= 16384
##$YMAX_p= 312525521
##$YMIN_p= -164170
$$ End of Bruker specific parameters
$$ ---------------------------------
##NTUPLES= NMR SPECTRUM
##VAR_NAME=  FREQUENCY,     SPECTRUM/REAL,   SPECTRUM/IMAG
##SYMBOL=    X,             R,               I
##VAR_TYPE=  INDEPENDENT,   DEPENDENT,       DEPENDENT
##VAR_FORM=  AFFN,          ASDF,            ASDF
##VAR_DIM=   16384,         16384,           16384
##UNITS=     HZ,            ARBITRARY UNITS, ARBITRARY UNITS
##FACTOR=    0.220516191357247, 1,           1
##FIRST=     3091.22856672548, 0,            0
##LAST=      -521.488196280288, 0,           0
##MIN=       -521.488196280288, -164170,     0
##MAX=       3091.22856672548, 312525521,    0
$$ Real data points
##PAGE= N=1
##DATA TABLE= (X++(R..R)), XYDATA
$$ [...]
6068A945118m789L5630K0442p303J8348j5328k8819K4169J9745j3068p0599p748
6056A915798J2829K1956P6529j9457L8336M3849r084N899n3733P233k4911M4405
6044B059649k3150J3574m3243N0853M6570n2549J5497j0024p364q218m4240M9899
6032B047254J5683J130O1022j8825j5133L0549m4966R858M5016J4501O097K4435
6020B176621M5401q4035n6137P288M353l5096P1491M2007M0443p7539m2395K9301
6008B121703J5223o0287j2219J7148O0512P6170l3032k3221O822j4820l6243k5969
5996B091787l6215n902N1258K3186j1315o2755o975N7959N922l4547N6900j7975
5984B111328k6883L2119J0889l6028O355q3L194J4976K272J2038K3866J9576j8419
$$ y = [1945118, 1940329, 1975959, 1996401, 1989098, 2007446, 1992118, 1963299, 1987468, 2007213, 1994145, 1923546, 1915798, 1928627, 1950583, 2027112, 2007655, 2045991, 2089840, 2080756, 2086655, 2032922, 2040155, 2015244, 2059649, 2036499, 2050073, 2006830, 2057683, 2104253, 2051704, 2067201, 2057177, 2049813, 2041595, 1997355, 2047254, 2062937, 2064067, 2125089, 2106264, 2091131, 2121680, 2076714, 2086572, 2131588, 2146089, 2152186, 2176621, 2222022, 2137987, 2081850, 2089138, 2093491, 2058395, 2129886, 2171893, 2212336, 2134797, 2092402, 2121703, 2136926, 2076639, 2064420, 2081568, 2142080, 2218250, 2185218, 2161997, 2168819, 2153999, 2117756, 2091787, 2055572, 2049670, 2100928, 2124114, 2112799, 2050044, 2043069, 2101028, 2106950, 2072403, 2129303, 2111328, 2084445, 2116564, 2127453, 2091425, 2097780, 2097697, 2100891, 2115867, 2118139, 2130177, 2154043, 2173619, 2155200]
5971B155200r0874o0136L9284O8012J4807K5793N052N947n1482m6407P7107K2014
5959B164317k7752k4801k5435N0567L938m6897k8064Q127l5269l9814k0360K0484
5947A999041L3226L0742N9955K384j673M5552l7451K1229J7620R617K3760m6676
5935B157326j15010n9036N9651k2023J6911J0949K2517j2033R54Q484L9151j7248
5923B090593m2266o8353p26j4241p292M458K6490M4034J7815J0779n1812n1622
5911A957857N1548Q306m2542J2337Q3493Q835m7896l7152m113j3012m4405j3153
5899A920103N0607j4152J1820j2402K3032j6250Q671Q7658m9510o0712K535L2792
5887A984192L2166m592P2402R421m3124R431J174j1847N541J8533K2081L6719
$$ y = [2155200, 2064326, 2004190, 2043474, 2111486, 2126293, 2152086, 2157138, 2163085, 2111603, 2065196, 2142303, 2164317, 2136565, 2111764, 2086329, 2136896, 2140834, 2093937, 2065873, 2074000, 2038731, 1998917, 1978557, 1999041, 2032267, 2063009, 2122964, 2125348, 2123675, 2169227, 2131776, 2153005, 2170625, 2180242, 2204002, 2157326, 2042316, 1983280, 2042931, 2020908, 2037819, 2048768, 2071285, 2059252, 2060206, 2068690, 2107841, 2090593, 2048327, 1979974, 1979248, 1965007, 1957715, 1962173, 1988663, 2032697, 2050512, 2061291, 2009479, 1957857, 2009405, 2017711, 1975169, 1987506, 2070999, 2079834, 2031938, 1994786, 1990673, 1977661, 1933256, 1920103, 1970710, 1956558, 1968378, 1955976, 1979008, 1962758, 1971429, 2059087, 2009577, 1948865, 1951400, 1984192, 2016358, 2011766, 2084168, 2093589, 2050465, 2059896, 2061070, 2049223, 2054764, 2073297, 2095378, 2132097]
5875B132097J3456l8762j8435K2999J9839j6029j7862N4891M989P310k1670J8930
5863B161753L6835J7629m0884k1252M1768K6393m5357J9406j4649k4258K6902
5852B184286N9931M0739L7012M1819m9733k8022o87J059M1332q365l6429J8338
5840B301280K1480K6429J9678o52N1135J5415P303M2928L2070p311Q287M247M2107
5827B564396N4896m2353J1390k1706k2820L8322O0233K0703N594J7444N8498L5488
5815B780085m499r069L1853M6028M2961M0191N0874J3314J6901N2276Q3339M6505
5803C190759k055k745N6710R0472J6191J5187M2156J20213l875P1679K6403N938
5791C627033k6919m7846P6871J1754Q9776Q3422l4671j2996j4315N6365N2752
$$ y = [2132097, 2145553, 2106791, 2088356, 2111355, 2131194, 2115165, 2097303, 2152194, 2157183, 2164493, 2142823, 2161753, 2198588, 2216217, 2175333, 2154081, 2195849, 2222242, 2176885, 2196291, 2181642, 2157384, 2184286, 2244217, 2284956, 2321968, 2363787, 2314054, 2286032, 2285345, 2286404, 2327736, 2319371, 2282942, 2301280, 2322760, 2349189, 2368867, 2368215, 2419350, 2434765, 2442068, 2484996, 2517066, 2509755, 2518042, 2522289, 2564396, 2619292, 2576939, 2588329, 2566623, 2543803, 2582125, 2642358, 2663061, 2668655, 2686099, 2744597, 2780085, 2775586, 2766517, 2798370, 2844398, 2887359, 2927550, 2978424, 2991738, 3008639, 3060915, 3144254, 3190759, 3188704, 3185959, 3242669, 3333141, 3349332, 3364519, 3406675, 3526888, 3523013, 3594692, 3621095, 3627033, 3600114, 3552268, 3629139, 3640893, 3730669, 3814091, 3779420, 3766424, 3752109, 3808474, 3861226]
5780C861226K4234J2623n0309J2708j3533j0216k0335M1170o898J6767K0163M416
5768C892016L5902n113O1341l6666l3055J55705J6740m0039J5300O6348O9719
5757D198198M0859K1954K6851L1639O7970p345j5032J3458K8787M5651j1793N198
5745D446395p4052K6389N9658J56292M4393J5661M554O6160k7096L705q524N0065
5733D763600K8166N7216L8359j7855P9666n4129K2215M1933K9233p309M6732Q7696
5721E115523M7022K7041O1135O4376L7610L0524M5311L2970J28249O6238l1026
5710E624973O3540L0701P7669K1468M3015J32874m7964O7608N3328L1573L9046
5699F137831j8451J7902L0538P4988K9802l9604J9050M3343m1566P998l3772k8353
$$ y = [3861226, 3885460, 3898083, 3847774, 3860482, 3846949, 3836733, 3816398, 3857568, 3850670, 3867437, 3887600, 3892016, 3927918, 3922805, 3984146, 3947480, 3914425, 4070130, 4086870, 4046831, 4062131, 4128479, 4198198, 4239057, 4261011, 4287862, 4319501, 4387471, 4380126, 4365094, 4378552, 4407339, 4452990, 4441197, 4446395, 4372343, 4398732, 4458390, 4614682, 4659075, 4674736, 4679290, 4745450, 4718354, 4722059, 4713535, 4763600, 4791766, 4848982, 4887341, 4869486, 4949152, 4895023, 4917238, 4959171, 4988404, 4981095, 5027827, 5115523, 5162545, 5189586, 5250721, 5315097, 5352707, 5383231, 5428542, 5461512, 5589761, 5655999, 5624973, 5688513, 5719214, 5796883, 5818351, 5861366, 5994240, 5946276, 6013884, 6067212, 6098785, 6137831, 6119380, 6137282, 6167820, 6242808, 6272610, 6233006, 6252056, 6295399, 6253833, 6261831, 6228059, 6199706]
5687F199706o8388N909N6817m7056o1507l4994J6310J2075k7491K5202k7159j03650
5675E945774k8445l6139Q761p3910j49513p5583k5083N717m665p1476J492n3975
5663E442955q0080k0345N7394l3812l8780M951p1173l2063k3906k8008K409M622
5651E184164j6807o8551k0964j4197n876J9085O462o795K3291n188j02863L0864
5639E022625Q9799j523L0190l295m7984M1262O5236L4675k040K2641J3006j1600
5627E252992K4586r300Q5680M0397o5999M0941J2412k12K2445j0963J0821p4535
5615E329265o34l1151l2565P1826L1592m3024j7826L6581Q018L2691l1968J2799
5603E365604l281J4442N1982j6248M1137m7243k9686J5319p591n0467m1732p3885
$$ y = [6199706, 6131318, 6137227, 6194044, 6146988, 6085481, 6050487, 6066797, 6078872, 6051381, 6076583, 6049424, 5945774, 5917329, 5881190, 5889951, 5816041, 5666528, 5590945, 5565862, 5571579, 5566914, 5495438, 5496930, 5442955, 5362875, 5342530, 5399924, 5366112, 5327332, 5332283, 5261110, 5229047, 5205141, 5177133, 5179542, 5184164, 5167357, 5098806, 5077842, 5063645, 5057769, 5076854, 5083316, 5076521, 5099812, 5094624, 4991761, 5022625, 5112424, 5110901, 5141091, 5137796, 5089812, 5131074, 5196310, 5230985, 5228945, 5251586, 5264592, 5252992, 5277578, 5268278, 5353958, 5394355, 5328356, 5369297, 5381709, 5381497, 5403942, 5392979, 5403800, 5329265, 5328631, 5297480, 5264915, 5336741, 5368333, 5325309, 5307483, 5344064, 5352082, 5384773, 5352805, 5365604, 5362323, 5376765, 5428747, 5412499, 5453636, 5406393, 5376707, 5392026, 5384435, 5333968, 5292236, 5218351]
5591E218351L3767j7376R648j6010n7596P675l9708J838M9213M6529p992M0166
5579E268505j1587J370p2178m4531K2324p624M8150m9126k9019N1866o3071J0314
5567E125393m926J2520p7748j8548o7472M830n8959q9815P793m2248m9159L6467
5555D778128L8383k7590m8476R052K6857k6491K3222k7432j8921N2643M6354L3189
5543D858918J2950n803M2617O352P2172L3292m8831N414k6511R1441K4969M1432
5531E108412R275j810l4132j45K5535J3527K3590M5861O9671L4663o0571j1465
5519E222411M26L9172M1314m1100J28001R4960Q4438N3333L1922L3154N9705L31
5507E748067Q6323R0069J26432J41778J37062J04186O1719O9650N5371R2034J15849
$$ y = [5218351, 5252118, 5234742, 5244390, 5228380, 5170784, 5178459, 5138751, 5140589, 5189802, 5236331, 5228339, 5268505, 5256918, 5258288, 5186110, 5141579, 5163903, 5156279, 5204429, 5155303, 5126284, 5178150, 5115079, 5125393, 5120467, 5132987, 5055239, 5036691, 4969219, 4974049, 4915090, 4825275, 4833068, 4790820, 4741661, 4778128, 4816511, 4788921, 4740445, 4749497, 4776354, 4749863, 4773085, 4745653, 4726732, 4779375, 4825729, 4858918, 4871868, 4866065, 4908682, 4915034, 4987206, 5020498, 4971667, 4977081, 4950570, 5042011, 5066980, 5108412, 5117687, 5115877, 5081745, 5081600, 5107135, 5120662, 5144252, 5190113, 5259784, 5294447, 5233876, 5222411, 5222837, 5262009, 5303323, 5262223, 5390224, 5485184, 5569622, 5622955, 5654877, 5688031, 5747736, 5748067, 5834390, 5924459, 6050891, 6192669, 6329731, 6433917, 6495636, 6565286, 6620657, 6712691, 6828540]
5496F828540O8640O8400M345Q5853R4277J30128P6436N4007J8996Q3316P5356
5485G588294J3248K063R1382Q2265Q3776P1276J50140J27229J9460R1312N2396
5474H372841J27107M1585J7994P7124J38008l0289O8225j3092k7178p000p0559
5463H694766Q699m3614m9463j20467j00256j7259r3690r4239p6994j31671j37864
5452G837948n9111n4549o7393o2307o8728j06926j23337p5508j8043o4546j0433
5441G127067o1242j01684o1509p1565o5567q1466j29999j15766o9547j19500j21790
5430F127432j05783j28983j74607n3184r7478m6818q2135j14800p1285j01352
5420E151007j08062p1451j00133p8720o5041o9103l6446j2961m994l7975j5305
$$ y = [6828540, 6897180, 6965580, 6969925, 7055778, 7150055, 7280183, 7356619, 7410626, 7429622, 7512938, 7588294, 7601542, 7603605, 7694987, 7777252, 7861028, 7932304, 8082444, 8209673, 8229133, 8320445, 8372841, 8499948, 8541533, 8559527, 8636651, 8774659, 8744370, 8812595, 8799503, 8772325, 8765325, 8694766, 8703465, 8659851, 8610388, 8489921, 8389665, 8372406, 8278716, 8184477, 8107483, 7975812, 7837948, 7778837, 7724288, 7656895, 7594588, 7525860, 7418934, 7295597, 7220089, 7202046, 7137500, 7127067, 7065825, 6964141, 6902632, 6831067, 6765500, 6684034, 6554035, 6438269, 6368722, 6249222, 6127432, 6021649, 5892666, 5718059, 5664875, 5567397, 5520579, 5438444, 5323644, 5252359, 5151007, 5042945, 4971494, 4871361, 4792641, 4727600, 4658497, 4622051, 4609090, 4604096, 4566121, 4550816]
5409D550816j1761K1208m0882j42506j0299M5610k3073p3951n895K5788o1355
5398D273700m4993J2459o5072o3336k8362o0697O3176n4770l5820m235n9376N8158
5386C990832j5766q5437r776M8353o6387l0175N2687N2963p977m8233O236J735
5374C889055M7046j9067k4178O5939K9922L9144M7630l7480J6938K0177j766M5548
5362D118908K5521O793n203L3887M6648Q6157K9622L240L4267L8407N2517L5449
5350D506213J4709M7105L8681J3170k3285K9783K4832J0991P2706J4090j6062
5339D732933K8066j0045L2506J1223L7985j5922n6000K0065M4502L5974j03838
5328D757449L084l1537L0405l7003j5079L5523n884m4010J3516O0312J7708K3857
$$ y = [4550816, 4539055, 4560263, 4519381, 4376875, 4366576, 4412186, 4389113, 4315162, 4309267, 4335055, 4273700, 4228707, 4241166, 4176094, 4112758, 4084396, 4023699, 4086875, 4032105, 3996285, 3992050, 3932674, 3990832, 3975066, 3889629, 3879853, 3928206, 3861819, 3831644, 3884331, 3937294, 3929317, 3881084, 3887320, 3889055, 3936101, 3917034, 3892856, 3958795, 3988717, 4027861, 4075491, 4038011, 4054949, 4075126, 4073360, 4118908, 4144429, 4151222, 4146019, 4179906, 4226554, 4312711, 4342333, 4345573, 4379840, 4418247, 4470764, 4506213, 4520922, 4568027, 4606708, 4619878, 4596593, 4626376, 4651208, 4662199, 4734905, 4748995, 4732933, 4760999, 4750954, 4783460, 4794683, 4832668, 4816746, 4760746, 4780811, 4825313, 4861287, 4757449, 4760533, 4728996, 4759401, 4722398, 4707319, 4742842, 4736958, 4692948, 4706464, 4766776, 4784484, 4808341]
5316D808341k551k5542K3920n900J5945L888j2644n2591J8286k5777N0295L2987
5304D828657R275j6202q1106L1058N87J825m4306j2505J5320J2379O1809P817
5292D814608K177M6168k5264o055n187M2904o6491k4862q75O6313l4851p660J7237
5279D818162k6989P3995j7660K4095L3931O1242K2264J8967p845L47l4902R000
5267D974607L1118k9192Q93R3041o1069n5881L9827M3106j0198J7859K2028j5699
5255E050440J18637k4077J1791K2068k702M9903L1367Q1900Q9951K2013M1492
5244E492783J13213Q4926J6198O3572O7451J23290O1747P7297R4538J50649J41504
5233F487168J70653R5431J03318J70989J12020J01265J38145J79826J34640J39597
$$ y = [4808341, 4805790, 4780248, 4804168, 4798268, 4814213, 4818101, 4805457, 4752866, 4771152, 4745375, 4795670, 4828657, 4837932, 4821730, 4740624, 4771682, 4772269, 4774094, 4729788, 4717283, 4732603, 4744982, 4806791, 4814608, 4816785, 4862953, 4837689, 4831634, 4826447, 4869351, 4802860, 4777998, 4777123, 4843436, 4808585, 4800925, 4818162, 4791173, 4865168, 4847508, 4871603, 4905534, 4966776, 4989040, 5008007, 5000162, 5000509, 4965607, 4974607, 5005725, 4976533, 4977426, 5070467, 5009398, 4953517, 4993344, 5036450, 5026252, 5044111, 5066139, 5050440, 5169077, 5145000, 5156791, 5178859, 5176157, 5226060, 5257427, 5339327, 5429278, 5451291, 5492783, 5605996, 5690922, 5707120, 5770692, 5838143, 5961433, 6023180, 6100477, 6195015, 6345664, 6487168, 6657821, 6753252, 6856570, 7027559, 7139579, 7240844, 7378989, 7558815, 7693455, 7833052]
5223G833052K25931J35932J34246J47044J11799J07895J71642J78305J66640J59664
5213I372150J14222J18339J97907J37172K36089K36135J90766J88669J88919K61509
5203A1241877J85163K21271K99779K53551K20176K01851J88146K62285L63562
5194A3437661L09723K81843L66410L59736L23501L25555L27136L09564L06720
5185A6347849K70083K45981J70631J91490O6014J19192Q6949J20140K05421J84586
5175A8008336J50624K57584K12381J49257N8256N7725M0646L6065J1283L459M4351
5164A9029967O2778L8196O9366J15886R6915R0915J08217L6841R6402P6182n7891
5153A9763774j59361k00092j38805j39828r6426p9092k7756n3671n9201l5947
$$ y = [7833052, 8058983, 8194915, 8329161, 8476205, 8588004, 8695899, 8867541, 9045846, 9212486, 9372150, 9486372, 9604711, 9802618, 9939790, 10175879, 10412014, 10602780, 10791449, 10980368, 11241877, 11427040, 11648311, 11948090, 12201641, 12421817, 12623668, 12811814, 13074099, 13437661, 13747384, 14029227, 14395637, 14755373, 15078874, 15404429, 15731565, 16041129, 16347849, 16617932, 16863913, 17034544, 17226034, 17292048, 17411240, 17498189, 17618329, 17823750, 18008336, 18158960, 18416544, 18628925, 18778182, 18836438, 18894163, 18934809, 18970874, 18982157, 18985616, 19029967, 19092745, 19130941, 19200307, 19316193, 19413108, 19504023, 19612240, 19649081, 19745483, 19821665, 19763774, 19604413, 19404321, 19265516, 19125688, 19029262, 18950170, 18922414, 18868743, 18809542, 18773595]
5143A8773595k8284j79177k09691j16472k11281j54085j55683k23490k83242l02241
5133A6909949k15323j23219p0061j64601n6755k3026o9611m6937j24207j00772
5123A5915437j24681j07385j29580j14013m7667m0607j2782p6385k2104n9339
5113A5180894L5545j0640L2204J10761M6208N1980J9961k4312j5000R3720K5780
5102A5547101O4601K8769O481P7646Q1230j165K5934L1065k2125J13116N9233
5091A6011886J39167Q391M2607Q2035J22837J50426J02440J61894J87484J70568
5081A7179735K53256K29552K45452K71307K32865J77578J54124K03028J23901
5072A9070798J22436J13676J97285K11219K29886J77887J89009K40870K96383
$$ y = [18773595, 18745311, 18566134, 18356443, 18239971, 18028690, 17874605, 17718922, 17495432, 17212190, 16909949, 16694626, 16571407, 16501346, 16336745, 16279990, 16256964, 16187353, 16140416, 16016209, 15915437, 15790756, 15683371, 15553791, 15439778, 15392111, 15351504, 15338722, 15262337, 15240233, 15180894, 15216439, 15205799, 15238003, 15348764, 15394972, 15446952, 15466913, 15442601, 15427601, 15521321, 15547101, 15611702, 15640471, 15646952, 15724598, 15805828, 15804663, 15830597, 15861662, 15839537, 15952653, 16011886, 16151053, 16159444, 16202051, 16284086, 16406923, 16557349, 16659789, 16821683, 17009167, 17179735, 17432991, 17662543, 17907995, 18179302, 18412167, 18589745, 18743869, 18946897, 19070798, 19193234, 19306910, 19504195, 19715414, 19945300, 20123187, 20312196, 20553066, 20849449]
5063B0849449L80803M76018M90088N02135O65049O93671O88976P20386Q41857
5054B6308432Q06322Q17952R22777R19379R51803Q85309O62229L64357j25723
5045C2512837l85845m66489n22935m48780n25281m31182l37785l19121j72747
5036B8902672j19231o4537l7286N1874P2410J29952J45745J74415J29386J34079
5026B9519479J34834J61839J23587J08849J74374R954Q8105K7131M4712j5713
5016C0377151j2363k4059l658q4243j73995j95949j67639j74890n3889j4508J8579
5005B9490537M2859P5414J98864L11556L26056K58157K86821K76294K07079J27630
4995C1601267n9387j9870Q9002J61958K66586L08919M33233N77973O16133P52834
$$ y = [20849449, 21230252, 21706270, 22196358, 22698493, 23363542, 24057213, 24746189, 25466575, 26308432, 27114754, 27932706, 28855483, 29774862, 30726665, 31611974, 32274203, 32638560, 32512837, 32126992, 31660503, 31137568, 30688788, 30163507, 29732325, 29394540, 29075419, 28902672, 28783441, 28718904, 28681618, 28733492, 28805902, 28935854, 29081599, 29256014, 29385400, 29519479, 29654313, 29816152, 29939739, 30048588, 30222962, 30232916, 30321021, 30348152, 30392864, 30377151, 30364788, 30340729, 30337071, 30252828, 30078833, 29882884, 29715245, 29540355, 29486466, 29471958, 29490537, 29533396, 29608810, 29807674, 30119230, 30445286, 30703443, 30990264, 31266558, 31473637, 31601267, 31541880, 31522010, 31611012, 31772970, 32039556, 32348475, 32781708, 33359681, 33975814, 34728648]
4985C4728648P88328P66625Q35770N41576J71180n8897l84209o97569q00337o72395
4975C5218720p25439n36502l43266m23868k50351j39242j5535J01052K22156K85325
4965C3393050L63671M08570M86035M68695M95178M75934M32360M20627K95032
4956C7239152J45404R7812J41014K22619K18550J20138K4468m4840k1283o4035
4946C8078999K3719N3455J430J36134l7296k2496m6891k71609k83457k89427l94977
4935C6947584m03809l35816k87475k83228l80278l88327m39377l31137k66682
4926C3831455l01018l05504k80593j94488j95043q5072j17226L0381J13814J28231
4916C2624937K56022J86966J59484K15187M9869k4280j33733l11398l57515l40345
$$ y = [34728648, 35516976, 36283601, 37119371, 37660947, 37832127, 37773230, 37389021, 36691452, 35891115, 35218720, 34493281, 33956779, 33613513, 33189645, 32939294, 32800052, 32784517, 32885569, 33107725, 33393050, 33756721, 34165291, 34651326, 35120021, 35615199, 36091133, 36523493, 36944120, 37239152, 37384556, 37482368, 37623382, 37846001, 38064551, 38184689, 38209157, 38164317, 38143034, 38078999, 38102718, 38156173, 38157603, 38293737, 38256441, 38233945, 38187054, 37915445, 37631988, 37342561, 36947584, 36543775, 36207959, 35920484, 35637256, 35256978, 34868651, 34429274, 34098137, 33831455, 33530437, 33224933, 32944340, 32749852, 32554809, 32469737, 32352511, 32382892, 32496706, 32624937, 32880959, 33067925, 33227409, 33442596, 33492465, 33468185, 33334452, 33023054, 32665539, 32325194]
4906C2325194l24611k37444k14835j65964o4610J07356J96038K79546L20084M01656
4896C2622410M46700M57820L74497L35565J73157O185o4960k38523m78958o62485
4886C2971408p91343q01583p27241o87033n87852m58951l72321l26376k39476
4877B7979232k24375j00525o0019q8666j23626k50898l75659m98654o59039q20524
4867B4777247q92737p70916p17160p23675o49719o86237n52292m41399n22823
4858A8820289m41873m19666k62509l34818k36295k31837k25586k01727k26097
4849A6239881k09130j65601j44786j87486k84796j93958k75641k73727l16774
4840A4187982k61555k26783k36529k48251k55255k36966j80759k12213j30274
$$ y = [32325194, 32000583, 31763139, 31548304, 31382340, 31317730, 31425086, 31621124, 31900670, 32220754, 32622410, 33069110, 33526930, 33901427, 34236992, 34410149, 34416334, 34351374, 34112851, 33633893, 32971408, 32180065, 31378482, 30651241, 29964208, 29376356, 28917405, 28545084, 28218708, 27979232, 27754857, 27654332, 27594313, 27505647, 27382021, 27131123, 26755464, 26256810, 25597771, 24777247, 23884510, 23113594, 22396434, 21672759, 21023040, 20336803, 19784511, 19343112, 18820289, 18378416, 17958750, 17696241, 17361423, 17125128, 16893291, 16667705, 16465978, 16239881, 16030751, 15865150, 15720364, 15532878, 15248082, 15054124, 14778483, 14504756, 14187982, 13926427, 13699644, 13463115, 13214864, 12959609, 12722643, 12541884, 12329671, 12199397]
4831A2199397j79257j15860n2362q0847r0781n0976L874m4357j7402p5911P6995
4820A1572513M9679p890j9054J8609l4589J32414P0502J11950N9622l3780M6880
4809A1966856O7304k108M9937J1773L541P2491L8739J3505P0423J08905P0822
4798A2472188J16046J49358K42706K42496K40427K53888L13198K97689M20818
4789A4748814M48535M05731M37768M97082N64583M68254L65091K99933J67574
4780A8403365L3237j15087j64571j71966j51884j73151k01963j78251n6406l4629
4770A7188694l9542P7682J38883Q3494J17557J63863K20110L16540L19056L75191
4760A8961528L52472N57750N37631N51376O16819N62443N87568N60060M46265
$$ y = [12199397, 12020140, 11904280, 11851918, 11771071, 11680290, 11629314, 11633188, 11588831, 11571429, 11495518, 11572513, 11622192, 11614302, 11595248, 11613857, 11579268, 11711682, 11782184, 11894134, 11953756, 11919976, 11966856, 12034160, 12032052, 12081989, 12093762, 12097303, 12169794, 12208533, 12222038, 12292461, 12401366, 12472188, 12588234, 12737592, 12980298, 13222794, 13463221, 13717109, 14030307, 14327996, 14748814, 15197349, 15603080, 16040848, 16537930, 17102513, 17570767, 17935858, 18235791, 18403365, 18436602, 18321515, 18156944, 17984978, 17833094, 17659943, 17457980, 17279729, 17223323, 17188694, 17149152, 17226834, 17365717, 17449211, 17566768, 17730631, 17950741, 18267281, 18586337, 18961528, 19314000, 19871750, 20409381, 20960757, 21577576, 22140019, 22727587, 23287647, 23733912]
4751B3733912M38999L17111L29015K85832M12625L48752K86513L09851M5755J4999
4741B6523364n8891j13059n1241j8737J38381J70536K16750L10463L55586L10577
4731B7783729K43099J77621m3689k0701k7345m2246p3000j13622k23072l14870
4721B7345904k39518l59888l85849l87535l39278l17242k71541j99403j26106
4712B4719544j36945q2292j12169p3657j03038l25303k31494l12061k44442k23793
4702B2874350k88565k50145k58143k40645l18620l86746l17455l71038m14104
4693B0028889l72360m00066m35757m17131m75941m49060l68789k39353k73558
4684A6596874k29951k11735j71945j20051j63990j53258k08687k33854j72934
$$ y = [23733912, 24172911, 24490022, 24819037, 25104869, 25517494, 25866246, 26152759, 26462610, 26508365, 26523364, 26464473, 26351414, 26300173, 26281436, 26419817, 26590353, 26807103, 27117566, 27473152, 27783729, 28026828, 28204449, 28160760, 28140059, 28112714, 28070468, 27997468, 27883846, 27660774, 27345904, 27106386, 26746498, 26360649, 25973114, 25633836, 25316594, 25045053, 24845650, 24719544, 24582599, 24500307, 24388138, 24314481, 24211443, 23886140, 23654646, 23342585, 23098143, 22874350, 22585785, 22335640, 22077497, 21836852, 21518232, 21131486, 20814031, 20442993, 20028889, 19656529, 19256463, 18820706, 18403575, 17927634, 17478574, 17109785, 16870432, 16596874, 16366923, 16155188, 15983243, 15863192, 15699202, 15545944, 15337257, 15103403, 14930469]
4675A4930469k44924l14649k78870k81945k55293l01813l29381k93611k50759
4666A2379224l28739l57488k79979k57852k48833k58870k42744j64941j73998
4657A0065780k14901j33213j48279p9151r6433j22622j03629l2456K9o4335M683
4646I075473k1320P2787O7555k6106n6030O658L8475R106k4775q4517q5872n1555
4634H919879j18325p8902j11013n6382p9907q7868r2421j14339o2105k3333m3399
4623H051885q4661j14488j26642j14300j80799j27826q0371k4784p9125j45914
4613F972975r5749j28139j17440o2419n3896m5772j03949m9614k6443l1897m0747
4602F216910j1284l6283k3116k0305M1907Q8280p567n9429K5762n740j3593o66
$$ y = [14930469, 14685545, 14370896, 14092026, 13810081, 13554788, 13252975, 12923594, 12629983, 12379224, 12050485, 11692997, 11413018, 11155166, 10906333, 10647463, 10404719, 10239778, 10065780, 9850879, 9717666, 9569387, 9490236, 9393803, 9271181, 9167552, 9135096, 9135125, 9070790, 9075473, 9054153, 9126940, 9194495, 9168389, 9112359, 9119017, 9157492, 9166598, 9141823, 9057306, 8971434, 8919879, 8801554, 8722652, 8611639, 8555257, 8475350, 8387482, 8295061, 8180722, 8118617, 8095284, 8051885, 7967224, 7852736, 7726094, 7611794, 7430995, 7303169, 7222798, 7198014, 7118889, 6972975, 6877226, 6749087, 6631647, 6569228, 6515332, 6469560, 6365611, 6315997, 6289554, 6257657, 6216910, 6205626, 6169343, 6146227, 6125922, 6167829, 6256109, 6248542, 6189113, 6214875, 6209135, 6195542, 6194876]
4590F194876J4224k4764O7707J4505r2963k7938o3855n4303n3438q2396r4841
4579E796814j45268n0433j29640n6363m8032k0692p7832k621l8954o7325j7698
4568E141956j07149k3489j13558j12125o2457j1205n0886l8499q9145m3176j14519
4557D375748p2464m2727L0741m059o4620n1653j1877k9910j5509N2351k4357o1884
4545D079780k1869N8428L6602q8M1727l4508M0260J5557M3107Q1011k7941m2548
4533D269518L0566N6796N0497k0101N0762P3478O5656R0360l8358L3483p658R1748
4521D746747R6844l5958K7774N5060K2259K5369K1454K0877m5045q5418n2754
4510D797209q566k990L0186J6043k4019o0782J2557O8712L4646J112j0763P2532
$$ y = [6194876, 6209100, 6184336, 6252043, 6266548, 6173585, 6145647, 6081792, 6027489, 5974051, 5891655, 5796814, 5651546, 5601113, 5471473, 5415110, 5367078, 5346386, 5268554, 5265933, 5226979, 5159654, 5141956, 5034807, 5011318, 4897760, 4785635, 4723178, 4711973, 4661087, 4622588, 4533443, 4490267, 4375748, 4303284, 4260557, 4291298, 4287239, 4222619, 4170966, 4159089, 4129179, 4113670, 4166021, 4141664, 4079780, 4057911, 4116339, 4152941, 4152853, 4194580, 4160072, 4200332, 4215889, 4258996, 4340007, 4312066, 4269518, 4300084, 4356880, 4407377, 4387276, 4438038, 4511516, 4577172, 4667532, 4629174, 4662657, 4654999, 4746747, 4843591, 4807633, 4835407, 4890467, 4912726, 4938095, 4959549, 4980426, 4935381, 4849963, 4797209, 4788643, 4785653, 4815839, 4831882, 4807863, 4747081, 4759638, 4828350, 4862996, 4864108, 4853345, 4925877]
4498D925877l122O5185R8401P4369Q1400Q9172R5309J61800J46569J27918J07565
4487E970443K09211K02751K18253K44631K24445K76316K06507J53269P3798P2474
4477G852098p4106j07243o6826j50728j19473j18559j80348j41348j23344j30940
4467F639183m7256o2295p5341p2839j6051J24j0759k3458L9956M3072N6333J10361
4455F581030K8921R9762J72537K09831J65418J87714K22245K86554K90021K95913
4445H539946L39976L54139M82617M69347M94160N05328M59424N04900M42982M17595
4435A3010414L97355M73594O49226P15449P11739P91539R50150J015898J038557
4426A9753921J100369J105804J016448P83431M54880j01516n97638p41935q56563
$$ y = [4925877, 4922755, 4987940, 5086341, 5160710, 5242110, 5331282, 5426591, 5588391, 5734960, 5862878, 5970443, 6179654, 6382405, 6600658, 6845289, 7069734, 7346050, 7552557, 7705826, 7779624, 7852098, 7777992, 7670749, 7603923, 7453195, 7333722, 7215163, 7034815, 6893467, 6770123, 6639183, 6591927, 6529632, 6454291, 6381452, 6365401, 6365525, 6354766, 6331308, 6371264, 6414336, 6470669, 6581030, 6609951, 6709713, 6882250, 7092081, 7257499, 7445213, 7667458, 7954012, 8244033, 8539946, 8879922, 9234061, 9716678, 10186025, 10680185, 11185513, 11644937, 12149837, 12592819, 13010414, 13407769, 13881363, 14530589, 15246038, 15957777, 16749316, 17699466, 18715364, 19753921, 20854290, 21960094, 22976542, 23759973, 24214853, 24113337, 23515699, 22773764, 21917201]
4417B1917201r19582r09615q80996r21950r46727q10858p99837p40836o58297
4408A4328503o47325o40743n61794m66167m72208m48744m22841l19164l41429
4399A0008088k98883l05927l18480k22878j22816k25498j97388j26475k34900
4390G954843n6163m2488q3094r1410m9234o0845l0585j03943q4297m2577n6824
4379G253383q4396m5006j01931n1416k8749N5211m4520j1575N41j6123P1908P7025
4367G074352m1766j64N4942K0833k2049o4432M7015O219N4959J7979J21617P0437
4355G339942O5349J18168J70369J72876J74413K14032K03342K66004K32423K56984
4345I213902L15500K34121L05701L85445L77032L43859M58879M78685N15334M75465
$$ y = [21917201, 20997619, 20088004, 19207008, 18285058, 17338331, 16527473, 15727636, 14986800, 14328503, 13681178, 13040435, 12478641, 12012474, 11540266, 11091522, 10668681, 10349517, 10008088, 9709205, 9403278, 9084798, 8861920, 8739104, 8513606, 8316218, 8189743, 7954843, 7898680, 7856192, 7773098, 7681688, 7632454, 7571609, 7541024, 7437081, 7352784, 7310207, 7253383, 7168987, 7123981, 7022050, 6970634, 6941885, 6997096, 6952576, 6941001, 6941542, 6925419, 6997327, 7074352, 7032586, 7032422, 7087364, 7108197, 7086148, 7021716, 7068731, 7074950, 7129909, 7147888, 7269505, 7339942, 7405291, 7523459, 7693828, 7866704, 8041117, 8255149, 8458491, 8724495, 8956918, 9213902, 9529402, 9763523, 10069224, 10454669, 10831701, 11175560, 11634439, 12113124, 12628458, 13103923]
4335A3103923M80553N17549N17974N70984O21770N28337M63216N63012N77892
4326A7945210O13588O19404N89587N95377O68885P85609P10602O36823O62689
4317B3827774O13029N79868N16869M79591M74198L91660M16150M88040M48189
4308B8235368M94026L99725M63080M39251L11930K56343J27909O8247m9787m7898
4298C0698194j07638j04692j38703n4096j68436j29229j57487k06606k34729k70087
4288B9126491l17315m62871n09554m86663n92146n81730o19912o03825n07317
4279B4445158o25112n49329m94522n66195o28638n76365n80995n76289o65146
4270A9182567o11137o39476n59030n72773n57122m99694n25957m74327n39975
$$ y = [13103923, 13584476, 14102025, 14619999, 15190983, 15812753, 16341090, 16804306, 17367318, 17945210, 18558798, 19178202, 19767789, 20363166, 21032051, 21817660, 22528262, 23165085, 23827774, 24440803, 25020671, 25537540, 26017131, 26491329, 26882989, 27299139, 27787179, 28235368, 28729394, 29129119, 29592199, 30031450, 30343380, 30599723, 30727632, 30795879, 30746092, 30698194, 30590556, 30485864, 30347161, 30293065, 30124629, 29995400, 29837913, 29631307, 29396578, 29126491, 28809176, 28346305, 27836751, 27350088, 26757942, 26176212, 25556300, 24952475, 24445158, 23820046, 23270717, 22776195, 22210000, 21581362, 21004997, 20424002, 19847713, 19182567, 18571430, 17931954, 17372924, 16800151, 16243029, 15743335, 15217378, 14743051, 14203076]
4261A4203076m85593m04436m58111m65117l29149l92932m66372l61841l44307
4252A0495218l39512l17464l37161k94692k76077k50929k46066k91775k78083
4243G863459k04501j86922j63137k23486j82130j95769k17154j16595k00405j54352
4233F019008j57689o2587j72463j36814p3655j23225j19193j10540j37073q9470
4223D836299o0219r6706j03945j73541o6332j09030q9188p8942n6172n8295o3833
4212C880096M129j40528r1300m5665l4027m5228q3527o8276n3514m0843k623m4142
4200C234552k5850K7138o9566o5959m9984l431p2973l1365j1246p3753j928m0784
4188B814851n5552m1759K5020K190k0513j7795J2566j6691k9065n0962k9703j1384
$$ y = [14203076, 13717483, 13313047, 12854936, 12389819, 12060670, 11667738, 11201366, 10839525, 10495218, 10155706, 9838242, 9501081, 9206389, 8930312, 8679383, 8433317, 8141542, 7863459, 7658958, 7472036, 7308899, 7085413, 6903283, 6707514, 6490360, 6373765, 6173360, 6019008, 5861319, 5798732, 5626269, 5489455, 5415800, 5292575, 5173382, 5062842, 4925769, 4836299, 4776080, 4679374, 4575429, 4401888, 4335556, 4226526, 4137338, 4058396, 4002224, 3943929, 3880096, 3884225, 3743697, 3652397, 3606732, 3572705, 3527477, 3443950, 3375674, 3322160, 3281317, 3278694, 3234552, 3208702, 3235840, 3166274, 3100315, 3050331, 3046900, 2973927, 2942562, 2931316, 2857563, 2855635, 2814851, 2759299, 2717540, 2742560, 2744750, 2724237, 2706442, 2719008, 2702317, 2673252, 2622290, 2592587, 2581203]
4176B581203l1303K6695j9770n3596o827Q572M6914k6286n4692m218R022m7388
4164B428326p8579O4104M2685n1276o9253j6028r30J8546J0552m0788K2110K8243
4152B357712l3360o2533j0234N3960n6222p7657j6342P8925k8980k6782j2774
4141B165713o4630k876J1208k0025k6576o7355J02532L4136m8609L7739L825O23
4129B125705n6012K3458N0535n769o5012l4440J0445K7418L9990O0737k3988p8364
4117B074703O53L249k2629o108L4478p793m8769M025N069l519l4315r337j2644
4104A977063k4109q517l011K8016P623J0860l2502P202l3083J0685N5751J2594
4092B008572J2864r6836o422M1866K4838l0334j7697Q400m1896j2931k8376p766
$$ y = [2581203, 2549900, 2576595, 2556825, 2503229, 2496402, 2504974, 2551888, 2525602, 2470910, 2466692, 2475714, 2428326, 2349747, 2413851, 2456536, 2405260, 2336007, 2319979, 2319049, 2337595, 2348147, 2307359, 2329469, 2357712, 2324352, 2261819, 2251585, 2305545, 2249323, 2171666, 2155324, 2234249, 2205269, 2178487, 2165713, 2101083, 2098207, 2109415, 2089390, 2062814, 1995459, 2097991, 2132127, 2083518, 2121257, 2125082, 2125705, 2069693, 2093151, 2143686, 2137917, 2072905, 2038465, 2048910, 2076328, 2116318, 2177055, 2153067, 2074703, 2075356, 2078605, 2055976, 2049868, 2084346, 2076553, 2027784, 2031809, 2036878, 2033359, 1999044, 1989707, 1977063, 1952954, 1944437, 1941426, 1969442, 1977065, 1987925, 1955423, 1962625, 1929542, 1940227, 1995978, 2008572, 2021436, 1924600, 1918178, 1960044, 1984882, 1954548, 1936851, 1945251, 1903355, 1890424, 1862048, 1854282]
4080A854282J9148N4276m64M0212J2547M6185L6285l0751m2639l2604J8000m180
4068A970297L005O675K1388N4597m0921m0376K2401L3093J896m1714k8886o567
4056A954888P3762K2219J1398N8797j6750k6481O0689n605J0689K2155m8053k5870
4044B091838P9240L2110l4242N760l8348q834M7812J6239L1677m0488O3754q474
4032B238044n2616M0915M4061N215K3712k4614R511l1942P2457J956k7989J8246
4020B316956Q280P8339K7498j7428J2882M863M138N1308j522J10197m7979M1478
4008B589010K2942l6876J0387q573P8147l6340q772J8716m1894P6979O3466N5978
3996B783170j9838M0349L0432l7814L7198N3027J02169J7543N2847O2144J6542
$$ y = [1854282, 1873430, 1927706, 1927242, 1967454, 1980001, 2026186, 2062471, 2031720, 1989081, 1956477, 1974477, 1970297, 1973302, 1979977, 2001365, 2055962, 2015041, 1974665, 1997066, 2030159, 2032055, 1990341, 1961455, 1954888, 2028650, 2050869, 2062267, 2121064, 2104314, 2077833, 2138522, 2132917, 2143606, 2165761, 2117708, 2091838, 2171078, 2203188, 2168946, 2174706, 2136358, 2127524, 2175336, 2191575, 2223252, 2182764, 2246518, 2238044, 2185428, 2226343, 2270404, 2275619, 2299331, 2274717, 2284228, 2252286, 2324743, 2326699, 2298710, 2316956, 2325236, 2403575, 2431073, 2413645, 2426527, 2431390, 2435528, 2486836, 2485314, 2595511, 2547532, 2589010, 2611952, 2575076, 2585463, 2576890, 2655037, 2618697, 2609925, 2628641, 2586747, 2663726, 2727192, 2783170, 2763332, 2803681, 2834113, 2796299, 2833497, 2886524, 2988693, 3006236, 3059083, 3121227, 3137769]
3985C137769J2368M6134L5173J2983K3925L7995R2203L3963k4894L2706M1493
3974C481818K1477R4731J550K338N5102N0143p7763j1181J6189L4419j7980L9382
3962C690225J7657M4892Q420L4448j3849k0796m4729O3837N8639L3701N2032L9255
3950C963732L311K7207L8284O45N9361M2660P0060k9555M1343m0058p7747m5912
3938D053331n4510j02989L859n9364j137L7414P133l8751p7121J5810L403n3320
3926C733758J42M5206o5972r0780Q5398L1134M0633P6759J7158K9213J11178n4768
3914C959059M4489J5367p5489j342l0858p0655m5568J3664J895k916q5552n3063
3902C669031n598p914o5513o8222N1468J6888N977m4774K5839O1007q2320m8899
$$ y = [3137769, 3150137, 3196271, 3231444, 3244427, 3268352, 3306347, 3398550, 3432513, 3407619, 3440325, 3481818, 3503295, 3598026, 3599576, 3601914, 3657016, 3707159, 3629396, 3618215, 3634404, 3668823, 3650843, 3690225, 3707882, 3752774, 3761194, 3795642, 3781793, 3760997, 3716268, 3780105, 3838744, 3872445, 3924477, 3963732, 3967043, 3994250, 4032534, 4033179, 4092540, 4135200, 4205260, 4175705, 4217048, 4176990, 4099243, 4053331, 3998821, 3895832, 3899691, 3840327, 3839190, 3876604, 3883737, 3844986, 3767865, 3783675, 3787078, 3733758, 3733900, 3779106, 3713134, 3622354, 3707752, 3738886, 3779519, 3856278, 3873436, 3902649, 4013827, 3959059, 4003548, 4018915, 3943426, 3942084, 3911226, 3840571, 3795003, 3808667, 3810562, 3807646, 3722094, 3669031, 3663433, 3655519, 3590006, 3521784, 3573252, 3590140, 3596117, 3551343, 3577182, 3638189, 3555869, 3506970]
3890C506970N3395L5172N1868K4522N8811m7818N616m6831J4441N0717j3423P0212
3878C763652K7822L596N4653M4245K4054L2359k393K0098o5177K0486j8506J7544
3866C922433N849M1094Q4207M4630j1422L3321L4223J3154R0581L202J5424N9486
3854D336182k1454R954O2468K9293J3536K089l9163J38562L1419m980M9260M7156
3842D654322Q0291J4449R6644P2766r56J04895M7704Q3491N9397N1997O0111N0337
3830E375448N5427L3742N8863J37312J44592J9613N8215N0527J13256K9218Q8177
3819F164390J73259K4820K6664N8569J18782O3314J38444R4665O7129J07789M8877
3808G086702J19670J30195M8295L2533J14535J23066K09534J24280N8918Q8396
$$ y = [3506970, 3560365, 3595537, 3647405, 3671927, 3730738, 3682920, 3688536, 3641705, 3656146, 3706863, 3693440, 3763652, 3791474, 3795070, 3849723, 3893968, 3918022, 3950381, 3947988, 3968086, 3902909, 3923395, 3904889, 3922433, 3928282, 3969376, 4053583, 4098213, 4086791, 4120112, 4154335, 4167489, 4258070, 4261272, 4276696, 4336182, 4314728, 4324682, 4387150, 4416443, 4429979, 4432068, 4392905, 4531467, 4562886, 4557906, 4607166, 4654322, 4734613, 4749062, 4845706, 4918472, 4917516, 5022411, 5070115, 5153606, 5213003, 5265000, 5325111, 5375448, 5430875, 5464617, 5523480, 5660792, 5805384, 5824997, 5883212, 5933739, 6046995, 6076213, 6164390, 6337649, 6362469, 6389133, 6447702, 6566484, 6629798, 6768242, 6862907, 6930036, 7037825, 7086702, 7206372, 7336567, 7384862, 7417395, 7531930, 7654996, 7864530, 7988810, 8047728, 8136124]
3798H136124R3795J74423J36782J29011J68412J98778J52768J33365J97590J70025
3788I691073J44470K16266J81906J94877K66342K93783L19226L38901L03273L38628
3778A2288745K87253L65283M24951L64112M48302M59562L66481L80943M27204
3769A5812836L58639L30813L19424L30279L10645K74121L20671L12868J70720
3760A8541016J93940J32954J71085J89043J13168J04252L5429O7701n5373o6663
3750A9426552l6224n4485k3408j11516r8340j16290q3979j81796j53680j26214
3740A8440620o6521j09361q1341k9018o3280r842j3035k5302Q5392R3612K8718
3729A8250642J48618J43723J52137J64629K30286J79146J67435K95493L37072
$$ y = [8136124, 8229919, 8404342, 8541124, 8670135, 8838547, 9037325, 9190093, 9323458, 9521048, 9691073, 9835543, 10051809, 10233715, 10428592, 10694934, 10988717, 11307943, 11646844, 11950117, 12288745, 12575998, 12941281, 13366232, 13730344, 14178646, 14638208, 15004689, 15385632, 15812836, 16171475, 16502288, 16821712, 17151991, 17462636, 17736757, 18057428, 18370296, 18541016, 18734956, 18867910, 19038995, 19228038, 19341206, 19445458, 19480887, 19548588, 19493215, 19426552, 19390328, 19335843, 19312435, 19200919, 19102579, 18986289, 18902310, 18720514, 18566834, 18440620, 18374099, 18264738, 18183397, 18154379, 18091099, 18081257, 18068222, 18042920, 18128312, 18221924, 18250642, 18399260, 18542983, 18695120, 18859749, 19090035, 19269181, 19436616, 19732109, 20069181]
3720B0069181K74004L19103M42719M48605M61799N61468N89283O46591O96989
3711B4509742Q51744Q83551R44216J001611J129347J275514J226771J469387J523112
3702C4814995J562068J647498J746785J722368J693148J708585J556161J389908
3694D7841516J257787J092474R66315Q15169N36601N16729M05066L05368L13892
3685E4050917K48135J93402M8256o5361j68934l30566m76414p34761r44333j090517
3675E0729824j179927j333622j403769j407215j420175j431831j428751j398712
3667C9725822j321346j215819j256886j097440j076968j061267r84476q25658
3659C0885962p98331q37226p58295o46561n76965o26855m92192m38030n27105
$$ y = [20069181, 20343185, 20662288, 21105007, 21553612, 22015411, 22576879, 23166162, 23812753, 24509742, 25361486, 26245037, 27189253, 28190864, 29320211, 30595725, 31822496, 33291883, 34814995, 36377063, 38024561, 39771346, 41493714, 43186862, 44895447, 46451608, 47841516, 49099303, 50191777, 51158092, 51973261, 52509862, 53026591, 53431657, 53737025, 54050917, 54299052, 54492454, 54540710, 54475349, 54306415, 53975849, 53499435, 52764674, 51820341, 50729824, 49549897, 48216275, 46812506, 45405291, 43985116, 42553285, 41124534, 39725822, 38404476, 37188657, 35931771, 34834331, 33757363, 32696096, 31711620, 30885962, 30087631, 29250405, 28492110, 27845549, 27268584, 26641729, 26149537, 25711507, 25184402]
3650B5184402m20663m15413m11764l31518k67231k00751k58640l12085k10119
3641B2356218k05358j40681q0700j70167j10598r7224j0966o3862m3831O3304
3631B1496135O4097O7534Q9567J89411J26429K11716K95135K68484K52399M61686
3621B3522593L63309L53959M47909M31936N08706N03218O40307O02101N60776
3612B7934814N88488O19519N93803O16131N92163M69141M71409M95074M31356
3603C2811898M35987M83074L62675L67016M14032L73959M19447L92937L68226
3594C6429251K82250K71363K92555K80163K24623K43619J88344K32798K69453
3585C8714419K51770L00295L21195M33978L93266M94286N64812O25888P20524
$$ y = [25184402, 24763739, 24348326, 23936562, 23605044, 23337813, 23137062, 22878422, 22566337, 22356218, 22150860, 22010179, 21929479, 21759312, 21648714, 21551490, 21540524, 21476662, 21432831, 21496135, 21560232, 21627766, 21717333, 21906744, 22033173, 22244889, 22540024, 22808508, 23060907, 23522593, 23885902, 24239861, 24687770, 25119706, 25628412, 26131630, 26771937, 27374038, 27934814, 28523302, 29142821, 29736624, 30352755, 30944918, 31414059, 31885468, 32380542, 32811898, 33247885, 33730959, 34093634, 34460650, 34874682, 35248641, 35668088, 36061025, 36429251, 36711501, 36982864, 37275419, 37555582, 37780205, 38023824, 38212168, 38444966, 38714419, 38966189, 39266484, 39587679, 40021657, 40414923, 40909209, 41474021, 42099909, 42820433]
3576D2820433Q20333Q92071R36783J127894J085860J146776J293596J420119J490347
3567E3034212J580672J574179J735290J812909J885412J993848K090925K146034
3559F7853481K196333K313523K516711K603910K826221K929494L139367L404825
3551H9783865L569648L857869M030111M357510M558186M752578M855446M959785
3543A24724998M937314M876898M703191M507452M320848M126583L783613L475700
3535A59456597L455111L282254L122606L010999K835251K683521K394711K119375
3527A82360425J725725J334621Q99092M19316j04646n79773q97295j254782j437167
3518A82465516j563080j639598j581225j549419j519465j423051j313012j126613
$$ y = [42820433, 43640766, 44532837, 45469620, 46597514, 47683374, 48830150, 50123746, 51543865, 53034212, 54614884, 56189063, 57924353, 59737262, 61622674, 63616522, 65707447, 67853481, 70049814, 72363337, 74880048, 77483958, 80310179, 83239673, 86379040, 89783865, 93353513, 97211382, 101241493, 105599003, 110157189, 114909767, 119765213, 124724998, 129662312, 134539210, 139242401, 143749853, 148070701, 152197284, 155980897, 159456597, 162911708, 166193962, 169316568, 172327567, 175162818, 177846339, 180241050, 182360425, 184086150, 185420771, 186319863, 186739179, 186634533, 186054760, 185157465, 183902683, 182465516, 180902436, 179262838, 177681613, 176132194, 174612729, 173189678, 171876666, 170750053]
3510A70750053j054551r09695q74604q70068q38666q89299j027291j114507j239264
3501A61932108j369225j411918j499029j709074j795247j963876k129830k170564
3493A47883345k415415k521050k662281k818087l046398l166398l269375l374482
3485A24609859l489927l578896l562120l629683l670487l556081l582307l448402
3477I6091956l308202l247553l160180l089920k929673k811505k638015k532094
3469G2374814k365808k330237k209594k078452j981520j847025j724431j712084
3461E6125663j519170j434330j414342j322597j188366j085823j030376r29572
3453D6201087q89847p40127p12779o71028n91566m01510l85022l05487l09507
$$ y = [170750053, 169695502, 168785807, 167911203, 167041135, 166202469, 165313170, 164285879, 163171372, 161932108, 160562883, 159150965, 157651936, 155942862, 154147615, 152183739, 150053909, 147883345, 145467930, 142946880, 140284599, 137466512, 134420114, 131253716, 127984341, 124609859, 121119932, 117541036, 113978916, 110349233, 106678746, 103122665, 99540358, 96091956, 92783754, 89536201, 86376021, 83286101, 80356428, 77544923, 74906908, 72374814, 70009006, 67678769, 65469175, 63390723, 61409203, 59562178, 57837747, 56125663, 54606493, 53172163, 51757821, 50435224, 49246858, 48161035, 47130659, 46201087, 45311240, 44571113, 43858334, 43187306, 42595740, 42194230, 41809208, 41503721, 41194214]
3444D1194214k11946j95367o0767k1790M6261M4207Q2160J30873J44054J82090
3434D1333989L21021K69197K16134K72884L35351K73503L79183L68500L17837
3425D4087599M33380M22820M34910M98515M87206M71073M44527L65168M75493
3416D8120691M14626L23549K61502K68264K36731J60078K6304K0145o0596k12019
3406D9559275k36001j78835l03079l42198k88304l03601l10793k82765k41919
3397D7071780k57712k53624k25100q9917N567O3823K26929L29007M12410O44410
3387D7927573P77232R33787J120616J192151J376292J451316J608481J665644
3379E8053092J654877J753473J823127J855717J804079J740282J541865J396658
$$ y = [41194214, 40982268, 40786901, 40726134, 40704344, 40750605, 40794812, 40876972, 41007845, 41151899, 41333989, 41655010, 41924207, 42140341, 42413225, 42748576, 43022079, 43401262, 43769762, 44087599, 44520979, 44943799, 45378709, 45877224, 46364430, 46835503, 47280030, 47645198, 48120691, 48535317, 48858866, 49120368, 49388632, 49625363, 49785441, 49811745, 49831890, 49771294, 49559275, 49323274, 49144439, 48841360, 48499162, 48210858, 47907257, 47596464, 47313699, 47071780, 46814068, 46560444, 46335344, 46245427, 46250994, 46314817, 46541746, 46870753, 47283163, 47927573, 48704805, 49638592, 50759208, 51951359, 53327651, 54778967, 56387448, 58053092, 59707969, 61461442, 63284569, 65140286, 66944365, 68684647, 70226512, 71623170]
3371G1623170J434663J252270J128495J034201Q83195P10712N24551K82603J8904
3362G8892764j75342m11400o21059q23237j116200j305457j538491j506255j614585
3353F9780738j781673j774506j815805j819593j831277j810560j809360j760596
3345E5377368j634745j687296j538597j649847j598606j518504j462286j454411
3337D2833076j431665j395150j335398j234413j143713j213084j118580j039969
3329C2921104r81829r32077q95019p81167p89270q42266p67577o85714o88633
3320B5557552o11349n72694n90346n34008m15461m17756l67878m07424l93266
3311B1247370k71504k39618k56985k20253k45260k92634k34890k40786k17715
$$ y = [71623170, 73057833, 74310103, 75438598, 76472799, 77355994, 78066706, 78591257, 78873860, 78892764, 78717422, 78306022, 77684963, 76861726, 75745526, 74440069, 72901578, 71395323, 69780738, 67999065, 66224559, 64408754, 62589161, 60757884, 58947324, 57137964, 55377368, 53742623, 52055327, 50516730, 48866883, 47268277, 45749773, 44287487, 42833076, 41401411, 40006261, 38670863, 37436450, 36292737, 35079653, 33961073, 32921104, 31939275, 31007198, 30112179, 29331012, 28541742, 27699476, 26931899, 26246185, 25557552, 24946203, 24373509, 23783163, 23249155, 22833694, 22415938, 22048060, 21640636, 21247370, 20975866, 20736248, 20479263, 20259010, 20013750, 19721116, 19486226, 19245440, 19027725]
3302A9027725k97216k54896l01957k71796k31847k92965k16103k77329k29941
3293A6653675l34026k59176k18344j89163j98066j59282k40527j95207j91560
3284A4668324j86400k36117o8508j85474j38066j06503q9532j77629j55893r0139
3274A3234063m1221p9859m5834j07700L420j8203m8593k4137p9791k1493n726
3263A2764926J888K1132j7237o3774q1195p3990M0254q7749l5460k5374l0537
3252A2412884m2724p6998m35j9800K4517n440k3123k8315m9283P2440L5834J09124
3240A2408681O0198P4748P2220J28840J33386R1142J38935J03148J63055J48034
3230A3522387J14170J79093J58284J57817J28276J06836J59560P2971j0175L6408
$$ y = [19027725, 18730509, 18475613, 18173656, 17901860, 17670013, 17377048, 17160945, 16883616, 16653675, 16319649, 16060473, 15842129, 15652966, 15454900, 15295618, 15055091, 14859884, 14668324, 14481924, 14245807, 14177299, 13991825, 13853759, 13747256, 13657724, 13480095, 13324202, 13234063, 13192842, 13112983, 13067149, 12959449, 12962869, 12944666, 12896073, 12871936, 12792145, 12770652, 12764926, 12766814, 12787946, 12770709, 12706935, 12625740, 12551750, 12592004, 12504255, 12468795, 12443421, 12412884, 12370160, 12293162, 12292727, 12272927, 12297444, 12292004, 12268881, 12240566, 12191283, 12263723, 12299557, 12408681, 12468879, 12543627, 12615847, 12744687, 12878073, 12969215, 13108150, 13211298, 13374353, 13522387, 13636557, 13815650, 13973934, 14131751, 14260027, 14366863, 14526423, 14599394, 14589219, 14625627]
3220A4625627P0602r0831q4332J11041J5480L5101j2539K3026N5463K9642N8237
3209A4836517L9301M9170J54815J71714J41512J24913K43240K40188K07932K62437
3199A6471739K63053K77184K39032L66899M00935L94190M26181M22177L98357
3190A9659747L72999M78726M89995M65661N99893N65280N71422N68058N66395
3181B4338176P04870P31085P07025O95896O61682O58757O26645O05354O01016
3172C0330506N68646P18272P54929Q76887Q66964Q98003J059349J195466J165309
3163C8434331J223923J427520J490193J660127J746025J863570K076311K224828
3155E2146828K462014K745652L071073L331829L680312M029418M507449M928144
$$ y = [14625627, 14696229, 14605398, 14521066, 14632107, 14647587, 14682688, 14670149, 14693175, 14748638, 14778280, 14836517, 14875818, 14924988, 15079803, 15251517, 15393029, 15517942, 15761182, 16001370, 16209302, 16471739, 16734792, 17011976, 17251008, 17617907, 18018842, 18413032, 18839213, 19261390, 19659747, 20032746, 20511472, 21001467, 21467128, 22067021, 22632301, 23203723, 23771781, 24338176, 25043046, 25774131, 26481156, 27177052, 27838734, 28497491, 29124136, 29729490, 30330506, 30899152, 31617424, 32372353, 33249240, 34116204, 35014207, 36073556, 37269022, 38434331, 39658254, 41085774, 42575967, 44236094, 45982119, 47845689, 49922000, 52146828, 54608842, 57354494, 60425567, 63757396, 67437708, 71467126, 75974575, 80902719]
3147H0902719N609274O169658O797498P376929P984901Q757603R620942J0596998
3139A43816522J1608067J2568182J3277321J3840973J4101566J4146813J4280675
3132B37640119J4542835J4578220J4170184J2784946J0279407O564081J965729
3125C12525521k375771n399742p142397q311830r860764j1338304j2724970j3538192
3117B41833551j3607227j3249506j2821563j2169872j1495863j0841620j0102001
3110A57545899r447344q650279q132662p498469o892941o403419n880243n463533
3102I9177009n063622m724966m417850m090418l843010l531642l262877l101686
3094F7140938k920841k813995k559946k480633k379801k199182k162003j980766
$$ y = [80902719, 86511993, 92681651, 99479149, 106856078, 114840979, 123598582, 133219524, 143816522, 155424589, 167992771, 181270092, 195111065, 209212631, 223359444, 237640119, 252182954, 266761174, 280931358, 293716304, 303995711, 310559792, 312525521, 310149750, 304750008, 297607611, 289295781, 279435017, 268096713, 255371743, 241833551, 228226324, 214976818, 202155255, 189985383, 178489520, 167647900, 157545899, 148098555, 139448276, 131315614, 123817145, 116924204, 110520785, 104640542, 99177009, 94113387, 89388421, 84970571, 80880153, 77037143, 73505501, 70242624, 67140938, 64220097, 61406102, 58846156, 56365523, 53985722, 51786540, 49624537, 47643771]
3086D7643771j866052j796375j749091j628955j603605j437290j329169j436233
3078C4797001j283074j275247j191772j063201j028914r80931r13487q96600p95107
3069B5368668p73590p72496p79909o99826o01631o55388n92821m89669n60164
3060A9443174m83684m96323m78949m19596m45759l71547m28605m03453l34296
3051A5580962l22447l00061l39537l18396l12361k81131l03154k98796k81329
3042A2823750k40385j48847k19628k26913k11058k97377j55978k04219j51509
3033A0967836j18853j50317j41757j73553j19828k45050j97407r3856k03844j55513
3023I367858j07060j37064r7647j46138j41402j25026j24336j27180p1825j55957
$$ y = [47643771, 45777719, 43981344, 42232253, 40603298, 38999693, 37562403, 36233234, 34797001, 33513927, 32238680, 31046908, 29983707, 28954793, 27973862, 27060375, 26163775, 25368668, 24595078, 23822582, 23042673, 22342847, 21741216, 21085828, 20493007, 20003338, 19443174, 18959490, 18463167, 17984218, 17564622, 17118863, 16747316, 16318711, 15915258, 15580962, 15258515, 14958454, 14618917, 14300521, 13988160, 13707029, 13403875, 13105079, 12823750, 12583365, 12434518, 12214890, 11987977, 11776919, 11479542, 11323564, 11119345, 10967836, 10848983, 10698666, 10556909, 10383356, 10263528, 10018478, 9821071, 9727215, 9523371, 9367858, 9260798, 9123734, 9026087, 8879949, 8738547, 8613521, 8489185, 8362005, 8290180, 8134223]
3013H134223j24422q3658j49437j16292j34802j03937j3784j56185j41826j21529
3003F988351p6856j32235j17167j27336l8816j19465j27332j00179j21494n0014
2993E977457j24470j16618n8268j01028q5007q1831n1706r4025k9513j9746j51441
2982E063804j21859n5726j758o6314j04753r6412r1196j47240l9974k3100r4672
2971D220800q3275j20308p8565m5903j35966r3511m4095m4674j8076j26619p6210
2960C353598q751j06235n6360m4826l4019m5486p3301j25180k7273m9281p4790
2949B708096o5209o5357j6145j7550p3999q875O094n0193k3373Q27K1001J4135
2937B429452L6483N3642k7560J5001N4983R352M213j4897n491N7294P561q58K6466
$$ y = [8134223, 8009801, 7926143, 7776706, 7660414, 7525612, 7421675, 7407891, 7251706, 7109880, 6988351, 6911495, 6779260, 6662093, 6534757, 6495941, 6376476, 6249144, 6148965, 6027471, 5977457, 5852987, 5736369, 5678101, 5577073, 5492066, 5410235, 5358529, 5264504, 5234991, 5215245, 5063804, 4941945, 4886219, 4884461, 4818147, 4713394, 4616982, 4525786, 4378546, 4338572, 4315472, 4220800, 4137525, 4017217, 3938652, 3892749, 3756783, 3663272, 3619177, 3574503, 3556427, 3429808, 3353598, 3344847, 3238612, 3182252, 3137426, 3103407, 3057921, 2984620, 2859440, 2832167, 2782886, 2708096, 2642887, 2577530, 2561385, 2543835, 2469836, 2460961, 2467055, 2416862, 2393489, 2394316, 2415317, 2429452, 2465935, 2519577, 2492017, 2507018, 2562001, 2571353, 2575566, 2560669, 2555178, 2612472, 2620033, 2619175, 2645641]
2924B645641J7700k7359l4724J3777K296n533m7516l3669J8940K3562o2714o8932
2912B441469L4565j1012J8392K0250j5841k6618O668j8708J2365J0666q668k433
2900B461095P628K806k3294j313L396R68N0512l2559l4034L8070l3915N7428O4182
2887B560970L834L7361N0321n7813L6628M1328n9979O1044N0645m4221k5401O169
2875B660886Q9514J7765n381J2422N1963m8718N7444r77K6236L0362r466L6574
2863B918624k585J5844O2814R6410P1179j7101O3992P7591J23739P4743L1618
2852C516868Q2948R7695N2847J73377R6757p240N3637L8839R567j9144J0956O384
2840D113491p6659n4185j03838j57620r0936r4462r775j21445p3229r7299l6280
$$ y = [2645641, 2663341, 2635982, 2601258, 2615035, 2617331, 2611798, 2564282, 2530613, 2549553, 2573115, 2510401, 2441469, 2476034, 2465022, 2483414, 2503664, 2487823, 2461205, 2467873, 2449165, 2461530, 2472196, 2463528, 2461095, 2468723, 2471529, 2448235, 2446922, 2450318, 2451286, 2501798, 2469239, 2435205, 2473275, 2439360, 2496788, 2560970, 2564804, 2602165, 2652486, 2594673, 2631301, 2672629, 2612650, 2673694, 2724339, 2680118, 2654717, 2660886, 2750400, 2768165, 2762784, 2775206, 2827169, 2778451, 2835895, 2834918, 2861154, 2891516, 2882050, 2918624, 2916039, 2931883, 2994697, 3091107, 3162286, 3145185, 3209177, 3286768, 3410507, 3485250, 3516868, 3599816, 3697511, 3750358, 3923735, 4020492, 4013252, 4066889, 4105728, 4115295, 4096151, 4107107, 4113491, 4036832, 3982647, 3878809, 3721189, 3630253, 3535791, 3526016, 3404571, 3331342, 3234043, 3197763]
2829C197763p0814j13551m7389j29414k4359r717p1399l8080r5641j38337l0897
2818B428165L1642j744o3947m5344l138j024j3270m3418p8112k3077K0937j02168
2806B105502j19816m2543l7597l9873L9383q8723p3308j17653j9484O2112n3406
2795A614594j04354q166J7574K3951n0053j4954r1402o1013j9546K3763j7517
2784A312877o2781j5571p0012j4733J0159m4921N4138m6735m6528k3877l4926
2773A017090j5488M1938j1127l5220p779k0742q4384l6924J0299q47m6128K990
2761H13678K4061o0229k7777m9008J9330l7768k5536j7928J2236J0963j00423
2750E61599J4584M7592l8768l7188p665P4349o2203L505Q34k7974o4696J9726
$$ y = [3197763, 3126949, 3013398, 2966009, 2836595, 2812236, 2802519, 2731120, 2693040, 2597399, 2459062, 2428165, 2459807, 2458063, 2394116, 2348772, 2345634, 2344610, 2331340, 2287922, 2209810, 2186733, 2207670, 2105502, 1985686, 1943143, 1905546, 1865673, 1905056, 1816333, 1743025, 1625372, 1605888, 1668000, 1614594, 1510240, 1502074, 1519648, 1543599, 1493546, 1478592, 1387190, 1326177, 1306631, 1330394, 1312877, 1250096, 1234525, 1164513, 1149780, 1159939, 1115018, 1169156, 1122421, 1075893, 1052016, 1017090, 1001602, 1043540, 1032413, 997193, 989414, 968672, 884288, 847364, 857663, 856816, 810688, 813678, 837739, 777510, 749733, 700725, 720055, 682287, 656751, 638823, 651059, 662022, 561599, 576183, 623775, 585007, 547819, 540154, 614503, 552300, 555805, 556639, 528665, 463969, 483695]
2738D83695p693l0393j8790M0228Q4812m6024J0613K1160k6139q1428p2513O6079
2726D23607J3787M0712o1862m4523Q447o6991K0015Q506j9540j0346O6652M0219
2714D18683N692N279p7839K8948J3339k7012k9198p635o5269J2673M4777j8534
2702C03904k5164R450j9063L9997o5011Q795L9570l4181J5641J2029J1847l048
2690B94766m1331l7523J6756N3929N735p0551L8702j9565M3217q0776k5488k2493
2678A55378j1695N2593j5792N020j2654J4810L588j1989l1224l5065J4801k9067
2666I8704P8613J4377l4812L7396j6643J702m1040L1859J6958m3432Q852j4164
2654A38370j9468M5869n5743K9630J0101J7345K2846p5540K4926Q111O249j1924
$$ y = [483695, 476002, 445609, 426819, 467047, 551859, 505835, 516448, 537608, 511469, 430041, 357528, 423607, 437394, 478106, 416244, 371721, 380168, 313177, 333192, 341698, 322158, 311812, 378464, 418683, 424375, 429654, 351815, 380763, 394102, 367090, 337892, 330257, 264988, 277661, 322438, 303904, 278740, 288190, 269127, 309124, 244113, 252908, 292478, 258297, 273938, 285967, 297814, 294766, 253435, 215912, 232668, 286597, 292332, 221781, 260483, 240918, 284135, 203359, 177871, 155378, 143683, 196276, 180484, 185504, 172850, 187660, 191248, 179259, 148035, 112970, 127771, 98704, 177317, 191694, 156882, 194278, 177635, 179337, 138297, 170156, 187114, 143682, 152534, 138370, 118902, 164771, 109028, 138658, 148759, 166104, 188950, 113410, 138336, 146447, 152696, 140772]
2642A40772L4046l9930O1271M8091q127K5608l7680N187L9661l0374L963k241
2630B40247l0143J2267l4719J3781J6641O5665p6546m3280J6368M1139j1411j5439
2618A94570J5558k4857o5436J8449r334R813o232K1257k0854M277K8153l5104
2606A30260m9979k3261Q6102K3145M1695j9327p2630m7985M6312l4927k1002L1630
2594I0033M1624K4476l9005k9324L0737p933n664P056K2933Q279n2272K8370L5280
2581A54590q81n8020r793M0518k9459L0497j2332k5095m0802Q9012k561j5498
2569A20176r707k8878K6114J8268p9217M1016M1416L3875o2564p815K2316K9950
2557A44950L314m788J4661k4650J3750r057l6145j8107K6405M6236j8467m9816
$$ y = [140772, 174818, 134888, 196159, 244250, 236123, 261731, 224051, 229238, 268899, 238525, 242488, 240247, 210104, 222371, 187652, 201433, 218074, 283739, 207193, 163913, 180281, 221420, 210009, 194570, 210128, 185271, 119835, 138284, 128950, 138763, 132531, 153788, 132934, 137211, 165364, 130260, 80281, 57020, 143122, 166267, 207962, 188635, 116005, 68020, 114332, 79405, 58403, 90033, 131657, 156133, 117128, 87804, 118541, 110608, 104944, 112000, 134933, 143212, 90940, 119310, 154590, 153709, 95689, 85896, 126414, 96955, 127452, 115120, 90025, 49223, 138235, 135674, 120176, 110469, 81591, 107705, 125973, 46756, 87772, 129188, 163063, 100499, 92684, 115000, 144950, 148264, 143476, 158137, 133487, 147237, 138180, 102035, 83928, 110333, 156569, 138102, 88286]
2545H8286l3098N347Q9352l0221j7868l9537l9226j0065J09533M0419l4985j5610
2533A12327l3557n896J7118l3462L9260O7061l9218j0578L6379J0749j4812m7124
2521I8247m617k9570k6700M0079j5399m2739J36388K3790k1667J5660r1676l7971
2509D3825O620N7850O54o2587N6960K1855K4785M672m6621L9368M153l1260N633
2496A25907N1934R027l0331k1544J384k9416j6291O3824Q515l3961m2177j1780
2484G5091O9277K7108L9556k7480k2494J6238l1279l845p657L5197K4522l9651
2472A54583L3134L7657m4598J3204L0167j6392l3485J2078K2598K7733n1769j6882
2460A68028K105L677l5157N1387k7006O3970j5426p459N9353j9857K861J6921
$$ y = [88286, 55188, 60535, 149887, 119666, 101798, 62261, 23035, 12970, 122503, 162922, 127937, 112327, 78770, 72874, 89992, 56530, 95790, 162851, 123633, 113055, 149434, 160183, 145371, 98247, 93630, 64060, 37360, 77439, 62040, 19301, 155689, 179479, 157812, 173472, 81796, 43825, 50445, 108295, 108949, 46362, 103322, 125177, 149962, 154634, 108013, 147381, 151534, 120274, 125907, 177841, 186868, 156537, 134993, 136377, 106961, 90670, 154494, 163009, 129048, 86871, 75091, 144368, 171476, 211032, 183552, 161058, 177296, 146017, 142172, 134515, 169712, 194234, 154583, 187717, 225374, 180776, 193980, 224147, 207755, 174270, 186348, 208946, 236679, 184910, 168028, 170133, 173810, 138653, 190040, 163034, 227004, 211578, 204119, 263472, 243615, 246476, 263397]
2448B63397J14991o9067o7871N2835J1200J2015j4976L806M4712k8059R366K9612
2436C61961o129j8352l771N1655M7866J0673K208J1047R580Q4410L6598J5090
2424F02836r356o0493P353J8116N10N4667K9700K5366O0351M5062k6673R9074
2412H46513L2777J6491O9003j0977M9219K8804J20268Q0702M0798N3548Q9632
2401A416778R4176R6420N5795J57841J45951J15603J48396J83119J08045J41493
2391B663617J66536K12250J94397K94444K66918K84951M11226M58204M34463M58072
2381E845078N32571M74456N91059P13707Q53873R80690J063980J131618J236780
2372A3423812J283884J354563J662770J700112J728895J542367J247825L27824
$$ y = [263397, 378388, 309321, 241450, 294285, 305485, 317500, 302524, 306330, 351042, 322983, 332349, 361961, 355832, 337480, 333709, 385364, 433230, 443903, 446111, 457158, 466738, 551148, 587746, 602836, 593480, 532987, 540340, 558456, 558966, 613633, 643333, 668699, 729050, 774112, 747439, 846513, 879290, 895781, 964784, 953807, 1003026, 1031830, 1152098, 1232800, 1273598, 1327146, 1416778, 1510954, 1607374, 1663169, 1821010, 1966961, 2082564, 2230960, 2414079, 2522124, 2663617, 2830153, 3042403, 3236800, 3531244, 3798162, 4083113, 4494339, 4952543, 5387006, 5845078, 6377649, 6852105, 7443164, 8156871, 9010744, 9991434, 11055414, 12187032, 13423812, 14707696, 16062259, 17725029, 19425141, 21154036, 22696403, 23944228, 24272052]
2364B4272052j186753j732251j585888j345381j242793j380221j327909j144965
2356A3325891j128144q38090q11368p87230o76217n54599o26136n55454m41739
2347F906914n51273m46557m15618l83631l63348l57617k44399k33675k20957j91033
2337C498806k54827j86000j70597j30203p0241j06234j40270j43723j37953o1896
2327B096862j01485j06368l7617j03570j31403j12932p4196p1367j1130j0987
2317A335807p2604k6036m9044n1014l7836O326l5131q7731L2314n0347j64635
2306H00069k718m0278k8318m351K9707J6759p9204Q260m4415L1699K2418K1853
2294G31481n6139j17518M3679q1330m2214P3374k7069j0278K9058p1683j2815
$$ y = [24272052, 23085299, 21353048, 19767160, 18421779, 17178986, 15798765, 14470856, 13325891, 12197747, 11359657, 10548289, 9761059, 9084842, 8530243, 7904107, 7348653, 6906914, 6355641, 5909084, 5493466, 5109835, 4746487, 4388870, 4144471, 3910796, 3689839, 3498806, 3243979, 3057979, 2887382, 2757179, 2686938, 2580704, 2440434, 2296711, 2158758, 2096862, 1995377, 1889009, 1851392, 1747822, 1616419, 1503487, 1429291, 1357924, 1346794, 1335807, 1263203, 1237167, 1188123, 1137109, 1099273, 1105599, 1070468, 982737, 1015051, 964704, 800069, 797351, 757073, 728755, 724404, 754111, 770870, 691666, 699926, 655511, 687210, 709628, 731481, 675342, 557824, 601503, 520173, 477959, 551333, 524264, 513986, 543044, 471361, 458546]
2283D58546K4159l6483m2768L8286n1548l3730m1418m1534P0463P353p922M3382
2271C86786q237J2573n6457n9644J8877J5498j6223n3417J16022j1185k1614j00134
2259B22845q098N6600J2992L8739J4525k1716n2074K943m3769l1033J1723j60
2247B03517q408L6374O219L3319K3864l4905p822l0056k3397j7866j4389J598
2235A68048j982l066K3040j2152Q61p506J3306o850n1962M251O7927L9769o8461
2222A65223N09j1230j10558m271K3720P199K5076P4048k5104j1320J3663j8466
2210A28489q8633n3865K3653J5946k1534k1803L5525K3161Q3674l9501k5849L126
2198F2389m3708M7120k3296l4712K769K2466K2470o85l2891L7083J3920p6599
$$ y = [458546, 482705, 446222, 403454, 441740, 390192, 356462, 315044, 273510, 343973, 351326, 343404, 386786, 378549, 391122, 334665, 275021, 293898, 309396, 293173, 239756, 355778, 344593, 322979, 222845, 214747, 271347, 284339, 323078, 337603, 315887, 263813, 266756, 222987, 191954, 203677, 203517, 195109, 231483, 237702, 271021, 294885, 259980, 252158, 222102, 198705, 180839, 166450, 168048, 166066, 163000, 186040, 173888, 174749, 167243, 180549, 173699, 121737, 125988, 193915, 233684, 165223, 165732, 154502, 43944, 39673, 63393, 70592, 95668, 169716, 144612, 133292, 146955, 128489, 39856, -14009, 9644, 25590, 4056, -17747, 17778, 40939, 124613, 85112, 59263, 62389, 18681, 65801, 42505, 7793, 10562, 33028, 55498, 54813, 21922, 59005, 72925, -3674]
2186c674L166N18R7546m3301j2359q568k2344J3208r8097Q4153K0689k0294j8157
2173g514q300m923M5968K0503n169o5614L5333J6144q700J401l7452n319J3896
2160i746L7614k862k3247k7836l2345r427M4814K137q7549l4530R4949K3781j2769
2147c7016M2157L5915l8280n725J9792R773j2827L981k8422Q547j5412j9088N486
2134c1119L02L3217L2384k7330j800k446L7853k8444k9559m4459m0719j4416O1333
2121e5203Q414k8576n052j04K4223M062M3603Q397q2600M5244J9455K0076r034
2108g095p746O7262M4175l2075n4701k6630k480J9000r325O4186O9163m816J7484
2095A36402j7067k0262l5008M6058j3990m2643M864l5088N202j1688j7782k2551
$$ y = [-3674, -508, 10, 97556, 54255, 41896, 33328, 10984, 24192, -73905, 10248, 30937, 10643, -7514, -15814, -20737, 25231, 45734, 40565, -25049, 10284, 26428, 17728, 19129, -18323, -23642, -9746, 27868, 25006, 1759, -26077, -58422, -67849, -23035, -20898, -108447, -142977, -48028, -24247, -37016, 5141, 41056, 2776, -2949, 16843, 26616, 13789, 17770, -10652, -2105, -17517, -36605, -31119, -30817, 2400, 34784, 7454, 5654, 3208, 41061, 12617, -16942, -61401, -102120, -116536, -55203, -46789, -75365, -80417, -80521, -56298, -52236, -8633, -236, -82836, -37592, -18137, 1939, -7095, -14841, 52421, 96596, 64521, 9820, -16810, -19290, -290, -9615, 54571, 123734, 118918, 136402, 119335, 99073, 64065, 110123, 96133, 53490, 58354, 23266, 28468, 16780, -1002, -23553]
2083b3553K4299j3977N91N3799k8923k6378J8415m1245j7872K2962j7494m8627
2071i8003K803Q0339r657l1399m8674k3209J3863k9419M8804K5238J2266l5642
2059i2690n9056L4878L0865K6656j7319N322J1335K5452n321l4889K9958k3493
2047f8302K0006m8228K6402K6954K8996l6208O170k2715k1982m2927M8051N4876
2035b8907p739j125K7440K6183j1243K924k6053m349j0524M7682Q366l8629m2543
2022e8517O7815P4455m9087m7242n6529q515M58N7946J7470K8235q9607R668R3429
2009C9979o4957l175k8551L4490k6770l5352O51K6963K1283J8481l2532P3723
1997B4233j4422q4590p170O314M603J2326R421n6837M1577L9159j6950l4204K6999
$$ y = [-23553, 746, -13231, -12640, 41159, 12236, -14142, 4273, -36972, -54844, -31882, -49376, -98003, -95200, -14861, -24518, -55917, -104591, -127800, -113937, -143356, -94552, -69314, -57048, -92690, -151746, -116868, -86003, -59347, -76666, -71344, -60009, -34557, -39878, -74767, -44809, -68302, -48296, -96524, -70122, -43168, -14172, -50380, -44210, -66925, -88907, -131834, -83783, -28907, -36646, -37771, -10331, 15852, 4609, 7533, -18520, -22869, -33393, 14289, 22655, -15974, -58517, 9298, 83753, 34666, -12576, -69105, -77620, -77162, -19216, -1746, 26489, -63118, -53450, 39979, -24978, -28153, -56704, -22214, -48984, -84336, -83685, -56722, -35439, -16958, -49490, 24233, 9811, -74779, -81949, -75635, -71032, -58706, -49285, -106122, -64545, -25386, -42336, -76540, -49541]
1984d9541m9580Q0766L2361m1468r2331M779M5792L1730R887L0579k1267R699
1972h594l569l6739l7116N263R0181n4853o8302l7276M8318P9720M9159L2467
1960E8659o5963p7332J7494N063o1331M112j8415p053N8382J01300J6434j4466
1948A6884k7789n293J4541r2437J0593m482l7424p317O0870K2766l0035j9433
1936i8556J4165Q079J0722m5571K9163Q6073n8704m9338N2722n6293O0397m9511
1924i6652M4231L1405l0989M7540m0576J5831n5354o063O8178M2283k0436n8103
1912e8705N4693R399k3874k2292J3889N0774p8482q0862Q515Q6772J5596j17317
1900a41894J0476l0908M9184L4331J9633j6673k5229j6436M0814k4150j3598L4968
$$ y = [-49541, -99121, -18355, 14006, -27462, -119793, -115014, -69222, -37492, -27605, 2974, -18293, -8594, -12163, -48902, -86018, -80755, 9426, -45427, -113729, -151005, -102687, -22967, 26192, 58659, -7304, -84636, -67142, -62079, -123410, -119298, -137713, -144766, -86384, 14916, 31350, 16884, -10905, -16198, -1657, -94094, -83501, -87983, -125407, -132724, -71854, -49088, -79123, -98556, -84391, -76312, -65590, -111161, -81998, 4075, -54629, -103967, -51245, -107538, -47141, -96652, -52421, -21016, -52005, -4465, -45041, -29210, -84564, -90627, -22449, 19834, -602, -58705, -4012, 5387, -18487, -40779, -26890, 23884, -54598, -135460, -126945, -40173, -24577, -141894, -131418, -162326, -113142, -78811, -59178, -75851, -101080, -117516, -76702, -100852, -114450, -79482]
1888g9482O8564J6250j0905m3163k3578p143q155j4349j4556l0299J7193Q1527
1876d8096l237j2439J6176k3920L1263j8609k5146M7342l5167j9112k3056m851
1864a18852L3282K5158M6251L5156n4616k6838K6245j1479l7146j5593L4180L0289
1852c3963m0208L2796P523J9221p8449M7992K4354L366j7925R696L0327J3563
1840A8293o4775o2954M8930K7598k9117o46k5536M2128L3497j8074J7731m0669
1828e3594l0733P597l4735N4799J9552p5179O1025L3355q3654l1754O8691O7856
1816C226l1085j04483L1559O7187j9416l0258l9082N5489K4875J9769j0270k4828
1804e7317k271R589j0931L1348M665o1953l3695M8483K0767j3706N697q256J5085
$$ y = [-79482, -10918, 5332, -5573, -48736, -72314, -79457, -87612, -101961, -116517, -146816, -129623, -48096, -51333, -63772, -47596, -71516, -40253, -58862, -84008, -36666, -71833, -90945, -114001, -118852, -85570, -60412, -14161, 20995, -33621, -60459, -34214, -45693, -82839, -98432, -64252, -33963, -74171, -41375, -33852, -14631, -93080, -45088, -20734, -17368, -35293, -25597, 4730, 18293, -46482, -109436, -60506, -32908, -62025, -62671, -88207, -46079, -12582, -30656, -12925, -53594, -84327, -76730, -111465, -56666, -37114, -112293, -51268, -17913, -101567, -133321, -64630, 3226, -27859, -132342, -100783, -33596, -53012, -83270, -122352, -66863, -41988, -22219, -32489, -57317, -59588, -49999, -60930, -29582, -24917, -86870, -120565, -72082, -51315, -65021, -59324, -67580, -52495]
1791e2495L4481J4051j32M467p3833m4408j0027m34K0604L9998L3772n6289K8452
1778f1793k0733L780l1778L3408j111o488P389k1573k4946M0633Q76N9444o77
1765b3569o8375J9459J0374L7348k1560K6121m9327n7498r26J6163k9224M0661
1753a00353M8393J7192N379k4861K6608l3193l4358M7175P7380n2370n1199K7331
1741d6876o8085O6085M764m6030l661K7261Q4603J0330m4360n209j5167K3799
1729a2546k9170L4755m8246R160L7949J8800m3166l8685k0254J0792m3482N9415
1717f4678M9236o5160l0842p570k1857P0429k8550k4999K5453l7001M3159P9499
1705a2881L6617l154j22871l1187m075K8990N5478M3663j6724m6435P238o681
$$ y = [-52495, -18014, -3963, -4095, 372, -73461, -117869, -127896, -128330, -107726, -67728, -33956, -90245, -61793, -82526, -78746, -110524, -77116, -78227, -84715, -77326, -98899, -123845, -83212, -82336, -22892, -23569, -91944, -72485, -62111, -24763, -46323, -20202, -69529, -127027, -127953, -111790, -141014, -100353, -51960, -34768, -29389, -54250, -27642, -60835, -95193, -48018, 29362, -23008, -74207, -46876, -114961, -48876, -44112, -90142, -93803, -66542, 18061, 28391, -15969, -21178, -36345, -12546, -41716, -6961, -55207, -46047, -8098, 10702, -32464, -71149, -91403, -80611, -124093, -64678, -15442, -80602, -111444, -119014, -140871, -70442, -98992, -123991, -98538, -135539, -92380, -12881, 23736, 20582, -102289, -133476, -137551, -108561, -53083, -9420, -26144, -72579, -65341, -72022]
1693g2022Q494m1245j7469o468N8235j2262J0473L0414K6143m1975M4251k5683
1681c9114m7227J8447k1708N3128K0086k3427k1022k8872j0720M6459k4240r497
1669h7707N0505l9054K9010j5935l7545N4798K0580J7348k0261M673K1212j6113
1657a8489r983j129l9017k8820q500k5883P3903O0676r237l7704j2001J2345L7950
1644e889r5943l8290O3260O0306J1880j862j4762p4293o174p631O6J06619N486
1631B773p3393q307O4624q235o345k7091N4647P9495K721j9605o3632l5927J7610
1618b0665k6242p4729M6530P5469K449m2979J8535k4180n4057N0513j5132j1963
1606g6451M8213L5779k8492n774l5325J2931J6995l9291M5909M5281j0383k6114
$$ y = [-72022, -63528, -104773, -122242, -128710, -70475, -82737, -72264, -41850, -15707, -57682, -13431, -39114, -86341, -67894, -89602, -36474, -16388, -39815, -60837, -89709, -100429, -53970, -78210, -87707, -37202, -76256, -47246, -63181, -100726, -45928, -25348, -8000, -28261, -23588, -2376, -18489, -28472, -29601, -68618, -97438, -105938, -131821, -57918, 2758, -6479, -44183, -56184, -43839, -5889, -101832, -140122, -76862, -16556, -4676, -6538, -21300, -95593, -101767, -109398, -109332, -2713, 2773, -70620, -78927, -14303, -22538, -28883, -55974, -1327, 78168, 80889, 61284, -2348, -38275, -20665, -46907, -121636, -75106, 363, 2812, -40167, -21632, -45812, -99869, -49356, -64488, -76451, -28238, 7541, -20951, -26725, -62050, -49119, -32124, -71415, -25506, 19775, 9392, -16722]
1594a6722K1221j8138j3435m7141K6500J1173o2119N066J4272j8644M3151M827
1582d9989K1569n0310p5803M6464P0200M0248j024O2257o5667r6065J2631k9100
1570a14589p605P7349j395m93l8167m368P836J5852M59o361L1712k3761l5473
1557i9004M1392O8456k7732j5822N019k6929J0946q884R134K7216q7513L2374
1545g1347K6674J7871j8052j9432j8391j9984J6617Q24k8151N2961N2492k0010
1533b7928m611K3025l0745N465j3715q415J9347k5042K3513j1689J7088p698N673
1520c5732r1149L8594O6039j1703k6275L4984J3860q421M0560J1432k8880q2323
1508g9014M1676j1826P1949K3488l8051k3626m4390p623O4807j1397j7590N2152
$$ y = [-16722, 4499, -13639, -27074, -74215, -47715, -36542, -98661, -93595, -79323, -97967, -54816, -49989, -28420, -78730, -154533, -108069, -37869, 2379, 1355, 63612, -2055, -98120, -85489, -114589, -122194, -44845, -46240, -46733, -84900, -89268, -81432, -65580, -65121, -71482, -39770, -63531, -99004, -57612, 10844, -16888, -32710, -27691, -54620, -43674, -52558, -43424, -16208, -103721, -71347, -44673, -26802, -44854, -64286, -82677, -102661, -86044, -85220, -113371, -60410, -7918, -27928, -32539, -9514, -40259, -34794, -48509, -56924, -37577, -62619, -39106, -50795, -33707, -41405, -35732, -126881, -88287, -22248, -33951, -60226, -25242, -11382, -19803, 20757, 32189, 3309, -79014, -37338, -49164, 22785, 46273, 8222, -15404, -59794, -67417, -2610, -14007, -31597, 20555]
1496B0555J4951p3451m7290r562K7255J7399m4084O7379o1195L0963L2434l4360
1484e9006O863j3894k247J9102J7177n1168l2024N1140J6021O372M6502O2511
1472F7349l1419r9519k3136L9697L9153p1787L9890J7845l8431L2993L5303Q793
1460A6731o2773M4409m6092l9446Q733N153Q9947K9638j736J823l7022k1821j2193
1447b4649j3458P1219N1773j0844p5735K3541l360o9085L8723K093n0745k541
1435f3068n8838L8294j7552N478O1522L9534l8036M2357K8371p6695n6948K9677
1423f5904M5400q852N4732l4656n1985K9858M7613n7151l3425M3713K4051k6044
1411c2650n6783O0874N1364m6459k3850p126m289K27J2685O939j2087m2843J3044
$$ y = [20555, 35506, -37945, -85235, -94797, -67542, -50143, -94227, -26848, -88043, -57080, -24646, -59006, -52143, -66037, -68284, -49182, -32005, -83173, -115197, -64057, -48036, -41664, 4838, 67349, 35930, -63589, -86725, -47028, -7875, -79662, -39772, -21927, -60358, -27365, 7938, 16731, -46042, -1633, -47725, -87171, -78438, -73285, 16662, 46300, 44564, 46387, 9365, -12456, -24649, -38107, 33112, 84885, 74041, -1694, 21847, 18487, -50598, -11875, -9782, -60527, -63068, -121906, -83612, -101164, -95686, -34164, 5370, -32666, 9691, 38062, -38633, -95581, -65904, -20504, -29356, 25376, -9280, -61265, -31407, 16206, -40945, -74370, -30657, -6606, -32650, -89433, -28559, 22805, -23654, -47504, -54630, -58919, -58692, -46007, -39068, -51155, -93998, -80954]
1398h0954L8874O2215j1107J9251o4844j5396M1883r657j3646M9938N216j873
1386A9900K5273j9695j545k8891j9428o871O4310l4157j3900n207l8636k9200
1374h8047M9913M5265o9520M1169O47o236l2259l4680N8484P6039J6632k1280
1362C6127m6480k9270J7635j0951k4948k9562K0721N7288l0242m439K6081l2525
1350e0565J6830J0036j642m0121N5256K4709j7546N1519l9901m9844M4451K9448
1338C2630j00398j2271p943Q4883J7311M8908n476p0519l0517O344J6185n8160
1326g9023K0131Q803M5774n450j3934k7681o692k0894K6611K6226k8040N2249
1314a920j3898J1393N8410j7629o9264M860L9021l5517l7789K2528L8735l115
$$ y = [-80954, -42080, 20135, 9028, 28279, -36565, -51961, -10078, -19735, -33381, 16557, 21773, 19900, 45173, 25478, 23933, -4958, -24386, -31257, 33053, -1104, -15004, -20211, -58847, -88047, -38134, 7131, -62389, -21220, -20573, -26809, -59068, -93748, -35264, 40775, 57407, 36127, -10353, -39623, -21988, -32939, -57887, -87449, -66728, -9440, -39682, -44121, -18040, -50565, -33735, -23699, -25341, -65462, -10206, 14503, -3043, 48476, 8575, -41269, 3182, 32630, -67768, -80039, -87982, -3099, 14212, 63120, 57644, -12875, -43392, -37048, -20863, -79023, -58892, -50089, -4315, -9765, -23699, -51380, -58072, -78966, -52355, -26129, -54169, -1920, -15818, -4425, 53985, 36356, -32908, -28048, 10973, -24544, -62333, -39805, -1070, -4185]
1302d185L6784k4073k1419k5363N2737L0706o0762k6922p626P6917P489k9140
1290E143m2916n527N5284K1572j1895p4362K7834M403m2747K0091n720n0862k299
1277a02001O8046K9912q2493j1218L9143k839J1578R8016m280q0990o354M229
1265c9251M5548P122O3310r226l2356J7317j01966l4456O4779L1671k0171O036
1253a643P868k1186l2882L6873k4378L7408J7287k9021k8445j9798O318M6497
1241e102J0249n1266j9596L2799l862l5677K2582l2494K2143O4076N5088r786
1229D9154n2836j5549K9071O578J4522j6293l3435o832k1855J141P4727j5869
1217A2524J9212n9262J682M5968n5408j2190L5729M7921M109k6913k4164P818
$$ y = [-4185, 32599, 8526, -12893, -38256, 14481, 45187, -15575, -42497, -50123, 26794, 34283, 5143, -37773, -43300, 11984, 33556, 21661, -52701, -24867, -20464, -63211, -43120, -48840, -99702, -102001, -33955, -4043, -86536, -97754, -58611, -61450, -49872, 48144, 43864, -37126, -43480, -39251, 6297, 13419, 76729, 67503, 35147, 52464, -49502, -83958, -19179, 12492, -7679, -1643, 6225, -14961, -47843, -10970, -35348, 2060, 19347, -9674, -38119, -57917, -51599, -5102, 5147, -46119, -65715, -32916, -36778, -72455, -49873, -82367, -60224, 3852, 58940, 49154, -3682, -19231, 9840, 16418, 30940, 14647, -18788, -25620, -47475, -46334, 28393, 12524, 31736, -27526, -25844, 20124, -35284, -47474, -11745, 36176, 40285, 13372, -10792, -2974]
1205b974n614M3421J5764J3434j6547m6743k6697n4489O1924K1340j3466k2928
1193c3575J0133O4602M890Q894J2614j9738m3264l0731J7362O7867j4063q6607
1181d1616j0922K2512K5319K2883Q3522m7682m8126J3881l2474K3645R405K4522
1169D4869n8213r6333J7255J5822l7669N9158Q9691l9826m8454l276K5230P7294
1157D5548o9064n6391J9141K760k1119P5205O8158k8293m6222k0999Q170n034
1145b8140P024k7733K7787O3244l4570K4801j5009M4753L1833j9280l3129k2005
1133A9576k533j4198n2020Q532M3065n8272O6157K4225N8j9352J0776J8198j9649
1120B4563K7169L4586j4617J6983o617j8608p2575L1229N171o9756P423m0211
$$ y = [-2974, -8588, 34833, 50597, 64031, 47484, 741, -25956, -80445, -18521, 2819, -10647, -33575, -23442, 41160, 46050, 54944, 67558, 47820, 4556, -26175, -8813, 59054, 44991, -41616, -52538, -30026, -4707, 18176, 101698, 54016, 5890, 19771, -12703, 10942, 20347, 44869, -13344, -109677, -92422, -76600, -114269, -55111, 34580, -5246, -53700, -56976, -31746, 45548, -23516, -79907, -60766, -58006, -79125, -3920, 64238, 35945, -10277, -31276, -23106, -28140, -21116, -48849, -21062, 42182, 7612, 32413, 17404, 62157, 93990, 74710, 41581, 19576, 17043, 2845, -49175, -40643, 2422, -55850, 10307, 34532, 34590, 15238, 26014, 44212, 24563, 51732, 86318, 71701, 88684, 82067, 63459, -9116, 22113, 27284, -42472, -35049, -75260]
1108g5260J0211k9076O6484m0189k8405L1750O8767l814l2168N1033L8708J3936
1096G1977q0656N1433j6417q3339K6947L0651l6769m9044O9097L0943M7347j7024
1084D5146J3672n3997j2935P574l8864K309P0037M0420j08855J04974o1710m1377
1072c3606N2844O8437j2608p520j10593j6545K9885M4164k2551M0660J9740o357
1060D5950n034n7078j2354N0279K6466p7763K764n8225P2189n956K0379K3446
1048B5063k1481J240o216l5102L921O3717K4947k8033p7530m6852R9542K7113
1036C0329M2991n2300r2440K6244L221j1167j1438L0239J8806K4475p07J3255
1024B1508j9757l4778L7734M3040n6038J9158P8196k2913l4776o8021j7379N9515
$$ y = [-75260, -65049, -94125, -27641, -67830, -96235, -64485, 4282, 468, -31700, 19333, 58041, 71977, -8679, 42754, 26337, -57002, -30055, 596, -36173, -85217, -16120, 14823, 62170, 45146, 58818, 4821, -8114, -540, -39404, -37095, 32942, 73362, -35493, 69481, 7771, -33606, 19238, 87675, 75067, 67547, -43046, -59591, -29706, 14458, -8093, 32567, 52307, 45950, 40916, -16162, -28516, 21763, 48229, -29534, -26770, -84995, -12806, -18762, 1617, 25063, 3582, 4822, -1394, -36496, -32575, 31142, 56089, 28056, -49474, -96326, 3216, 30329, 73320, 21020, -71420, -45176, -41955, -53122, -64560, -34321, -15515, 8960, 8253, 21508, 1751, -33027, 4707, 47747, -8291, 10867, 89063, 66150, 31374, -36647, -54026, 5489]
1012E489P853M6504j4894j1987n4148m5933J9530L4133L7227j5624k17o223J4668
999A6378K762r832k3047J2744l1529K3667P378K8095J64l3404J6358k5518k2688
986c8472K8089J5743M0453N5861o6159l0371j6543J4678p5407K016N3973M0100
974B3961o305p9242M4568N7715M0734L4527k3738j0641j8555p0132n8914J9682
962d6340P4918J5395N827J4808J8249k1735k166l0618k4328K8833K382k5060j2839
949b674K8176p509p3470J6392j5595K5690L354P887n720M6412J3432n436p947
936B2992o7366k0516O6949K6181N272J1988j3176k929j1370o5964K3481J6126
924h332M0554n7131P2773J0842n2834N6557k0303L3453m3843J8927k9493K6518
$$ y = [5489, 13342, 59846, 44952, 32965, -21183, -67116, -47586, -13453, 23774, 8150, 7933, 1710, 16378, 19140, 9308, -13739, -995, -32524, -8857, -1479, 26616, 26780, -6624, 9734, -15784, -38472, -10383, 5360, 45813, 101674, 35515, 5144, -11399, 3279, -72128, -70112, -16139, 23961, 17656, -61586, -17018, 40697, 81431, 115958, 92220, 81579, 63024, -7108, -66022, -46340, 28578, 43973, 49800, 64608, 82857, 61122, 58956, 28338, 4010, 32843, 35225, 10165, -2674, 25502, 17993, -55477, -39085, -54680, -28990, -25636, -17749, -23469, 22943, 36375, 30939, 22992, -44374, -64890, 2059, 28240, 33512, 45500, 32324, 29395, 18025, -47939, -24458, -8332, 32222, -24909, 47864, 58706, 5872, 62429, 42126, 75579, 31736, 50663, 21170, 47688]
912D7688o3338j917k4224J5833r841o034n726R965J00251J6917o8035k3567L6680
899B4652n4849K3054J5912j5073K6494J6715J0271r1738O2901j1352L2808K0491
887F0286k0351Q587j8063q0864K1834M645j2791L9437n803j2328K2465L178o2176
874e1944N3796k899M7997m7352J8020M2713j4967k2121J9542n55K2093l339n2146
861H838m3510j95L6442M0150L284j9007K8182m5395Q439J6655j4698m2882K1039
848b658O1314k215l5286R985L7824J7264L6719r3882o6590K0498k140M0893j6940
835D786n0703l153R7818n8094J6660k5555k4456P2075j5003M012j1123J5922p0201
822d7015L4303J8002j3036j078J9823l7274J7527O5671k1479M453k0190q55k9364
$$ y = [47688, -15650, -17567, -41791, -25958, -35799, -41833, -47559, -37594, 62657, 79574, 11539, -12028, 24652, -30197, -7143, 8769, -6304, 20190, 36905, 47176, -44562, 18339, 6987, 39795, 60286, 39935, 48522, 30459, -50405, -28571, -23926, -36717, 2720, -3083, -15411, 7054, 10232, -51944, 1852, -1047, 46950, -402, 17618, 60331, 45364, 23243, 42785, 42230, 64323, 60984, 8838, -34672, -34867, 1575, 41725, 45009, 26002, 54184, 8789, 17228, 33883, 19185, -23697, -2658, 58656, 56441, 21155, 31140, 68964, 86228, 122947, 29065, -37525, -17027, -19167, 21726, 4786, -45917, -49070, 48748, -9346, 7314, -18241, -42697, 29378, 14375, 18387, 7264, 23186, -47015, -12712, 5290, -7746, -8824, 10999, -26275, -8748, 56923, 35444, 39897, 19707, 18852, -10512]
809a0512L331L1043M731K92n362J7920p1785k8286M2522m158k5309J9157N8629
796C2213j061M4806k7777j8640j8454P4449J6439j728L964J5940k4619l5609j3626
783D6297m7608k2702K6606J4665k6718J0567M2388k586l3456o905M1850J4555
771E6953l8593J006k6037L1057k5063j4492j6382Q3705J970J775j7554j5560m1147
758a8362j3887J1951m342o272M0999N9191m492m6259N290n268R078K5523n1199
745A951l2015N8841K7313j769j3710L3480K9538k9615r639l2669m8830l3240M9439
732i25O0421K5295p746l8222P29l5193L241j5402L5705N9219r8384k4105P882
719b7485M3997N2220o3023L3916M3275q7639m973j8102L0969l749j8053L0769
$$ y = [-10512, -7181, 23862, 28593, 28885, 23523, 41443, -30342, -58628, -16106, -20264, -45573, -26416, 32213, 31152, 75958, 48181, 29541, 11087, 85536, 101975, 100247, 104211, 120151, 95532, 59923, 46297, -1311, -24013, 2593, 17258, -9460, 1107, 43495, 40909, 7453, 548, 42398, 56953, 18360, 19366, -6671, 24386, -677, -15169, -31551, 52154, 54124, 55899, 38345, 22785, -18362, -32249, -20298, -24640, -30912, 10087, 69278, 64786, 18527, 23817, 18549, 27627, 53150, 1951, -30064, 28777, 56090, 54321, 40611, 74091, 103629, 74014, 64375, 31706, -17124, -50364, -925, 59496, 84791, 77045, 38823, 39552, 4359, 7600, -7802, 27903, 87122, -11262, -35367, -27485, 16512, 68732, 5709, 39625, 82900, -4739, -9712, -27814, 3155, -594, -18647, 12122]
707A2122j3913n2250L3793M7320m8377j3109r806Q4784m3624R191M3424l6468
695A3087K5890K3486l4247l4501O5360k2890J1075j9260m417N2819o3531l6143
683b3272J4084R236K0914k4011m309J9331J246O0066j4080k9319J4937L4360j0230
670F8953q9824k8762M342J6216K0807K9054l7905k063l4066K9340n901m271M8780
657A4700j3739l9454L2691J9769J9975j4946L0808O52n4156q109o0R521N3102
644E0754l5736n924K4967k0133P5020K4694k1775k2676k3573O7958j5201N810
632A04185q5074Q740j4738P0497L0873Q412m6573k3290N045j6399L3499q7695
620a2518j7260l1040K7398J4212J0423m630O169m1015l337K9781R6896o1292l6183
$$ y = [12122, -1791, -54041, -20248, 27072, -21305, -34414, -44220, 40564, -3060, 6131, 49555, 13087, 38977, 62463, 28216, -6285, 59075, 36185, 47260, 28000, 23583, 76402, 12871, -23272, -9188, 48, 20962, -3049, -7358, 11973, 13219, 73285, 59205, 29886, 44823, 79183, 68953, -20871, -49633, -45291, -29075, -8268, 20786, -17119, -19182, -53248, -23908, -29809, -34080, 14700, 961, -38493, -5802, 13967, 33942, 18996, 49804, 50456, -3700, -11809, -11869, -2348, 50754, 15018, 9094, 34061, 13928, 88948, 113642, 91867, 69191, 45618, 113576, 98375, 104185, 19111, 27851, 13113, 83610, 114483, 122895, 76322, 53032, 58077, 41678, 75177, -12518, -29778, -60818, -33420, -19208, -8785, -13415, -7246, -48261, -51598, -21817, 75079, 13787, -22396]
607b2396m4319N6742M127j9007K9330j1956k4038j3565j1424Q840k0126N5784
595a2008N3912J1830j2151l3176p030M7985L3192q971J0040L817k1841n7497l4843
582b6741P2822K8774k5386l9800L7902K4891j4754m23n139K8797n7694O198l7967
569h520J7595K5414j6405j9303M4213n2888m850P5182K3990n5671m6983L2211
557A3985M5661k5565o1419J3320K5203j0312j788M6914L5054J3454k0709O07J7029
544I1434P485J8002o5070k5354O2964j630K591k8555k5315n0810j6741M7061M3447
531E9509L098R343L8820l3485p0843L8343k9479M7280m0336J096J5661J7594N65
518E7166j0432N5580m2121J5173n858L490j8786L1976o2579M933K9503m0988N3324
$$ y = [-22396, -66715, -9973, -5846, -24853, 4477, -7479, -31517, -45082, -56506, -47666, -67792, -12008, 41904, 53734, 41583, 8407, 1377, 49362, 82554, 73583, 83623, 87440, 65599, 8102, -26741, 46081, 74855, 49469, 9669, 47571, 72462, 57708, 57285, 52146, 80943, 23249, 29447, -8520, 9075, 34489, 18084, -1219, 42994, -9894, -14744, 60438, 84428, 28757, -18226, 13985, 59646, 34081, -27338, -14018, 11185, 873, -915, 45999, 81053, 94507, 73798, 74405, 91434, 98919, 116921, 51851, 26497, 89461, 87831, 90422, 61867, 36552, -14258, -30999, 16062, 59509, 62607, 71950, 110770, 77285, 6442, 44785, 15306, 62586, 22250, 23346, 39007, 56601, 57166, 46734, 102314, 60193, 75366, 69508, 72998, 54212, 86188, 23609, 28542, 58045, 17057, 70381]
505G0381K9825m8156j6368N6976J5535n851q7340K6057j6020O782K6331R845K1436
492H9433K419l8325K7081N7691q352k5562q4010L3360l7795J1913j2326J5127
480C0654L0690J3534o9772o5130j15J2205K2050L3546j938O5744l6166p9269J4900
467b9067l051k1899O5544J5337L8709M019m851K870J6738K4070l6755j2299j3349
454D6016L5775k0434q340q35r317J0020m1240O758M2931r832j018K0616L5850
441A06950o7905k3586l3305j185M2025J8741o1839l327N658K9951M2432J7239
429G1849p8170N3006Q6160o4736k3230j6927o632K9942J1783k8132K4785n2042
417G656M9166k7927j3594O021m303J2120n0417N4567L2814L532k9127k4849m991
$$ y = [70381, 100206, 52050, 35682, 92658, 108193, 102342, 15002, 41059, 25039, 31821, 58152, 67997, 89433, 91852, 53527, 80608, 138299, 129947, 104385, 20375, 53735, 15940, 27853, 15527, 30654, 61344, 74878, 5106, -60024, -60139, -47934, -25884, 7662, 5724, 71468, 35302, -43967, -29067, -32118, -54017, 11527, 26864, 65573, 69592, 64741, 67611, 84349, 108419, 71664, 59365, 46016, 81791, 61357, 53017, 52182, 42865, 52885, 11645, 18403, 61334, 51502, 50484, 71100, 106950, 39045, 15459, -17846, -19031, 22994, 41735, -20104, -23431, -17773, 12178, 54610, 71849, -6321, 46685, 132845, 68109, 44879, 27952, 21320, 51262, 63045, 34913, 59698, 7656, 56822, 28895, 15301, 21322, 17019, 29139, -21278, 33289, 66103, 69635, 40508, 15659, 10668]
404A0668L6731N7323L2081Q38n4835l7055M3593J0168K0449O591j5561o38j0371
391I9982k5481k086l0547J6079L4262K0017k5300m3552L509j2151P3546l89l2137
378G5752j9996N0642o5473L5952O9022K6049l3938j06829L1762K5754N5179j0945
366A32931o3801j432J0627J0919r30K9755o5935r051J9985N6775j2138l1572j2290
353F3843l3408J9719O219k4132n4172j4664N3314N0354k1495N7420l150L4147
341A33995l9874q067M542k907R397l8332j321J9865N81m8320Q529J0408J4145
328F2641J4670K3112j3127o228k1112j5530M9895q679P6042p8958R336L4628r7263
315B9427j1008K3173k5287J3012k9724M1836J1646j2689O6203k9669n244O5623
$$ y = [10668, 47399, 104722, 136803, 137641, 82806, 45751, 89344, 99512, 119961, 126552, 110991, 110353, 99982, 74501, 72415, 41868, 57947, 92209, 112226, 86926, 43374, 46883, 34732, 108278, 107889, 75752, 55756, 106398, 40925, 76877, 145899, 171948, 138010, 31181, 62943, 88697, 143876, 132931, 69130, 67698, 78325, 89244, 88314, 118069, 52134, 43083, 63068, 119843, 107705, 76133, 63843, 30435, 50154, 56373, 32241, -21931, -36595, 16719, 67073, 45578, 102998, 99848, 133995, 94121, 86054, 90596, 87689, 97086, 58754, 57433, 77298, 77879, 29559, 38088, 48496, 62641, 77311, 100423, 87296, 81068, 59956, 44426, 94321, 85642, 161684, 82726, 92062, 126690, 29427, 18419, 41592, 16305, 29317, -407, 41429, 53075, 40386, 106589, 76920, 71676, 137299]
303A37299K3566q943o5205j4250M2771j8505M9328m620l3210N243J4553k4771
291A03256l7615K6711L9878k2453n6829L3582P4900m8819l3889N8802p665o8777
279F1082j5867l8674O404l302L1282O4209J7685L4525k4257r420j3245J9721K1885
266A52028K973m8932q6082N7018M0178j1195k1727J1310j9459j3639J481j6338
254D7616L3023n5099N0743R294l0675k6882L0062Q7211q9519q332L9250k368J753
241H6077J4853p174j4636j9027J7419J7299k8030N9399K1110j9956l9788j9367
229F8179j0056L2891M0971j9433l8979l7635L9977L777M6103k6765k9480l2180
217C7370M9581J0408m8333K068Q195o3848L8884O7877M9026L276n0421r835j8025
$$ y = [137299, 160865, 151922, 86717, 72467, 115238, 96733, 146061, 141441, 108231, 113474, 128027, 103256, 65641, 92352, 132230, 109777, 52948, 86530, 161430, 112611, 78722, 137524, 129859, 61082, 45215, 6541, 12945, 9643, 40925, 105134, 122819, 157344, 133087, 123667, 110422, 130143, 152028, 155001, 106069, 19987, 77005, 117183, 105988, 84261, 95571, 76112, 62473, 63954, 47616, 80639, 25540, 76283, 85577, 54902, 28020, 58082, 145293, 55774, 47442, 86692, 84324, 86077, 100930, 93756, 79120, 60093, 77512, 94811, 66781, 126180, 147290, 127334, 87546, 68179, 58123, 91014, 131985, 112552, 73573, 35938, 75915, 79692, 125795, 99030, 69550, 37370, 86951, 97359, 49026, 51094, 59289, -4559, 34325, 102202, 151228, 154504, 104083, 94248, 76223]
204G6223l4642j0387L7661O4633J1717j8898k1740n8195j2498J7275K2659r853
192F3955L1909n1482l7586J14988K2497K5141l2922o0614R691L3958k9544l7417
180E2574K0229p691p161K5248L3590J7818L6939m1635m3046j7235j05M8864J1043
167A29432q2184L499J7102O683J4591J6835K2352j6293n8487N4212J2740m1230
155G9252R955K48k7729J6996K0391K6514o1671j0963R318j489K1575k3436J072
142F0033k0453O0694J8322j8518j8394J7962M3780j4884k0953J8894L3808n1016
130A09275o448o628L3738K3106l9825n1170K5048J0299k6868j9243K9566O3619
118A44469o3085p542K2571l0241k9506K8109K3227M5431l5271l0571N2899L5739
$$ y = [76223, 41581, 31194, 68855, 133488, 145205, 126307, 104567, 46372, 33874, 51149, 73808, 63955, 95864, 44382, 6796, 121784, 144281, 169422, 136500, 75886, 85577, 119535, 89991, 52574, 72803, 65112, 57951, 83199, 116789, 134607, 171546, 129911, 86865, 69630, 69525, 118389, 129432, 47248, 50747, 67849, 74532, 89123, 105958, 128310, 112017, 53530, 107742, 120482, 79252, 89207, 89455, 61726, 78722, 99113, 125627, 63956, 52993, 62311, 60822, 82397, 58961, 60033, 39580, 100274, 118596, 100078, 81684, 99646, 143426, 128542, 107589, 126483, 160291, 109275, 102827, 96199, 129937, 153043, 113218, 62048, 87096, 97395, 70527, 51284, 80850, 144469, 81384, 73842, 96413, 66172, 36666, 64775, 88002, 133433, 98162, 67591, 120490, 156229]
106A56229q3284l4093J9080k3404P3988k3815j9101L4305L0709m2502k3999K4996
94H9109j3047l163j3853L9290M1398p1393O347K6924m8953j2345N6888j0613l0203
81E6386P866J9354J4572J9166l2207J2002k061n2160K9768J8962K5294m5001J7162
68H9103k635J3423j8403K1147J4835R858m7056m9297l6584O5277L9974K3868l273
55A20237k3421L4131r331Q062r645j279R071j4480m925K5196j6732k765k3366
42I0753k9999M5794L9927k1007j9603q864J4108m0952j442K973L3108l5132J4848
29H4512M695j0425L08M3008j0095n682p188r177N7454m0220R334J2338N80J84
15A29626J4063l3564r255L2475k1473j252k5187m4630O9257j6638k8779k2620
$$ y = [156229, 72945, 38852, 57932, 34528, 108516, 84701, 65600, 99905, 130614, 88112, 64113, 89109, 76062, 72899, 59046, 98336, 139734, 68341, 74688, 101612, 52659, 40314, 97202, 86589, 56386, 64252, 83606, 98178, 117344, 85137, 97139, 95078, 42918, 72686, 91648, 116942, 71941, 89103, 86468, 99891, 81488, 102635, 117470, 127328, 80272, 30975, -5609, 59668, 99642, 123510, 120237, 96816, 130947, 121616, 129678, 120033, 118754, 127825, 113345, 108420, 133616, 116884, 114119, 90753, 60754, 106548, 146475, 125468, 105865, 97001, 111109, 70157, 68715, 71688, 104796, 69664, 84512, 89207, 78782, 79090, 122098, 112003, 106321, 99133, 89956, 147410, 107190, 116524, 128862, 129442, 129626, 143689, 110125, 100870, 133345, 111872, 110620, 85433, 40803, 110060, 93422, 64643, 42023]
3D2023k2204K4725K8473
0G3017
$$ y = [42023, 19819, 44544, 73017]
$$ Imaginary data points
##PAGE= N=2
##DATA TABLE= (X++(I..I)), XYDATA
16383a715479k1551j5463P2025L9770j2036l503L1239O0410L8721K8641K4886
16372a472340M2900J2186m8788J7366O1881o670P573R3776K6395r511K8161K5034
16360a222037J826M8260N6171J601j2935K0997K0743O0802M4999l6815O0038K1267
16348i35083Q553N7192J3427L7234o985k2136K4600K0965J3212N2223L8347j1474
16336g09925L9525O6563K7182M8574j6017J631m8323J9710O3299P358K8461Q764
16324d63198N3584N9095q412L5118K1793M4647P6824j1633k4749m0405M204P5659
16312a77473M3402L4117M6065j1754l0706L2057N8000m03K125M5055K6891K8049
16300I5425R843k9861Q3294l1720Q343L9690M1607N0518o318L5124K5289n93R954
$$ y = [-1715479, -1737030, -1752493, -1680468, -1640698, -1652734, -1656237, -1624998, -1564588, -1525867, -1497226, -1472340, -1429440, -1417254, -1466042, -1448676, -1386795, -1393465, -1385892, -1292116, -1265721, -1275232, -1247071, -1222037, -1220211, -1171951, -1115780, -1114179, -1127114, -1106117, -1085374, -1024572, -979573, -1016388, -956350, -935083, -926530, -869338, -855911, -818677, -825662, -847798, -823198, -802233, -789021, -736798, -698451, -709925, -670400, -603837, -576655, -528081, -544098, -542467, -590790, -571080, -507781, -500423, -471962, -463198, -409614, -350519, -358931, -323813, -302020, -257373, -180549, -192182, -216931, -257336, -253132, -177473, -134071, -99954, -53889, -65643, -96349, -64292, -6292, -6695, -4570, 40485, 67376, 95425, 105268, 75407, 158701, 126981, 135324, 175014, 216621, 267139, 260821, 295945, 321234, 320641, 330595]
16287C30595j145M4376J2032k8986R2745J5304j2208M5398r218n560k9243K8018
16275D82108L2191k2952K0029p528P4989N6173o277K9797J9478K179L6982n6082
16263F61087Q467K6825J0106J5768J4821O7985L3959K2379k650J2352J5890p205
16251H79784J1424N8684j341j732J5606J6950R270K6517j7757J5681J2558R0530
16239A116174k8507m2874j0661k6548O7284N8937L1931j7503K4964n4406L3596
16228A152387J03998j8400k9775Q007k4050L6002P600j2657M8059L9893j1119
16217A299945j8259L6591M6435n129j4931j7098K5268P634n4735L8309M1823K2450
16205A408303O5278m284Q745q028n3831O5309N8290l1078Q280j2613j6091k5894
$$ y = [330595, 329450, 373826, 385858, 356872, 449617, 464921, 452713, 498111, 488893, 483333, 454090, 482108, 514299, 491347, 511376, 503848, 578837, 635010, 628733, 658530, 678008, 680187, 717169, 661087, 669554, 696379, 706485, 722253, 737074, 805059, 839018, 861397, 858747, 871099, 886989, 879784, 891208, 949892, 948551, 946819, 962425, 979375, 988645, 1015162, 997405, 1013086, 1025644, 1116174, 1087667, 1044793, 1034132, 1007584, 1074868, 1133805, 1165736, 1148233, 1173197, 1118791, 1152387, 1256385, 1237985, 1208210, 1216217, 1192167, 1228169, 1235769, 1223112, 1271171, 1311064, 1299945, 1281686, 1318277, 1364712, 1359583, 1344652, 1327554, 1352822, 1360456, 1305721, 1344030, 1385853, 1408303, 1473581, 1469297, 1478042, 1470014, 1416183, 1481492, 1539782, 1508704, 1516984, 1504371, 1488280, 1462386]
16193A462386P6400L6062m1656N1121l103R183j0556l1391L5621J8023j0217M6690
16181A638563K5591Q299j6477k027k7745l0669M1387K0630j2618O7598j4073m7215
16169A651244M8094K3510M5989n5471N0522K9421n263k3774K0826k1656n6445
$$ y = [1462386, 1538786, 1574848, 1533192, 1584313, 1581210, 1590393, 1579837, 1548446, 1584067, 1602090, 1591873, 1638563, 1664154, 1672453, 1655976, 1653949, 1626204, 1595535, 1636922, 1657552, 1644934, 1712532, 1698459, 1651244, 1699338, 1722848, 1768837, 1713366, 1763888, 1793309, 1788046, 1764272, 1785098, 1763442, 1706997]
$$ [...]
##END NTUPLES=NMR SPECTRUM
##END=
