##TITLE=1H_CA-9385-1
 200.13MHz, CDCl3,
 8 sc
 
 6.10.2025
##JCAMPDX= 6.0         $$ Bruker NMR JCAMP-DX V2.0
##DATA TYPE= NMR SPECTRUM
##DATA CLASS= NTUPLES
##ORIGIN= UXNMR, Bruker Analytische Messtechnik GmbH
##OWNER= pz
$$ XWIN-NMR		Version 3.5
$$ Mon Oct  6 16:01:22 2025 Russian Standard Time (UT+4h)  she@DPX200
##.OBSERVE FREQUENCY= 200.1308
##.OBSERVE NUCLEUS= ^1H
##.ACQUISITION MODE= SIMULTANEOUS
##.ACQUISITION SCHEME= undefined
##.AVERAGES= 8
##.DIGITISER RES= 18
##SPECTROMETER/DATA SYSTEM= spect
##.PULSE SEQUENCE= zg30
##.SOLVENT NAME= CDCl3
##.SHIFT REFERENCE= (INTERNAL, CDCl3, 0, 15.3701)
##AUDIT TRAIL= $$ (NUMBER, WHEN, WHO, WHERE, WHAT)
$$ ##TITLE= Audit trail, XWIN-NMR		Version 3.5
$$ ##JCAMPDX= 5.01
$$ ##ORIGIN= Bruker BioSpin GmbH
$$ ##OWNER= she
$$ F:/spectra/data/she/nmr/H-C/1/pdata/1/auditp.txt
$$ ##AUDIT TRAIL=  $$ (NUMBER, WHEN, WHO, WHERE, WHAT)
(   1,<2025-10-06 15:59:08.73 +0400>,<she>,<DPX200>,
      <created by zg, POWCHK disabled, PULCHK disabled
       configuration hash MD5:
       00 E9 B6 7A A2 85 ED C7 34 08 36 98 17 FE 4E 26
       data hash MD5: 16K
       12 E2 5B 27 03 0F 96 2D 27 39 3D 5E C8 91 F4 13>)
(   2,<2025-10-06 15:59:32.50 +0400>,<she>,<DPX200>,
      <Start of raw data processing
       efp BC_mod = 2 LB = 0.25 FT_mod = 6 PKNL = 1 PHC0 = -2277.294 PHC1 = 7.592239 SI = 16K 
       data hash MD5: 16K
       15 05 26 0B E4 1D 60 9E EC 60 CA 40 F0 AD 60 8A>)
(   3,<2025-10-06 16:00:27.21 +0400>,<she>,<DPX200>,
      <pk PHC0 = 2.558214 PHC1 = 0 
       data hash MD5: 16K
       AE 4F E3 07 21 13 9C 0C 1A 72 FA 61 38 29 AB 83>)
(   4,<2025-10-06 16:00:32.48 +0400>,<she>,<DPX200>,
      <abs ABSG = 5 
       data hash MD5: 16K
       24 ED C3 96 AC 95 C7 0A 94 AB EC 6C 2F 3F 42 18>)
$$ ##END=
$$ 
$$ hash MD5
$$ 8C 65 E7 C2 70 E7 02 63 B9 90 F2 D2 A6 5B E7 C0
##$RELAX= 
##$RELAX= 
##$RELAX= 
##$RELAX= 
##$RELAX= 
##$RELAX= 
$$ Bruker specific parameters
$$ --------------------------
##$DU= <F:/spectra>
##$EXPNO= 1
##$NAME= <H-C>
##$PROCNO= 1
##$TYPE= <nmr>
##$USER= <she>
##$AMP= (0..31)
100 100 100 100 100 100 100 100 100 100 100 100 100 100 100 100 100 100 
100 100 100 100 100 100 100 100 100 100 100 100 100 100 
##$AQSEQ= 0
##$AQ_mod= 1
##$AUNM= <au_zg>
##$AUTOPOS= <>
##$BF1= 200.13
##$BF2= 200.13
##$BF3= 200.13
##$BF4= 200.13
##$BF5= 200.13
##$BF6= 200.13
##$BF7= 200.13
##$BF8= 200.13
##$BYTORDA= 1
##$CFDGTYP= 0
##$CFRGTYP= 5
##$CHEMSTR= <none>
##$CNST= (0..31)
1 1 145 1 1 1 1 1 1 1 1 1 1 1 1 1 1 1 1 1 1 1 1 1 1 1 1 1 1 1 1 1 
##$CPDPRG= <>
##$CPDPRG1= <>
##$CPDPRG2= <>
##$CPDPRG3= <>
##$CPDPRG4= <mlev>
##$CPDPRG5= <mlev>
##$CPDPRG6= <mlev>
##$CPDPRG7= <mlev>
##$CPDPRG8= <mlev>
##$CPDPRGB= <>
##$CPDPRGT= <>
##$D= (0..31)
0 0.7 0 0 0 0 0 0 0 0 0 0.03 0 0 0 0 0 0 0 0 0 0 0 0 0 0 0 0 0 0 0 0 
##$DATE= 1759751948
##$DBL= (0..7)
120 120 120 120 120 120 120 120 
##$DBP= (0..7)
150 150 150 150 150 150 150 150 
##$DBP07= 0
##$DBPNAM0= <>
##$DBPNAM1= <>
##$DBPNAM2= <>
##$DBPNAM3= <>
##$DBPNAM4= <>
##$DBPNAM5= <>
$$ [...]
##$SUBNAM3= <"">
##$SUBNAM4= <"">
##$SUBNAM5= <"">
##$SUBNAM6= <"">
##$SUBNAM7= <"">
##$SUBNAM8= <"">
##$SUBNAM9= <"">
##$SW= 18.0517779522481
##$SWIBOX= (0..15)
0 0 2 0 0 0 0 0 0 0 0 0 0 0 0 0 
##$SW_h= 3612.71676300578
##$TD= 16384
##$TD0= 1
##$TE= 0
##$TE2= 300
##$TE3= 300
##$TEG= 300
##$TL= (0..7)
0 120 120 120 120 120 120 120 
##$TP= (0..7)
150 150 150 150 150 150 150 150 
##$TP07= 0
##$TPNAME0= <>
##$TPNAME1= <>
##$TPNAME2= <>
##$TPNAME3= <>
##$TPNAME4= <>
##$TPNAME5= <>
##$TPNAME6= <>
##$TPNAME7= <>
##$TPOAL= (0..7)
0.5 0.5 0.5 0.5 0.5 0.5 0.5 0.5 
##$TPOFFS= (0..7)
0 0 0 0 0 0 0 0 
##$TUNHIN= 0
##$TUNHOUT= 0
##$TUNXOUT= 0
##$USERA1= <user>
##$USERA2= <user>
##$USERA3= <user>
##$USERA4= <user>
##$USERA5= <user>
##$V9= 5
##$VALIST= <valist>
##$VCLIST= <CCCCCCCCCCCCCCC>
##$VD= 0
##$VDLIST= <DDDDDDDDDDDDDDD>
##$VPLIST= <PPPPPPPPPPPPPPP>
##$VTLIST= <TTTTTTTTTTTTTTT>
##$WBST= 1024
##$WBSW= 4
##$XGAIN= (0..3)
0 0 0 0 
##$XL= 0
##$YL= 0
##$YMAX_a= 390718
##$YMIN_a= -533487
##$ZGOPTNS= <>
##$ZL1= 120
##$ZL2= 120
##$ZL3= 120
##$ZL4= 120
##$ABSF1= 15.40427
##$ABSF2= -2.647623
##$ABSG= 5
##$ABSL= 3
##$ALPHA= 0
##$AQORDER= 0
##$ASSFAC= 0
##$ASSFACI= 0
##$ASSFACX= 0
##$ASSWID= 0
##$AUNMP= <proc_1d>
##$AZFE= 0.1
##$AZFW= 0.1
##$BCFW= 0
##$BC_mod= 2
##$BYTORDP= 0
##$COROFFS= 0
##$CY= -3
##$DATMOD= 1
##$DC= 0
##$DFILT= <>
##$DTYPP= 0
##$F1P= 0
##$F2P= 0
##$FCOR= 1
##$FTSIZE= 16384
##$FT_mod= 6
##$GAMMA= 0
##$GB= 0
##$INTBC= 1
##$INTSCL= 3.241238e-09
##$ISEN= 128
##$LB= 0.25
##$LEV0= 0
##$LPBIN= 0
##$MAXI= 10000
##$MC2= 0
##$MEAN= 0
##$ME_mod= 0
##$MI= 1.114404
##$NCOEF= 0
##$NC_proc= -8
##$NLEV= 6
##$NOISF1= 3.799351
##$NOISF2= 2.8
##$NSP= 0
##$NTH_PI= 0
##$NZP= 0
##$OFFSET= 15.37011
##$PC= 1
##$PHC0= -2274.736
##$PHC1= 7.592239
##$PH_mod= 1
##$PKNL= yes
##$PPARMOD= 0
##$PSCAL= 0
##$PSIGN= 0
##$REVERSE= no
##$SF= 200.129530345435
##$SI= 16384
##$SIGF1= 3
##$SIGF2= 2
##$SINO= 0.751879
##$SIOLD= 32768
##$SREGLST= <19F.Aceton>
##$SSB= 0
##$STSI= 16384
##$STSR= 0
##$SW_p= 3612.71676300577
##$SYMM= 0
##$S_DEV= 0
##$TDeff= 16384
##$TDoff= 0
##$TI= <>
##$TILT= no
##$TM1= 0
##$TM2= 0
##$TOPLEV= 0
##$USERP1= <user>
##$USERP2= <user>
##$USERP3= <user>
##$USERP4= <user>
##$USERP5= <user>
##$WDW= 1
##$XDIM= 16384
##$YMAX_p= 504262989
##$YMIN_p= -1766019
$$ End of Bruker specific parameters
$$ ---------------------------------
##NTUPLES= NMR SPECTRUM
##VAR_NAME=  FREQUENCY,     SPECTRUM/REAL,   SPECTRUM/IMAG
##SYMBOL=    X,             R,               I
##VAR_TYPE=  INDEPENDENT,   DEPENDENT,       DEPENDENT
##VAR_FORM=  AFFN,          ASDF,            ASDF
##VAR_DIM=   16384,         16384,           16384
##UNITS=     HZ,            ARBITRARY UNITS, ARBITRARY UNITS
##FACTOR=    0.220516191357247, 1,           1
##FIRST=     3076.01280722153, 0,            0
##LAST=      -536.703955784241, 0,           0
##MIN=       -536.703955784241, -1766019,    0
##MAX=       3076.01280722153, 504262989,    0
$$ Real data points
##PAGE= N=1
##DATA TABLE= (X++(R..R)), XYDATA
$$ [...]
5757A3768276m25788M97249N01479K2226l02486L29090M35227M70242L20242m1327
5747A5574430n8445M26002M16303P508L35300P73669Q93907j45714J050685Q80984
5737B0154629Q43816O99845Q19571O44390J246781K61748N30098J003528j16230
5728B6088176L23011p7129j22502l97694n0622j004239n82198k09021j266211
5719B2701571j218606j152160o86242p52240l11882o72651q55127k89181o51998
5710A6111484m61876n61927k99049j96825m32989l53420K62582j12166j87800
5701A3768014m26516n0943K2919K48726L16503l19593k09661J86930K71386l20091
5691A3487674J31879L44095n8607N28399J91730j11947k53744M9130N20568n9002
$$ plain form
5757 13768276 13342488 13839737 14341216 14363442 14060956 14390046 14825273 15295515 15615757 15574430
5747 15574430 15515985 15941987 16358290 16365798 16701098 17474767 18368674 18222960 19273645 20154629
5737 20154629 20998445 21698290 22517861 23162251 24409032 24670780 25200878 26204406 26088176
5728 26088176 26411187 26334058 26211556 25813862 25763240 24759001 24176803 23967782 22701571
5719 22701571 21482965 20330805 19644563 18892323 18580441 17907790 17052663 16763482 16111484
5710 16111484 15649608 15087681 14788632 14591807 14158818 13805398 14067980 13955814 13768014
5701 13768014 13341498 13290555 13313474 13562200 13878703 13559110 13349449 13536379 13807765 13487674
5691 13487674 13619553 13963648 13905041 14433440 14625170 14513223 14259479 14308609 14829177 14770175
5681A4770175j69618m41640J2956k1479n28513L35992N92726J08594L97237J84101
5671A5240531K38165O23295j8805O57242K61428P79995K62959l645M16476K70031
5661A8727672O19723M64369l44471M39523N08790M83318M80075K83931m16769
5652B1246161M6080r887J66852m71226k19735k75146l62526l14731m90325k56506
5642A9059011p81777r5321r1357J64239j57156R1347P5501J30044K67445p3059
5632A8588917J04830N2644j76933l63780L34J15524l33461m57034o82598n14330
5622A6334113m38142p03997m20524J31086j051578j02085j53649l59897J5798
5613A3251125p99723j96506P977q74661Q4040k63382m6051l05063j77079k7798
$$ plain form
5681 14770175 14600557 14158917 14171873 14150394 13621881 13957873 14550599 14659193 15056430 15240531
5671 15240531 15478696 16101991 16083186 16740428 17001856 17781851 18044810 18041165 18457641 18727672
5661 18727672 19347395 19811764 19467293 19906816 20415606 20898924 21378999 21662930 21246161
5652 21246161 21292241 21282354 21449206 20977980 20758245 20483099 20120573 19805842 19315517 19059011
5642 19059011 18277234 18181913 18090556 18254795 18097639 18188986 18264487 18394531 18661976 18588917
5632 18588917 18693747 18746391 18569458 18205678 18206012 18321536 17988075 17531041 16848443 16334113
5622 16334113 15895971 15191974 14771450 14902536 13850958 13748873 13595224 13235327 13251125
5613 13251125 12451402 12254896 12262873 11388212 11472252 11208870 11162819 10857756 10680677 10652879
5603A0652879l95372l70529q00811r7138K90451l56024k92082j63568J56950L11326
5593H936082k42616m02818o4400k90832j82988K49815K13877j90496n0527p12300
5583G262797n68005J98175M55180R4302K09647J13419q85736N3927M1668J50495
5573G125869k54534o51849L01583O88192j93839j6455J30262j12850j59759m53664
5563F402956L4255L81753n84479j90885L12390q0433J7749M2958M788k90611j64472
5552E885969O25086L19972J76128j52609N202o4475k83781L45188n44606K60875
5542F572949j78160l39589J51451j09201M73769N50554r50409k93292Q91566K86020
5532G055658l8346P3072K59848j17916K62630l99395q3616P9303m0298J41094
$$ plain form
5603 10652879 10257507 9886978 9086167 8989029 9279480 8923456 8631374 8467806 8624756 8936082
5593 8936082 8693466 8290648 8226248 7935416 7752428 8002243 8216120 8025624 7975097 7262797
5583 7262797 6694792 6892967 7348147 7442449 7652096 7765515 6879779 6933706 6975374 7125869
5573 7125869 6871335 6219486 6521069 7209261 7015422 6998967 7129229 7016379 6856620 6402956
5563 6402956 6437211 6818964 6234485 6043600 6355990 6275557 6293306 6336264 6341052 6050441 5885969
5552 5885969 6511055 6831027 7007155 6854546 6859748 6795273 6511492 6856680 6312074 6572949
5542 6572949 6394789 6055200 6206651 6097450 6571219 7121773 6171364 5878072 6769638 7055658
5532 7055658 7017312 7090384 7350232 7232316 7494946 7095551 7011935 7091238 7050940 7192034
5522G192034l9978J77550j06793m6639j61319j29284j32840r9448K2528J14964
5512F790775J79504j6056K97325k0731J42866j31569l05605k33211l29543j47165
5502F226590J24307l4316L6842K69976L07122l05290j22317L62136J19594l81892
5492F602752m17477K73255Q84617K00256j20778l45159q08791O25928k85428j18099
5482F491076m8020n050K52627j53904p8813K12563M51387l05822j85475m40596
5472F189973K333J33214j02869m4640q9645M04106j55649K41254K2118m14309
5462F185886O6056J73800P5865m7092L3770l6779Q1016M93450L980n930K64454
5451G288476K41061J7186j29708J93977L3014m19155K11869k29502L1759P38628
$$ plain form
5522 7192034 7152056 7329606 7222813 7176174 7014855 6885571 6752731 6653283 6675811 6790775
5512 6790775 6970279 6954223 7251548 7230817 7373683 7242114 6936509 6703298 6373755 6226590
5502 6226590 6350897 6316581 6353423 6623399 6930521 6625231 6502914 6865050 6984644 6602752
5492 6602752 6185275 6458530 7343147 7543403 7422625 7077466 6268675 6894603 6609175 6491076
5482 6491076 6443056 6438006 6690633 6536729 6457916 6670479 7121866 6816044 6630569 6189973
5472 6189973 6192306 6325520 6222651 6178011 6088366 6492472 6336823 6578077 6600195 6185886
5462 6185886 6251942 6425742 6501607 6454515 6488285 6451506 6532522 7025972 7029952 7024022 7288476
5451 7288476 7529537 7546723 7417015 7610992 7644006 7224851 7436720 7207218 7238977 7977605
5441G977605m5854p01693Q9313k0559j59208J74016k85120R14965J45063L32518
5431H421046j14642k69197K49698L80196j34182j43003O981P6462j86424p2952
5421H213983M04896J73480j6221L04009J61384j14307N0038N33814N60488K72334
5411A0543898m3900n3191L41718K65853o0669r0679O8300L67553n87517Q16071
5401A1567437L62304n41905J06714J43453J82010o1234l06534k74277O91619K02585
5391A2072172O0330J4986k67987J11908L29517k30311k16562M52583M67719j14575
5381A2679780N48395M57370m00481j102574M74473O02878P6363j326N4287k36541
5371A3152624N11268k72969K1191K2965k57128N39907J53299n38875l83305J97386
$$ plain form
5441 7977605 7931751 7230058 7319371 7298812 7139604 7313620 7028500 7943465 8088528 8421046
5431 8421046 8306404 8037207 8286905 8667101 8532919 8389916 8396897 8473359 8286935 8213983
5421 8213983 8618879 8792359 8776138 9080147 9241531 9127224 9177262 9711076 10271564 10543898
5411 10543898 10499998 10446807 10788525 11054378 10993709 10903030 10971330 11338883 10751366 11567437
5401 11567437 11929741 11387836 11494550 11638003 11820013 11758779 11452245 11177968 11869587 12072172
5391 12072172 12132502 12147488 11879501 11991409 12320926 12090615 11874053 12326636 12794355 12679780
5381 12679780 13228175 13685545 13285064 12182490 12656963 13259841 13336204 13334878 13389165 13152624
5371 13152624 13663892 13390923 13412114 13435079 13177951 13717858 13871157 13332282 12948977 13146363
5361A3146363M27831l30962j95089j49506k30663K87570M30305L37592m68300
5352A3255141p6911k01741R7567k42629l79571l47017m30181N671j141m58655
5342A1220533j26602J9455p939L1396j96328O34237M15853p54863q5774m46582
5332A0703386m41132j39246K06000q9939q4374N00843k88648m39074k80147J01519
5322I749188J1838l26195l9972J08277j35893n33220r3342Q9740M28016r8652
5312I159785N970L5144N6228J88470M1281K09088L25845k40534j21346O3631k7872
5301I695690l2148m60307O7241J07383N25943k15514k11825L07863j01501j06416
5291I576409k28434J35102M20659n20345o0974J58374q649J06656Q0006K1841
$$ plain form
5361 13146363 13574194 13243232 13048143 12898637 12667974 12955544 13385849 13723441 13255141
5352 13255141 13178230 12976489 13074056 12831427 12451856 12104839 11674658 11680329 11679188 11220533
5342 11220533 11093931 11113386 11105447 11136843 10940515 11574752 11990605 11235742 11149968 10703386
5332 10703386 10262254 10123008 10329008 10239069 10154695 10655538 10366890 9927816 9647669 9749188
5322 9749188 9761026 9434831 9394859 9503136 9367243 8834023 8740681 8830421 9258437 9159785
5312 9159785 9165755 9200899 9257127 9445597 9486878 9695966 10021811 9781277 9659931 9723562 9695690
5301 9695690 9663542 9203235 9270476 9377859 9903802 9688288 9476463 9784326 9682825 9576409
5291 9576409 9347975 9483077 9903736 9383391 9322417 9480791 9472142 9578798 9658804 9680645
5281I680645R9355K29259J69642K97531M47483l70049l14413m9495L04234J55601
5271A0649793n8004j66936J17706k94336m90470N16521J31210j99768K11939L61469
5261A0779124J9136n04614K90312N18410l06026j35895m9080N8706J0999M58793
5251A1139865j77931j10112K64041l09424J8905q0235K73587O5696k48020L29343
5241A1165715Q1813M44461N76713m62761j7308Q0633L52683L78940J7948k02662
5231A2416175k45904K04462K97045N21223j1349n73063J01348k88931N23496K79723
5221A3224225n33499P36467k35380r0788L04987K30985j69162j49250j73363J44014
5211A3289236j35563n1682N91991j0602L59298K06962J36521M60717J2806o57833
$$ plain form
5281 9680645 9780000 10009259 10178901 10476432 10923915 10553866 10239453 10189958 10494192 10649793
5271 10649793 10591789 10424853 10542559 10248223 9757753 10274274 10405484 10205716 10417655 10779124
5261 10779124 10798260 10293646 10583958 11102368 10796342 10660447 10611367 10670073 10681072 11139865
5251 11139865 10961934 10851822 11115863 10806439 10825344 10745109 11018696 11084392 10836372 11165715
5241 11165715 11247528 11691989 12268702 11805941 11788633 11869266 12221949 12600889 12618837 12416175
5231 12416175 12170271 12374733 12671778 13193001 13181652 12608589 12709937 12421006 12944502 13224225
5221 13224225 12690726 13427193 13191813 13101025 13406012 13636997 13467835 13318585 13145222 13289236
5211 13289236 13153673 13101991 13693982 13683380 14042678 14249640 14386161 14846878 14859684 14201851
5201A4201851K838N01782j41381O46266L70253K20547L61671o4277o08141N48372
5191A6039781L11238j0377L24153l1810p24841K25239N60442O0559Q2382j06576
5181A6730190L42063M88607J0549J03476R2356J15238O84864N40002L8681o53474
5171A8492552j52256K48291M11129J73008K71366M67885N52702N21843k9426O2876
5161B1019970K92334K79356L62290N14917L2719L40668M83250Q52932N31780M43765
5151B5153981R83822R73974O59514O19342O72104Q00961J111412R12471J422139
5142C3309720J692749J453394J686448J312790J862649J266770R96065O02374
5134D4182959J019338J061132R69526R13547J479517J341584J158774K135778
$$ plain form
5201 14201851 14204689 14706471 14565090 15211356 15581609 15802156 16163827 16099550 15491409 16039781
5191 16039781 16351019 16340642 16664795 16632985 15908144 16133383 16693825 16754384 16836766 16730190
5181 16730190 17072253 17560860 17571409 17674885 17767241 17882479 18567343 19107345 19146026 18492552
5171 18492552 18340296 18588587 18999716 19172724 19444090 19911975 20464677 20986520 20957094 21019970
5161 21019970 21312304 21591660 21953950 22468867 22501586 22842254 23325504 24178436 24710216 25153981
5151 25153981 26137803 27111777 27771291 28390633 29062737 29863698 30975110 31887581 33309720
5142 33309720 35002469 36455863 38142311 39455101 41317750 42584520 43580585 44182959
5134 44182959 45202297 46263429 47232955 48146502 49626019 50967603 52126377 54262155
5126E4262155K181429K616329J868359K207627K435129L517578K992947L183079
5118G5264632L354421L672711M139301N158523N218874N705173O177067P153831
5110A15844533Q258022Q873693R673195J1075606J1683845J3331466J5706536
5103A94446896J8369099K2202707K4433835K2679979J8308704J0085259j733776
5096C08792703j1943413j9094380k2865519k3112262k0009321j6580117j4779584
5089A80408107j3194992j1643496j1026334r401864p102979o351100n163018m248197
5081A12276127l184431l162066l184721k533914j241630j576139j041682J4389
5073I6365933j35740K98335M75184J99396J496316K094734J832542K409957K422212
$$ plain form
5126 54262155 56443584 59059913 60928272 63135899 65571028 69088606 72081553 75264632
5118 75264632 78619053 82291764 86431065 91589588 96808462 102513635 108690702 115844533
5110 115844533 124102555 132976248 142649443 153725049 165408894 178740360 194446896
5103 194446896 212815995 235018702 259452537 282132516 300441220 310526479 308792703
5096 308792703 296849290 277754910 254889391 231777129 211767808 195187691 180408107
5089 180408107 167213115 155569619 144543285 135141421 128038442 121687342 116524324 112276127
5081 112276127 109091696 105929630 102744909 100210995 98969365 97393226 96351544 96365933
5073 96365933 96230193 96528528 97003712 97203108 98699424 100794158 102626700 105036657 107458869
5064A07458869K681902L257676L491966M163007M232818M997828N050129N899592
5056A41233787O358287P224957Q741651Q840947R078357J0093543J1558847J2664269
5048B15794645J4776268J6804084K0112976K2191929K2764383K0354736J4696746
5041C47495767O711474l759721j2196388j7659899k1803893k1105349j9059925
5034B58622066j6742019j4969129j3069382j1604923r709596r035186o835460
5027A76656371n882340n123671l942253l853554k493630j341718q79956l3384
5019A53105865k00835M60827O20613J593809J761294J420853J993406J823905
5011A62579737P91341J150666J340860J114781J258259J762488J481035J141719
$$ plain form
5064 107458869 110140771 113398447 116890413 121053420 125286238 130284066 135334195 141233787
5056 141233787 147592074 154817031 163558682 172399629 181477986 191571529 203130376 215794645
5048 215794645 230570913 247374997 267487973 289679902 312444285 332799021 347495767
5041 347495767 354207241 350447520 338251132 320591233 298787340 277681991 258622066
5034 258622066 241880047 226910918 213841536 202236613 192527017 183491831 176656371
5027 176656371 170774031 165650360 161708107 157854553 155360923 154019205 153139249 153105865
5019 153105865 152905030 153365857 153986470 155580279 157341573 158762426 160755832 162579737
5011 162579737 163371078 164521744 165862604 166977385 168235644 169998132 171479167 172620886
5003A72620886K117919K069389K372533J825972K540926K632424K455051K784806
4995A91419906K817525K740821K754954K335017J879483J260562J503435J232692
4987B07944395J139414J235404M55135j74777j02421o05935j493439j744626k229438
4978B04423712k539297k219406k000792k253518j833220j516796r96419n46870
4970A90517394K03744O80679N25803R01828J034183L88968J179519J077656N78148
4961A97087922O64048k73467p96265p54477j690530k647532k917029k820061k722603
4952A83130006k205750k846672k487429j497045j347733j790159j244177r95835
4944A68715206Q2199L01767j46963J70180M96991M60701N84042L52362L01239
$$ plain form
5003 172620886 174738805 176808194 179180727 181006699 183547625 186180049 188635100 191419906
4995 191419906 194237431 196978252 199733206 202068223 203947706 205208268 206711703 207944395
4987 207944395 209083809 210319213 210774348 210599571 210497150 209891215 208397776 206653150 204423712
4978 204423712 201884415 199665009 197664217 195410699 193577479 192060683 191064264 190517394
4970 190517394 190721138 191401817 191927620 192829448 193863631 194252599 195432118 196509774 197087922
4961 197087922 197751970 197478503 196682238 195927761 194237231 191589699 188672670 185852609 183130006
4952 183130006 180924256 178077584 175590155 174093110 172745377 170955218 169711041 168715206
4944 168715206 168797405 169099172 168952209 169122389 169619380 170080081 170664123 171016485 171317724
4935A71317724J024274P24364J112192Q29738J052970J052520J182330J325134
4927A79621246K221811J712037J743336K528316K048140K099441J705738J663743
4919A95343808K498377J899425J620796J139478P22680L43187L68037l79174o85123
4910B02871491q33784j105542q65385j556292k059776j070924j372650j180138
4902A92827000k97993L84124N5969J87333N52436P27111r1200O47870O84018L33139
4892A96009807m18926q60795j011515k131783k429834k735685l290338l727991
4884A79402940l901446l722792l880977m592387m062572l816750l717015l769716
4876A47939285l568899k640125k948790k193166k954128k777678k242730k066276
$$ plain form
4935 171317724 172341998 173066362 174178554 175008292 176061262 177113782 178296112 179621246
4927 179621246 181843057 183555094 185298430 187826746 189874886 191974327 193680065 195343808
4919 195343808 197842185 199741610 201362406 202501884 203224564 203567751 203935788 203556614 202871491
4910 202871491 202037707 200932165 200066780 198510488 196450712 195379788 194007138 192827000
4902 192827000 192529007 192913131 192969100 193156433 193708869 194435980 194344780 194992650 195676668 196009807
4892 196009807 195590881 194730086 193718571 191586788 189156954 186421269 183130931 179402940
4884 179402940 175501494 171778702 167897725 163305338 159242766 155426016 151709001 147939285
4876 147939285 144370386 141730261 138781471 136588305 133634177 130856499 128613769 126547493
4868A26547493j258140j793365j831430j379413j316648j090212j244072k012445
4860A14621768j681423j178121j212391q99059j694096j638099j428586j683871
4852A03206122j243226j350442j324771j388294p88138j085659o07487l77986
4844I5040119o29841q80271q75003q67637n45605m62041l76409p5156j00987k69848
4834H9957321N7482l13429K95825p1287M16494n91650r26443J85722l45489r53931
4824H7710615J82545j93055m83940k32343r9970o00683p29458N5779M37522L32463
4814H6379475M23547P09856r3802M94375P86789M32825J002222M20939O79178
4805I1235404R79599J909P55726N29017M4398M93975o6176j05532L51110m9555
$$ plain form
4868 126547493 125289353 123495988 121664558 120285145 118968497 117878285 116634213 114621768
4860 114621768 112940345 111762224 110549833 109650774 107956678 106318579 104889993 103206122
4852 103206122 101962896 100612454 99287683 97899389 97111251 96025592 95418105 95040119
4844 95040119 94410278 93530007 92655004 91787367 91241762 90779721 90403312 90328156 90227169 89957321
4834 89957321 90014803 89701374 89997199 89925912 90342406 89750756 88824313 89010035 88664546 87710615
4824 87710615 87893160 87700105 87216165 86983822 86883852 86283169 85553711 85609490 86047012 86379475
4814 86379475 86803022 87512878 87419076 87913451 88700240 89133065 90135287 90556226 91235404
4805 91235404 92215003 92216912 92972638 93501655 93546053 94040028 93973852 93868320 94219430 94169875
4795I4169875j26795p34433m47093n37489l59210m85165r21901n81741M5043K07297
4785I0228388q88062m01429J45547M57958M5729l91308n2572L82850o149n38821
4775H8982131K90143K97646J81993K79062O00292N57531P90989Q23358N63898
4766I3367043J406044J308140J510906M54278J228514J601348J586178R63287
4758A03425738J139722J347212J573587K215888K332263J325040J388020K440984
4750A17188454J957554J860675K236987K777324K947242K944284L416536L587466
4742A38916522L794872M003763L589206L258210L301454K212558J598848O87834
4734A61363267R7371N21828J17829J320640K144245K752745K600751L656216M167554
$$ plain form
4795 94169875 94043080 93308647 92861554 92324065 91964855 91479690 90557789 89976048 90021091 90228388
4785 90228388 89340326 88938897 89084444 89542402 89588131 89196823 89144251 89527101 89520952 88982131
4775 88982131 89272274 89569920 89751913 90030975 90631267 91188798 91979787 92803145 93367043
4766 93367043 94773087 96081227 97592133 98046411 99274925 100876273 102462451 103425738
4758 103425738 104565460 105912672 107486259 109702147 112034410 113359450 114747470 117188454
4750 117188454 119146008 121006683 123243670 126020994 128968236 131912520 135329056 138916522
4742 138916522 142711394 146715157 150304363 153562573 156864027 159076585 160675433 161363267
4734 161363267 161460638 161982466 162100295 163420935 165565180 168317925 170918676 174574892 178742446
4725A78742446M830355N565852O221734O667837P920354Q151715R713138R855343
4717B37668774J1091970J1524279R970309Q828680O808908M355067L419946L471813
4709B97139746L603383M571420O571165P352832Q316556Q669108J0740951J0847260
4701C57812421J0822990R853112O843884L138907k192431p678207j1932064j4990795
4693C51677817j7389237j6537476j6470152j4436112j3528479j2745417j1112965
4686B49457979r830394q895157p840198o783673o478963n856075n090058m164952
4678A94518509l972274m663334l758027l092984k718026k580007k692915j990630
4670A69050312j860005j495858j619469j749044j059127q66786p44594m69240
$$ plain form
4725 178742446 183572801 189138653 195360387 202028224 209948578 218100293 227813431 237668774
4717 237668774 248760744 260285023 270255332 279084012 285892920 290247987 293667933 297139746
4709 297139746 300743129 305314549 311885714 319238546 327555102 336224210 346965161 357812421
4701 357812421 368635411 378488523 385332407 388471314 386278883 378600676 366668612 351677817
4693 351677817 334288580 317751104 301280952 286844840 273316361 260570944 249457979
4686 249457979 239627585 230732428 222892230 216108557 209629594 203773519 198683461 194518509
4678 194518509 190546235 185882901 182124874 179031890 176313864 173733857 171040942 169050312
4670 169050312 167190307 165694449 164074980 162325936 161266809 160400023 159655429 159186189
4662A59186189o35246m02402J43685n49768L47742Q57095L20055J11450L27553
4653A59706353J51427M55550P35001M70737R84983J421530J762337J039366J489729
4644A68217013K107923J626392J953671K458306K606413L001530K741627K504221
4636A87217096M413147M463639M643628N780158N057950N750541M327560M573466
4628B26227185M943928M329063M280430M453350L974121M428623N360515O409780
4620B64406995P498519P389257R329580R789963J0350243J2171310J3136946J3986715
4612C48059528J6164892J7100182J8853813K0513121K1228810J9824975J8172625
4605D79917946J4661136Q282150J401757m870728j0236822j4243425j7684303
$$ plain form
4662 159186189 158550943 158148541 158292226 157742458 158090200 158947295 159267350 159378800 159706353
4653 159706353 159857780 160313330 161048331 161519068 162504051 163925581 165687918 166727284 168217013
4644 168217013 170324936 171951328 173904999 176363305 178969718 181971248 184712875 187217096
4636 187217096 191630243 196093882 200737510 206517668 211575618 217326159 221653719 226227185
4628 226227185 231171113 235500176 239780606 244233956 248208077 252636700 257997215 264406995
4620 264406995 271905514 279294771 288624351 298414314 308764557 320935867 334072813 348059528
4612 348059528 364224420 381324602 400178415 420691536 441920346 461745321 479917946
4605 479917946 494579082 502861232 504262989 499392261 489155439 474912014 457227711
4598D57227711j8857494j8290367j7287547j5698549j3366117j1934162r914237
4591C51879238q000081o486537m155684k254808j257729K76372J937903L265282
4583C35203956M309826O069214P641584P801036Q901974P860821O207461L374469
4575C87370341k83839m044197p358203j1127186j4298038j5920139j7115993j6809786
4567C00412960j5616047j4382902j3647489j2175505j2130002j0711913r429923
4560B12319179q880803q062432p202281n827989n133741n574067n317911l776670
4552A62543285l156142k674219k452044k807450k390982j456199j623993k038962
4544A43943294j923361j637127k091412k151336k315831k740794k794370k937935
$$ plain form
4598 457227711 438370217 420079850 402792303 387093754 373727637 361793475 351879238
4591 351879238 343879157 337392620 333236936 330982128 329724399 330000771 331938674 335203956
4583 335203956 339513782 345582996 353224580 361025616 369927590 377788411 383995872 387370341
4575 387370341 387086502 383042305 375684102 364556916 350258878 334338739 317222746 300412960
4567 300412960 284796913 270414011 256766522 244591017 232461015 221749102 212319179
4560 212319179 203438376 195375944 188173663 182345674 177211933 171637866 166319955 162543285
4552 162543285 159387143 156712924 154260880 151453430 149062448 147606249 145982256 143943294
4544 143943294 142019933 140382806 138291394 136140058 133824227 131083433 128289063 125351128
4536A25351128k527303k399151l174967j946543j859212k208914j975882j518195
4528A07740961j381637j640535j254999j547220j917725p74952j522238j688976
4520I6012679j617089k117888k024740j693872j575535j992471j757055j527278
4512H1706751p54638j854001j659731j285429p79511n36691q85902j046274p19316
4503G2185258k99928p44198o90057l61202M46378n74800J08586m6652K78525l19540
4493F9982370K95590O6229q46251j3078K12208q21524p85005m05336l54428m69530
4483F6861245n71191n36726r7308l04004l50235l01464m89352J79719q8692P01487
4473F5003479P20174J39610L02704O60711P79546R81451L8337M22361L50460L84449
$$ plain form
4536 125351128 122823825 120424674 117249707 115303164 113443952 111235038 109259156 107740961
4528 107740961 106359324 104718789 103463790 101916570 99998845 99223893 97701655 96012679
4520 96012679 94395590 92277702 90252962 88559090 86983555 84991084 83234029 81706751
4512 81706751 80952113 79098112 77438381 76152952 75373441 74836750 73950848 72904574 72185258
4503 72185258 71885330 71141132 70451075 70089873 70536251 69961451 70070037 70023385 70301910 69982370
4493 69982370 70277960 70344189 69497938 69484860 69697068 68875544 68090539 67685203 67330775 66861245
4483 66861245 66290054 65753328 65656020 65352016 65001781 64700317 64210965 64390684 64301992 65003479
4473 65003479 65723653 65863263 66165967 66826678 67606224 68587675 68626012 69048373 69398833 69783282
4463F9783282k32474n34168o81790j240366j314500q9076m91509r98599p44879
4454F3455921r00616n59079n66298K60287k21258m46150M22418M9249o21657j84082
4444F0688735O2649l1146k47603k30895Q24000N02779P63054M45634R03565M21394
4434F4102166Q70224J140004J590552J290218J025127J966972J347345J527281
4426G4859889J894931J692814J713344J748991J588955K003121J126779J274897
4418H7903721J725691K007929K290377J856079J939068K763245K275425K439884
4410A05201419L522317K797087L062491L976075L904230M167761M724322O058657
4402A37414359N941884O407680O584598P604600Q219482Q378528R249883R162381
$$ plain form
4463 69783282 69550808 69016640 68334850 67094484 65779984 65690908 65199399 64200800 63455921
4454 63455921 62555305 61996226 61429928 61690215 61468957 61022807 61445225 61494474 60872817 60688735
4444 60688735 60751384 60720238 60472635 60241740 61065740 61568519 62331573 62777207 63680772 64102166
4434 64102166 64972390 66112394 67702946 68993164 70018291 71985263 73332608 74859889
4426 74859889 76754820 78447634 80160978 81909969 83498924 85502045 86628824 87903721
4418 87903721 89629412 91637341 93927718 95783797 97722865 100486110 102761535 105201419
4410 105201419 108723736 111520823 114583314 118559389 122463619 126631380 131355702 137414359
4402 137414359 143356243 149763923 156348521 163953121 172172603 180551131 189801014 198963395
4394A98963395R296971J0683846J0242333J0129091Q928634O854205M483986O79775
4386B60262236k606165n510083q532711j0238917j0517986j0408428r894487j0268638
4378A92284821r108565q369768p911071p532872p027305n448315n424730n104067
4370A36358128m316176l661603l365286l639627k712706k590861k377706j959725
4362A11734438j642812k029463k076576j033506k33739o00284j495006n53543
4354A02069509n59382r00321m33978q78636r96370q24177o91430p79209k03947
4345I5802059l62608r34302r88957o16412q32916n67591l08804j043870j316549
4336H8830050j135820j315458j066624j453951j032238j214609j212759j197820
$$ plain form
4394 198963395 208260366 218944212 229186545 239315636 248244270 255098475 259582461 260262236
4386 260262236 257656071 252145988 243613277 233374360 222856374 212447946 202553459 192284821
4378 192284821 183176256 174806488 166895417 159362545 152335240 146886925 141462195 136358128
4370 136358128 132041952 128380349 125015063 121375436 118662730 116071869 113694163 111734438
4362 111734438 110091626 108062163 105985587 104952081 104718342 104118058 102623052 102069509
4354 102069509 101510127 100609806 100175828 99297192 98300822 97476645 96785215 96006006 95802059
4345 95802059 95439451 94505149 93516192 92899780 92066864 91499273 91190469 90146599 88830050
4336 88830050 87694230 86378772 85312148 83858197 82825959 81611350 80398591 79200771
4328G9200771j307823j726784j601086j163364j216103j165127j354805j877041
4320F7788638j368215j601691j750106j127203j304832j686526j627453j010012
4312E6312600j626292j573277j391470j721817j510818j132534j153506j128916
4304D5073970j470357j115721q63734j459034q66214m45025j323938r52678j445464
4295C5131805o93718q83109o64609o37794j132955m87621p41805l72461q07692
4286B8710041m62446k54679j014056o45384l96080r23071n40984o57053k9156
4277B3787132q53743j261155J11684J61147n14586q72531k98584j03306J4751
4268B0170809k21547m11667n01155R1922m02472q1124n89214m5162K85191j81504
$$ plain form
4328 79200771 77892948 76166164 74565078 73401714 72185611 71020484 69665679 67788638
4320 67788638 66420423 64818732 63068626 61941423 60636591 58950065 57322612 56312600
4312 56312600 54686308 53113031 51721561 49999744 48488926 47356392 46202886 45073970
4304 45073970 43603613 42487892 41624158 40165124 39298910 38853885 37529947 36577269 35131805
4295 35131805 34438087 33554978 32890369 32252575 31119620 30631999 29890194 29517733 28710041
4286 28710041 28247595 27992916 26978860 26333476 25937396 25014325 24473341 23816288 23787132
4277 23787132 22933389 21672234 21783918 21945065 21430479 20557948 20259364 20156058 20170809
4268 20170809 19949262 19537595 19036440 19128362 18725890 18644766 18055552 18010390 18295581 18114077
4258A8114077k60058j15644j85663l89120J11009L05154j40318K38450J20153
4249A7798040k89456L1000k28761K57321m82681j47136N33420J47742j39320O9016
4239A7549185O90563M32002q2260J81809N24288K82591N36029K67222M75989M39141
4229B1296559K14955j80051M39123J45150K46796j6618J24228K72130n79378j84105
4219B1778789l91247k8911m24437n06662l1357R8634k91924j65528J81394p28330
4209A9490421n46250P56738L96038o24386J87966K8362O17981K26246M3969M7158
4199B0624243j99092J95344M46828M6887k17853q42r28834p29326p06517q1555
4189A8449283k69081r03951k98679o69217n79540K26074k47687k03439q05310
$$ plain form
4258 18114077 17854019 17738375 17552712 17163592 17274601 17579755 17439437 17677887 17798040
4249 17798040 17508584 17539584 17310823 17568144 17085463 16938327 17471747 17619489 17480169 17549185
4239 17549185 18239748 18671750 18589490 18771299 19295587 19578178 20114207 20381429 20857418 21296559
4229 21296559 21511514 21331463 21770586 21915736 22162532 22145914 22270142 22542272 21962894 21778789
4219 21778789 21387542 21358631 20934194 20427532 20396175 20494809 20202885 20037357 20218751 19490421
4209 19490421 18944171 19700909 20096947 19472561 19660527 19688889 20306870 20533116 20577085 20624243
4199 20624243 20425151 20620495 21067323 21114210 20896357 20895515 19966681 19237355 18530838 18449283
4189 18449283 18180202 17276251 16977572 16308355 15728815 15954889 15707202 15503763 14698453
4180A4698453j73983n89749j69865o65857k71017r8436n05097k26289j35787r33126
4170A0929247N19281J75934k53100j56228L5632l13358n63838J08255J28151l67355
4160A0242621L29214k83959p5203j25782k31989M2815l13173J17176l2007K24516
4150I894229k68148J54835o424p08032n51557K9715k62259N87899m59235p9338
4140H331685P5992N98617J98561n574r7766m56943K63281j48831J7581l17162
4130H459441o7597k47916P969O05828L99580M13034l96856l53513k21448P2189
4120H670711L19192P9627l67460j19801O0588l70689K5720M82442j9295K77804
4110I038839K34958o76680j66600K73854o47661K51020K07457n9505L63540n5107
$$ plain form
4180 14698453 14524470 13934721 13764856 13098999 12827982 12729546 12224449 11998160 11862373 10929247
4170 10929247 11448528 11624462 11371362 11215134 11250766 10937408 10373570 10481825 10609976 10242621
4160 10242621 10571835 10287876 10212673 10086891 9854902 9897717 9584544 9701720 9669713 9894229
4150 9894229 9626081 9780916 9774492 9066460 8514903 8544618 8282359 8870258 8411023 8331685
4140 8331685 8407677 9006294 9204855 9199281 9101515 8644572 8907853 8759022 8776603 8459441
4130 8459441 8391844 8143928 8151897 8757725 9157305 9570339 9173483 8819970 8598522 8670711
4120 8670711 8989903 9069530 8702070 8582269 8642857 8272168 8297888 8780330 8761035 9038839
4110 9038839 9273797 8597117 8430517 8704371 8056710 8307730 8515187 8455682 8819222 8764115
4100H764115K86943L50742j56412k25282n41890M49776m23275J21570L54878m68486
4090H512679j11070P80505L56228j73393M27848n0640l7881m36672J07315K21451
4080I596370n43321j34708J4230k53694o5395K93514j08192n6307N3963m27063
4070H369397o68498K60387O13850j53521l12431m21104N39121K31308o7706P7822
4060H468625m23034L2578M60362l48509K96966J22267m85371J12578J29323p3498
4050H292287N8000K29180j8865m6733P702L94899M60709K06068k37550j11787
4040I233910K73427j27213l948m1101m65879l57840J67939O3984L94497K60031
4030I397807l36578o631J78633K85476J73138K7580R7724L24770k42599k64137
$$ plain form
4100 8764115 9051058 9401800 9245388 9020106 8478216 8927992 8504717 8626287 8981165 8512679
4090 8512679 8401609 9182114 9538342 9364949 9792797 9742157 9704276 9267604 9374919 9596370
4080 9596370 9053049 8918341 8932571 8678877 8613482 8906996 8798804 8742497 8796460 8369397
4070 8369397 7700899 7961286 8575136 8421615 8109184 7688080 8227201 8458509 8390803 8468625
4060 8468625 8045591 8078169 8538531 8190022 8486988 8609255 8123884 8236462 8365785 8292287
4050 8292287 8350287 8579467 8560602 8513869 8521571 8916470 9377179 9583247 9345697 9233910
4040 9233910 9507337 9380124 9376176 9335075 8869196 8511356 8679295 8743279 9137776 9397807
4030 9397807 9061229 9054598 9233231 9518707 9691845 9719425 9817149 10141919 9899320 9635183
4020I635183L63464q161m5459j21907K09949L94797J99836m57539J38718M29776
4010A0738657J41155j55524N69052K41399J98965K3752N8379l73312P359O26495
4000A2076377k44121m66113M20062N68379p9048N3537J26942J89295k83502M27814
3990A2789622j50923n90071M77572N04474n10195J73950J35360P9889O2594M95529
3980A3467801N3944m69167k36869L97823R7066n4302N63903K40803k9961L9814
3970A4070855R7326k30669J73460J30771N5931j84094m8212L61653O50967k43023
3960A4834965k71901M16994M03367m67049L45230k3342j2899J16940K55750M60763
3950A6058818M24147m4022J60099J80659l33690J94962k78126j51482L02922P0882
$$ plain form
4020 9635183 9998647 9990486 9945027 9823120 10033069 10427866 10627702 10170163 10308881 10738657
4010 10738657 10879812 10724288 11293340 11534739 11733704 11757456 11815835 11442523 11449882 12076377
4000 12076377 11832256 11366143 11786205 12354584 12275536 12329073 12456015 12645310 12361808 12789622
3990 12789622 12638699 12048628 12526200 13030674 12520479 12694429 12829789 12909678 12972272 13467801
3980 13467801 13521745 13052578 12815709 13213532 13310598 13256296 13820199 14061002 14031041 14070855
3970 14070855 14168181 13937512 14110972 14241743 14297674 14113580 14065368 14427021 15077988 14834965
3960 14834965 14563064 14980058 15383425 14916376 15261606 15238264 15225365 15342305 15598055 16058818
3950 16058818 16482965 16438943 16599042 16779701 16446011 16640973 16362847 16211365 16514287 16585169
3940A6585169J02339Q8847Q57857L95953o979n485k45742R66953p3736N8377R92449
3929A9716002O4058m8885j61932l00512M99865L76273O47962M4513K74522M9163
3919B1161029L85650J30323M50373K12697J33832L43079M77067M70039L79468
3910B4143557K5495O42632L15815R0099p8448L95253K92043k16646N34418Q60071
3900B7004289N23538N1671J79545j61122Q30945P50159j1384O72876M57121J13965
3890C0411603L18203K40142P32605N66518M91491R8927O18008L80217L44363Q17105
3880C5019182L37223L8052N32873N24344k6803M29651q6661L45437N28411L44161
3870C7985870M25495P43686M4709O1105R61673j0926K71060K43269L37279Q39673
$$ plain form
3940 16585169 16687508 16776355 17634212 18030165 18023186 18017701 17771959 18738912 18665176 18723553 19716002
3929 19716002 19780060 19731175 19569243 19268731 19768596 20144869 20792831 20837344 21111866 21161029
3919 21161029 21546679 21677002 22127375 22340072 22473904 22816983 23294050 23764089 24143557
3910 24143557 24169052 24811684 25127499 25217598 25139150 25534403 25826446 25609800 26144218 27004289
3900 27004289 27527827 27579498 27759043 27597921 28428866 29179025 29167641 29840517 30297638 30411603
3890 30411603 30729806 30969948 31702553 32269071 32760562 32859489 33477497 33857714 34202077 35019182
3880 35019182 35356405 35394457 35927330 36451674 36424871 36854522 36767861 37113298 37641709 37985870
3870 37985870 38411365 39155051 39199760 39260865 40222538 40211612 40482672 40725941 41063220 41902893
3860D1902893N52208j8637O45210P24467P25863Q04038N53796P38212Q57625R64824
3850D8450499J150905R96831R39972P43003J642558J481805J522884J335480J433618
3841E9697555J763864J522835K072397K326203K328813J851132K167074K134107
3833G5863980J753407K513517K548681J865831K057857K296943J881671K363863
3825I3145750K411321K597703J263346P10900J781469J832323J847295J449718
3817A07039825J160820Q66481K00540Q00594O27252K32698K76377n43969o09604
3808A10051014q07792p71509j069420j121553j179578j396814j425237j536537
3800A00742574j252193j310635j757406j065979j646568j732208j779286k209255
$$ plain form
3860 41902893 42455101 42436464 43081674 43806141 44532004 45336042 45889838 46628050 47485675 48450499
3850 48450499 49601404 50598235 51538207 52281210 53923768 55405573 56928457 58263937 59697555
3841 59697555 61461419 62984254 65056651 67382854 69711667 71562799 73729873 75863980
3833 75863980 77617387 80130904 82679585 84545416 86603273 88900216 90781887 93145750
3825 93145750 95557071 98154774 99418120 100129020 101910489 103742812 105590107 107039825
3817 107039825 108200645 109067126 109267666 110068260 110695512 110928210 111204587 110660618 110051014
3808 110051014 109243222 108471713 107402293 106280740 105101162 103704348 102279111 100742574
3800 100742574 99490381 98179746 96422340 95356361 93709793 91977585 90198299 87989044
3792H7989044j368224j946426j643728j349571k211681k310382k233219k099181
3784G2826632j342519q53088j371281j588527j373366j344071j174644j037507
3776F2741629j022324q60867m51932o80778k39381K14214m57323j6090O6718J10124
3766E9403990l09228l54270p0370L62476M40220M3271J29712K36861k20532o14041
3756E9048089n59163J57453K65625J35637l45236o10508l86939k56891l26677
3747E7121390n27984L23220K90111n10449p01859k67014l27041m69272m60110
3738E4470992l79944k29280o6050m75069m96708j73281r0760P15012M79959l66631
3728E3388240j37594J88230L99405Q45339L88121J49069P85816L55281P24575
$$ plain form
3792 87989044 86620820 84674394 83030666 81681095 79469414 77159032 74925813 72826632
3784 72826632 71484113 70631025 69259744 67671217 66297851 64953780 63779136 62741629
3776 62741629 61719305 60858438 60406506 59725728 59486347 59700561 59243238 59227148 59293866 59403990
3766 59403990 59094762 58740492 58670122 59032598 59472818 59516089 59645801 59882662 59662130 59048089
3756 59048089 58488926 58646379 58912004 59047641 58702405 58091897 57704958 57448067 57121390
3747 57121390 56593406 56916626 57206737 56696288 55994429 55727415 55400374 54931102 54470992
3738 54470992 54091048 53861768 53795718 53320649 52823941 52650660 52559900 53274912 53754871 53388240
3728 53388240 53250646 53438876 53838281 54683620 55071741 55220810 56006626 56361907 57086482
3719E7086482L03560R20957J011513P95806O46644J259803J090525R46157J304953
3710F5366400P65892R82240P19935J373604J589959J176329J038910J520433J292064
3701G5825766J387120N41776J723661J051280O20892P72271J234018N63731N66926
3692H4287441R75698O48658J92812K45161L62008j93043J2763K04864K96530q1194
3682H6951698J41902k54144L16304L19424m59767k60343K73601J98841O01189
3673H7828705O86602L38891J55927R73166J335112J350922R58920J371365R38291
3664I5937901J197515K117086J642868J867873J773616K307595K312369K371399
3656A11528222K665733K329831K896499L033639L441815K590062L190732L994374
$$ plain form
3719 57086482 57390042 58310999 59322512 60118318 60764962 62024765 63115290 64061447 65366400
3710 65366400 66132292 67114532 67834467 69208071 70798030 71974359 73013269 74533702 75825766
3701 75825766 77212886 77754662 79478323 80529603 81150495 81922766 83156784 83720515 84287441
3692 84287441 85263139 85911797 86104609 86349770 86711778 86518735 86531498 86736362 87032892 86951698
3682 86951698 87093600 86839456 87155760 87475184 87015417 86755074 87028675 87227516 87828705
3673 87828705 88515307 88854198 89010125 89983291 91318403 92669325 93628245 94999610 95937901
3664 95937901 97135416 99252502 100895370 102763243 104536859 106844454 109156823 111528222
3656 111528222 114193955 116523786 119420285 122453924 125895739 128485801 131676533 135670907
3648A35670907L710894L277776L480006L457682L597318M496930L815445L094510
3640A64601468L552405L803779L658031L093563L547875L361793L466219M309401
3632A93394534L624002L669251M592696M929723M576520M914618N348798N280252
3624B30330394N699610N750824N646627O067010N867484N347160N524861N523677
3616B75757647N101276M008019L973151L988171L383283K206944J364446J682896
3608C01465833Q99783J012767Q65202Q51258L98901R74738O45696K51075K61187
3599C07626440R87403J328806P50516J178500J630028J680591J369885J230239
3591C17782408J577109J670029J066799Q47582P45782J276800J008423J202792
$$ plain form
3648 135670907 139381801 142659577 146139583 149597265 153194583 157691513 161506958 164601468
3640 164601468 168153873 171957652 175615683 178709246 182257121 185618914 189085133 193394534
3632 193394534 197018536 200687787 205280483 210210206 214786726 219701344 225050142 230330394
3624 230330394 236030004 241780828 247427455 253494465 259361949 264709109 270233970 275757647
3616 275757647 280858923 284866942 288840093 292828264 296211547 298418491 299782937 301465833
3608 301465833 302365616 303378383 304243585 305094843 305493744 306468482 307114178 307365253 307626440
3599 307626440 308613843 309942649 310693165 311871665 313501693 315182284 316552169 317782408
3591 317782408 319359517 321029546 322096345 322943927 323689709 324966509 325974932 327177724
3583C27177724J096772J635334J600149J515829K826102K991415K806706L001721
3575C44651752L647206L211094L761454L054128L154946K593890J696604J009516
3567C66780590J61915o09172j231771j478473k913925k764615l491138m156225
3559C50297186m541486m736872m704513n447154o246220n917420o550647o655272
3551C05497602p578384q142122q413870q540489q996449r652295r162537r359387
3543B35652069q639073q460597q689364q553562p677913p423007p337729p063664
3535A71807160o157423n734852n808012n497322n025293m432590m721854m158891
3527A30270923l153770l280321k971582k617213k789376k381531k025016j734279
$$ plain form
3583 327177724 328274496 329909830 331509979 333025808 335851910 338843325 341650031 344651752
3575 344651752 348298958 351510052 355271506 358325634 361480580 364074470 365771074 366780590
3567 366780590 366942505 366333333 365101562 363623089 360709164 357944549 354453411 350297186
3559 350297186 345755700 341018828 336314315 330867161 324620941 318703521 312152874 305497602
3551 305497602 297919218 289777096 281363226 272822737 263826288 254173993 245011456 235652069
3543 235652069 227012996 218552399 209863035 201309473 193631560 186208553 178870824 171807160
3535 171807160 165649737 159914885 154106873 148609551 143584258 139151668 134429814 130270923
3527 130270923 127117153 123836832 120865250 118248037 115458661 113077130 111052114 109317835
3519A09317835j722969j590393j730867q13984q75660j302861q1206p78894q58778
3510I9562223j171609q26434k58181o67252j141264l44672q81727j292816r14592
3501I2063676r76240j158146j358229p15741q34500j016050j019966j081258o16018
3492H3287528j223325r44306q59549r50634p87760q73259p63625j069908k06365
3483G5608797n52625r26156o01762Q0929K9480n32105o07472K60524m00890Q9550
3473G2448270K27534n26895K55342j5122L76967J155246Q5027N35097O19390M35052
3463G5595908N31215j96309M5858J42947Q30908J147448l7034J17616J210373
3454G9388930J183745L28866R36830J161881L86956Q46050P35127J116169J299906
$$ plain form
3519 109317835 107594866 106004473 104273606 103459622 102583962 101281101 101199895 100421001 99562223
3510 99562223 98390614 97564180 97305999 96638747 95497483 95152811 94271084 92978268 92063676
3501 92063676 91087436 89929290 88571061 87855320 87020820 86004770 84984804 83903546 83287528
3492 83287528 82064203 81119897 80260348 79309714 78521954 77648695 76885070 75815162 75608797
3483 75608797 75056172 74130016 73528254 73609183 73638663 73106558 72499086 72759610 72358720 72448270
3473 72448270 72675804 72148909 72404251 72389129 72766096 73921342 74006369 74541466 75160856 75595908
3463 75595908 76127123 75930814 75976672 76119619 76950527 78097975 78060941 78178557 79388930
3454 79388930 80572675 80901541 81838371 83000252 83387208 84233258 84968385 86084554 87384460
3445H7384460J066735J302453J073371O57733J164697J464254J207679J213873
3437I6535255P11616J114167O90636P86169L70051K35859Q30374R45022K70825
3428A02489974O94730O97490J97966L94833J048998Q03288P96961R88613J255636
3419A09368489J090089P97352J417086J307183J047716J698195J654905P22143
3411A19103158J106932J054127P34614P29818M11117n5275n9204o60188o41363
3402A21723736j031351j237643k035395j430034j699991j442458j600897j401496
3394A09844471j869998r81334j380499q87303p89440n48997m66297k52069n02056
3385A02166478r99678o23090j079042q02433j546393j514042k009462j901981
$$ plain form
3445 87384460 88451195 89753648 90827019 91484752 92649449 94113703 95321382 96535255
3437 96535255 97246871 98361038 99051674 99837843 100207894 100443753 101274127 102219149 102489974
3428 102489974 103184704 103882194 104080160 104474993 105523991 106327279 107124240 108112853 109368489
3419 109368489 110458578 111255930 112673016 113980199 115027915 116726110 118381015 119103158
3411 119103158 120210090 121264217 121998831 122728649 123139766 123084491 123025287 122365099 121723736
3402 121723736 120692385 119454742 117419347 115989313 114289322 112846864 111245967 109844471
3394 109844471 107974473 106993139 105612640 104725337 103935897 103386900 102920603 102668534 102166478
3385 102166478 101166800 100543710 99464668 98662235 97115842 95601800 93592338 91690357
3377I1690357k108626k820869l020224k705259k887655k527365l341051k741399
3369F9537909k378794k272066k897724k735522j712172j488429j871584j926032
3361E2255586j340987j582528j067780j087153j079666j256634r61057j046591
3353D2833190m98090p71480n39022j34576o38679q59986j043640l52221j34683
3344C7860813l59510M77394m527o46906R4882l26690P4534k19269k13308O10289
3334C7347702O09050Q6463K763P0174J16060L18909M11019n7323L90447k20323
3324C9074941k51750k10681Q2016j25890l05691p18768k52984p17363r40565J99247
3314C5832512p34262o62363l61501m25862p7063k23493l34766j16138j52242J94897
$$ plain form
3377 91690357 89581731 86760862 83740638 81035379 78147724 75620359 72279308 69537909
3369 69537909 67159115 64887049 61989325 59253803 57541631 56053202 54181618 52255586
3361 52255586 50914599 49332071 48264291 47177138 46097472 44840838 43879781 42833190
3353 42833190 42335100 41563620 41024598 40890022 40251343 39391357 38347717 37995496 37860813
3344 37860813 37501303 37978697 37974170 37327264 37422146 37095456 37169990 36950721 36737413 37347702
3334 37347702 37956752 38043215 38045978 38116152 38232212 38551121 38962140 38904817 39295264 39074941
3324 39074941 38823191 38612510 38694526 38568636 38262945 37544177 37291193 36573830 35633265 35832512
3314 35832512 35098250 34435887 34074386 33648524 33571461 33347968 33013202 32897064 32744822 32939719
3304C2939719j10007k98068N1839o8656j08924J012125N09204k27319J23694J34134
3294C3957741k60925m4871J60905J38432k76894m66688Q77217K99151P8242N416
3284C4467726n47581l52501j41220K56304K96841J68491M03771J76169L71289
3275C5099289K26577O59321K51029J82831J30713M00941Q00563L17752Q79106
3266C8948122P49511Q86237P48229K21373R14724J401614R85975J310780O74165
3257D6840730L96837J062587J226980J273537Q12044J368205J614525J465521
3249E6060966J277140J430610J512576J615604K090493J911795K161250K072154
3241G0132588J639632J937195K187905K045420K287024J614940J850903K245230
$$ plain form
3304 32939719 32829712 32531644 32583483 32514827 32405903 33418028 33927232 33699913 33823607 33957741
3294 33957741 33696816 33651945 33812850 33951282 33674388 33207700 34084917 34384068 34462310 34467726
3284 34467726 33920145 33567644 33426424 33682728 33979569 34148060 34551831 34728000 35099289
3275 35099289 35325866 35985187 36236216 36419047 36549760 36950701 37751264 38069016 38948122
3266 38948122 39697633 40583870 41332099 41553472 42468196 43869810 44855785 46166565 46840730
3257 46840730 47237567 48300154 49527134 50800671 51612715 52980920 54595445 56060966
3249 56060966 57338106 58768716 60281292 61896896 63987389 65899184 68060434 70132588
3241 70132588 71772220 73709415 75897320 77942740 80229764 81844704 83695607 85940837
3233H5940837K722645K244703K647214L091177L052080L140871L518046L507004
3225A09864577M018502M003593M431357L866694L886051M056061M047551L998169
3217A42172555M426841M954518M719354M893269O215282O526052O863455P409689
3209A88181015Q092733R870758J0112903J1100912J0629901J0738667J0825849
3202B59552738R074726P935628O845467O617261O851878N746454O998066O884354
3194C16506572N277011M566340K575303R48741j73527j560440k277372k597789
3186C23264839j915971j777513j834756j924452j610132r83485q28308k40015
3178C12150207k27670J166926J621483L006896L545374L787354N287827O800569
$$ plain form
3233 85940837 88663482 90908185 93555399 96646576 99698656 102839527 106357573 109864577
3225 109864577 113883079 117886672 122318029 126184723 130070774 134126835 138174386 142172555
3217 142172555 146599396 151553914 156273268 161166537 167381819 173907871 180771326 188181015
3209 188181015 196273748 206144506 216257409 227358321 237988222 248726889 259552738
3202 259552738 268627464 276563092 283408559 290025820 296877698 302624152 309622218 316506572
3194 316506572 321783583 326349923 328925226 329873967 329700440 328140000 325862628 323264839
3186 323264839 321348868 319571355 317736599 315812147 314202015 313218530 312390222 312150207
3178 312150207 311922537 313089463 314710946 317717842 321263216 325050570 330338397 337138966
3170C37138966P325765Q011067R841741J1083223J2575950J3685807J4524162
3163D14186681J4881459J5901723J4493477J2006339R000676M299024j559039
3156D83210340o858902j1842538j6055284k0140702k2558732k3055668k3452679
3149C59245835k2559491k1603253k0985840j9045236j8206648j7205409j5624654
3142B24015304j5003114j3073047j2391751j0676232r593724r861669q905698
3135A44510069p910310p382432o871214n759958o095785n403268m870159m548035
3127I5668908m078219l502332l478624l193133l204940l033530l059815k043637
3119G0074678k229101k889731k422479k099994j939055j709280j766857k097399
$$ plain form
3170 337138966 344464731 352475798 362317539 373400762 385976712 399662519 414186681
3163 414186681 429068140 444969863 459463340 471469679 480470355 484769379 483210340
3156 483210340 476351438 464508900 448453616 428312914 405754182 382698514 359245835
3149 359245835 336686344 315083091 294097251 275052015 256845367 239639958 224015304
3142 224015304 209012190 195939143 183547392 172871160 163277436 153415767 144510069
3135 144510069 136599759 129217327 122346113 116586155 110490370 105087102 100216943 95668908
3127 95668908 91590689 88088357 84609733 81416600 78211660 75178130 72118315 70074678
3119 70074678 67845577 64955846 62533367 60433373 58494318 56785038 55018181 52920782
3111E2920782j826935j916280j250333j562238j930367j363160j588952j365492
3103D0117025r38342j102001r43658j278187r87039l98378r06664q97758r22089
3094C1742909q88005m94388l31816o61553j202236r31442k43208q45323p92713
3085B5352225n95391l17965k21895n00029m74491j039952J36583q14526m99507
3076B1025052n9354m00239k76316k73808k50640m02799p38703k05533m97661L00024
3066A8220023o55991n27796n90035p6077l37448l35850M3823r5232n67778j100633
3056A3977006N4856l93530j84596m04250K38148L04735j01585l44010q3653m71660
3046A2591461J09017J55739l14785n28054j98069J26978K2020m59364l9292m03962
$$ plain form
3111 52920782 51093847 49177567 47927234 46364996 44434629 43071469 41482517 40117025
3103 40117025 39178683 38076682 37133024 35854837 34867798 34469420 33562756 32664998 31742909
3094 31742909 30854904 30360516 30028700 29367147 28164911 27233469 26990261 26144938 25352225
3085 25352225 24756834 24438869 24216974 23716945 23242454 22202502 22339085 21524559 21025052
3076 21025052 20965698 20565459 20289143 20015335 19764695 19361896 18623193 18417660 17919999 18220023
3066 18220023 17564032 17036236 16446201 16370124 16032676 15696826 15740649 15645417 15077639 13977006
3056 13977006 14031862 13638332 13453736 13049486 13287634 13592369 13490784 13146774 13063121 12591461
3046 12591461 12700478 12856217 12541432 12013378 11815309 11942287 11964307 11504943 11465651 11061689
3036A1061689l21815l07100j43327k22604L39880n5672p2875m93161k41782M12058
3026I955291m87695j53628p6570K18999l43287j73619k99204l38701M28435M00288
3016I130309o16637j19652J79374J11283j13045o3271L7943q06048Q890j30129
3006G619017k05399N7099o2591O11255j07964j47802n28302r8879P5008Q5605
2996G297047K53545k28604N8801n07504k49431L09625k48065J61719J09534M27379
2986G384046K65836l0500m42620m17589o6559K64218L96213n31535l24284N42044
2976G039270J14337j67566K49218J33401r6694q0750l67160P0698J60141j36075
2966F918820k02065J02715L27610o54877n321M80820N71138l87364p25571M06917
$$ plain form
3036 11061689 10739874 10432774 10289447 10066843 10406723 10351051 10278176 9785015 9543233 9955291
3026 9955291 9467596 9313968 9237398 9456397 9113110 8939491 8640287 8301586 8730021 9130309
3016 9130309 8513672 8394020 8573394 8684677 8571632 8508361 8546304 7740256 7749146 7619017
3006 7619017 7413618 7470717 7408126 8019381 7911417 7763615 7235313 7136434 7211442 7297047
2996 7297047 7550592 7321988 7380789 6873285 6623854 6933479 6685414 6847133 6956667 7384046
2986 7384046 7649882 7619382 7176762 6759173 6692614 6956832 7353045 6821510 6497226 7039270
2976 7039270 7153607 6986041 7235259 7368660 7271966 7191216 6824056 6894754 7054895 6918820
2966 6918820 6716755 6819470 7147080 6492203 6486882 6967702 7538840 7151476 6425905 6832822
2956F832822M25305J67809P9199k68830j79622P78038L9074m03127l40117N5256
2946G185807J69382J18580L80491J88231q0005k4893k12216m93270N26312R2047
2936G850466l78619K4372K08359M09320O4765q1828j51320m11109m3820l6885
2926G453701K11005N053L30342l25661N6496K86398l66761N69799P23882l38032
2916H606222q2577J59637m21792K13752K03699J48717o3129J20742l41589k82821
2906H260861K94981o99747J65301J65420j45581J2729k71362l28976m88121J94568
2896G160073J62252l60781k53383O81908P5023m58000K55655N49473k50617k52666
2886G308937M56686n87750k58620l1670L73394k6695N66824k17688J70686J50174
$$ plain form
2956 6832822 7258127 7425936 7505135 7236305 7056683 7834721 7873795 7470668 7130551 7185807
2946 7185807 7355189 7473769 7854260 8042491 7962486 7937593 7725377 7232107 7758419 7850466
2936 7850466 7471847 7496219 7704578 8113898 8178663 8096835 7945515 7534406 7490586 7453701
2926 7453701 7664706 7669759 8000101 7674440 7730936 8017334 7650573 8220372 8944254 8606222
2916 8606222 8523645 8683282 8261490 8475242 8678941 8827658 8764529 8885271 8543682 8260861
2906 8260861 8555842 7856095 8021396 8186816 8041235 8053964 7782602 7453626 6965505 7160073
2896 7160073 7322325 6961544 6708161 7390069 7465092 7007092 7262747 7812220 7561603 7308937
2886 7308937 7765623 7177873 6919253 6887583 7260977 7234282 7801106 7583418 7754104 7904278
2876G904278j31798n6347o94578j43572J39336P4835q22377l15588j37754N65134
2866F381569J58315k72158o5661l92006l71165l69609o6658J2934j24016J07633
2856D999178o147k41514m25298Q0723j43423K5494k55912o11488k93089l5917
2846C092607M11726K99356k42037K59441j65855q40054L72466K77062j50168N8180
2836C372724o7100j40591J4601l25931l22016J74097j15993n29554J99724k30785
2826B029176k46791N64884K86235j13025L50575k40773m85639J75782J92424K73184
2816B786032J0744k61316j06914j64964k23821k78798k93464O06790J1725M14526
2806B500540o5464l23284l97919L18386l89440K1185N47159J4882l82913j98419
$$ plain form
2876 7904278 7772480 7716133 7021555 6877983 7017319 7092154 6269777 5954189 5816435 6381569
2866 6381569 6539884 6267726 6202065 5810059 5438894 5069285 5002627 5015561 4891545 4999178
2856 4999178 4993031 4751517 4326219 4406942 4263519 4289013 4033101 3421613 3128524 3092607
2846 3092607 3504333 3803689 3561652 3821093 3655238 2815184 3187650 3464712 3314544 3372724
2836 3372724 3305624 3165033 3179634 2853703 2531687 2705784 2589791 2060237 2259961 2029176
2826 2029176 1782385 2347269 2633504 2520479 2871054 2630281 2144642 2320424 2512848 2786032
2816 2786032 2796776 2535460 2428546 2263582 2039761 1760963 1467499 2074289 2086014 2500540
2806 2500540 2435076 2111792 1713873 2032259 1642819 1664004 2211163 2226045 1843132 1644713
2796A644713p7562J09782Q4197O21795N2289o59615R9430l78221M24351P5887
2786A997046J9777m1827m56732J13060K43478J16665l5121j2547J38692R6877
2776B179368j33062m87555L00748l4912L84668k95899o24487j54422J93484M75649
2766A803580k01493j81860J32217L44631j0754k86551M51504n4295k19923l8052
2756A739004q5689L3031N556j30276k49515P8720K75953j7288l06266L53410L07932
2745B004572J57365k58222l13804J33683J62743L23772J06522m63791M9424p51633
2735A150631Q31968p7631p21288P546J69782l212M31940J09928l10605K22001
2725A811060o9950n4429n24096m9229M75007J88445l41414K99077N4618J72473
$$ plain form
2796 1644713 1567151 1676933 1761130 2382925 2435214 1775599 1875029 1496808 1921159 1997046
2786 1997046 2016823 1974996 1518264 1631324 1874802 1991467 1956346 1943799 2082491 2179368
2776 2179368 2046306 1558751 1859499 1824587 2209255 1913356 1288869 1134447 1327931 1803580
2766 1803580 1602087 1420227 1552444 1897075 1886321 1599770 2051274 1996979 1777056 1739004
2756 1739004 1653315 1686346 1691902 1561626 1312111 1390831 1666784 1649496 1343230 1696640 2004572
2745 2004572 2161937 1903715 1589911 1723594 1886337 2210109 2316631 1852840 1902264 1150631
2735 1150631 1982599 1904968 1183680 1191226 1361008 1357796 1789736 1899664 1589059 1811060
2725 1811060 1741110 1686681 1162585 1113356 1588363 1776808 1435394 1734471 1789089 1961562
2715A961562l12675j22720L93717N1417Q1367J33683n24107P19187L6239p0371
2705B347299J17635J25660l7227L93726k44153l83161L98211M51576k40423l4297
2695B894846j030752l72263J60395K2804j93532k62524J13732L06008M03966J55121
2685B197801j97761k49582j79821L51318J90535o06257j19515k07244L89573N2198
2675A621245j094j85060J96007M48951m9666p81546L84417J288o1931J49865K57227
2664A979703k25551k03123n3606K18682m4238n19404k62289K25546k37116L29949
2654A208553j95656O9217N74649K61262k49065j86025N49776l0877l67039n49867
2644A084928J63102K48874L29005n21390q5528m9715n3113k4032K05881m38684
$$ plain form
2715 1961562 1648887 1526167 1919884 1971301 2052668 2186351 1662244 2381431 2417670 2347299
2705 2347299 2464934 2590594 2553367 2947093 2702940 2319779 2717990 3169566 2929143 2894846
2695 2894846 1864094 1491831 1652226 1675030 1481498 1218974 1332706 1638714 2042680 2197801
2685 2197801 2000040 1750458 1570637 1921955 2112490 1506233 1386718 1179474 1569047 1621245
2675 1621245 1620151 1435091 1631098 2080049 2030383 1248837 1633254 1634542 1572611 1722476 1979703
2664 1979703 1754152 1551029 1497423 1716105 1671867 1152463 890174 1115720 878604 1208553
2654 1208553 1012897 1082114 1656763 1918025 1668960 1482935 2032711 2001834 1634795 1084928
2644 1084928 1248030 1496904 1825909 1304519 1218991 1169276 1116163 1092131 1298012 859328
2634H59328M27972M0081K4362P8785J5248O68055l23152m61927K63477J3931o96732
2623I09428K53768J15768j50443J70212J48151K36384L59883j12528n71320J13333
2613A472636J10436m69665P9113J09680K4439p7213M39538m5375n9631j87087
2603A396871L30479J36594j38444Q9440l17345k00835K34444j63589J58352O756
2593A532723J94194L66707n27617k05576O47252j26152L6473J35057k52860k50870
2583A549331j78802O30080O1574J51601J30653o00613P3024L30812n5209J21246
2573B213697m43643m59283M14667J132K92709L39056n11733L8270M47558J02303
2563B434733m38349N8127O79461l75749r1231j38472j04249J53412J72477L80795
$$ plain form
2634 859328 1287300 1327381 1351743 1430528 1445776 2113831 1790679 1328752 1592229 1606160 909428
2623 909428 1163196 1278964 1128521 1298733 1446884 1683268 2043151 1930623 1359303 1472636
2613 1472636 1583072 1113407 1192520 1302200 1326639 1249426 1688964 1643589 1583958 1396871
2603 1396871 1727350 1863944 1725500 1814940 1497595 1296760 1531204 1367615 1525967 1532723
2593 1532723 1726917 2093624 1566007 1360431 2007683 1881531 1918004 2053061 1800201 1549331
2583 1549331 1370529 2000609 2062183 2213784 2344437 1743824 1816848 2147660 2092451 2213697
2573 2213697 1770054 1310771 1725438 1726570 2019279 2358335 1846602 1884872 2332430 2434733
2563 2434733 1996384 2054511 2733972 2358223 2266992 2128520 2024271 2177683 2350160 2730955
2553B730955k04674k57500p17960J4013K90872N38472J17536j31550L02371l28761
2543B353774q3850L41058J34126l22429K82014J87519m47381j02586L2845L87464
2533B762554O27771l1245n73604L21135L87972Q3463j08618o9421N3978j3128
2523C440857L85182j25223m63337P38006J80415J00985m37995j42934R3540N31658
2513D301154R0341P59459o33951o34487N21941M32346j16200l04389L60906K32399
2503E009519P765L21811L2563J89158M84349K84761K74282M62403K35025L76959
2493G678595L49422j04367L91811N30255N84744j86344L48993M38174J025280
2484A1056563O14248O16676L12478J157760J021469J252152J303303J263191R84760
$$ plain form
2553 2730955 2526281 2268781 1550821 1564834 1855706 2394178 2511714 2380164 2682535 2353774
2543 2353774 2269924 2610982 2745108 2422679 2704693 2892212 2444831 2342245 2375090 2762554
2533 2762554 3390325 3359080 2785476 3106611 3494583 3578046 3469428 3400007 3453985 3440857
2523 3440857 3826039 3700816 3237479 3975485 4155900 4256885 3818890 3675956 3769496 4301154
2513 4301154 4391495 5150954 4517003 3882516 4404457 4836803 4720603 4416214 4777120 5009519
2503 5009519 5017284 5339095 5371658 5560816 6045165 6329926 6604208 7066611 7301636 7678595
2493 7678595 8028017 7923650 8315461 8845716 9430460 9244116 9593109 10031283 11056563
2484 11056563 11670811 12287487 12599965 13757725 14779194 16031346 17334649 18597840 19582600
2475A9582600J500803Q43573J430056N57028N32315L33039Q85882J329045M05608
2466B7399949J137235J003767R23690K257927J331250J102683K294245J526364
2458C8977110K407510K338927K779750K713290L118373L575393L759895M624986
2450F4295234M745009M511544N239045N185732N683561O599665Q207246Q258843
2442A12725879R459109J0793846J2394307J5836379J9137730K2068509K3483640
2435B25899399J6830969P542886l033491j5889833k2992633k3456374j9513910
2428A65387013j7222208j4635995j2636663j2470369j1433686r491155q206622
2421G9290315o330977n566860o131130m791364m384718m606427l860447l665322
$$ plain form
2475 19582600 21083403 21926976 23357032 23914060 24446375 24779414 25665296 26994341 27399949
2466 27399949 28537184 29540951 30464641 32722568 34053818 35156501 37450746 38977110
2458 38977110 41384620 43723547 46503297 49216587 52334960 55910353 59670248 64295234
2450 64295234 69040243 73551787 78790832 83976564 89660125 96259790 104467036 112725879
2442 112725879 122184988 132978834 145373141 161209520 180347250 202415759 225899399
2435 225899399 242730368 250273254 247239763 231349930 208357297 184900923 165387013
2428 165387013 148164805 133528810 120892147 108421778 96988092 87496937 79290315
2421 79290315 72959338 67392478 61261348 56469984 52085266 47478839 43618392 39953070
2413C9953070l280699k591317k336292k375113j622251j314785j671562j394829
2405B3366222j276453j393746j347186k70771j120568o67384r86211p31491o06779
2396A4965633p61795n57856o34261m04477k07627j059215k95227l92489p08493
2387I944193k25901k88615k15321l60318K65499m40465j56886n70816l48105m520
2377G598745m07590m45523j83172K66914l47706n07356J29504l02846J67947m25860
2367E543057j43927j86150k65525j36427N5711j34435j19970k35280n76509l6320
2357C764225Q9743K47279j79323k32147O127j83619N71886n57448l26780m5987
2347C153956J25716K70834k95054k8162j04347j39612k34605l98716L06696J63655
$$ plain form
2413 39953070 36672371 34081054 31744762 29369649 27747398 26432613 24761051 23366222
2405 23366222 22089769 20696023 19348837 19078066 17957498 17290114 16303903 15572412 14965633
2396 14965633 14203838 13645982 13011721 12607244 12399617 11340402 11045175 10652686 9944193
2387 9944193 9718292 9429677 9214356 8854038 9119537 8679072 8522186 7951370 7603265 7598745
2377 7598745 7191155 6745632 6562460 6829374 6481668 5974312 6103816 5800970 5968917 5543057
2367 5543057 5399130 5212980 4947455 4811028 4866739 4732304 4612334 4377054 3800545 3764225
2357 3764225 3853968 4101247 3921924 3689777 3695904 3512285 4084171 3526723 3199943 3153956
2347 3153956 3279672 3550506 3255452 3227290 3122943 2983331 2748726 2350010 2656706 2820361
2337B820361J21495J134n17642k59904M6774k832K45434j30343K20934q8143l79177
2326B078091O4208K07570K17338j85095J08307k23968J5386N8693k25748k58548
2316A856234M93449j1550m50485J7719j53251m05736k05788j93518J33756O8230
2306A149060P92371K95735n13583m42687P4948J90409j3077J79854j88021M39
2296A525448r2997l69748j06604k6210J38902J95242j13114O3166J50539n28469
2286H36155K63986M81333l7029L7332k70725J3620L12899n67879k70382k31514
2276E67796j79199L35892L02573j3446R5885M60770k85761l97300J13546k23416
2266G77340N0208j08506m64631M1959P4178J34395K08241j49109O7457n1822L08532
$$ plain form
2337 2820361 2941856 2942990 2425348 2165444 2212218 2209386 2454820 2324477 2545411 2457268 2078091
2326 2078091 2142299 2349869 2567207 2382112 2490419 2266451 2281837 2340530 2114782 1856234
2316 1856234 2349683 2338133 1887648 1905367 1752116 1346380 1140592 947074 1080830 1149060
2306 1149060 1941431 2237166 1723583 1280896 1355844 1546253 1533176 1713030 1525009 1525448
2296 1525448 1432451 1062703 956099 929889 1068791 1264033 1150919 1214085 1364624 836155
2286 836155 1100141 1581474 1544445 1581777 1311052 1324672 1637571 1069692 799310 567796
2276 567796 388597 724489 1027062 1013616 1109501 1570271 1284510 887210 1000756 777340
2266 777340 827548 719042 254411 296370 370548 504943 713184 564075 631532 579710 888242
2255H88242J07953K72111m369o227m0495k46302k02838k7914L02560Q953K3523
2244A075197l60442o5158m38576K10445K37971q1213M86397l65762m59722P1472
2234C10609K16316Q764k04291M4058N32392M62872m47295k3452j69647r4804M8398
2223F83920q9725M40095j14420q7307l00749J88384J64699J96398m09731j22290
2213E49274K68513r6235L2376l45927J61634K68877L62668n04910L84383k64973
2203H15680k99891K10592O7752l05064J1045J40215J82301k29517j12805K8218
2193E08526O2903p1594J63790K51658M2756Q4627O103j25699j46734L99839o4082
2182A112093L16298l41987J48254J97640n4900n9555m11359L55901K48428l84509
$$ plain form
2255 888242 996195 1268306 1263937 1257710 1217215 970913 768075 740161 1042721 1051674 1075197
2244 1075197 714755 649597 211021 421466 659437 578224 1064621 698859 239137 310609
2234 310609 526925 535689 331398 375456 907848 1370720 923425 899973 730326 635522 683920
2223 683920 594195 1034290 919870 832563 531814 720198 884897 1081295 671564 549274
2213 549274 817787 721552 753928 408001 569635 838512 1201180 696270 1080653 815680
2203 815680 515789 726381 794133 489069 500114 640329 822630 593113 480308 508526
2193 508526 571429 499835 663625 915283 958039 1042666 1048769 923070 776336 1176175 1112093
2182 1112093 1428391 1086404 1234658 1432298 1377398 1317843 906484 1262385 1510813 1126304
2172A126304j02594j14297n3728O08292O1441J40609l62700J75051M79045l12232
2162A645191o7004R8629K1235k03134k4373l55184m65797M31571L39319k72273
2152A148180n65470K46137L41487o53624R3415K12060J72681m94864K59535k22429
2142E37108K71599m35054K37741r9828r7402J48082p85717l6764k51043M29991
2132h1287K80345J41119J59081Q3689j11511P0399j07289n3341P1124k9042J79494
2121F02781Q09j34024j59305K17282L75288M7653k69451P7404k37q4305j25969
2110E47926r52318P21434L49772j94714n09172K70264K58441J64827J87149j4363
2100H29246r4474K7702j00921j0179J73042j07030m05217m12959R3882j44091
$$ plain form
2172 1126304 1023710 909413 855685 1463977 1525418 1666027 1303327 1478378 1957423 1645191
2162 1645191 1578187 1676816 1698051 1494917 1470544 1115360 649563 1081134 1420453 1148180
2152 1148180 582710 828847 1170334 516710 610125 822185 994866 500002 759537 537108
2142 537108 808707 373653 611394 511566 414164 562246 -223471 -260235 -511278 -81287
2132 -81287 199058 340177 499258 582947 471436 541835 434546 381205 452329 423287 602781
2121 602781 603590 469566 310261 527543 902831 950484 681033 758437 758200 673895 547926
2110 547926 -404392 317042 666814 472100 -37072 233192 491633 656460 843609 829246
2100 829246 734772 762474 661553 651374 824416 717386 312169 -100790 -6908 -150999
2090a50999q7466k34P0890M27752N10482r0645o30352J98081L3202m39194j7471
2079a75954M8415L69288j95604r0450N25770L81404J77834M96314j50130n26096
2069H60791l02037k25070p5189j94322K3548l2116N80801l54945J15176L41868
2059G38505j64800j39139J08478R5586K48581j58409m98618K33664K48177l99600
2049C12425l01088R6703l45180M02991m26215K48952P4379P49936l47069m11440
2039E4394J03141j79774Q13719P5377q3913n1224o63803j36073k24908L12637
2029A9573O06387l78628j7222M85275K42589j92061l43883R4796l05264L73449
2019E85011k80004L1938l39288k49592O13052N65424o86876k92598j68116J84513
$$ plain form
2090 -150999 -238465 -238699 -167809 259943 770425 679780 49428 247509 280711 -158483 -175954
2079 -175954 -127539 241749 46145 -44305 481465 862869 1040703 1537017 1386887 860791
2069 860791 558754 333684 258495 64173 87721 55605 636406 281461 396637 738505
2059 738505 573705 434566 543044 638630 887211 728802 230184 463848 712025 312425
2049 312425 11337 108040 -237140 165851 -260364 -11412 62967 812903 465834 54394
2039 54394 157535 -22239 791480 866857 782944 731720 67917 -68156 -293064 19573
2029 19573 625960 247332 230110 715385 957974 765913 422030 516826 211562 585011
2019 585011 305007 336945 -2343 -251935 361117 926541 239665 -52933 -221049 -36536
2009c6536L47529n66323M80619Q9122j36435n8364J06931j14098m14159o1590
1999c63304L58307O2673k6981R1484O41964l98008m99258L50536J10690m15002
1989h6899j13730L56772K64489j41579m25037N89931N07626l08844o16621j38986
1979a12878L13667o04619j61412J97563K38260N92506J95799R8552j5617l52820
1969C89001l22396K09372q5620N8370K79666J13279l35664m30139Q4479q876K39237
1958A90709p9814N9769n8344p9560J70119P16493m99300j52637k93888N9722j23193
1947h9924m1218L30796J62208m71527N25323l14605J85964K57322j30280J27560
1937E41619l28836l83125J33505P3971l63269j41069J41752q8328J87590M65340
$$ plain form
2009 -36536 310993 -255330 225289 314411 177976 119612 226543 112445 -301714 -363304
1999 -363304 -4997 57676 30695 122179 764143 366135 -133123 217413 328103 -86899
1989 -86899 -200629 156143 420632 279053 -145984 443947 951573 642729 26108 -112878
1979 -112878 200789 -403830 -565242 -367679 -129419 463087 658886 757438 741821 389001
1969 389001 66605 275977 190357 248727 528393 641672 306008 -124131 -39652 -48528 190709
1958 190709 110895 170664 112320 32760 202879 919372 420072 267435 -26453 33269 -89924
1947 -89924 -131142 199654 361862 -109665 415658 101053 287017 544339 414059 541619
1937 541619 212783 -170342 -36837 37134 -326135 -467204 -325452 -413780 -226190 239150
1927B39150l57190P9595L29433l5427j10851J37665l45317J99607O02277o4516
1917F74426k22542j55821K6137j49336L34178o2978m55747J81725j64235j70418
1907a64611j51828J39999k2671j5731J84365K70404j93612J19347n26163N26740
1897A66239J80256k31901l33467k85507N27597n5914J73440J53609l74008J59244
1887G9588L60108J59209m07436L50930l65638q2333p9266p6540k50177J42244
1877a69311j10512k22666P29459J3025k42504L33544J80009k15506j82804J15293
1867B28027K1004l18205k88176N97865k49771P7645N18700l70687j06343l30720
1857b20661L97363O1042o42816J81268N72985P7683L8061J65160j089186l64172
$$ plain form
1927 239150 -118040 -38445 290988 255561 144710 282375 -62942 136665 738942 674426
1917 674426 451884 296063 322200 172864 507042 444064 -11683 170042 5807 -164611
1907 -164611 -316439 -176440 -199111 -214842 -30477 239927 46315 165662 -360501 166239
1897 166239 346495 114594 -218873 -504380 23217 -32697 140743 294352 -79656 79588
1887 79588 439696 598905 191469 542399 176761 94428 15162 -61378 -311555 -169311
1877 -169311 -279823 -502489 226970 239995 -2509 331035 511044 295538 112734 228027
1867 228027 249031 -69174 -357350 240515 -9256 68389 587089 216402 110059 -220661
1857 -220661 176702 237744 -405072 -223804 349181 426864 464925 630085 -459101 -823273
1847h23273N8206J42832L93619J9739N3300r4415j90388Q3741K10286L9786j58059
1836b64626N41845O02132o32207j62575p0117J83866j38169l03757J98861L87158
1826C42411K91719n02230Q1345N50800p21683K4962l30131K25246N05143l7939
1816D29643k93199l0742j89256K38302P6981L6830J98869J22721k48166j51976
1806A90007k60883M5597l5942J83291N2782l31613m13484N74331J11142m73055
1796c57827M13043r5689k4439l13885n3649j46511M85946K07012l08087O03186
1786D09100R7634k06022k86483l57090K93611L03118m55237n15570n380N26839
1776a95480P2791M01217J54613n8615O1288k82301L16453j35437k6481J16843
$$ plain form
1847 -823273 -765067 -622235 -228616 -208877 -155577 -249992 -440380 -356639 -146353 -106567 -264626
1836 -264626 277219 879351 247144 84569 14452 198318 60149 -243608 -44747 342411
1826 342411 634130 131900 213245 764045 42362 67324 -262807 -37561 467582 429643
1816 429643 136444 105702 -83554 154748 231729 268559 467428 590149 341983 190007
1806 190007 -70876 -25279 -61221 122070 174852 -156761 -570245 4086 115228 -357827
1796 -357827 55216 -40473 -64912 -378797 -432446 -578957 -93011 114001 -194086 409100
1786 409100 506734 300712 14229 -342861 -49250 253868 -201369 -716939 -722319 -195480
1776 -195480 -122689 278528 433141 374526 435814 153513 469966 334529 308048 424891
1766D24891R5344l51562P8753l33325J35633K9103n4636J98596n6178j24360k59793
1755b17534p6211P09198K17508k94723j55391N59934k10621p84939n0098L91598
1745H8721L90401m2686k99632K37075K28454o13244j69387l35798m8926K73132
1735b91890K58346k7382O45505N8422k48634q280m14902m48004M10218J94277
1725A27676K47904k35248k18551k7546q9823J82876L56532m20972j82750k1647
1715b81549L34361L09221m62884K41977N2559L73566n22273J0128N07944J70313
1705G33363j63676M8080n41620n24053M42883N37855j69089J6608l41618j83578
1695a44845L89525J18064l17914l21937p7214J35432M125J40701j62318k30804
$$ plain form
1766 424891 520235 168673 247426 -85899 49734 78837 24201 222797 166619 42259 -217534
1755 -217534 -293745 415453 632961 338238 182847 742781 532160 -252779 -302877 88721
1745 88721 479122 436436 136804 373879 602333 -10911 -180298 -516096 -565022 -291890
1735 -291890 -33544 -60926 584579 643001 394367 386087 -28815 -476819 -66601 127676
1725 127676 375580 140332 -78219 -105765 -195588 -12712 343820 -77152 -259902 -281549
1715 -281549 52812 362033 -100851 141126 193685 567251 44978 55106 563050 733363
1705 733363 569687 617767 76147 -447906 -5023 532832 363743 380351 38733 -144845
1695 -144845 244680 362744 44830 -277107 -354321 -218889 -214764 -74063 -236381 -467185
1685d67185L8323O20427P0348k86661J27675l31448L15576K51734k39159k36748
1675a37118L46829q7903k06558k26708L13582K87147N03580l61923m73744k40779
1665b83595r4015N27460J74452m69841M31665k90359k33402M27903n42732j89302
1655e41766p9110M52689L2425J8016o5088K38715K07978k62104J03025l43208
1645b38428J4419J07531P1788r0854m27123M94774Q1817k08487k17100J43629
1635b68034j70901M91967j21314j51431K58163K41582m8215J0631L25618j78527
1625C89539k69929l70486K32893K54593R8203m14326p5120l42103p7955M11574
1615a63117K96724n84782j75838J44813P34603J38967j75217M06320N8190j16749
$$ plain form
1685 -467185 -428862 191565 261913 -24748 102927 -228521 87055 338789 99630 -137118
1675 -137118 209711 121808 -84750 -311458 2124 289271 792851 430928 -42816 -283595
1665 -283595 -377610 149850 324302 -145539 286126 -4233 -237635 190268 -352464 -541766
1655 -541766 -620876 -168187 -135762 -117746 -182834 55881 263859 1755 104780 -238428
1645 -238428 -224009 -116478 -44690 -135544 -562667 -67893 13924 -194563 -411663 -268034
1635 -268034 -438935 53032 -68282 -219713 38450 280032 231817 242448 568066 389539
1625 389539 119610 -250876 -17983 236610 334813 -79513 -154633 -496736 -574691 -163117
1615 -163117 133607 -451175 -627013 -482200 252403 391370 216153 622473 680663 563914
1605E63914q9642m81998K29705L75002o26683O06930J21130l37940l20619m26390
1595c86591L00497N43085M1290N3536n10631k53539N74334j48043N27346K32949
1585I74233m71370o9865j68999M8731k53810j97775K67396L76024k94109M3139
1575B53595J67968k41933r6930Q0257K1777k8342J58188K88928m51353m20982
1565b68827R10629L70020m58572n00844J48415L5218R2299k12259j67829K29525
1555A77775r8880L90057j49485l58123k56843L35512L76516q8004k82642l04785
1545b58902j12289j29795j85744Q67270n6325k115o5363K7066N77138l37107l41531
1534a7697k68647J97787J14215L26991j04507l57220L02484N94619l44124p30961
$$ plain form
1605 563914 474272 -7726 221979 596981 -29702 577228 698358 360418 39799 -386591
1595 -386591 -86094 456991 498281 551817 41186 -212353 361981 213938 741284 974233
1585 974233 502863 432998 263999 312730 58920 -138855 128541 504565 210456 253595
1575 253595 421563 179630 82700 162957 184734 156392 314580 603508 152155 -268827
1565 -268827 641802 1011822 553250 52406 200821 236039 328338 116079 -51750 177775
1555 177775 78895 468952 319467 -38656 -295499 40013 416529 328525 45883 -258902
1545 -258902 -371191 -500986 -686730 180540 124215 122100 56737 83803 660941 323834 -17697
1534 -17697 -286344 -88557 25658 352649 248142 -109078 193406 788025 443901 -287060
1524b87060K7897o7859k64594M70040L8536n8508k4501R3974L05545n2386n59556
1513c78472o02307N71269N98592M046J00500l33411J86944k40368k57414L58471
1503G850K64857N8374L46160k86314N8017M5997n29561k36945j84935M08165L62678
1492C14343J13039k28450j63960L49616k16780k4141j24183n17207J89490M14028
1482A05795M12413m12969l89915m4348M03111r5466j8682K24969N4972J70315
1472D10195o51429J79280o2436k63483J88209K91053m4237j42850J25348j78699
1462a49049P3359O7965k88027J68738L02130m51868L41534K80455K1056K61060
1452F27353o5789q69234p9518N93007K63721k23978n9406l58322L02047J70263
$$ plain form
1524 -287060 -259163 -327022 -591616 -121576 -83040 -141548 -166049 -72075 233470 181084 -378472
1513 -378472 -980779 -409510 189082 193128 293628 -39783 147161 -93207 -350621 7850
1503 7850 272707 331081 677241 390927 448944 494941 -34620 -271565 -456500 -48335 314343
1492 314343 427382 198932 34972 384588 167808 143667 19484 -497723 -308233 105795
1482 105795 518208 105239 -284676 -329024 74087 -21379 -40061 184908 239880 410195
1472 410195 -241234 -61954 -124390 -387873 -199664 91389 47152 -95698 29650 -149049
1462 -149049 -75690 -7725 -295752 -127014 175116 -276752 64782 345237 366293 627353
1452 627353 561564 -307670 -387188 205819 469540 245562 186156 -172166 129881 300144
1442C00144l11903l38197o1697p478m7624M19915J06656K3784J78210l31812J84105
1431A14103k63958k40750J170204j86982m43481k81631N47495k28626n9972O615
1421A33017j38111M61420j27410l81018K7843K55794j85217l91778j38834J89032
1411b95262J49055J29199k9328j00063j14688J25223j87188Q1887K69008K7394
1401E5237k81582K12162L86712j75279k0819P5209o73486K6337j4909k8768K84631
1390a54555k68563K46463O3321L9368l69229J96100J7041O6979L20757k76031
1380a18349j92267K67841o3917K11037j59978J17252J89055l57960L21229N6750
1370B70693l06083m76724L28298j69741K1003M86444O2567N0836K62263j50416
$$ plain form
1442 300144 -11759 -349956 -411653 -419131 -466755 -46840 59816 83600 261810 -70002 114103
1431 114103 -149855 -390605 779599 592617 149136 -132495 415000 186374 126402 133017
1421 133017 -5094 456326 328916 -52102 -24259 231535 46318 -345460 -484294 -295262
1411 -295262 -146207 -17008 -46336 -146399 -261087 -135864 -323052 -241165 27843 55237
1401 55237 -226345 -14183 372529 197250 176431 251640 -421846 -395509 -410418 -439186 -154555
1390 -154555 -423118 -176655 -113334 -73966 -443195 -247095 -230054 -163075 157682 -118349
1380 -118349 -310616 -42775 -106692 104345 -55633 61619 250674 -107286 213943 270693
1370 270693 -35390 -512114 -183816 -353557 -332554 153890 216457 267293 529556 379140
1360C79140l41741l3998M5039o2175n8050M18450o8061m15650k69314J40497m0474
1349c06337O36149N86006r093n77465n01057j41667m22058L67428L23078N5919
1339A0903L2388M35776k08938o16654n1173R31275m19691o12095L28961m96571
1329f65819m1510Q66548L72202J21148l13426j40333k88019n7888q8084N5930
1319a79251K99059j34806k46037J05598Q1978K24007M54458r58368j51217M72032
1309c2547R0750k9j96239j71719L80234J18875n06093m523K26496K45761j14671
1298C6295n99672J80143L98822K62278m95402m01667L87328K85913p7371j00381
1288a23714M4462J91952J88322j29249L0211l18707J85358N64546m79714Q8541
$$ plain form
1360 379140 37399 3401 48440 -13735 -71785 346665 278604 -137046 -406360 -265863 -306337
1349 -306337 329812 915818 906725 329260 -171797 -313464 -735522 -368094 -45016 10903
1339 10903 43291 479067 270129 -346525 -397698 533577 113886 -498209 -169248 -665819
1329 -665819 -707329 159219 531421 652569 339143 198810 -89209 -147097 -235181 -179251
1319 -179251 119808 -14998 -261035 -155437 -73459 150548 605006 -353362 -504579 -32547
1309 -32547 58203 58174 -138065 -309784 70450 189325 -316768 -321291 -94795 150966 36295
1298 36295 -563377 -383234 15588 277866 -217536 -619203 -231875 54038 -23333 -123714
1288 -123714 -79252 112700 301022 171773 201984 -116723 68635 633181 153467 242008
1278B42008K54524k64983R6480j80045l6078j11367o08281L39898L8042m28769
1268f58571K06307K38073k12194R40777l10181O266j04279o6104K03441o08553
1258c65018O051L22250k16653n01856O99333Q02466k17543j92624J64687o94248
1248a93155m40646L03879J90680M10824L92720K12162j07874k56421n75914j14316
1238a78061K87564K74410o3721O7706J66437o24505M105J05331m57355J48234
1228b69855j77331l25383P19667Q8416l71312l27832P6568q886L52256M40624
1218A96932J68267k65844j71129M84699K8237k53749j38018L57518K79034K54832
1208I40779p91919l12947N65154o23641n40977O861O61085M448L83369P2752m17508
$$ plain form
1278 242008 496532 231549 328029 147984 111906 539 -607742 -267844 -229802 -658571
1268 -658571 -452264 -214191 -426385 514392 204211 210477 106198 40094 243535 -365018
1258 -365018 -358967 -36717 -253370 -755226 -55893 746573 529030 336406 501093 -193155
1248 -193155 -633801 -329922 -139242 271582 664302 876464 768590 512169 -63745 -178061
1238 -178061 109503 383913 320192 387898 554335 -70170 -66065 39266 -418089 -269855
1228 -269855 -447186 -772569 -52902 35514 -335798 -663630 -587062 -595948 -243692 196932
1218 196932 365199 99355 -71774 412925 441162 187413 49395 406913 685947 940779
1208 940779 148860 -164087 401067 -222574 -763551 -756690 -95605 -91157 292212 364964 -52544
1197e2544J9224L65013l03621r7350k5509r1730K9993o7090m39501M87275O27560
1186D51720l65222K1718k356k18449M64983K20581q0266k82890L55035r26086
1176c61232J96376M2647q2223R6336l35381O3741K13371J32792m42888P580k11682
1165f80563J05676J49750L57616j67966l13961N48433Q7198J45006j38296J54782
1155B47675l60016n91806O34538k82001p1660M63319J68938j24279j80022j70345
1145b65659L50815r26j61800L93124N06163o12770k10237l4741K56481r5423m88437
1134c63410M57152L23325o17390n9945K09197J40338l30618j02126J66743Q0887
1124i5847K09287l87802J11764l4868K82129J69247n11110l4443J66230K00329
$$ plain form
1197 -52544 -33320 331693 28072 -69278 -94787 -186517 -156524 -223614 -663115 -175840 451720
1186 451720 86498 108216 105860 -112589 352394 572975 492709 209819 564854 -361232
1176 -361232 -164856 -122209 -204432 -108096 -443477 -379736 -166365 -33573 -476461 -468881 -680563
1165 -680563 -574887 -425137 -67521 -235487 -549448 -1015 86183 231189 92893 247675
1155 247675 -112341 -704147 -69609 -351610 -423270 40049 208987 84708 -95314 -265659
1145 -265659 85156 84230 -77570 315554 821717 208947 -1290 -36031 220450 125027 -363410
1134 -363410 93742 417067 -200323 -260268 -51071 89267 -241351 -343477 -176734 -95847
1124 -95847 113440 -274362 -162598 -197466 84663 253910 -257200 -291643 -125413 74916
1114G4916K1076K32127m71334p4412J6018j92637k94046p2604M35157M32106l44169
1103b37802k044L7926M29656j92548l40926j93999L45132L4377J31938j34869
1093a23159R5141J85220j47816L11798k6302m41284J93371J51442L9263j82450
1083E5224l1191o5837j62635k36982m57796L41174M99142J81396k20185J189R9132
1072B631m11826j82411J14092J45278L45667j18090M0845L71258J12240j37314
1062B82370k68050j35157L53511j43608J17417j83756m72178L28151N77620n6781
1052C99539l3954l34460j52925o3917N28925J37356j88220j11767J70383n14731
1042a63771o7876K14154m1997j11219J41476l7954K55528K1106o59319l2907Q51501
$$ plain form
1114 74916 95992 328119 -143215 -217627 -201609 -394246 -688292 -760896 -325739 106367 -237802
1103 -237802 -239846 -201920 227736 35188 -305738 -499737 -154605 -120228 11710 -123159
1093 -123159 -28018 157202 9386 321184 294882 -146402 46969 198411 237674 55224
1083 55224 24033 -41804 -204439 -441421 -899217 -558043 -58901 122495 -97690 -96501 2631
1072 2631 -409195 -591606 -477514 -332236 13431 -104659 -63814 307444 419684 282370
1062 282370 14320 -120837 232674 89066 206483 22727 -449451 -121300 456320 399539
1052 399539 365585 31125 -121800 -185717 343208 480564 292344 180577 350960 -163771
1042 -163771 -231647 -17493 -59490 -170709 -29233 -67187 188341 209447 -449872 -482779 368722
1031C68722m15430l10002j48322M03709L38396m4665r2473k88425J11835M99603
1021D22948k11515m93277K87113K39635k65275n02694k67154L90611O79256m49860
1011a70212j44728K63919K77941L24409l93554J6838o62443m9545O8479L23923
1001a44973P9923k82866M33571J66465n33122k19319m0654N1892P18279m42869
991b13673L35656M44755j023364o68874M76573M03710L20870k2971j02557M28036
981C78161P0919p56589k58428j8942J40958L30923N54952j76318j15941m75116
971c25421q0568J8496k38226L84295J14594R6809o894k76035k90008L19522K53274
960c0162m74155l73148M03918N21859N95911R0263j75159k04506l86282k34296
$$ plain form
1031 368722 -46708 -356710 -505032 -101323 237073 192408 99935 -188490 -76655 422948
1021 422948 211433 -281844 5269 244904 -20371 -523065 -790219 -399608 279648 -170212
1011 -170212 -314940 -51021 226920 551329 157775 174613 -487830 -537375 -468896 -144973
1001 -144973 -65050 -347916 85655 252120 -281002 -500321 -540975 -489083 229196 -213673
991 -213673 121983 566738 -456626 -1125500 -648927 -245217 75653 52682 -49875 378161
981 378161 449080 -307509 -565937 -584879 -443921 -112998 441954 265636 149695 -325421
971 -325421 -405989 -387493 -625719 -241424 -126830 -30021 -36915 -312950 -602958 -283436 -30162
960 -30162 -504317 -877465 -473547 48312 644223 734486 559327 354821 -31461 -265757
950b65757J17399m1591l05629J60541N66470J42734p86622M04821O8630n60465
940d99469p49215O74197p331N96224K90917q7497l88323K4824K15219j01894J30047
929I7699J09120m07599l5311m03462K38349N63097l44394j26740M14267q576o887
918H9563J67273l13365Q755J66667k69615k05167N1817k20785M49455j47676L70848
907A47770j56854J3445j06714J61921O09772m69636m95671J32252l7258K1049
897a79924k1257O88547j52911L09748J90449l94987o26757J69447q5359p43839
887h46843K01736J98977J9800J18657L92835j50652o4091j76288L78361Q4843
877A57335k96969k19075l61876M11231M75857n4629k64517o1785n74867K28543
$$ plain form
950 -265757 -148358 -189949 -495578 -335037 231433 374167 -412455 -7634 60996 -499469
940 -499469 -1248684 -574487 -581818 14406 305323 217826 -170497 -145673 69546 -32348 97699
929 97699 206819 -200780 -236091 -639553 -401204 161893 -182501 -309241 105026 96450 89563
918 89563 256836 -56529 -47774 118893 -150722 -355889 -304072 -524857 -75402 -223078 147770
907 147770 -9084 4361 -102353 59568 669340 199704 -295967 -163715 -200973 -179924
897 -179924 -201181 487366 334455 644203 834652 439665 -187092 -17645 -103004 -846843
887 -846843 -645107 -446130 -426330 -307673 85162 -65490 -129581 -305869 72492 157335
877 157335 -139634 -358709 -720585 -309354 166503 111874 -152643 -214428 -789295 -560752
867e60752o9462J03358j9239p2154o1327l2754L96291j86459M9949K42167K7651
856a82731K4089m69501K21363J41603J43980O8367k77962j89040L09495O87789
846D77452o33157j48150N96385l49983K35127P8002m41893K11730M13716M5532
836D84761m57897m3190J16241k55966k89657K54441J15321r0363j30620k9374
826c26303j97820K08235M90954k75781K91220k1169M791K8721j84236q2706k07513
815b71607q6694J11737L91841m0794n6502L90187m67559j50751J80730O9342M9867
804A19797k19612J4368L4256k8350k95151L65909L2114l52677m1280K21248l118
793a52496j31192K95173Q8413N9426O2366P158N3030p59917k62008J28847L16364
$$ plain form
867 -560752 -630214 -526856 -546095 -618249 -679576 -712330 -316039 -502498 -452549 -210382 -182731
856 -182731 -158642 -628143 -406780 -265177 -121197 -52830 -330792 -519832 -210337 477452
846 477452 -155705 -303855 292530 -57453 177674 255676 -186217 25513 439229 484761
836 484761 26864 -16326 99915 -156051 -445708 -191267 -75946 -166309 -296929 -326303
826 -326303 -524123 -315888 175066 -100715 190505 169336 174127 202848 18612 -64094 -271607
815 -271607 -358301 -246564 145277 104483 47981 438168 -29391 -180142 588 69930 119797
804 119797 -99815 -85447 -51191 -79541 -374692 -8783 23331 -329346 -370626 -149378 -152496
793 -152496 -283688 11485 99898 159324 221690 228848 281878 -478039 -740047 -611200 -294836
782b94836J1306P10109p89806K2917K36290K27704K0288Q9172m7875N75065l04346
771D55988l99255o41824P3197K85486K92922k71029j47276P3376j37423Q9808
761c26030j27955p4429m49209N96074L02347O370j77294J97402l15874L93000
751B4402L10975K25914l27758J66835l8742k42389J4957k1058N2794P2960j76175
740F2715J18936j91865K00598P8847k9908m75793J78229K472L33502n9082o7754
729A50897p9312J09641l72553l84938l42090J21386J61245N34653j17441j53742
719c72254N23248j68665l88458N20864K68829j49703j56251m7084P7520l71762
709b63716l13323K02049L62270J39396k80993J10055N66863k84781K69708n0492
$$ plain form
782 -294836 -283530 426579 -363227 -340310 -104020 123684 143972 233144 185269 760334 455988
771 455988 56733 -585091 -511894 -226408 66514 -204515 -351791 -278415 -415838 -326030
761 -326030 -453985 -528414 -977623 -381549 -79202 -72832 -250126 -52724 -368598 24402
751 24402 335377 561291 233533 400368 361626 119237 134194 113136 165930 238890 62715
740 62715 181651 -10214 190384 269231 239323 -236470 -58241 -55769 277733 218651 150897
729 150897 71585 181226 -191327 -576265 -918355 -796969 -635724 -101071 -218512 -372254
719 -372254 150994 -17671 -406129 114735 383564 233861 77610 30526 108046 -263716
709 -263716 -577039 -374990 -12720 126676 -154317 -44262 522601 237820 507528 457036
699D57036p6183j68132j20417k82708K17446J32205k94924k74073M74794j09466
689d4422K74684k17056k59481O2159M30158j32294r761J40834K0114l07481k0198
678f2744K6885l17244K69657L6456M71521r1124m4777l70998J7335l00340j91042
667e56415N71451l37547k40546J33214n8391K91895M87112J90150m21643n70305
657e11025K82782M19463K67306l77192k09841n5015J74998L31648J59126j87480
647B94770K49910J53374K89691j73123l76849m30309o54993k57176M88539Q07207
637C91041l52228m24698Q7612N17030l89759j31059n58N76929K64756l95481j18872
626B4713l0811J24780m98536L65374j43558P85613m92297L356k23619Q407L76313
$$ plain form
699 457036 380853 212721 92304 -190404 27042 159247 -135677 -409750 65044 -44422
689 -44422 230262 13206 -246275 -184116 246042 113748 103987 244821 264935 -42546 -62744
678 -62744 -35859 -353103 -83446 -46990 424531 333407 288630 -82368 -65033 -365373 -556415
667 -556415 15036 -322511 -563057 -429843 -488234 -196339 290773 480923 59280 -511025
657 -511025 -228243 191220 458526 81334 -128507 -183522 -8524 323124 482250 294770
647 294770 544680 698054 987745 814622 437773 7464 -647529 -904705 -416166 391041
637 391041 38813 -385885 -298273 218757 -171002 -302061 -302619 274310 539066 143585 24713
626 24713 -6098 118682 -379854 -14480 -158038 627575 135278 138634 -84985 -76578 299735
615B99735j36221O8406j17353L42189K38689j53965l03322k60423L3534M4395
605E5664r0088K26745q9128l1991J68679j71859l50078K31968j07541J48310L38120
594C28801M04261r2744R2718k72713k83641j41612N46376o99026k05022j287k74556
583e98445M43854J22j71618L57530m93M24476j31612j92247m89167N05423J010
572A48833Q4826j17281R638J97525J86400l39131j47165P8714j97084J71813o5662
561A1426k22241L3097l16280L63233P77220n01207l6300k66718N49352m54131
551f2549r8230k08085N33847k67708J68342l36469n61830M28849K50677J06986
541d6170j81393l4883k46457j99578Q5174M67484j70123J18368J78293P6045J59237
$$ plain form
615 299735 163514 231920 114567 456756 695445 541480 238158 -22265 11269 55664
605 55664 -34424 192321 103193 71202 239881 68022 -282056 -50088 -157629 -9319 328801
594 328801 733062 640318 733036 460323 176682 35070 581446 -117580 -322602 -323889 -598445
583 -598445 -154591 -154469 -326087 31443 30950 455426 323814 131567 -357600 147823 148833
572 148833 233659 116378 126016 323541 509941 170810 23645 102359 -94725 77088 11426
561 11426 -210815 -177718 -493998 -130765 646455 145248 108948 -157770 391582 -62549
551 -62549 -160779 -368864 164983 -102725 65617 -270852 -832682 -403833 -153156 -46170
541 -46170 -227563 -262446 -508903 -708481 -623307 -155823 -325946 -207578 -29285 46760 205997
530B05997l10932o428j41412J59980J94575m40736Q8350j03735K11757k74202
520d16786J16436m9896m28168p0636K6751N72297K27246n29639M75939P0688l34519
509c40287L18033m53063j64001O83992K69104n12741l12754k50635m18781K79388
499i01745N65602k54956l0185q500K27002L56309p5156k04944j25406O9656O2914
488c19409j80202J24694K81015j12578q6373K3395R7337J50781l29713L29455
478b1598P0362k79726N56330N2742o84009l50892o7735N79087M90615p584l96869
467e9277N56547L3604j44902j67193j87026l05009L12646P2741M58626J43654
457G14411m58315j65912K74290K66405k69725k90886m12303N5857J16746l22860
$$ plain form
530 205997 -104935 -111363 -252775 -92795 101780 -338956 -250606 -354341 -142584 -416786
520 -416786 -300350 -350246 -778414 -849050 -822299 -250002 -22756 -552395 -76456 -5768 -340287
509 -340287 -22254 -475317 -639318 44674 313778 -198963 -511717 -762352 -1181133 -901745
499 -901745 -336143 -591099 -621284 -629784 -402782 -46473 -121629 -326573 -451979 -382323 -319409
488 -319409 -499611 -374917 -93902 -206480 -292853 -269458 -172121 -21340 -351053 -21598
478 -21598 48764 -230962 325368 378110 -305899 -656791 -724526 -145439 345176 337592 -59277
467 -59277 497270 530874 385972 218779 31753 -273256 39390 112131 570757 714411
457 714411 256096 90184 364474 630879 361154 70268 -342035 -286178 -169432 -492292
447d92292O1696L81610m2854r2619J46598L3061k04516j8522l72888L31370l93283
436f62639L65213K75145j55469l23793m46771M91726J86549j98437j45908J51852
426d62532p8176j78915p5789j45735O57936L3559m04891M73553J15264j11114
416a76840K8566l34676N97444l76390k12308M46909k32966J79227q0925K23986
406F2027Q2144k06820j61736J13779M32909o7140J79923K39259k88963o09435
396b24053L13627J22065m2266j05461M8681N197j50585K5013K24429l04175j82121
385b69649J65717M25002J88680o89680k825O59701l5002j51822L2353N8690J52700
374E33865k16046j89888J8053L8163m51728J71491p4498m9556K34534n0965J16275
$$ plain form
447 -492292 -430596 -48986 -91840 -184459 -37861 -4800 -209316 -227838 -600726 -269356 -662639
436 -662639 -297426 -22281 -177750 -501543 -948314 -456588 -270039 -468476 -614384 -462532
426 -462532 -540708 -719623 -795412 -941147 -283211 -249652 -654543 -180990 -65726 -176840
416 -176840 -148274 -482950 114494 -261896 -474204 -27295 -260261 -81034 -161959 62027
406 62027 144171 -62649 -224385 -110606 322303 255163 435086 674345 385382 -224053
396 -224053 89574 211639 169373 63912 112593 117790 -32795 -7782 216647 -87528 -269649
385 -269649 -103932 321070 509750 -179930 -182755 476946 441944 290122 322475 381165 533865
374 533865 317819 127931 145984 184147 -267581 -96090 -170588 -220144 14390 -36575 79700
363G9700K11825L1137l5826n03081k1022L62115j05322p2394p8511k39524J04789
352b66114M73922J49570K2137M29160L1540o51058M3646k89415k4631M21830J18596
341D59183Q7161j29702L5947K33230l09557k46504J88685k97571k46106p4170
331b99404J8813j96955J55324J59664j05302J54764L68312O0052n1404k9411k90038
320e5585l46887L83532K18758j63491j98891j25875N0626J03574L44650k13428
310c017L061K64345o05992n58189J50852Q55810j05955j0948j4931j74449P6902
299a22511M8558R9309p3366L87784m96647k28045q4724K25595K39811j02501j36217
288b42954M87867l30159k87428K04044K80119j04538J81300j43178k70966K27574
$$ plain form
363 79700 291525 322662 286836 -216245 -237267 124848 19526 -52868 -131379 -370903 -266114
352 -266114 207808 357378 379515 808675 840215 189157 232803 -56612 -81243 340587 459183
341 459183 546344 416642 452589 685819 376262 129758 318443 20872 -225234 -299404
331 -299404 -280591 -477546 -322222 -162558 -267860 -113096 255216 315268 263864 234453 -55585
320 -55585 -402472 -18940 199818 36327 -162564 -288439 -237813 -134239 210411 -3017
310 -3017 44 264389 -341603 -899792 -748940 106870 915 -10033 -24964 -199413 -122511
299 -122511 -73953 25356 -48010 339774 -156873 -384918 -469642 -244047 -4236 -106737 -242954
288 -242954 244913 -85246 -372674 -168630 111489 6951 188251 45073 -225893 1681
278A681J31369J83449l51666N5225J67478o994O1784j05861Q0986j32510j55643
267g0702K35892J34325p5805J39622J96630k39129m023n76271K04211P04736P865
256F57351k04728R614o54288K3115q2414K32032O8954J10428N9646O8447k1235
245B66922m7617m7638L52872l7991m28337N6091K87509k9758l57610J79844K51683
234D45970k200k63580l20887k13182J88321J91672L69442L4483j46950n65632
$$ plain form
278 1681 133050 316499 -35167 20058 187536 180542 242326 136465 217451 84941 -70702
267 -70702 165190 299515 223710 363332 559962 320833 316810 -259461 -55250 649486 657351
256 657351 452623 462237 -192051 -168936 -251350 -19318 49636 160064 219710 288157 266922
245 266922 219305 171667 524539 486548 58211 114302 401811 372053 14443 194287 445970
234 445970 443770 180190 -140697 -353879 -165558 26114 395556 430039 283089 -282543
$$ [...]
##END NTUPLES=NMR SPECTRUM
##END=
