##TITLE=1H_CA-9384-0
 200.13MHz, CDCl3,
 8 sc
 
 1.10.2025
##JCAMPDX= 6.0         $$ Bruker NMR JCAMP-DX V2.0
##DATA TYPE= NMR SPECTRUM
##DATA CLASS= NTUPLES
##ORIGIN= UXNMR, Bruker Analytische Messtechnik GmbH
##OWNER= pz
$$ XWIN-NMR		Version 3.5
$$ Wed Oct  1 15:22:38 2025 Russian Standard Time (UT+4h)  she@DPX200
##.OBSERVE FREQUENCY= 200.1313
##.OBSERVE NUCLEUS= ^1H
##.ACQUISITION MODE= SIMULTANEOUS
##.ACQUISITION SCHEME= undefined
##.AVERAGES= 8
##.DIGITISER RES= 18
##SPECTROMETER/DATA SYSTEM= spect
##.PULSE SEQUENCE= zg30
##.SOLVENT NAME= CDCl3
##.SHIFT REFERENCE= (INTERNAL, CDCl3, 0, 15.4935)
##AUDIT TRAIL= $$ (NUMBER, WHEN, WHO, WHERE, WHAT)
$$ ##TITLE= Audit trail, XWIN-NMR		Version 3.5
$$ ##JCAMPDX= 5.01
$$ ##ORIGIN= Bruker BioSpin GmbH
$$ ##OWNER= she
$$ F:/spectra/data/she/nmr/H-C/1/pdata/1/auditp.txt
$$ ##AUDIT TRAIL=  $$ (NUMBER, WHEN, WHO, WHERE, WHAT)
(   1,<2025-10-01 15:20:00.81 +0400>,<she>,<DPX200>,
      <created by zg, POWCHK disabled, PULCHK disabled
       configuration hash MD5:
       00 E9 B6 7A A2 85 ED C7 34 08 36 98 17 FE 4E 26
       data hash MD5: 16K
       1B 40 A6 F2 A8 91 12 FC 0C 72 7C C6 AD DA 19 94>)
(   2,<2025-10-01 15:20:54.76 +0400>,<she>,<DPX200>,
      <Start of raw data processing
       efp BC_mod = 2 LB = 0.25 FT_mod = 6 PKNL = 1 PHC0 = -1720.684 PHC1 = 21.19226 SI = 16K 
       data hash MD5: 16K
       E8 F2 E2 03 48 63 F7 76 11 41 6D 29 14 48 53 F2>)
(   3,<2025-10-01 15:21:25.65 +0400>,<she>,<DPX200>,
      <pk PHC0 = -190.9765 PHC1 = -12.8 
       data hash MD5: 16K
       19 E7 8E E2 C5 3F BC DD B0 99 CB 53 A3 47 4A E2>)
(   4,<2025-10-01 15:21:31.28 +0400>,<she>,<DPX200>,
      <abs ABSG = 5 
       data hash MD5: 16K
       C4 76 31 5B 4C EB 7D 5A 6F 08 9F 28 EA 4B B1 24>)
$$ ##END=
$$ 
$$ hash MD5
$$ 13 AC 80 56 74 AC EA 43 26 10 85 05 DD D2 B5 14
##$RELAX= 
##$RELAX= 
##$RELAX= 
##$RELAX= 
##$RELAX= 
##$RELAX= 
$$ Bruker specific parameters
$$ --------------------------
##$DU= <F:/spectra>
##$EXPNO= 1
##$NAME= <H-C>
##$PROCNO= 1
##$TYPE= <nmr>
##$USER= <she>
##$AMP= (0..31)
100 100 100 100 100 100 100 100 100 100 100 100 100 100 100 100 100 100 
100 100 100 100 100 100 100 100 100 100 100 100 100 100 
##$AQSEQ= 0
##$AQ_mod= 1
##$AUNM= <au_zg>
##$AUTOPOS= <>
##$BF1= 200.13
##$BF2= 200.13
##$BF3= 200.13
##$BF4= 200.13
##$BF5= 200.13
##$BF6= 200.13
##$BF7= 200.13
##$BF8= 200.13
##$BYTORDA= 1
##$CFDGTYP= 0
##$CFRGTYP= 5
##$CHEMSTR= <none>
##$CNST= (0..31)
1 1 145 1 1 1 1 1 1 1 1 1 1 1 1 1 1 1 1 1 1 1 1 1 1 1 1 1 1 1 1 1 
##$CPDPRG= <>
##$CPDPRG1= <>
##$CPDPRG2= <>
##$CPDPRG3= <>
##$CPDPRG4= <mlev>
##$CPDPRG5= <mlev>
##$CPDPRG6= <mlev>
##$CPDPRG7= <mlev>
##$CPDPRG8= <mlev>
##$CPDPRGB= <>
##$CPDPRGT= <>
##$D= (0..31)
0 0.7 0 0 0 0 0 0 0 0 0 0.03 0 0 0 0 0 0 0 0 0 0 0 0 0 0 0 0 0 0 0 0 
##$DATE= 1759317600
##$DBL= (0..7)
120 120 120 120 120 120 120 120 
##$DBP= (0..7)
150 150 150 150 150 150 150 150 
##$DBP07= 0
##$DBPNAM0= <>
##$DBPNAM1= <>
##$DBPNAM2= <>
##$DBPNAM3= <>
##$DBPNAM4= <>
$$ [...]
##$SUBNAM3= <"">
##$SUBNAM4= <"">
##$SUBNAM5= <"">
##$SUBNAM6= <"">
##$SUBNAM7= <"">
##$SUBNAM8= <"">
##$SUBNAM9= <"">
##$SW= 18.0517328524113
##$SWIBOX= (0..15)
0 0 2 0 0 0 0 0 0 0 0 0 0 0 0 0 
##$SW_h= 3612.71676300578
##$TD= 16384
##$TD0= 1
##$TE= 0
##$TE2= 300
##$TE3= 300
##$TEG= 300
##$TL= (0..7)
0 120 120 120 120 120 120 120 
##$TP= (0..7)
150 150 150 150 150 150 150 150 
##$TP07= 0
##$TPNAME0= <>
##$TPNAME1= <>
##$TPNAME2= <>
##$TPNAME3= <>
##$TPNAME4= <>
##$TPNAME5= <>
##$TPNAME6= <>
##$TPNAME7= <>
##$TPOAL= (0..7)
0.5 0.5 0.5 0.5 0.5 0.5 0.5 0.5 
##$TPOFFS= (0..7)
0 0 0 0 0 0 0 0 
##$TUNHIN= 0
##$TUNHOUT= 0
##$TUNXOUT= 0
##$USERA1= <user>
##$USERA2= <user>
##$USERA3= <user>
##$USERA4= <user>
##$USERA5= <user>
##$V9= 5
##$VALIST= <valist>
##$VCLIST= <CCCCCCCCCCCCCCC>
##$VD= 0
##$VDLIST= <DDDDDDDDDDDDDDD>
##$VPLIST= <PPPPPPPPPPPPPPP>
##$VTLIST= <TTTTTTTTTTTTTTT>
##$WBST= 1024
##$WBSW= 4
##$XGAIN= (0..3)
0 0 0 0 
##$XL= 0
##$YL= 0
##$YMAX_a= 820059
##$YMIN_a= -1035132
##$ZGOPTNS= <>
##$ZL1= 120
##$ZL2= 120
##$ZL3= 120
##$ZL4= 120
##$ABSF1= 15.57171
##$ABSF2= -2.480142
##$ABSG= 5
##$ABSL= 3
##$ALPHA= 0
##$AQORDER= 0
##$ASSFAC= 0
##$ASSFACI= 0
##$ASSFACX= 0
##$ASSWID= 0
##$AUNMP= <proc_1d>
##$AZFE= 0.1
##$AZFW= 0.1
##$BCFW= 0
##$BC_mod= 2
##$BYTORDP= 0
##$COROFFS= 0
##$CY= -3
##$DATMOD= 1
##$DC= 0
##$DFILT= <>
##$DTYPP= 0
##$F1P= 0
##$F2P= 0
##$FCOR= 1
##$FTSIZE= 16384
##$FT_mod= 6
##$GAMMA= 0
##$GB= 0
##$INTBC= 1
##$INTSCL= 3.241238e-09
##$ISEN= 128
##$LB= 0.25
##$LEV0= 0
##$LPBIN= 0
##$MAXI= 10000
##$MC2= 0
##$MEAN= 0
##$ME_mod= 0
##$MI= 1.114404
##$NCOEF= 0
##$NC_proc= -7
##$NLEV= 6
##$NOISF1= 3.799351
##$NOISF2= 2.8
##$NSP= 0
##$NTH_PI= 0
##$NZP= 0
##$OFFSET= 15.49348
##$PC= 1
##$PHC0= -1911.66
##$PHC1= 8.392261
##$PH_mod= 1
##$PKNL= yes
##$PPARMOD= 0
##$PSCAL= 0
##$PSIGN= 0
##$REVERSE= no
##$SF= 200.130005649658
##$SI= 16384
##$SIGF1= 3
##$SIGF2= 2
##$SINO= 0.751879
##$SIOLD= 32768
##$SREGLST= <19F.Aceton>
##$SSB= 0
##$STSI= 16384
##$STSR= 0
##$SW_p= 3612.71676300578
##$SYMM= 0
##$S_DEV= 0
##$TDeff= 16384
##$TDoff= 0
##$TI= <>
##$TILT= no
##$TM1= 0
##$TM2= 0
##$TOPLEV= 0
##$USERP1= <user>
##$USERP2= <user>
##$USERP3= <user>
##$USERP4= <user>
##$USERP5= <user>
##$WDW= 1
##$XDIM= 16384
##$YMAX_p= 416215535
##$YMIN_p= -1435747
$$ End of Bruker specific parameters
$$ ---------------------------------
##NTUPLES= NMR SPECTRUM
##VAR_NAME=  FREQUENCY,     SPECTRUM/REAL,   SPECTRUM/IMAG
##SYMBOL=    X,             R,               I
##VAR_TYPE=  INDEPENDENT,   DEPENDENT,       DEPENDENT
##VAR_FORM=  AFFN,          ASDF,            ASDF
##VAR_DIM=   16384,         16384,           16384
##UNITS=     HZ,            ARBITRARY UNITS, ARBITRARY UNITS
##FACTOR=    0.220516191357247, 1,           1
##FIRST=     3100.71018563734, 0,            0
##LAST=      -512.006577368442, 0,           0
##MIN=       -512.006577368442, -1435747,    0
##MAX=       3100.71018563734, 416215535,    0
$$ Real data points
##PAGE= N=1
##DATA TABLE= (X++(R..R)), XYDATA
$$ [...]
$$ plain form
5671 32284631 32735055 32647151 33078930 33603281 33777722 33966967 34229622 34638511 34947970 35170749
5661 35170749 35960879 36321447 36490424 36880794 37355442 37939932 38102732 38460971 39141137
5652 39141137 39755278 40122102 40787948 41360841 41819634 42255079 42830831 43250880 43670024
5643 43670024 44407468 45096515 45494838 46056469 46619930 47406168 47971059 48293507 48953940
5634 48953940 49438184 49990012 50642395 51277471 51717257 52106490 52240745 52718797 53508925
5625 53508925 54022107 54512678 55203276 55785721 56431955 57395167 57927444 58326296 59209027
5616 59209027 60169565 60949474 61553203 62141029 63011786 64112764 65150912 66189665 67363592
5607 67363592 68751562 69758629 71029627 72264026 73562903 75083904 76335470 77580654
$$ packed form
5671C2284631M50424q7904M31779N24351J74441J89245K62655M08889L09459K22779
5661C5170749P90130L60568J68977L90370M74648N84490J62800L58239O80166
5652C9141137O14141L66824O65846N72893M58793M35445N75752M20049M19144
5643D3670024P37444O89047L98323N61631N63461P86238N64891L22448O60433
5634D8953940M84244N51828O52383O35076M39786L89233J34255M78052P90128
5625E3508925N13182M90571O90598N82445O46234R63212N32277L98852Q82731
5616E9209027R60538P79909O03729N87826Q70757J100978J038148J038753J173927
5607F7363592J387970J007067J270998J234399J298877J521001J251566J245184
$$ plain form
5599 77580654 79140191 80511238 81941464 83493699 85231695 86639640 88166677 89629596
5591 89629596 90941308 92594656 93886123 94908952 96174700 97353798 98422952 99775723
5583 99775723 100689422 101275498 102167152 102887193 103779774 104224758 104451458 104703306 105201827
5574 105201827 105604436 105889418 106004846 106103308 105926130 105689341 105655379 105717679 105809399 105678102
5564 105678102 105333015 104993957 104501928 103991117 103647800 103315466 103142582 102647044 102210018
5555 102210018 101589461 101107692 100639933 99988094 99324092 98676964 98151405 97292467 96310208
5546 96310208 95536228 94089712 92854486 91854256 90864132 89395759 87938491 86686576
5538 86686576 85271898 83902273 82672994 81088988 79288596 77456302 76052748 74650197
$$ packed form
5599G7580654J559537J371047J430226J552235J737996J407945J527037J462919
5591H9629596J311712J653348J291467J022829J265748J179098J069154J352771
5583I9775723R13699N86076Q91654P20041Q92581M44984K26700K51848M98521
5574A05201827M02609K84982J15428R8462j77178k36789l3962O2300R1720j31297
5564A05678102l45087l39058m92029n10811l43317l32334j72884m95538m37026
5555A02210018o20557m81769m67759o51839o64002o47128n25559q58938r82259
5546I6310208p73980j446516j235226j000230r90124j468373j457268j251915
5538H6686576j414678j369625j229279j584006j800392j832294j403554j402551
$$ plain form
5530 74650197 73126987 71780517 70023451 68463542 67314983 65792026 64425276 63384723
5522 63384723 62259977 61010432 59699508 58401175 57409210 56824505 55550513 54488086
5514 54488086 53655924 52761205 52245965 51231760 50352996 49564212 48926221 48338575 47720726
5505 47720726 47229968 46652926 46259484 45878390 45235222 44712872 44198359 43668201 43536763
5496 43536763 42913483 42509875 42137315 41960430 42000897 41500885 41183417 40736764 40572517 40071125
5486 40071125 39797261 39351181 39190316 38829111 38349711 37896898 37475434 37290380 36850720
5477 36850720 36661263 36326665 35912168 35600691 35180790 34863638 34627938 34087981 33562761
5468 33562761 32906518 32798351 32553953 32133061 31875088 31564562 31323090 30950831 30634136
$$ packed form
5530G4650197j523210j346470j757066j559909j148559j522957j366750j040553
5522F3384723j124746j249545j310924j298333r91965n84705j273992j062427
5514E4488086q32162q94719n15240j014205q78764p88784o37991n87646o17849
5505D7720726m90758n77042l93442l81094o43168n22350n14513n30158j31438
5496D3536763o23280m03608l72560j76885M0467n00012l17468m46653j64247n01392
5486D0071125k73864m46080j60865l61205m79400m52813m21464j85054m39660
5477C6850720j89457l34598m14497l11477m19901l17152k35700n39957n25220
5468C3562761o56243j08167k44398m20892k57973l10526k41472l72259l16695
$$ plain form
5459 30634136 30226032 30070025 29887235 29409544 29161515 28847342 28519474 28297436 28123522
5450 28123522 27576854 27213651 27073362 26752624 26547752 26367291 26120223 25900630 25508355
5441 25508355 25374187 24939475 24763398 24572662 24285935 24383616 24116772 23670787 23478669 23497943
5431 23497943 23208086 23036235 22781820 22653108 22519274 22247750 22540574 22305177 21915819
5422 21915819 21592854 21460174 21405080 21139781 21028799 20851307 20501960 20318860 20518898 20371428
5412 20371428 20248779 20457503 20369139 20475632 20415874 20210413 20102504 19798592 19571514 19778313
5402 19778313 19752845 19734023 19847489 19569513 19411597 19389071 19332076 19213705 18993871 19045422
5392 19045422 19208086 19266469 19226887 19014194 19187882 19076067 18807414 18865785 19113608 18680548
$$ packed form
5459C0634136m08104j56007j82790m77691k48029l14173l27868k22038j73914
5450B8123522n46668l63203j40289l20738k04872j80461k47068k19593l92275
5441B5508355j34168m34712j76077j90736k86727R7681k66844m45985j92118J9274
5431B3497943k89857j71851k54415j28712j33834k71524K92824k35397l89358
5422B1915819l22965j32680n5094k65299j10982j77492l49347j83100K00038j47470
5412B0371428j22649K08724q8364J06493n9758k05461j07909l03912k27078K06799
5402A9778313k5468j8822J13466k77976j57916k2526n6995j18371k19834N1551
5392A9045422J62664N8383l9582k12693J73688j11815k68653N8371K47823m33060
$$ plain form
5382 18680548 18736283 18906190 18804785 18974304 18928800 18923738 18982727 18980638 18973676 18814886 18643380
5371 18643380 18602656 18818360 18904228 18601492 18683526 18696590 18736537 18866524 18916323 18824685 18873957
5360 18873957 19146615 19154905 18945614 18715663 18848511 19015416 19017236 18983756 19036638 19091261 19278320
5349 19278320 19445373 19357026 19160993 18944248 19366527 19446211 19343270 19289911 19468841 19682644
5339 19682644 19621394 19367809 19297442 19411668 19653361 20090419 20147092 20071534 20106657 20248337
5329 20248337 20093350 20152583 20458589 20493514 20519823 20627324 20791623 20771789 21182476 21371498
5319 21371498 21294967 21382355 21519486 21446043 21637903 21965704 22349705 22332890 22522662 22858879
5309 22858879 22704082 22932886 23216919 23563043 23983198 23775276 24018620 24391646 24333833 24503986
$$ packed form
5382A8680548N5735J69907j01405J69519m5504n062N8989k089o962j58790j71506
5371A8643380m0724K15704Q5868l02736Q2034J3064L9947J29987M9799r1638M9272
5360A8873957K72658Q290k09291k29951J32848J66905J820l3480N2882N4623J87059
5349A9278320J67053q8347j96033k16745M22279P9684j02941n3359J78930K13803
5339A9682644o1250k53585p0367J14226K41693M37058N6673p5558L5123J41680
5329B0248337j54987N9233L06006L4925K6309J07501J64299j9834M10687J89022
5319B1371498p6531Q7388J37131p3443J91860L27801L84001j6815J89772L36217
5309B2858879j54797K28804K84033L46124M20155k07922K43344L73026n7813J70153
$$ plain form
5299 24503986 24804095 24888078 25030430 25099132 25293264 25747531 25852078 26105430 26158602 26371926
5289 26371926 26634226 26899832 26850685 26879202 26915169 27129966 26952325 27171560 27528582 27781623
5279 27781623 27779698 28011021 28167752 28135049 28361503 28439303 28478494 28615290 28899384 29046363
5269 29046363 28803846 29148462 29299500 29191042 29301527 29358437 29334858 29312005 29344266 29452776
5259 29452776 29590036 29432873 29148829 29048632 28886704 28929787 28900655 28604252 28602696 28697092
5249 28697092 28560323 28489223 28180764 28151549 28061440 28180040 28202109 28038214 27991480 27846885
5239 27846885 27830669 27681084 27688842 27226319 27275306 27031469 26949538 26650823 26541445 26569014
5229 26569014 26491255 26255767 25973737 25722179 25736794 25701885 25529536 25135435 25176922 24768466
$$ packed form
5299B4503986L00109Q3983J42352O8702J94132M54267J04547K53352N3172K13324
5289B6371926K62300K65606m9147K8517L5967K14797j77641K19235L57022K53041
5279B7781623j925K31323J56731l2703K26454P7800L9191J36796K84094J46979
5269B9046363k42517L44616J51038j08458J10485N6910k3579k2853L2261J08510
5259B9452776J37260j57163k84044j00197j61928M3083k9132k96403j556R4396
5249B8697092j36769p1100l08459k9215r0109J18600K2069j63895m6734j44595
5239B7846885j6216j49585P758m62523M8987k43837q1931k98715j09378K7569
5229B6569014p7759k35488k82030k51558J4615l4909j72349l94101M1487m08456
$$ plain form
5219 24768466 24528002 24487515 24134479 24263603 23879616 23763720 23884062 23866158 23481041 23264659
5209 23264659 23177346 23135536 22979658 22984223 22923600 22913862 22586397 22547659 22739238 22694176 22542301
5198 22542301 22543530 22698629 22533199 22356281 22384617 22377332 22134726 22512916 22498525 22414611 22500188
5187 22500188 22653016 22612967 22702111 22836083 22719885 22770536 22899259 22828813 22860557 22819141
5177 22819141 22900444 22804050 22886810 23015205 22930156 22899350 22775658 22740497 22966907 23373834
5167 23373834 23495637 23495806 23393759 23557925 23689829 23692264 23658563 23760621 23807609 23850079 23847469
5156 23847469 23895631 24087886 24126166 24013670 24363914 24483241 24500958 24563698 24904036 24995368
5146 24995368 24924620 25002916 24976349 24969101 25000909 25170077 25460353 25539345 25701280 25775139 25657153
$$ packed form
5219B4768466k40464m0487l53036J29124l83987j15896J20342j7904l85117k16382
5209B3264659q7313m1810j55878M565o0623r738l27465l8738J91579m5062j51875
5198B2542301J229J55099j65430j76918K8336p285k42606L78190j4391q3914Q5577
5187B2500188J52828m0049Q9144J33972j16198N0651J28723p0446L1744m1416
5177B2819141Q1303r6394Q2760J28395q5049l0806j23692l5161K26410M06927
5167B3373834J21803J69j02047J64166J31904K435l3701J02058M6988M2470k610
5156B3847469M8162J92255L8280j12496L50244J19327J7717O2740L40338R1332
5146B4995368p0748P8296k6567p248L1808J69168K90276P8992J61935P3859j17986
$$ plain form
5135 25657153 25815266 25675309 25681951 25703189 25873895 26193705 26211221 26363452 26704358 26627887
5125 26627887 26595296 26646315 26745339 26953450 27196183 27339523 27706251 27900805 28086292 28261682
5115 28261682 28402433 28263195 28350455 28777005 28980227 29073135 29039120 29237427 29405816 29829180
5105 29829180 30071131 30375563 30563077 30810879 31254730 31422685 31757313 32083819 32403317
5096 32403317 32577600 32565978 32660848 33059962 33654838 33871177 33851192 33975160 34526973 34912508
5086 34912508 35191890 35695111 36144501 36575725 36884469 37203084 37283856 37606193 37937597 38385095
5076 38385095 38880327 39085696 39513949 40026251 40589007 41336026 41627785 41931210 42470915
5067 42470915 42998520 43517479 43910861 44522041 44845306 45238929 45647240 46191648 46709405
$$ packed form
5135B5657153J58113j39957O642K1238J70706L19810J7516J52231L40906p6471
5125B6627887l2591N1019R9024K08111K42733J43340L66728J94554J85487J75390
5115B8261682J40751j39238Q7260M26550K03222R2908l4015J98307J68389M23364
5105B9829180K41951L04432J87514K47802M43851J67955L34628L26506L19498
5096C2403317J74283j1622R4870L99114N94876K16339j9985J23968N51813L85535
5086C4912508K79382N03221M49390M31224L08744L18615Q0772L22337L31404M47498
5076C8385095M95232K05369M28253N12302N62756P47019K91759L03425N39705
5067D2470915N27605N18959L93382O11180L23265L93623M08311N44408N17757
$$ plain form
5058 46709405 47216721 47919138 48395432 48922635 49488532 50111957 50569018 51300512 51867103
5049 51867103 52266755 53058600 53452200 54115577 54993526 55693317 56271051 56890544 57627736
5040 57627736 58608884 59580388 60010832 60465766 61247339 62155041 62993087 63958390 65211943
5031 65211943 65754915 66059355 67232029 68284550 69111866 70217903 71194739 72350567 73320993
5022 73320993 74346429 75694944 77087178 78328233 79831601 80948014 82529454 84146340
5014 84146340 85905611 87549575 89268336 91126167 93120835 95258373 97320453 99938479
5006 99938479 102097215 104408550 106915871 109735466 112543941 115681839 118761196 121731578
4998 121731578 124934627 128409010 131946898 135771725 139595748 143273603 147393056 151563347
$$ packed form
5058D6709405N07316P02417M76294N27203N65897O23425M57061P31494N66591
5049E1867103L99652P91845L93600O63377Q77949O99791N77734O19493P37192
5040E7627736R81148R71504M30444M54934P81573R07702Q38046R65303J253553
5031F5211943N42972L04440J172674J052521Q27316J106037R76836J155828R70426
5022G3320993J025436J348515J392234J241055J503368J116413J581440J616886
5014H4146340J759271J643964J718761J857831J994668K137538K062080K618026
5006I9938479K158736K311335K507321K819595K808475L137898L079357K970382
4998A21731578L203049L474383L537888L824827L824023L677855M119453M170291
$$ plain form
4990 151563347 155850082 160149308 164519827 168871257 173133224 177494223 181801213 185827944
4982 185827944 189608067 193144601 196297969 198821346 201049674 202799729 203859063 204144283
4974 204144283 204127560 203472233 202143134 200769449 198858874 196625960 194063118 191450459
4966 191450459 188756917 186177243 183555028 180801361 178283733 175719448 173278821 171081620
4958 171081620 169062547 167239201 165666433 164035125 162460166 161648754 160561547 159625023
4950 159625023 159141656 159167542 159035671 159074735 159611121 160187822 161105290 162264325 163171293
4941 163171293 164584260 166250445 167922441 169948976 172252586 174570720 176984724 179503903
4933 179503903 182105885 185182806 188199159 191192206 194531806 197604724 200388076 203385562
$$ packed form
4990A51563347M286735M299226M370519M351430M261967M360999M306990M026731
4982A85827944L780123L536534L153368K523377K228328J750055J059334K85220
4974B04144283j6723o55327j329099j373685j910575k232914k562842k612659
4966A91450459k693542k579674k622215k753667k517628k564285k440627k197201
4958A71081620k019073j823346j572768j631308j574959q11412j087207r36524
4950A59625023m83367K5886j31871L9064N36386N76701R17468J159035R06968
4941A63171293J412967J666185J671996K026535K303610K318134K414004K519179
4933A79503903K601982L076921L016353K993047L339600L072918K783352K997486
$$ plain form
4925 203385562 206604169 209178896 211451134 213693479 214896614 215621498 216457941 216448515 215576658
4916 215576658 214487862 212733644 210982960 208239004 205146990 202098186 198584289 195019457
4908 195019457 191083148 187315810 183523763 179591941 175815582 172123945 168238241 164832436
4900 164832436 161473722 157921224 154610660 151360766 148404079 145566464 142821194 140171599
4892 140171599 137722694 135794893 133657523 131555514 129358196 127354949 125621292 123955987
4884 123955987 122419904 121199633 119699264 118248726 117368174 116415452 115168702 113781588
4876 113781588 112906862 112337666 111477667 110270621 109490353 108637944 108293468 107823142 106951580
4867 106951580 106116592 105349076 104722323 104155442 103793954 103432950 102752500 102357903 101810287
$$ packed form
4925B03385562L218607K574727K272238K242345J203135P24884Q36443r426q71857
4916B15576658j088796j754218j750684k743956l092014l048804l513897l564832
4908A95019457l936309l767338l792047l931822l776359l691637l885704l405805
4900A64832436l358714l552498l310564l249894k956687k837615k745270k649595
4892A40171599k448905j927801k137370k102009k197318k003247j733657j665305
4884A23955987j536083j220271j500369j450538q80552r52722j246750j387114
4876A13781588q74726n69196q59999j207046p80268q52409l44476m70326q71562
4867A06951580q34988p67516o26753n66881l61488l61004o80450l94597n47616
$$ plain form
4858 101810287 101618035 101252054 100643340 99939913 99783554 99397412 99133207 99109773 98776367
4849 98776367 98598755 98307805 98177974 98131051 98027113 97961257 97984959 97846943 97770105 98012111
4839 98012111 98197321 98357311 98372174 98558126 99143948 99080536 99102480 99658275 100086027 100453099
4829 100453099 100979999 101379361 101939946 102392311 103028693 103863481 104903046 105212643 105738804
4820 105738804 106704255 107648939 108562664 109490810 110762260 112045862 113244256 114525437 115873255
4811 115873255 117251091 118604781 120035560 121802380 123220056 124651972 126414178 128037183
4803 128037183 130103804 131841332 133256309 135114957 136867239 138507201 140290076 142185654
4795 142185654 143541866 145033933 146692165 148419967 149829072 151269070 152462071 153401540
$$ packed form
4858A01810287j92252l65981o08714p03427j56359l86142k64205k3434l33406
4849I8776367j77612k90950j29831m6923j03938o5856K3702j38016p6838K42006
4839I8012111J85210J59990J4863J85952N85822o3412K1944N55795M27752L67072
4829A00453099N26900L99362N60585M52365O36382Q34788J039565L09597N26161
4820A05738804R65451R44684R13725R28146J271450J283602J198394J281181J347818
4811A15873255J377836J353690J430779J766820J417676J431916J762206J623005
4803A28037183K066621J737528J414977J858648J752282J639962J782875J895578
4795A42185654J356212J492067J658232J727802J409105J439998J193001R39469
$$ plain form
4787 153401540 154565101 155520299 156393552 156916305 157110224 157552979 157621427 157555932 157570404 157284872
4777 157284872 156793841 156329449 155631306 155024518 154340631 153153174 152108779 151035248 149836185
4768 149836185 148550575 147164291 145598380 144225599 142968470 141715158 140341276 138746795
4760 138746795 137290247 135770279 134552732 133538701 132462946 130932995 129479066 128289648
4752 128289648 127075315 126381994 125299516 124142190 123514512 122929905 122022383 121113267 120535276
4743 120535276 120170850 119803869 119419646 119117218 118942001 118529213 118323045 118408452 118739976
4734 118739976 118719388 118721003 118777048 118901608 119194244 119258273 119339076 119971458 120528973 121150829
4724 121150829 121534700 121957748 122789862 123597643 124176591 124732840 125382919 125951401 126742266
$$ packed form
4787A53401540J163561R55198Q73253N22753J93919M42755O8448o5495J4472k85532
4777A57284872m91031m64392o98143o06788o83887j187457j044395j073531j199063
4768A49836185j285610j386284j565911j372781j257129j253312j373882j594481
4760A38746795j456548j519968j217547j014031j075755j529951j453929j189418
4752A28289648j214333o93321j082478j157326o27678n84607r07522r09116n77991
4743A20535276l64426l66981l84223l02428j75217m12788k06168Q5407L31524
4734A18739976k0588J615N6045J24560K92636O4029Q0803O32382N57515O21856
4724A21150829L83871M23048Q32114Q07781N78948N56249O50079N68482P90865
$$ plain form
4715 126742266 127470631 128117638 128880190 129554756 130122435 131027872 131745657 132332906 133084562
4706 133084562 133688656 134500577 135196680 135906065 136391401 137194775 137933124 138510123 139077780
4697 139077780 139520384 140350853 141081928 141745972 142586131 143215817 143778403 144519969 145002004
4688 145002004 145875900 146496510 147122695 147499506 148035664 149016508 149700864 150350905 150843403
4679 150843403 151427735 151983907 152304376 152738269 153163701 153508069 153709494 154257942 154687773
4670 154687773 155100876 155291830 155400604 155719779 155981397 156191851 156156081 156403960 156247864
4661 156247864 156399720 156471656 156269964 155897532 155603133 155379984 154838668 154643733 154128710
4652 154128710 153706398 153286662 152946680 152564162 152009255 151306830 150926048 150392867 150308397
$$ packed form
4715A26742266P28365O47007P62552O74566N67679R05437P17785N87249P51656
4706A33084562O04094Q11921O96103P09385M85336Q03374P38349N76999N67657
4697A39077780M42604Q30469P31075O64044Q40159O29686N62586P41566M82035
4688A45002004Q73896O20610O26185L76811N36158R80844O84356O50041M92498
4679A50843403N84332N56172L20469M33893M25432L44368K01425N48448M29831
4670A54687773M13103J90954J08774L19175K61618K10454l5770K47879j56096
4661A56247864J51856P1936k01692l72432k94399k23149n41316j94935n15023
4652A54128710m22312m19736l39982l82518n54907p02425l80782n33181q4470
$$ plain form
4643 150308397 149846012 149421276 149415501 149148025 148972803 148824490 148774057 148508779 148060559 148153891
4633 148153891 148179674 148044818 148129981 148298732 148436526 148490673 148782445 148820595 149023135 149294373
4623 149294373 149621444 150225911 150765335 151081804 151615856 152196098 152724428 153647140 154359641
4614 154359641 155140681 155921981 156806982 157791513 158714243 160078036 161330703 162402373 163300867
4605 163300867 164663509 166120010 167326619 168773545 169998770 171422157 173083240 174168605
4597 174168605 175396960 176763414 178231327 179348999 180679870 181699884 183036240 184041662
4589 184041662 184692469 185342880 185976053 186188652 186309729 186500258 186075224 185682254 184976785
4580 184976785 184231935 183449176 182709562 181845895 180898348 179741117 178690100 177913664 177310942
$$ packed form
4643A50308397m62385m24736n775k67476j75222j48313n0433k65278m48220R3332
4633A48153891K5783j34856Q5163J68751J37794N4147K91772L8150K02540K71238
4623A49294373L27071O04467N39424L16469N34052N80242N28330R22712P12501
4614A54359641P81040P81300Q85001R84531R22730J363793J252667J071670Q98494
4605A63300867J362642J456501J206609J446926J225225J423387J661083J085365
4597A74168605J228355J366454J467913J117672J330871J020014J336356J005422
4589A84041662O50807O50411O33173K12599J21077J90529m25034l92970p05469
4580A84976785p44850p82759p39614q63667r47547j157231j051017p76436o02722
$$ plain form
4571 177310942 176799146 176269500 175788965 175604176 175077328 175005536 174997590 174799354 175098477 175604274
4561 175604274 176038687 176834810 177740875 178846838 180151578 181411282 183188987 185227093
4553 185227093 187091458 189319971 191334076 193502702 196299146 198995495 202265683 205521292
4545 205521292 209142450 212522416 216154501 220232280 224526362 228677119 232969017 237414961
4537 237414961 241696554 246699826 251900713 256864917 261888776 266891158 271812350 276718434
4529 276718434 281624158 286540831 290852205 295204318 299073940 302214754 304833026 307406406
4521 307406406 309511546 311301512 312189475 312393576 312337524 311839427 310968089 309813926 308073290
4512 308073290 306001919 304097903 301749393 299196768 296792835 294351047 291725360 289391161
$$ packed form
4571A77310942n11796n29646m80535j84789n26848p1792p946j98236K99123N05797
4561A75604274M34413P96123R06065J105963J304740J259704J777705K038106
4553A85227093J864365K228513K014105K168626K796444K696349L270188L255609
4545B05521292L621158L379966L632085M077779M294082M150757M291898M445944
4537B37414961M281593N003272N200887M964204N023859N002382M921192M906084
4529B76718434M905724M916673M311374M352113L869622L140814K618272K573380
4521C07406406K105140J789966Q87963K04101n6052m98097q71338j154163j740636
4512C08073290k071371j904016k348510k552625k403933k441788k625687k334199
$$ plain form
4504 289391161 286872582 284630500 282622676 280190449 278097159 276514503 274731004 273415820
4496 273415820 272518492 271154179 269782650 268846964 268052953 266996031 266055494 264915906 263447073
4487 263447073 262286659 260858182 259084846 257211019 254758540 251872428 248954437 245791166
4479 245791166 242265746 238316262 234296288 230015680 225772132 221175986 216856449 212467799
4471 212467799 207688987 202998889 198124377 193513264 188937488 184698392 180083372 175573827
4463 175573827 171543671 167357864 162996565 159149189 155605543 151930670 148289286 144858578
4455 144858578 141571018 138280063 135187789 131936487 128892493 126202996 123549659 120851149
4447 120851149 118367166 115772098 113566096 111312616 109169653 107379910 105590039 103665537
$$ packed form
4504B89391161k518579k242082k007824k432227k093290j582656j783499j315184
4496B73415820q97328j364313j371529r35686p94011j056922r40537j139588j468833
4487B63447073j160414j428477j773336j873827k452479k886112k917991l163271
4479B45791166l525420l949484m019974m280608m243548m596146m319537m388650
4471B12467799m778812m690098m874512m611113m575776m239096m615020m509545
4463A75573827m030156m185807m361299l847376l543646l674873l641384l430708
4455A44858578l287560l290955l092274l251302l043994k689497k653337k698510
4447A20851149k483983k595068k206002k253480k142963j789743j789871j924502
$$ plain form
4439 103665537 101650714 99881334 98129870 96408494 94908358 93728454 92194405 90769153
4431 90769153 89541597 88253568 87167188 85977294 84759179 83660867 82658066 81676605
4423 81676605 80819044 79782231 78824629 78176584 77342663 76259775 75769176 74872220 73909051
4414 73909051 73136284 72643343 72041650 71530062 70925384 70172955 69419658 68827415 68501050
4405 68501050 67843298 67234255 66487835 66060519 65716340 65400557 65078538 64817353 64309741
4396 64309741 63789201 63601175 63280695 63058755 62963792 62635022 62597532 62099589 62037467 62047690
4386 62047690 61806167 61511030 61542493 61359121 60934580 61020518 61191184 61329287 61475653 61583435
4376 61583435 61659933 61678349 61768258 61634300 61754214 62027813 62012989 62402429 62823840 63204903
$$ packed form
4439A03665537k014823j769380j751464j721376j500136j179904j534049j425252
4431I0769153j227556j288029j086380j189894j218115j098312j002801r81461
4423H1676605q57561j036813r57602o48045q33921j082888m90599q96956r63169
4414G3909051p72767m92941o01693n11588o04678p52429p53297n92243l26365
4405F8501050o57752o09043p46420m27316l44179l15783l22019k61185n07612
4396F4309741n20540j88026l20480k21940r4963l28770l7490m97943o2122J0223
4386F2047690k41523k95137L1463j83372m24541Q5938J70666J38103J46366J07782
4376F1583435P6498J8416Q9909j33958J19914K73599j4824L89440M21411L81063
$$ plain form
4366 63204903 63086054 63098333 63267481 63256698 63393568 63864662 64221941 64348063 64328621 64425488
4356 64425488 64541759 64592147 64465081 64213526 64460402 64444347 64528761 64238617 63867067 63754342
4346 63754342 63680998 63445020 63295637 63137696 62799871 62202413 61722597 61546029 61121507 60560250
4336 60560250 59891043 59274744 58457373 57845084 57507269 56972901 56170432 55482741 54777871
4327 54777871 54189320 53662579 52856030 52260155 51858084 51295425 50554208 50064715 49609130
4318 49609130 49043197 48443242 48205091 48017637 47204662 46714064 46695080 46365442 46030816 45738103
4308 45738103 45295435 44722916 44458645 44470631 44101367 44045817 43625728 43106473 43055339 42819492
4298 42819492 42909956 42757029 42460908 42350229 42253262 42020065 41851613 41964209 42056884 41939507
$$ packed form
4366F3204903j18849J2279J69148j0783J36870M71094L57279J26122j9442R6867
4356F4425488J16271N0388j27066k51555K46876j6055Q4414k90144l71550j12725
4346F3754342p3344k35978j49383j57941l37825n97458m79816j76568m24522n61257
4336F0560250o69207o16299q17371o12289l37815n34368q02469o87691p04870
4327E4777871n88551n26741q06549n95875m02071n62659p41217m89493m55585
4318D9609130n65933n99955k38151j87454q12975m90598j8984l29638l34626k92713
4308D5738103m42668n72519k64271J1986l69264n5550m20089n19255n1134k35847
4298D2819492R0464j52927k96121j10679r6967k33197j68452J12596R2675j17377
$$ plain form
4288 41939507 41999539 42152173 42183744 42085768 42106327 42171950 42170585 42194397 42436490 42492198 42525524
4277 42525524 42836396 42861711 43152324 43275269 43339324 43744965 44046125 44217823 44538175 45034339
4267 45034339 45270613 45632857 45952983 46155372 46487540 46851730 47666388 48071788 48508368
4258 48508368 48591401 48971597 49270698 49508090 49895060 50509425 50901292 51327462 51709955 52045280
4248 52045280 52244203 52727322 53238165 53617407 54367355 54835985 55444164 55996695 56187688
4239 56187688 56665997 57343821 57849583 58532206 59015992 59633404 60236209 60783558 61206058
4230 61206058 61684521 62084252 62656089 63280028 63454002 64039303 64622679 65131848 65368603
4221 65368603 65636714 66326659 66623596 66934325 67387299 67612757 67817098 68156716 68565624
$$ packed form
4288D1939507O0032J52634L1571r7976K0559O5623j365K3812K42093N5708L3326
4277D2525524L10872K5315K90613J22945O4055M05641L01160J71698L20352M96164
4267D5034339K36274L62244L20126K02389L32168L64190Q14658M05400M36580
4258D8508368Q3033L80196K99101K37392L86970O14365L91867M26170L82493L35325
4248E2045280J98923M83119N10843L79242P49948M68630O08179N52531J90993
4239E6187688M78309O77824N05762O82623M83786O17412O02805N47349M22500
4230F1206058M78463L99731N71837O23939J73974N85301N83376N09169K36755
4221F5368603K68111O89945K96937L10729M52974K25458K04341L39618M08908
$$ plain form
4212 68565624 68746918 69093292 69242444 69470054 69398612 69533789 69791395 69870507 69893759 69620549
4202 69620549 69417497 69236556 69191900 68777317 68423542 68468547 68111592 67718382 67460206 66992417
4192 66992417 66648233 65982925 65371303 64857148 64216086 63530413 62937837 62147058 61363240
4183 61363240 60555425 59683859 58929121 57825801 57029060 56383786 55365850 54568041 53544450
4174 53544450 52345229 51564946 50837923 49503901 48602673 47786271 46902346 46235135 45499060
4165 45499060 44131392 43201517 42500285 41840107 40871370 39972443 39211638 38428143 37801831
4156 37801831 37191962 36164979 35395413 34913512 34456703 33609155 32678354 32187828 31815714
4147 31815714 31316535 30570336 29952496 29546885 28973150 28501864 28212389 27616961 27099919
$$ packed form
4212F8565624J81294L46374J49152K27610p1442J35177K57606P9112K3252k73210
4202F9620549k03052j80941m4656m14583l53775M5005l56955l93210k58176m67789
4192F6992417l44184o65308o11622n14155o41062o85673n92576p90779p83818
4183F1363240q07815q71566p54738j103320p96741o45274j017936p97809j023591
4174E3544450j199221p80283p27023j334022r01228q16402q83925o67211p36075
4165D5499060j367668r29875p01232o60178r68737q98927p60805p83495o26312
4156C7801831o09869j026983p69566m81901m56809q47548r30801m90526l72114
4147C1815714m99179p46199o17840m05611n73735m71286k89475n95428n17042
$$ plain form
4138 27099919 26760429 26143511 25952620 25955891 25499277 24804640 24244809 23681880 23327331 23216012
4128 23216012 22935235 22925881 22591313 22366068 22292893 22164111 21794802 21138872 20941242 20847356
4118 20847356 20610797 20483983 20335888 20155529 19778695 19607602 19383019 19297814 19192664 18885877
4108 18885877 18763806 18620523 18766877 18560745 18162125 18119299 17810865 17794742 17755195 17377270
4098 17377270 17022198 16888832 16825536 16623927 16450285 16211808 16058913 16130366 16284559 16266186
4088 16266186 15771119 15643963 15437672 15369586 15295118 15314073 15271162 15283307 15144167 15047337
4078 15047337 14911327 14849512 14649244 14744275 14640175 14392825 14446765 14536172 14315973 14228234
4068 14228234 14272185 14149163 13989185 13714912 13583729 13664735 13510245 13425142 13486909 13331104
$$ packed form
4138B7099919l39490o16918j90891L271m56614o94637n59831n62929l54549j11319
4128B3216012k80777r354l34568k25245p3175j28782l69309o55930j97630r3886
4118B0847356k36559j26814j48095j80359l76834j71093k24583q5205j05150l06787
4108A8885877j22071j43283J46354k06132l98620m2826l08434j6123l9547l77925
4098A7377270l55072j33366o3296k01609j73642k38477j52895P1453J54193j8373
4088A6266186m95067j27156k06291o8086p4468J8955m2911J2145j39140r6830
4078A5047337j36010o1815k00268R5031j04100k47350N3940Q9407k20199q7739
4068A4228234M3951j23022j59978k74273j31183Q1006j54490q5103O1767j55805
$$ plain form
4058 13331104 13192906 13066632 13115628 12978730 12903002 12702325 12615546 12505338 12854344 12753838
4048 12753838 12375182 12338572 12129773 12192304 12134894 12128410 11956686 11699026 11863838 12007147
4038 12007147 12204601 12340943 12142375 12068275 11963083 11627575 11449656 11415921 11546135 11455058
4028 11455058 11423970 11381647 11309150 10926714 11195933 11267260 11076030 11063251 11065270 11043955 10933251
4017 10933251 11070876 10866218 10839596 10798439 10855585 10870091 10898277 10872086 10789788 10824996 10772153
4006 10772153 10508556 10479419 10465259 10610087 10140784 9904150 10264735 10669808 10613711 10360141
3996 10360141 10314769 10101589 10051643 9994664 9984448 9669603 10001195 10440421 10175956 9948084
3986 9948084 9881689 10027755 9900881 9732963 9851647 9919359 10017802 9923358 9852371 9641618
$$ packed form
4058A3331104j38198j26274M8996j36898p5728k00677q6779j10208L49006j00506
4048A2753838l78656l6610k08799O2531n7410o484j71724k57660J64812J43309
4038A2007147J97454J36342j98568p4100j05192l35508j77919l3735J30214r1077
4028A1455058l1088m2323p2497l82436K69219P1327j91230j2779K019k1315j10704
4017A0933251J37625k04658k6622m1157N7146J4506K8186k6191q2298L5208n2843
4006A0772153k63597k9137j4160J44828m69303k36634L60585M05073n6097k53570
3996A0360141m5372k13180m9946n6979j0216l14845L31592M39226k64465k27872
3986I948084o6395J46066j26874j67918J18684O7712R8443r4444p0987k10753
$$ plain form
3976 9641618 9664041 9612151 9767556 9628185 9602504 9697443 9651278 9676804 9606363 9622503 9562482
3965 9562482 9576980 9509519 9551114 9679265 9657243 9997109 9693632 9415752 9488226 9621460
3955 9621460 9733056 9717737 9568381 9350847 9359335 9357247 9588766 9919036 9757936 9532159
3945 9532159 9303103 9409068 9431249 9306066 9240054 9233558 9189675 9029219 9164352 9254599 9330300
3934 9330300 9387490 9579807 9542348 9348506 9358355 9408246 9426269 9334111 9180520 9348094 9372254
3923 9372254 9634719 9428625 9562455 9511678 9421890 9573698 9363273 9442732 9301478 9417434
3913 9417434 9459364 9331795 9627277 9375617 9415967 9659916 9543794 9636759 9530925 9231872
3903 9231872 9191858 9483546 9715205 9755124 9643729 9547069 9801047 9601197 9452119 9509459
$$ packed form
3976I641618K2423n1890J55405j39371k5681R4939m6165K5526p0441J6140o0021
3965I562482J4498o7461M1595J28151k2022L39866l03477k77880P2474J33234
3955I621460J11596j5319j49356k17534Q488k088K31519L30270j61100k25777
3945I532159k29056J05965K2181j25183o6012o496m3883j60456J35133R0247P5701
3934I330300N7190J92317l7459j93842R849M9891J8023r2158j53591J67574K4160
3923I372254K62465k06094J33830n0777q9788J51808k10425P9459j41254J15956
3913I417434M1930j27569K95482k51660M0350K43949j16122R2965j05834k99053
3903I231872m0014K91688K31659L9919j11395r6660K53978j99850j49078N7340
$$ plain form
3893 9509459 9479230 9514602 9596371 9887805 9739931 9588712 9579337 9623175 9617701 9638270 9775158
3882 9775158 9638902 9572062 9440791 9365327 9212007 9004177 9322118 9482698 9617242 9581215
3872 9581215 9707574 9569248 9318172 9454055 9324530 9686773 9656514 9760922 9879770 9466698
3862 9466698 9632586 9709798 9762884 9684939 9511814 9634342 9723609 9766631 9713421 9898168 9864154
3851 9864154 9736098 10012516 9881480 9863363 9937439 10137508 10152186 10089152 10047341 9962327 9769224
3840 9769224 9860637 10392019 10455023 10064030 10203302 10286191 10387854 10245607 9961502 10006479
3830 10006479 10258890 10272283 10185711 10228107 10284198 10438633 10435863 10360289 10641223 10912305 10886494
3819 10886494 10772082 10859634 11004777 10780457 11123790 11200861 11286087 11096383 11005400 11190271
$$ packed form
3893I509459l0229L5372Q1769K91434j47874j51219r375M3838n474K0569J36888
3882I775158j36256o6840j31271p5464j53320k07830L17941J60580J34544l6027
3872I581215J26359j38326k51076J35883j29525L62243l0259J04408J18848m13072
3862I466698J65888P7212N3086p7945j73125J22528Q9267M3022n3210J84747l4014
3851I864154j28056K76418j31036j8117P4076K00069J4678o3034m1811q5014j93103
3840I769224R1413N31382O3004l90993J39272Q2889J01663j42247k84105M4977
3830A0006479K52411J3393q6572M2396N6091J54435k770p5574K80934K71082k5811
3819A0886494j14412Q7552J45143k24320L43333P7071Q5226j89704r0983J84871
$$ plain form
3809 11190271 11406649 11453205 11403400 11502052 11317698 11464993 11445834 11653279 11712952 11632550
3799 11632550 11843109 11928605 12123986 12128371 12157732 11979204 12254004 12213386 12258088 12288961 12204761
3788 12204761 12475007 12551585 12438214 12581503 12524349 12740430 12861785 13158798 12819789 12752880
3778 12752880 13003530 12932999 12970492 13079275 13384904 13434356 13539505 13690174 13902129 13935409
3768 13935409 13807236 13833495 13879240 13760828 13855512 14140844 14043154 14251759 14528350 14478666
3758 14478666 14518396 14568291 14660867 14717740 14712635 14643283 14924338 15064269 15271543 15507107 15431359
3747 15431359 15563736 15743174 15417331 15601481 15890014 16161622 16097082 16145833 15858770 15982231
3737 15982231 16277302 16514711 16552551 16560821 16524685 16354169 16297912 16489658 16658049 16737857
$$ packed form
3809A1190271K16378M6556m9805R8652j84354J47295j9159K07445N9673q0402
3799A1632550K10559Q5496J95381M385K9361j78528K74800m0618M4702L0873q4200
3788A2204761K70246P6578j13371J43289n7154K16081J21355K97013l39009o6909
3778A2752880K50650p0531L7493J08783L05629M9452J05149J50669K11955L3280
3768A3935409j28173K6259M5745j18412R4684K85332r7690K08605K76591m9684
3758A4478666L9730M9895R2576N6873n105o9352K81055J39931K07274K35564p5748
3747A5431359J32377J79438l25843J84150K88533K71608o4540M8751k87063J23461
3737A5982231K95071K37409L7840Q270l6136j70516n6257J91746J68391P9808
$$ plain form
3727 16737857 16853452 17077524 17012316 17183611 17408978 17427090 17628291 17717418 17869365 17981818
3717 17981818 18213043 18283809 18395097 18257935 18169338 18446263 18528150 18738500 18829413 18989952
3707 18989952 19031407 18833396 19110880 19275018 19461498 19330530 19339138 19600652 19442853 19480617
3697 19480617 19719757 20163128 20450706 20249842 20348850 20687582 20749886 21108650 21250335 21585585
3687 21585585 21789123 21810385 21902746 22089801 22248346 22529377 22927559 23153699 23493744 23620277
3677 23620277 23708158 23996153 24189362 24393010 24560886 24691817 24986127 25153176 25494780 25507251
3667 25507251 25793402 26175397 26291229 26529601 26935538 27022350 27507257 28175827 28293087 28602680
3657 28602680 28880034 28704132 28960741 29492420 29774917 30250927 30448065 30693271 31393263
$$ packed form
3727A6737857J15595K24072o5208J71295K25367J8112K01201Q9127J51947J12453
3717A7981818K31225P0766J11288j37162q8597K76925Q1887K10350R0913J60539
3707A8989952M1455j98011K77484J64138J86480j30968Q608K61514j57799L7764
3697A9480617K39140M43371K87578k00864R9008L38732O2304L58764J41685L35250
3687B1585585K03538K1262R2361J87055J58545K81031L98182K26140L40045J26533
3677B3620277Q7881K87995J93209K03648J67876J30931K94310J67049L41604J2471
3667B5507251K86151L81995J15832K38372M05937Q6812M84907O68570J17260L09593
3657B8602680K77354j75902K56609N31679K82497M76010J97138K45206O99992
$$ plain form
3648 31393263 31523788 31927166 32033372 32251851 32581767 32956369 33292073 33510457 34041331
3639 34041331 34502717 34929989 35075045 35197014 35600020 36162963 36753727 36978477 37315697
3630 37315697 37521481 38064813 38592213 38868023 39450248 39703851 39885946 40085477 40568934
3621 40568934 40800514 41197457 41666076 41912725 42241994 42536059 42809849 42874847 43103395 43475694
3611 43475694 43853155 44289615 44619844 44888656 45010049 45203858 45459485 45911174 46358676
3602 46358676 46750201 46985436 47202970 47346295 47738606 48382352 48843118 49057430 49139016 49330498
3592 49330498 49709928 50200853 50690937 50909433 51227646 51617255 51953847 52431099 52657241
3583 52657241 52964715 53488889 54205221 54796343 55030952 55188492 55942434 56451422 57028899
$$ packed form
3648C1393263J30525M03378J06206K18479L29916L74602L35704K18384N30874
3639C4041331M61386M27272J45056J21969M03006N62943N90764K24750L37220
3630C7315697K05784N43332N27400K75810N82225K53603J82095J99531M83457
3621D0568934K31580L96943M68619K46649L29269K94065K73790O4998K28548L72299
3611D3475694L77461M36460L30229K68812J21393J93809K55627M51689M47502
3602D6358676L91525K35235K17534J43325L92311O43746M60766K14312Q1586J91482
3592D9330498L79430M90925M90084K18496L18213L89609L36592M77252K26142
3583E2657241L07474N24174P16332N91122K34609J57540P53942N08988N77477
$$ plain form
3574 57028899 57302919 57714545 58693847 59427487 59742100 60363791 60788723 61618562 62331103
3565 62331103 62973273 63867242 64668000 65515675 65983258 66672248 67423094 68100313 68847644
3556 68847644 69905093 70586710 71261438 72102291 73122650 74237026 75279788 76217332 77449556
3547 77449556 78318925 79347498 80596802 82014901 83282723 84487247 85677004 86959364
3539 86959364 88227137 89814573 91466596 92841221 94574552 95970494 97517264 99483486
3531 99483486 101269782 103196199 104844294 106821047 108987365 111374398 113517642 115776248
3523 115776248 118339772 120429021 122913885 125789790 128670710 131534812 134506491 137477964
3515 137477964 140678477 143931271 147371805 150755619 154038815 157516203 161091462 164536144
$$ packed form
3574E7028899K74020M11626R79302P33640L14613O21691M24932Q29839P12541
3565F2331103O42170Q93969Q00758Q47675M67583O88990P50846O77219P47331
3556F8847644J057449O81617O74728Q40853J020359J114376J042762R37544J232224
3547G7449556Q69369J028573J249304J418099J267822J204524J189757J282360
3539H6959364J267773J587436J652023J374625J733331J395942J546770J966222
3531I9483486J786296J926417J648095J976753K166318K387033K143244K258606
3523A15776248K563524K089249K484864K875905K880920K864102K971679K971473
3515A37477964L200513L252794L440534L383814L283196L477388L575259L444682
$$ plain form
3507 164536144 168229950 172131865 175861454 179539017 183493260 187300954 191093662 195036447
3499 195036447 198882768 202656580 206573617 210228682 213912471 217771814 221469132 225177298
3491 225177298 228700962 232243254 235871186 239410028 242880438 246215312 249518341 252793176
3483 252793176 255791331 258625261 261570440 264725779 267734672 270594875 273492201 276225074
3475 276225074 278951187 281645760 284331735 287215734 289943326 292474805 295383686 298455537
3467 298455537 300846665 303390479 305964607 308648267 311780082 314663305 317386239 319793498
3459 319793498 322066900 324536247 326734637 328709464 330720922 332784564 334642335 335990614
3451 335990614 337081613 337933932 338357435 338916950 339115018 338977590 338272347 337597198 336195258
$$ packed form
3507A64536144L693806L901915L729589L677563L954243L807694L792708L942785
3499A95036447L846321L773812L917037L655065L683789L859343L697318L708166
3491B25177298L523664L542292L627932L538842L470410L334874L303029L274835
3483B52793176K998155K833930K945179L155339L008893K860203K897326K732873
3475B76225074K726113K694573K685975K883999K727592K531479K908881L071851
3467B98455537K391128K543814K574128K683660L131815K883223K722934K407259
3459C19793498K273402K469347K198390J974827K011458K063642J857771J348279
3451C35990614J090999Q52319M23503N59515J98068j37428p05243o75149j401940
$$ plain form
3442 336195258 334499333 332733887 330742698 328529651 325734235 322134038 318625239 315025323
3434 315025323 310863688 306879921 302673190 298088803 292766655 288026419 283225635 278291681
3426 278291681 273069132 267752072 262548611 257247126 252082080 247206125 242033758 237336415
3418 237336415 232467820 227754054 223016313 218455700 214365089 210274907 206478335 202779575
3410 202779575 199022880 195386694 192047041 188673638 185603023 182777370 179826009 177052909
3402 177052909 174517484 172313229 169849486 167668230 165762362 163816136 162347835 160449881
3394 160449881 158972708 157489151 155854456 154490046 153340489 152108603 150849738 149977727
3386 149977727 148924440 148100614 147210237 146626959 146260885 145687587 145010500 144333397 143815496
$$ packed form
3442C36195258j695925j765446j991189k213047k795416l600197l508799l599916
3434C15025323m161635l983767m206731m584387n322148m740236m800784m933954
3426B78291681n222549n317060n203461n301485n165046m875955n172367m697343
3418B37336415m868595m713766m737741m560613m090611m090182l796572l698760
3410B02779575l756695l636186l339653l373403l070615k825653k951361k773100
3402A77052909k535425k204255k463743k181256j905868j946226j468301j897954
3394A60449881j477173j483557j634695j364410j149557j231886j258865q72011
3386A49977727j053287q23826q90377n83278l66074n73298o77087o77103n17901
$$ plain form
3377 143815496 143799321 143819278 143356030 142839829 142417830 142352354 142241549 142319963 142247499 142298619
3367 142298619 142264387 142527611 142919691 143116426 143654055 143968095 144209968 144846452 145507499
3358 145507499 146102602 147028650 147842798 148679826 149431965 150243930 151338490 152602121 153877737
3349 153877737 155084949 156001834 157358858 158848350 160294062 161811308 163442485 165040130
3341 165040130 166785895 168582539 170255870 172208139 174082051 176464691 178700991 180730864
3333 180730864 183007810 185172645 187156122 189734654 192240553 194738201 197381019 199934348
3325 199934348 202568555 205282409 208211410 211319190 214218997 217099569 220048439 223028552
3317 223028552 225970498 229195537 232321780 235399229 238680187 242183624 245769405 249023258
$$ packed form
3377A43815496j6175J9957m63248n16201m21999o5476j10805P8414p2464N1120
3367A42298619l4232K63224L92080J96735N37629L14040K41873O36484O61047
3358A45507499N95103R26048Q14148Q37028P52139Q11965J094560J263631J275616
3349A53877737J207212R16885J357024J489492J445712J517246J631177J597645
3341A65040130J745765J796644J673331J952269J873912K382640K236300K029873
3333A80730864K276946K164835J983477K578532K505899K497648K642818K553329
3325A99934348K634207K713854K929001L107780K899807K880572K948870K980113
3317B23028552K941946L225039L126243L077449L280958L503437L585781L253853
$$ plain form
3309 249023258 252358367 255715759 258904995 262037767 265390799 268463851 271763041 274953829
3301 274953829 277760985 280320043 282729796 285077017 287048234 288531984 289716916 290679241
3293 290679241 291435634 291510931 291601245 291372907 290785176 290014873 288469317 286961027 285140269
3284 285140269 283001922 280539367 278056582 275238655 272325656 269214595 265936341 262230220
3276 262230220 258827093 255230071 251125210 247142141 242951501 238829827 234301727 230310175
3268 230310175 225971025 221554111 217220219 212720484 208684152 204489206 200228817 196059670
3260 196059670 191686462 187729557 184001310 179980984 176441479 172621084 169146538 165702563
3252 165702563 162163747 158927857 155829603 152696156 149633337 146826823 144229368 141632152
$$ packed form
3309B49023258L335109L357392L189236L132772L353032L073052L299190L190788
3301B74953829K807156K559058K409753K347221J971217J483750J184932R62325
3293B90679241P56393P5297R0314k28338n87731p70303j545556j508290j820758
3284B85140269k138347k462555k482785k817927k912999l111061l278254l706121
3276B62230220l403127l597022m104861l983069m190640m121674m528100l991552
3268B30310175m339150m416914m333892m499735m036332m194946m260389m169147
3260A96059670m373208l956905l728247m020326l539505l820395l474546l443975
3252A65702563l538816l235890l098254l133447l062819k806514k597455k597216
$$ plain form
3244 141632152 138952630 136503626 134116014 131922152 129955673 127831254 125821733 124009920
3236 124009920 122342726 120693175 118948119 117272166 115914306 114461484 113024808 111645410
3228 111645410 110111310 108591281 107413414 106186190 104897818 103789044 102615952 101264211
3220 101264211 99732777 98560055 97472708 96272949 95154401 94183295 92851349 91609697
3212 91609697 90483703 89456417 88202931 87091966 86218655 85363680 84405936 83192711 82101103
3203 82101103 81292814 80170775 79284777 78363345 77353165 76857877 76147187 75237446 74762266
3194 74762266 73692294 73181788 72556858 71743454 71186593 70557424 70322647 69911025 69632066
3185 69632066 69146808 68586367 68234172 68072473 67872038 67768287 67652860 67231092 66803672
$$ packed form
3244A41632152k679522k449004k387612k193862j966479k124419k009521j811813
3236A24009920j667194j649551j745056j675953j357860j452822j436676j379398
3228A11645410j534100j520029j177867j227224j288372j108774j173092j351741
3220A01264211j531434j172722j087347j199759j118548r71106j331946j241652
3212I1609697j125994j027286j253486j110965q73311q54975r57744j213225j091608
3203H2101103q08289j122039q85998r21432j010180m95288p10690r09741m75180
3194G4762266j069972n10506o24930q13404n56861o29169k34777m11622k78959
3185F9632066m85258n60441l52195j61699k00435j03751j15427m21768m27420
$$ plain form
3176 66803672 66727319 66798907 66826420 66563690 66667525 66633555 66687856 66797576 66872314 66855974 66799998
3165 66799998 67107166 67423172 67518626 67949304 68394482 68286140 68730578 68989727 69184136 69231846
3155 69231846 69807321 70402337 70973674 71370103 71668481 72268430 72977525 73283561 73772637
3146 73772637 74477346 74913654 75912306 76630072 77183668 77914883 78941964 79739834 80411839
3137 80411839 81504364 82568582 83564001 84588240 85534021 86728954 87863503 89113695
3129 89113695 90377656 92095970 93458093 94753411 96341374 97840420 99516451 101326052
3121 101326052 102673064 104484456 106246792 108244914 110483386 112601028 114508114 116658084
3113 116658084 118875394 121187725 124052787 126637462 129615901 132529913 135626440 138823761
$$ packed form
3176F6803672p6353P1588K7513k62730J03835l3970N4301J09720P4738j6340n5976
3165F6799998L07168L16006R5454M30678M45178j08342M44438K59149J94409M7710
3155F9231846N75475N95016N71337L96429K98378N99949P09095L06036M89076
3146G3772637P04709M36308R98652P17766N53596P31215J027081P97870O72005
3137H0411839J092525J064218R95419J024239R45781J194933J134549J250192
3129H9113695J263961J718314J362123J295318J587963J499046J676031J809601
3121A01326052J347012J811392J762336J998122K238472K117642J907086K149970
3113A16658084K217310K312331K865062K584675K978439K914012L096527L197321
$$ plain form
3105 138823761 142388772 146102352 149604004 153135660 157197039 161241033 165207334 169525541
3097 169525541 174063766 178799056 183656866 188726974 194129273 199739067 205145082 210549143
3089 210549143 216354877 222426524 228628071 235106624 241828607 248229652 254950979 262265494
3081 262265494 269609894 276808162 284111173 291563733 299158971 306348381 313870482 321442058
3073 321442058 329059196 336676225 344280198 351413268 358525142 365590322 371931356 378807428
3065 378807428 385010498 390697291 395919544 400491881 404819528 408664193 411722518 414022799
3057 414022799 415652638 416215535 415973083 415132248 413534609 410940808 407377469 402839222
3049 402839222 397532765 391548252 384806893 377600659 369613550 361490972 352986827 344208826
$$ packed form
3105A38823761L565011L713580L501652L531656M061379M043994L966301M318207
3097A69525541M538225M735290M857810N070108N402299N609794N406015N404061
3089B10549143N805734O071647O201547O478553O721983O401045O721327P314515
3081B62265494P344400P198268P303011P452560P595238P189410P522101P571576
3073C21442058P617138P617029P603973P133070P111874P065180O341034O876072
3065C78807428O203070N686793N222253M572337M327647L844665L058325K300281
3057D14022799J629839N62897k42452q40835j597639k593801l563339m538247
3049D02839222n306457n984513o741359p206234p987109q122578q504145q778001
$$ plain form
3041 344208826 335094177 326025589 316981811 307878324 298809505 289819084 280838658 272146892
3033 272146892 263714786 255429905 247067668 239204193 231509814 224067241 216794456 210116342
3025 210116342 203515617 197090079 190845937 184515484 179071334 173819546 168296382 163119045
3017 163119045 158342350 153694788 149726221 145522354 141443089 137317284 133309084 129807513
3009 129807513 126607211 123410962 120330879 117094209 114152354 110997808 108429914 105914129
3001 105914129 103316055 100916186 98369789 95961768 93770032 91805107 89627576 87711132
2993 87711132 85613100 83829000 82143314 80382297 78758825 76931734 75032044 73367952
2985 73367952 71743377 70406281 68946599 67334186 66011967 64879483 63927886 62532337
$$ packed form
3041C44208826r114649r068588r043778r103487r068819q990421q980426q691766
3033B72146892q432106q284881q362237p863475p694379p442573p272785o678114
3025B10116342o600725o425538o244142o330453n444150n251788n523164n177337
3017A63119045m776695m647562l968567m203867m079265m125805m008200l501571
3009A29807513l200302l196249l080083l236670k941855l154546k567894k515785
3001A05914129k598074k399869k546397k408021k191736j964925k177531j916444
2993H7711132k098032j784100j685686j761017j623472j827091j899690j664092
2985G3367952j624575j337096j459682j612413j322219j132484r51597j395549
$$ plain form
2977 62532337 61094079 60012608 58849943 57605925 56413319 55521037 54474698 53483426
2969 53483426 52653749 51489580 50487052 49856833 49136851 48282466 47479341 46734940 45817256
2960 45817256 44983589 44103782 43195449 42840387 42160582 41221335 40738220 40134512 39184345
2951 39184345 38564219 38071330 37757505 37277746 36783667 36221238 35719073 35188412 34714437
2942 34714437 34134248 33675442 33314371 33098875 32674144 32255282 31765018 31353983 30816225
2933 30816225 30514424 30261935 30137557 29803756 29219300 28775357 28295221 28129087 27593448
2924 27593448 27189120 26655768 26459823 25958803 25895147 25580279 25080228 24733952 24587190 24506616
2914 24506616 24070412 23868905 23660988 23157006 22997450 22668704 22281130 22111623 21833112
$$ packed form
2977F2532337j438258j081471j162665j244018j192606q92282j046339r91272
2969E3483426q29677j164169j002528o30219p19982q54385q03125p44401r17684
2960D5817256q33667q79807r08333l55062o79805r39247m83115o03708r50167
2951C9184345o20126m92889l13825m79759m94079n62429n02165n30661m73975
2942C4714437n80189m58806l61071k15496m24731m18862m90264m11035n37758
2933C0816225l01801k52489j24378l33801n84456m43943m80136j66134n35639
2924B7593448m04328n33352j95945n01020o3656l14868n00051l46276j46762q0574
2914B4506616m36204k01507k07917n03982j59556l28746l87574j69507k78511
$$ plain form
2905 21833112 21401011 21166764 21235061 21043478 20956468 20508886 20226084 19890833 19461179 19296998
2895 19296998 19049932 18905720 18721256 18574003 18388673 18150077 18165139 17862985 17562685 17641483
2885 17641483 17530592 17560929 17314134 16884971 16781844 16539069 16399873 16308873 15963292 15733961
2875 15733961 15749734 15512106 15419698 15421686 15100569 14878650 15083488 14869912 14594921 14551366
2865 14551366 14382073 14354855 14263767 14214187 14082679 14031095 13780924 13532613 13393808 13525963
2855 13525963 13393901 13085782 13193592 13269420 13152042 13028269 12807242 12587330 12588095 12599608
2845 12599608 12584366 12258328 12084810 12097047 12151573 11840320 11891423 11804058 11554108 11849792
2835 11849792 11729846 11505981 11435034 11312731 11343640 11587013 11522529 11436089 11520706 11232241
$$ packed form
2905B1833112m32101k34247O8297j91583q7010m47582k82802l35251m29654j64181
2895A9296998k47066j44212j84464j47253j85330k38596J5062l02154l00300P8798
2885A7641483j10891L0337k46795m29163j03127k42775j39196r1000l45581k29331
2875A5733961J5773k37628r2408J988l21117k21919K04838k13576k74991m3555
2865A4551366j69293k7218r1088m9580j31508n1584k50171k48311j38805J32155
2855A3525963j32062l08119J07810P5828j17378j23773k21027k19912P65J1513
2845A2599608j5242l26038j73518J2237N4526l11253N1103q7365k49950K95684
2835A1849792j19946k23865p0947j22303L0909K43373o4484q6440Q4617k88465
$$ plain form
2825 11232241 11239790 11320158 11215614 11220601 10943032 10706011 10910400 10821533 10609960 10527502 10517374
2814 10517374 10457932 10454868 10443050 10436682 10577306 10285106 10060800 9975999 10168795 10187320 9821231
2803 9821231 10008870 9934028 9847093 10001983 10004674 10111761 10096091 10105802 10121414 10028534 9786416
2792 9786416 9869473 9708350 9900781 9772267 9657592 9894218 9974280 9684125 9529144 9859911
2782 9859911 9955613 9716996 9570014 9516482 9304955 9213566 9168029 9424132 9479197 9518904 9370953
2771 9370953 9196026 9382981 9429828 9437133 9358656 9259549 9269399 9329167 8959482 8792782 8728317
2760 8728317 8742111 8568465 8501925 8305714 8245689 8484186 8040879 8002106 8124120 8043349
2750 8043349 7873999 7744304 7597428 7397726 7448560 7555536 7680204 7595158 7367391 7260002
$$ packed form
2825A1232241P549Q0368j04544M987k77569k37021K04389q8867k11573q2458j0128
2814A0517374n9442l064j1818o368J40624k92200k24306q4801J92796J8525l66089
2803I821231J87639p4842q6935J54890K691J07087j5670R711J5612r2880k42118
2792I786416Q3057j61123J92431j28514j14675K36626Q0062k90155j54981L30767
2782I859911R5702k38617j46982n3532k11527r1389m5537K56103N5065L9707j47951
2771I370953j74927J86955M6847P305p8477r9107R850N9768l69685j66700o4465
2760H728317J3794j73646o6540j96211o0025K38497m43307l8773J22014q0771
2750H043349j69350j29695j46876j99702N0834J06976J24668q5046k27767j07389
$$ plain form
2740 7260002 7135080 7084619 7045186 6882496 6907990 6876049 6640073 6567765 6445897 6673378
2730 6673378 6789646 6641410 6556738 6218978 6249153 6099718 5964701 6348864 6402592 6448680
2720 6448680 6369539 6300703 6233614 6072409 5869999 6223987 6092768 5940034 5893859 5715771
2710 5715771 5474830 5613485 5699138 5646728 5860863 5632663 5441840 5556499 5735423 5551341
2700 5551341 5528635 5478236 5095381 5177008 5188362 5201139 5219350 5253656 5352675 5372480 5455117
2689 5455117 5253018 4936858 5064462 5471565 5186145 5105113 5103218 5020684 5061089 5155665 4989262
2678 4989262 4781724 4947139 4976290 4957821 4940490 4939972 4814614 4661074 4748097 4933921 4686883
2667 4686883 4503541 4582323 4694027 4486309 4321247 4401485 4367517 4534405 4527840 4754524
$$ packed form
2740G260002j24922n0461l9433j62690K5494l1941k35976p2308j21868K27481
2730F673378J16268j48236q4672l37760L0175j49435j35017L84163N3728M6088
2720F448680p9141o8836o7089j61205k02410L53988j31219j52734m6175j78088
2710E715771k40941J38655Q5653n2410K14135k28200j90823J14659J78924j84082
2700E551341k2706n0399l82855Q1627J1354J2777J8211L4306R9019J9805Q2637
2689E455117k02099l16160J27604M07103k85420q1032j895q2534M0405R4576j66403
2678D989262k07538J65415K9151j8469j7331n18j25358j53540Q7023J85824k47038
2667D686883j83342P8782J11704k07718j65062Q0238l3968J66888o565K26684
$$ plain form
2657 4754524 4718015 4433254 4358533 4103490 4075058 4286071 4483344 4464707 4550741 4339027
2647 4339027 4216652 3942666 3902420 4194093 4331976 4023622 4228848 4107758 3860962 4020011
2637 4020011 4006557 4096578 4023821 4069193 3901403 3767429 3764309 3786623 3687643 3921937 4332157
2626 4332157 4038503 3723649 3972911 3991134 4223019 4014158 3982239 4118256 4122220 3924183
2616 3924183 3867982 3883198 3937772 4068120 4006475 3793820 3862328 3945162 3894645 3695937 3777604
2605 3777604 3827333 3890653 3893826 3889689 3891548 3606493 3623725 3713850 3547311 3787545 3803961
2594 3803961 3709839 3461130 3691291 3616003 3672185 3857194 3690317 3907293 3843646 3671939
2584 3671939 3566868 3758244 3656323 3808470 3922153 3710601 3378649 3462718 3450559 3744067
$$ packed form
2657D754524l6509k84761p4721k55043k8432K11013J97273j8637Q6034k11714
2647D339027j22375k73986m0246K91673J37883l08354K05226j21090k46796J59049
2637D020011j3454R0021p2757M5372j67790j33974l120K2314r8980K34294M10220
2626D332157k93654l14854K49262J8223K31885k08861l1919J36017L964j98037
2616C924183n6201J5216N4574J30348o1645k12655O8508Q2834n0517j98708Q1667
2605C777604M9729O3320L173m137J859k85055J7232R0125j66539K40234J6416
2594C803961r4122k48709K30161p5288N6182J85009j66877K16976o3647j71707
2584C671939j05071J91376j01921J52147J13683k11552l31952Q4069j2159K93508
$$ plain form
2574 3744067 3809174 3451072 3390980 3519333 3544848 3483951 3390139 3399079 3491518 3430277 3577953
2563 3577953 3489375 3262893 2967764 3024469 3257356 3447463 3395665 3408715 3340446 3413143 3332248
2552 3332248 3417883 3701910 3337463 3073779 3141427 3212380 3194082 3106175 3097456 3325643 3353463
2541 3353463 3419007 3155739 3284142 3332419 3137237 3273796 3381955 3157065 3049429 2967400
2531 2967400 3131622 3235946 3306106 3016801 3080949 3288341 3202747 3095810 3197750 3276257
2521 3276257 3251329 3292072 2958456 2740092 3056216 3112548 3274243 3170631 2969217 2767681
2511 2767681 2821519 3066102 3025745 2993691 2718993 3007982 3222856 3058164 3126140 3368061
2501 3368061 2982019 3033691 3212768 3302913 3290174 3300876 3099976 3055019 2957781 2993340 3158166
$$ packed form
2574C744067O5107l58102o0092J28353K5515o0897r3812Q940R2439o1241J47676
2563C577953q8578k26482k95129N6705K32887J90107n1798J3050o8269P2697q0895
2552C332248Q5635K84027l64447k63684O7648P0953j8298q7907q719K28187K7820
2541C353463O5544k63268J28403M8277j95182J36559J08159k24890j07636q2029
2531B967400J64222J04324P0160k89305O4148K07392q5594j06937J01940P8507
2521C276257k4928M0743l33616k18364L16124N6332J61695j03612k01414k01536
2511B767681N3838K44583m0357l2054k74698K88989K14874j64692O7976K41921
2501C368061l86042N1672J79077R0145j2739J0702k00900m4957r7238L5559J64826
$$ plain form
2490 3158166 2934724 2850600 3087368 3358398 3381850 3205719 3063950 2967986 2982849 3485514
2480 3485514 3574949 3357042 3326015 3274586 3160197 2979082 2808267 3000156 3243998 3361061
2470 3361061 3279064 3256755 3134990 3182281 3253753 3283745 3108971 3047531 2967237 3212231 3239963
2459 3239963 3164123 3295194 3035342 2948919 3018833 2874204 3062732 3440420 3640040 3422813
2449 3422813 3472320 3576560 3483995 3433832 3636202 3683743 3449646 3480552 3480786 3403277 3476121
2438 3476121 3611057 3623992 3531722 3618850 3681482 3489412 3710189 3617099 3614365 3807066 3972950
2427 3972950 3862603 3752652 3610595 3561650 3829087 4153062 4095858 3993593 4078497 4188432
2417 4188432 4155213 4386407 4226902 4407392 4559398 4476829 4507297 4561756 4737599 4886519
$$ packed form
2490C158166k23442q4124K36768K71030K3452j76131j41769r5964J4863N02665
2480C485514Q9435k17907l1027n1429j14389j81115j70815J91889K43842J17063
2470C361061q1997k2309j21765M7291P1472K9992j74774o1440q0294K44994K7732
2459C239963p5840J31071k59852q6423O9914j44629J88528L77688J99620k17227
2449C422813M9507J04240r2565n0163K02370M7541k34097L0906K34p7509P2844
2438C476121J34936J2935r2270Q7128O2632j92070K20777r3090k734J92701J65884
2427C972950j10347j09951j42057m8945K67437L23975n7204j02265Q4904J09935
2417D188432l3219K31194j59505J80490J52006q2569L0468N4459J75843J48920
$$ plain form
2407 4886519 4968514 5107744 4855434 5034568 5052472 5243232 5509063 5536109 5412944 5427909
2397 5427909 5456055 5705410 5669668 5694707 5931741 6163336 6296194 6487887 6480644 6391035 6475760
2386 6475760 6593494 7102746 7215866 7347591 7271113 7390845 7613671 7930002 8122263 8319728
2376 8319728 8509777 8711076 8851342 9196131 9582375 9660491 9671302 10096402 10630846 10996610
2366 10996610 11154812 11648777 11800667 12218374 12966430 13415901 13334935 13911340 14236366 14855209
2356 14855209 15489857 16281386 16952203 17233393 17999109 18637712 19289712 20017783 20694359
2347 20694359 21422683 22385161 23182312 23954694 25042488 25834139 26814429 27789500 28813152
2338 28813152 30007958 30904819 31864311 32775260 33986824 34893015 35853176 37077732 37975870
$$ packed form
2407D886519Q1995J39230k52310J79134J7904J90760K65831K7046j23165J4965
2397E427909K8146K49355l5742K5039K37034K31595J32858J91693p243q9609Q4725
2386F475760J17734N09252J13120J31725p6478J19732K22826L16331J92261J97465
2376H319728J90049K01299J40266L44789L86244P8116J0811M25100N34444L65764
2366A0996610J58202M93965J51890M17707P48056M49471q0966N76405L25026O18843
2356A4855209O34648P91529O70817K81190P65716O38603O52000P28071O76576
2347B0694359P28324R62478P97151P72382J087794P91651R80290R75071J023652
2338B8813152J194806Q96861R59492R10949J211564R06191R60161J224556Q98138
$$ plain form
2329 37975870 38670246 39423228 40204455 40359756 40368582 40627665 40557429 40537040 40403859 39645017
2319 39645017 39045112 38543503 37715835 36726897 35642294 34657566 33653272 32729010 31440823
2310 31440823 30156121 29223097 28182319 27180865 26255792 25218260 24326517 23247789 22449066
2301 22449066 21441437 20739397 19856487 19137370 18591082 17912443 17263048 16699729 16267655
2292 16267655 15607532 14994335 14336333 13725485 13442046 13289618 12737062 12269809 11872544
2283 11872544 11354853 10883554 10849412 10634287 10038909 9846512 9457834 9183786 8953596 8816354
2273 8816354 8517419 8265903 8294121 8162237 7654869 7320279 7138917 7066454 7031262 6857273
2263 6857273 6870614 6756477 6627067 6366977 6258031 6282123 6058457 5815808 5653482 5604057
$$ packed form
2329C7975870O94376P52982P81227J55301Q826K59083p0236k0389j33181p58842
2319C9645017n99905n01609q27668r88938j084603r84728j004294r24262j288187
2310C1440823j284702r33024j040778j001454r25073j037532q91743j078728p98723
2301B2449066j007629p02040q82910p19117n46288o78639o49395n63319m32074
2292A6267655o60123o13197o58002o10848k83439j52428n52556m67253l97265
2283A1872544n17691m71299l4142k15125n95378j92397l88678k74048k30190j37242
2273H816354k98935k51516K8218j31884n07368l34590j81362p2463l5192j73989
2263F857273J3341j14137j29410k60090j08946K4092k23666k42649j62326m9425
$$ plain form
2253 5604057 5515542 5315786 5173936 5318074 5237684 5005774 4887781 4555506 4538398 4442499
2243 4442499 4241527 4128248 4277576 4200726 3977330 3942697 4117650 3990342 3710394 3534763
2233 3534763 3439049 3297474 3443799 3563030 3433390 3366880 3423065 3406216 3506310 3478564
2223 3478564 3249532 3174340 3075386 2914181 2947432 3035679 2912449 2998347 2794830 2551982
2213 2551982 2870508 2768104 2786876 2619765 2539105 2671836 2475794 2573938 2505108 2535963
2203 2535963 2574800 2158375 2267942 2366255 2369575 2193283 2354187 2313833 2131762 2216014 2419737
2192 2419737 2481897 2334121 2217695 1971715 1776223 1719654 1973010 2145578 2077251 2137788
2182 2137788 2246785 1957279 2101637 2012632 1867363 1803737 2108417 2215876 1999970 2156308
$$ packed form
2253E604057q8515j99756j41850J44138q0390k31910j17993l32275j7108r5899
2243D442499k00972j13279J49328p6850k23396l4633J74953j27308k79948j75631
2233C534763r5714j41575J46325J19231j29640o6510N6185j6849J00094k7746
2223C478564k29032p5192r8954j61205L3251Q8247j23230Q5898k03517k42848
2213B551982L18526j02404J8772j67111q0660J32731j96042R8144o8830L0855
2203B535963L8837m16425J09567R8313L320j76292J60904m0354j82071Q4252K03723
2192B419737O2160j47776j16426k45980j95492n6569K53356J72568o8327O0537
2182B137788J08997k89506J44358q9005j45269o3626L04680J07459k15906J56338
$$ plain form
2172 2156308 2098015 1838436 1754246 1745726 1785798 1571620 1542945 1666983 1842703 1847144 1872939
2161 1872939 1682530 1599276 1480958 1311306 1323962 1554645 1606955 1552296 1621739 1556908 1665366
2150 1665366 1594050 1356546 1662567 1539122 1201305 1405182 1797787 1736966 1659306 1696831
2140 1696831 1565935 1485815 1260299 1370123 1488758 1611988 1384444 1133375 1052879 1227338
2130 1227338 1375099 1421633 1466983 1221553 1291295 1392696 1360723 1126878 973316 1025044
2120 1025044 894788 1003860 1176232 1271849 1190183 1069368 1107477 1231956 1280804 1197588
2110 1197588 1351403 1363671 1314095 1007658 873339 1322045 1345633 1300512 1499898 1208534
2100 1208534 1203745 1177374 1131335 1181745 1244082 1233143 1023954 866936 1071956 1318611 1355604
$$ packed form
2172B156308n8293k59579q4190q520M0072k14178k8675J24038J75720M441K5795
2161A872939j90409q3254j18318j69652J2656K30683N2310n4659O9443o4831J08458
2150A665366p1316k37504L06021j23445l37817K03877L92605o0821p7660L7525
2140A696831j30896q0120k25516J09824J18635J23230k27544k51069q0496J74459
2130A227338J47761M6534M5350k45430O9742J01401l1973k33845j53562N1728
2120A025044j30256J09072J72372R5617q1666j20815L8109J24479M8848q3216
2110A197588J53815J2268m9576l06437j34319M48706K3588m5121J99386k91364
2100A208534m789k6371m6039N0410O2337j0939k09189j57018K05020K46655L6993
$$ plain form
2089 1355604 1337901 1233400 1431882 1311406 1055028 1123975 1503679 1333097 1267374 1121381
2079 1121381 1148388 1286980 1169692 957649 902097 1098067 1155956 1092821 1116453 1329683
2069 1329683 1258325 1162730 1056241 966817 1035417 927938 866952 1004884 935525 761166 1027495
2058 1027495 818769 852347 1090347 879884 741360 782118 846454 792998 955644 875674
2048 875674 831141 965460 931894 930094 927889 958147 998376 881239 783282 804132 977243
2037 977243 966716 766301 697430 777481 962276 893494 903885 970459 706098 689345 636985
2026 636985 433859 798783 781120 1068778 1027404 916715 886908 691164 914377 818624
2016 818624 891174 676123 597522 649472 712050 893402 749003 792615 812733 902188 913756
$$ packed form
2089A355604j7703j04501J98482j20476k56378O8947L79704j70582o5723j45993
2079A121381K7007J38592j17288k12043n5552J95970N7889o3135K3632K13230
2069A329683p1358r5595j06489q9424O8600j07479o0986J37932o9359j74359K66329
2058A027495k08726L3578K38000k10463j38524M0758O4336n3456J62646p9970
2048H75674m4533J34319l3566j800k205L0258M0229j17137r7957K0850J73111
2037I77243j0527k00415o8871Q0051J84795o8782J0391O6574k64361j6753n2360
2026F36985k03126L64924j7663K87658m1374j10689k9807j95744K23213r5753
2016H18624P2550k15051p8601N1950O2578J81352j44399M3612K0118Q9455J1568
$$ plain form
2005 913756 953512 790104 854465 972485 943560 608034 450017 438731 405702 440829 668422
1994 668422 888984 658938 748442 632074 497265 592698 659911 616929 721931 681466 748291
1983 748291 695909 699548 429585 708735 712966 663010 653947 439578 345844 562626 463067
1972 463067 364075 420670 352885 427603 536074 612202 773796 805895 598749 607759 749932
1961 749932 634772 518786 629669 621366 786640 843259 703750 571499 626938 593196 529460
1950 529460 674206 654275 398398 217463 427827 696118 309122 -29489 129345 234618
1940 234618 443839 518677 156035 74383 183111 246769 253066 457809 224431 156663 175813
1929 175813 122248 319987 316141 424476 603043 379098 416185 530714 262020 106965
$$ packed form
2005I13756L9756j63408O4361J18020k8925l35526j58017j1286l3029L5127K27593
1994F68422K20562k30046Q9504j16368j34809R5433O7213m2982J05002m0465O6825
1983G48291n2382L639k69963K79150M231m9956r063k14369r3734K16782r9559
1972D63067r8992N6595o7785P4718J08471P6128J61594L2099k07146R010J42173
1961G49932j15160j15986J10883q303J65274N6619j39509j32251N5439l3742o3736
1950E29460J44746j9931k55877j80935K10364K68291l86996l38611J58834J05273
1940B34618K09221P4838l62642q1652J08728O3658O297K04743k33378o7768J9150
1929A75813n3565J97739l846J08335J78567k23945L7087J14529k68694j55055
$$ plain form
1919 106965 120852 268899 255765 295859 392343 362538 319361 244116 323699 431879 504486
1908 504486 334933 259876 176479 355250 347770 170088 131712 359683 563106 645359 589156
1897 589156 519795 655999 478022 672871 578281 515979 379953 314639 298284 350157 392590
1886 392590 604935 423491 355627 456290 330450 395390 406596 397005 632543 672392 400136
1875 400136 522844 420759 337393 288013 316982 582852 394920 249295 398567 284941
1865 284941 285392 320811 384073 282296 178475 93083 250277 346027 370092 338831 249569
1854 249569 333289 131335 -8233 46810 72079 295558 466536 366413 193984 -21101
1844 -21101 52413 333844 159577 45980 303850 374061 376639 465409 311469 319724 282507
$$ packed form
1919A06965J3887J48047j3134M0094R6484k9805m3177p5245P9583J08180P2607
1908E04486j69553p5057q3397J78771p480j77682l8376K27971K03423Q2253n6203
1897E89156o9361J36204j77977J94849r4590o2302j36026o5314j6355N1873M2433
1886C92590K12345j81444o7864J00663j25840O4940J1206r591K35538L9849k72256
1875D00136J22708j02085q3366m9380K8969K65870j87932j45625J49272j13626
1865B84941M51L5419O3262j01777j03821q5392J57194R5750K4065l1261q9262
1854B49569Q3720k01954j39568N5043K5269K23479J70978j00123j72429k15085
1844b1101P3514K81431j74267j13597K57870P0211K578Q8770j53940Q255l7217
$$ plain form
1833 282507 249570 498995 573023 373837 327975 477933 263175 353173 623721 488007
1823 488007 377028 449514 445944 598590 722120 590017 443998 96413 241490 540832
1813 540832 521142 512858 444676 405776 156107 207556 134025 161363 346714 223677 232852
1802 232852 431263 541278 300398 84938 -45806 1855 -177724 49043 412721 266686
1792 266686 286072 342938 312144 260980 274303 273691 -19179 103581 134658 39922 233982
1781 233982 133670 351353 276693 148585 78376 163991 166021 31225 235840 533225 706036
1770 706036 554997 491613 457303 335332 296233 194395 161066 257935 -70599 104836 110319
1759 110319 83129 162407 67179 223521 214167 123155 119580 -31438 130245 152405 88815
$$ packed form
1833B82507l2937K49425P4028j99186m5862J49958k14758Q9998K70548j35714
1823D88007j10979P2486l570J52646J23530j32103j46019l47585J45077K99342
1813E40832j9690q284o8182l8900k49669N1449p3531K7338J85351j23037R175
1802B32852J98411J10015k40880k15460j30744M7661j79579K26767L63678j46035
1792B66686J9386N6866l0794n1164J3323o12k92870J22760L1077r4736J94060
1781B33982j00312K17683p4660j28108p0209Q5615K030j34796K04615K97385J72811
1770G06036j51039o3384l4310j21971l9099j01838l3329R6869l28534J75435N483
1759A10319k7190P9278r5228J56342r354r1012l575j51018J61683K2160o3590
$$ plain form
1748 88815 237462 288526 318131 231533 153381 318150 523399 227609 335839 442051 359522
1737 359522 270496 210720 173256 154318 188609 109691 78752 169853 64066 -93465 150953
1726 150953 360675 314696 232604 244201 12634 -149807 -184260 83582 158716 49791 335860
1715 335860 100251 218069 283180 148000 63182 191425 376495 326965 341544 245772 267709
1704 267709 277396 268022 355210 559443 435094 132790 238705 -8497 -16498 94614 101257
1693 101257 267034 47335 223609 188283 104238 181280 184543 268115 319044 228227 -101880
1682 -101880 -73652 -113984 257865 335077 149991 61742 -70914 -225976 -252019 -27881 55532
1671 55532 157388 153164 -11497 231475 446059 304246 314189 432246 257810 78950 -53039
$$ packed form
1748H8815J48647N1064K9605q6598p8152J64769K05249k95790J08230J06212q2529
1737C59522q9026n9776l7464j8938L4291p8918l0939R1101j05787j57531K44418
1726A50953K09722m5979q2092J1597k31567j62441l4453K67842P5134j08925K86069
1715C35860k35609J17818O5111j35180q4818J28243J85070m9530J4579r5772K1937
1704B67709R687r374Q7188K04233j24349l02304J05915k47202q001J11112O643
1693A01257J65777k19699J76274l5326q4045P7042L263Q3572N0929r0817l30107
1682a01880K8228m0332L71849P7212j85086q8249j32656j55062k6043K24138Q3413
1671E5532J01856m224j64661K42972K14584j41813R943J18057j74436j78860j31989
$$ plain form
1660 -53039 -169757 210822 304096 342077 359928 295481 236737 142673 54295 240079 244512
1649 244512 325923 338059 286428 208578 110131 312883 343509 355555 262926 174344 132339
1638 132339 160306 74595 146389 317454 191992 102562 26974 -123466 -206684 -94728 -23175
1627 -23175 2607 77470 40142 210998 31579 -281434 -156999 -441619 -124800 82469
1617 82469 7394 82486 241263 257202 181494 343223 288258 308237 60895 -64714 116785
1606 116785 88447 1849 -107360 60380 195228 255274 326964 199815 212320 159955 95762
1595 95762 284543 208475 71752 207032 36891 -193539 -94080 49082 287373 278205 250685
1584 250685 383100 482326 541091 203942 85889 61337 1276 73212 289711 168019 50358
$$ packed form
1660e3039j16718L80579R3274L7981J7851o4447n8744r4064q8378J85784M433
1649B44512Q1411J2136n1631p7850r8447K02752L0626J2046r2629q8582m2005
1638A32339K7967q5711P1794J71065j25462q9430p5588j50440q3218J11956P1553
1627b3175K5782P4863l7328J70856j79419l13013J24435k84620L16819K07269
1617H2469p5075P5092J58777J5939p5708J61729n4965J9979k47342j25609J81499
1606A16785k8338q6598j09209J67740J34848O0046P1690j27149J2505n2365o4193
1595I5762J88781p6068j36723J35280j70141k30430R9459J43162K38291r168k7520
1584B50685J32415R9226N8765l37149j18053k4552o0061P1936K16499j21692j17661
$$ plain form
1573 50358 296123 275701 184571 129898 174758 234794 51212 -60503 -175732 -176054 59723
1562 59723 112695 -95032 65019 64154 -44810 95606 -90272 -281000 -26028 240093 126134
1551 126134 -17078 61178 -164280 37903 50558 -8866 114640 158960 370786 250823
1541 250823 101366 -128055 74793 339652 223664 167531 184157 145775 457254 190815
1531 190815 4924 -4849 83760 187472 45032 58101 41392 133080 345009 426579 522298
1520 522298 547085 401644 397653 306355 394072 285168 131414 -11326 -86751 14316 -203075
1509 -203075 69098 280928 77042 77938 98633 28503 -57741 37585 155881 14168 -38387
1498 -38387 -27421 -46939 -339799 -519155 -99221 -38639 -115820 25744 -22135 -33178 -78381
$$ packed form
1573E0358K45765k0422r1130n4673M4860O0036j83582j11715j15229l22K35777
1562E9723N2972k07727J60051q65j08964J40416j85878j90728K54972K66121j13959
1551A26134j43212P8256k25458K02183J2655n9424J23506M4320K11826j19963
1541B50823j49457k29421K02848K64859j15988n6133J6626l8382L11479k66439
1531A90815j85891r773Q8609J03712j42440J3069j6709R1688K11929Q1570R5719
1520E22298K4787j45441l991r1298Q7717j08904j53754j42740p5425J01067k17391
1509b03075K72173K11830k03886Q96K0695p0130q6244R5326J18296j41713n2555
1498c8387J0966j9518k92860j79356M19934O0582p7181J41564m7879j1043m5203
$$ plain form
1487 -78381 -143082 36628 306682 407246 175123 29473 11912 -12806 92173 170466 84609
1476 84609 120482 3698 -220556 -92404 103032 117126 226782 245808 302387 227036 239192
1465 239192 224628 -66016 -286613 -269834 -34832 -103984 183535 249478 -75296 38688
1455 38688 -79612 -87526 168510 229724 -13876 -271639 -415893 -217997 -100049 -103105 21594
1444 21594 -106957 180559 148666 20246 -214520 60003 204683 352643 228482 63607
1434 63607 11175 -115471 171623 290382 245467 49985 32864 130302 148483 15904 31348
1423 31348 60630 -35463 -85906 -161368 -59442 284236 172502 53652 224566 296740 -37271
1412 -37271 23187 -231858 104296 -91763 -137856 -59806 -134387 -182496 -41445 -193447 -97192
$$ packed form
1487g8381o4701J79710K70054J00564k32123j45650j7561k4718J04979P8293q5857
1476H4609L5873j16784k24254J28152J95436J4094J09656J9026N6579p5351J2156
1465B39192j4564k90644k20597J6779K35002o9152K87519O5943l24774J13984
1455C8688j18300p914K56036O1214k43600k57763j44254J97896J17948l056J24699
1444B1594j28551K87516l1893j28420k34766K74523J44680J47960j24161j64875
1434F3607n2432j26646K87094J18759m4915j95482j7121R7438J8181j32579J5444
1423C1348K9282r6093n0443p5462J01926L43678j11734j18850J70914P2174l34011
1412c7271O0458k55045L36154j96059m6093P8050p4581m8109J41051j52002R6255
$$ plain form
1401 -97192 -29281 -135308 -149270 -164882 -137831 -46497 -24280 -44603 -49305 -116890 2477 14629
1389 14629 10523 -180912 -172303 200323 232763 16351 -43070 -20288 214517 97296 100393
1378 100393 172587 127935 -119338 -107764 -113679 -232323 76875 61972 21498 79118 -75390
1367 -75390 -108908 -82776 73209 186893 293390 167371 184827 262399 439061 442956 337465
1356 337465 48203 164366 111457 -17885 -73355 54832 2952 24675 -132919 -213403 -121046
1345 -121046 98184 195075 291561 78882 52188 119943 236373 -17428 -145014 -38555
1335 -38555 84160 113650 220739 241446 143254 164915 339686 -44761 37735 342561 195057
1324 195057 111511 78138 154679 129682 -29995 41949 171808 101082 -84505 -52873 139416
$$ packed form
1401i7192O7911j06027j3962j5612K7051R1334K2217k0323m702o7585J19367J2152
1389A4629m106j91435Q609L72626L2440k16412n9421K2782K34805j17221L097
1378A00393P2194m4652k47273J1574n915j18644L09198j4903m0474N7620j54508
1367g5390l3518K6132J55985J13684J06497j26019J7456P7572J76662L895j05491
1356C37465k89262J16163n2909j29342n5470J28187n1880K1723j57594q0484R2357
1345a21046K19230R6891R6486k12679k6694O7755J16430k53801j27586J06459
1335c8555J22715K9490J07089K0707r8192K1661J74771l84447Q2496L04826j47504
1324A95057q3546l3373P6541k4997j59677P1944J29859p0726j85587L1632J92289
$$ plain form
1313 139416 -183455 -33131 -35851 -187661 -46189 -142079 -160166 -20658 -4787 56077 -154064
1302 -154064 91614 -52725 -208211 -236838 -123665 -155594 -168673 -168913 -139869 -112967 -155456
1291 -155456 -208779 -172401 -118878 92192 83037 -72026 11095 137562 126144 39800 -62287
1280 -62287 -139717 -503946 -284266 -87549 529 40115 -7740 20881 56172 -63618 37396
1269 37396 112206 165961 97976 37209 13687 95704 130027 -338637 -385683 -216453 -100822
1258 -100822 -46435 50545 -44749 -63555 -130247 -120067 74551 11054 -17086 -11775 22504 -198368
1246 -198368 -204235 -101607 -202810 -51782 -180957 -289099 22349 -215555 -119415 82598
1236 82598 -84503 -170041 -16913 131310 -68544 -70767 -75228 6491 24811 -23939 -166384
$$ packed form
1313A39416l22871J50324k720j51810J41472r5890j8087J39508J5871O0864k10141
1302a54064K45678j44339j55486k8627J13173l1929j3079k40K9044K6902m2489
1291a55456n3323L6378N3523K11070r155j55063Q3121J26467j1418q6344j02087
1280f2287p7430l64229K19680J96717Q8078L9586m7855K8621L5291j19790J01014
1269C7396P4810N3755o7985o0767k3522Q2017L4323m68664m7046J69230J15631
1258a00822N4387R6980r5294j8806o6692J0180J94618o3497k8140N311L4279k20872
1246a98368n867J02628j01203J51028j29175j08142L11448k37904R6140K02013
1236H2598j67101q5538J53128J48223j99854k223m461Q1719J8320m8750j42445
$$ plain form
1225 -166384 5550 121035 176643 168363 -9931 -58036 -59852 -42589 15018 181746 76720
1214 76720 -102848 147717 165084 -62441 -187682 37138 91597 215339 205350 168878 94898
1203 94898 -128068 102263 46043 76453 325204 232444 102620 3436 -202948 -156171 -108789
1192 -108789 -53522 77347 -168357 -143264 135406 90770 -32175 -112362 -19147 -35834 -115026
1181 -115026 -143342 -22372 26653 77637 85346 -49938 -32319 35914 160748 163796 21826
1170 21826 -253885 -243514 -30712 -48061 46632 111389 141183 18127 -51549 -161790 28124
1159 28124 136731 113697 126086 -11323 157365 142839 47787 4269 123108 228944 139497
1148 139497 -15859 -91069 -315490 -93911 -69092 40881 119567 -93133 -37732 -61314 -55992
$$ packed form
1225a66384J71934J15485N5608q280j78294m8105j816J7263N7607J66728j05026
1214G6720j79568K50565J7367k27525j25241K24820N4459J23742r989l6472p3980
1203I4898k22966K30331n6220L0410K48751r2760j29824r9184k06384M6777M7382
1192a08789N5267J30869k45704K5093K78670m4636j22945q0187R3215j6687p9192
1181a15026k8316J20970M9025N0984P709j35284J7619O8233J24834L048j41970
1170B1826k75711J0371K12802j7349R4693O4757K9794j23056o9676j10241J89914
1159B8124J08607k3034J2389j37409J68688j4526r5052m3518J18839J05836q9447
1148A39497j55356p5210k24421K21579K4819J09973P8686k12700N5401k3582N322
$$ plain form
1137 -55992 -180302 -30066 27591 -155748 122412 168063 158202 9154 223547 151995 26359
1126 26359 -83796 -31047 68872 74820 -159699 -110994 -113981 51312 53287 45001 162611 92001
1114 92001 132260 193965 227033 -106632 -87741 25338 -8035 -63290 150348 51518 -53249
1103 -53249 191221 -145512 -234680 40500 -169750 -253009 -345201 -303362 8888 -97998 -313696
1092 -313696 -75994 -262338 -183607 35599 66064 82074 -74767 -190926 -163798 13911
1082 13911 257987 167978 13704 -146791 -31367 88165 -606 -144921 -307250 -168882
1072 -168882 -205303 -214691 -258716 -403974 -46410 -90468 -91759 -222402 -232638 -62619 125100
1061 125100 43030 85523 7136 -2412 -158653 -355719 -336309 -341260 -9217 -14971 -181532
$$ packed form
1137e5992j24310J50236N7657j83339K78160M5651r861j49048K14393p1552j25636
1126B6359j10155N2749R9919N948k34519M8705k987J65293J975q286J17610p0610
1114I2001M0259O1705L3068l33665J8891J13079l3373n5255K13638r8830j04767
1103e3249K44470l36733q9168K75180k10250q3259r2192M1839L12250j06886k15698
1092c13696K37702j86344P8731K19206L0465J6010j56841j16159K7128J77709
1082A3911K44076r0009j54274j60495J15424J19532q8771j44315j62329J38368
1072a68882l6421r388m4025j45258L57564m4058j291j30643j0236J70019J87719
1061A25100q2070M2493p8387r548j56241j97066J9410m951L32043n754j66561
$$ plain form
1050 -181532 -211630 68548 342593 37405 -7964 140503 169337 213359 -29609 -242158
1040 -242158 -414612 -248985 -267521 -183793 -141219 -259894 -129302 -52024 -58546 -180861 -82516
1029 -82516 -174218 -90319 -106037 -83117 -207825 -29068 5017 -172174 -49609 -260701 -70248
1018 -70248 -109407 -391898 -128225 178563 34700 -234922 -96893 -28714 -150772 92979
1008 92979 74803 25882 -24396 2941 -165674 -201922 -89992 -360154 -366929 -108905 -221253
997 -221253 -215300 -230566 -418018 -326423 -178972 -260327 -184760 -81941 51665 138509 -197990
986 -197990 -254127 -115913 -144832 -5799 42292 157536 -20103 -140708 137752 -120546
976 -120546 -435477 -66992 48812 76532 151229 119117 107394 -30641 -125882 -67222 43381
$$ packed form
1050a81532l0098K80178K74045l05188m5369J48467K8834M4022k42968k12549
1040b42158j72454J65627j8536Q3728M2574j18675J30592P7278o522j22315R8345
1029h2516r1702Q3899j5718K2920j24708J78757L4085j77191J22565k11092J90453
1018g0248l9159k82491K63673L06788j43863k69622J38029O8179j22058K43751
1008I2979j8176m8921n0278K7337j68615l6248J11930k70162o775K58024j12348
997b21253N953j5266j87452R1595J47451q1355P5567J02819J33606Q6844l36499
986a97990n6137J38214k8919J39033M8091J15244j77639j20605K78460k58298
976a20546l14931L68485J15804K7720P4697l2112j1723j38035r5241N8660J10603
$$ plain form
965 43381 104381 115613 45780 44262 191586 189439 65015 93482 44154 -128758 -10506 79918
953 79918 123280 86306 -347484 -582871 -459690 -177667 -14174 7085 -216177 -286087 -45325
942 -45325 129185 61831 8874 -138661 -63993 -21261 139828 236359 136161 429115 292827
931 292827 166947 -67174 -344726 -424934 -264646 -174982 -445427 -322062 -48668 48732
921 48732 -10176 -223115 -223621 -44184 -239142 -33305 -140191 -63317 71799 87485 213391
910 213391 125314 89587 15487 -32202 84463 33986 76734 11651 -10118 28517 -96441
899 -96441 -178613 -152757 171532 -195632 -286235 -112363 -142593 -120646 -46283 30483 197100
888 197100 -55624 100669 55728 54287 219535 77390 88996 -171375 -387288 -289143 -180617
$$ packed form
965D3381O1000J1232o9833j518J47324k147j24424K8467m9328j72912J18252R0424
953G9918M3362l6974m33790k35387J23181K82023J63493K1259k23262o9910K40762
942d5325J74510o7354n2957j47535P4668M2732J61089R6531j00198K92954j36288
931B92827j25880k34121k77552q0208J60288Q9664k70445J23365K73394R7400
921D8732n8908k12939n06J79437j94958K05837j06886P6874J35116J5686J25906
910B13391q8077l5727p4100m7689J16665n0477M2748o5083k1769L8635j24958
899i6441q2172K5856L24289l67164r0603J73872l0230K1947P4363P6766J66617
888A97100k52724J56293m4941j441J65248j42145J1606k60371k15913R8145J08526
$$ plain form
877 -180617 -138306 -139766 -196533 -94327 -69278 -93137 -174043 -124130 -270436 -171519 52951
866 52951 -138018 -236568 -148290 143787 88750 114255 28159 164610 75652 172424 109304
855 109304 -135542 -23265 34287 -15214 6111 -283764 -210759 -146580 -112500 -48602 127035
844 127035 120262 -64836 -32921 24561 96028 -205191 -421919 -217765 -140814 32249 52744
833 52744 96156 32532 -194778 -77378 -176521 -165609 -159046 -32626 -306588 -194120 -241388
822 -241388 -117259 -51339 198087 161900 -158945 -256733 -68645 -175555 -175034 -152552 33263
811 33263 246442 358275 284476 172106 266524 124622 -50338 51068 -15467 -35052 36090
800 36090 92360 -44940 -197044 -196193 -366304 -267275 -196399 -381286 -96326 -101271 7133
$$ packed form
877a80617M2311j460n6767J02206K5049k3859q0906M9913j46306R8917K24470
866E2951j90969r8550Q8278K92077n5037K5505q6096J36451q8958R6772o3120
855A09304k44846J12277N7552m9501K1325k89875P3005O4179L4080O3898J75637
844A27035o773j85098L1915N7482P1467l01219k16728K04154P6951J73063K0495
833E2744M3412o3624k27310J17400r9143J0912O563J26420k73962J12468m7268
822b41388J24129O5920K49426l6187l20845r7788J88088j06910N21K2482J85815
811C3263K13179J11833p3799j12370R4418j41902j74960J01406o6535j9585P1142
800C6090N6270j37300j52104Q51j70111R9029P0876j84887K84960m945J08404
$$ plain form
789 7133 77800 -134039 -190416 -128091 108428 74687 -29586 -38103 45503 80888 -38752 -296843
777 -296843 -120422 -26095 -310277 -245065 -146360 -182889 -64530 -61717 -164447 -40411 -272070
766 -272070 -269034 -12124 -90077 -132892 -67588 -86683 -420581 -561624 -678751 -107272 -11075
755 -11075 -66388 31038 -122876 -141019 -116688 6221 -65883 -213839 -133855 -91392 -72199
744 -72199 -44881 -234627 -342204 -43429 -105415 -85897 -68371 -231095 -186670 -236974 -99650
733 -99650 -79340 243946 157733 -24476 -141416 78850 264180 216208 129474 176920 220988
722 220988 -191091 -361296 -145916 -319358 -182207 40076 33018 121147 68845 163192 -44642
711 -44642 -33210 48498 -64435 186871 65096 -187755 -233629 -406708 -250872 -227572 -203359
$$ packed form
789G133P0667k11839n6377O2325K36519l3741j04273q517Q3606L5385j19640k58091
777b96843J76421R4327k84182O5212R8705l6529J18359K813j02730J24036k31659
766b72070L036K56910p7953m2815O5304j9095l33898j41043j17127N71479R6197
755a1075n5313R7426j53914j8143K4331J22909p2104j47956P9984M2463J9193
744g2199K7318j89746j07577K98775o1986J9518J7526j62724M4425n0304J37324
733i9650K0310L23286q6213j82209j16940K20266J85330m7972q6734M7446M4068
722B20988m12079j70205K15380j73442J37151K22283p058Q8129n2302R4347k07834
711d4642J1432Q1708j12933K51306j21775k52851m5874j73079J55836K3300K4213
$$ plain form
700 -203359 -158495 20773 305986 234683 -52017 102061 84650 28128 150399 76169 -109396
689 -109396 164973 7525 -170726 -150763 22624 -57304 88208 -357183 -621119 -144562
679 -144562 195168 192592 195832 87531 -37776 -220538 -15032 -156459 -49094 -75855 -223375
668 -223375 -45042 -54315 27318 -120054 -257133 -124664 -234561 -164043 77577 -11974 -159264
657 -159264 -80997 31397 -56213 16481 112010 -67283 -133263 -76919 -165550 -110046 40930
646 40930 -54159 -238201 -264453 -148773 -216818 -52041 26169 5845 58713 -198684 -179551
635 -179551 -310043 -190483 -42058 31156 35731 84027 152503 -39821 -337043 -50799 -221088
624 -221088 -50842 28031 219596 164061 -67290 -244424 -48164 108164 141242 186431 86061
$$ packed form
700b03359M4864J79268K85213p1303k86700J54078j7411n6522J22271p4230j85565
689a09396K74369j57448j78251J9963J73387p9928J45512m45391k63936M76557
679a44562L39730k576L240j08301j25307j82762K05506j41427J07365k6761j47520
668b23375J78333r273Q1633j47372j37079J32469j09897P0518K41620q9551j47290
657a59264P8267J12394q7610P2694R5529j79293o5980N6344q8631N5504J50976
646D0930r5089j84042k6252J15680o8045J64777P8210k0324N2868k57397J9133
635a79551j30492J19560J48425P3214M575M8296O8476j92324k97222K86244j70289
624b21088J70246P8873J91565n5535k31351j77134J96260J56328L3078M5189j00370
$$ plain form
613 86061 -201258 -323465 -414293 -442362 -233130 250558 15667 86852 -71224 -105769 88384
602 88384 212418 248598 208574 148506 -118806 -55842 106165 -23906 -163860 33714 235932
591 235932 173479 -91469 -392081 -367729 117813 245075 -75201 -153197 -64095 24041 43575
580 43575 -87918 76198 229162 100603 -122314 -65027 -21564 -83670 -137949 -121549 -70407
569 -70407 -130957 44451 271309 254066 11808 -251671 54709 184265 -84872 -139534 47939
558 47939 150751 130776 71451 7617 232304 112037 -152975 -58410 -95126 49859 -55484
547 -55484 -109468 11798 81543 -196143 -398926 -125981 63767 -34804 -10753 -114434 -324495
536 -324495 -141101 -20888 -95380 66177 12970 162539 174140 176850 101259 231165 35510
$$ packed form
613H6061k87319j22207r0828k8069K09232M83688k34891P1185j58076l4545J94153
602H8384J24034L6180m0024o0068k67312O2964J62007j30071j39954J97574K02218
591B35932o2453k64948l00612K4352M85542J27262l20276p7996Q9102Q8136J9534
580D3575j31493J64116J52964j28559k22917N7287M3463o2106n4279J6400N1142
569g0407o0550J75408K26858j7243k42258k63479L06380J29556k69137n4662J87473
558D7939J02812j9975n9325o3834K24687j20267k65012R4565l6716J44985j05343
547e5484n3984J21266O9745k77686k02783K72945J89748r8571K4051j03681k10061
536c24495J83394J20213p4492J61557n3207J49569J1601K710p5591J29906j95655
$$ plain form
525 35510 -148270 46035 152341 39661 -72115 75387 274742 354817 285050 157382
515 157382 -121801 -247987 -66909 -14601 -197998 -171745 -185125 130025 103731 -206736 49251
504 49251 254029 78155 -9176 60956 -233076 -124815 -239933 -314888 -30791 149092 -41874
493 -41874 119083 55067 -24718 -259680 -112517 447688 287157 152890 -79669 6335 -23164
482 -23164 -278491 -110934 -8556 58396 477 -79007 -89336 -94002 -151819 -333021 -242795
471 -242795 -329856 -340777 -106587 -145633 -86695 119747 -101742 -183737 42208 -44152 -258563
460 -258563 -194097 -135929 -276103 -172983 -219085 -261545 -161996 43259 17604 -14922 54802
449 54802 66186 -103404 -210300 -25327 46382 285386 -17138 -243033 -272536 -54436 -117431
$$ packed form
525C5510j83780J94305J06306j12680j11776J47502J99355Q0075o9767j27668
515A57382k79183j26186J81078N2308j83397K6253j3380L15150k6294l10467K55987
504D9251K04778j75874q7331P0132k94032J08261j15118p4955K84097J79883j90966
493d1874J60957o4016p9785k34962J47163N60205j60531j34267k32559Q6004k9499
482b3164k55327J67557J02378O6952n7919p9484j0329m666n7817j81202R0226
471b42795q7061j0921K34190l9046N8938K06442k21489q1995K25945q6360k14411
460b58563O4466N8168j40174J03120m6102m2460R9549K05255k5655l2526O9724
449E4802J1384j69590j06896J84973P1709K39004l02524k25895k9503K18100o2995
$$ plain form
438 -117431 147028 228225 93952 6239 -108871 -301684 -389304 -166023 15517 254579
428 254579 158006 370701 190499 -41478 102408 124102 -3982 215680 277743 380264
418 380264 203469 65984 110777 -147483 -228558 -282254 -59815 46664 129288 20825 46647
407 46647 4638 174199 143855 189861 42280 41412 130719 -77946 -112216 -165516 -120238 150490
395 150490 92503 -316936 -273041 -155024 125320 165037 229146 148202 255200 327911 174593
384 174593 194422 42893 149947 -28160 -9751 277438 117916 2214 202593 211908 -39682
373 -39682 -248426 -97584 103140 12227 135106 44892 109297 306145 274959 265507 424637
362 424637 468279 192705 107563 37565 71696 -289537 -287663 -319688 -29795 -149354 95607
$$ packed form
438a17431K64459Q1197j34273q7713j15110j92813q7620K23281J81540K39062
428B54579r6573K12695j80202k31977J43886K1694j28084K19662O2063J02521
418C80264j76795j37485M4793k58260q1075n3696K22439J06479Q2624j08463K5822
407D6647m2009J69561l0344M6006j47581q68Q9307k08665l4270n3300M5278K70728
395A50490n7987m09439M3895J18017K80344L9717O4109q0944J06998P2711j53318
384A74593J9829j51529J07054j78107J8409K87189j59522j15702K00379R315k51590
373c9682k08744J50842K00724r0913J22879r0214O4405J96848l1186r452J59130
362D24637M3642k75574q5142o9998L4131l61233J874l2025K89893j19559K44961
$$ plain form
351 95607 127757 98577 154517 -260946 -285276 -198915 23761 146760 101770 173374 105697
340 105697 271951 105444 -25822 -94278 65487 165938 91365 154083 95741 32448 95490
329 95490 29076 -122946 -85367 193158 287549 214194 177815 88047 347435 376121 153420
318 153420 -138728 202491 158697 260438 57681 252918 157706 26315 107508 -2846
308 -2846 -197535 -208593 -32579 223581 467219 407734 130168 -70726 -47591 -45993 -224704
297 -224704 -124406 32192 181288 33363 -184588 45646 183629 48873 255975 199259
287 199259 121284 -191617 -265992 -259706 -34715 -48205 -110952 142479 150348 -34380 62478
276 62478 168757 171981 147524 212694 -122672 -129290 41337 89697 304102 238203 213195 353914
$$ packed form
351I5607L2150k9180N5940m15463k4330Q6361K22676J22999m4990P1604o7677
340A05697J66254j66507j31266o8456J59765J00451p4573O2718n8342o3293O3042
329I5490o6414j52022L7579K78525R4391p3355l6379q9768K59388K8686k22701
318A53420k92148L41219m3794J01741k02757J95237r5212j31391Q1193j10354
308b846j94689j1058J76014K56160K43638n9485k77566k00894K3135J598j78711
297b24704J00298J56598J49096j47925k17951K30234J37983j34756K07102n6716
287A99259p7975l12901p4375O286K24991j3490o2747K53431P869j84728R6858
276F2478J06279L224k4457O5170l35366o618J70627M8360K14405o5899k5008J40719
$$ plain form
264 353914 259390 31556 88309 199998 -93088 -377152 -147395 -229431 -62239 129006
254 129006 192684 311350 197699 -34009 -46233 -143853 -19222 155057 45598 -220636
244 -220636 -303762 67581 147823 72714 117586 123883 166840 -24167 107898 -10683 76934
233 76934 -3904 196871 399524 385398 243604 390026 396986 261608 191576 291509 401324
222 401324 333198 335380 158292 39076 116643 127770 29336 44805 -112791 -132189 -150408
211 -150408 -327346 -191594 -73359 -15310 258996 368904 128117 174746 231840 320175 220975
200 220975 38382 71727 -117802 -154668 -182910 105479 280797 28699 155231 346769
190 346769 416925 213770 -36486 -87387 -66009 58119 -97160 122867 179401 71806 133251
$$ packed form
264C53914r4524k27834N6753J11689k93086k84064K29757q2036J67192J91245
254A29006O3678J18666j13651k31708j2224r7620J24631J74279j09459k66234
244b20636q3126L71343Q0242p5109M4872O297M2957j91007J32065j18581Q7617
233G6934q0838K00775K02653j4126j41794J46422O960j35378p0032R9933J09815
222D01324o8126K182j77088j19216P7567J1127r8434J5469j57596j9398j8219
211a50408j76938J35752J18235N8049K74306J09908k40787M6629N7094Q8335r9200
200B20975j82593L3345j89529l6866k8242K88389J75318k52098J26532J91538
190C46769P0156k03155k50256n0901K1378J24128j55279K20027N6534j07595O1445
$$ plain form
179 133251 184537 267844 338404 414738 191276 177452 54913 -184301 -127267 -23384 119637
168 119637 220354 397602 330593 401247 628063 436007 101077 -140756 49763 65622
158 65622 156843 -94774 12936 315847 313471 214472 177120 247657 155375 237644 121690
147 121690 -39120 136774 -80919 30897 -115005 -161846 96730 184429 261206 20584
137 20584 -108761 -120454 -28870 -83472 -230454 78667 -31485 34728 31570 16794 156447
126 156447 -109100 27750 48152 250773 261762 158572 -17554 -40766 -207626 -464
116 -464 194089 60898 -26618 54430 -106726 -135416 -57092 8316 121885 238836 317537
105 317537 196234 132439 261173 292309 262645 20538 -26827 -60396 47597 58145 -70171
$$ packed form
179A33251N1286Q3307P0560P6334k23462j3824j22539k39214N7034J03883J43021
168A19637J00717J77248o7009P0654K26816j92056l34930k41833J90519J5859
158F5622R1221k51617J07710L02911k376r8999l7352P0537r2282Q2269j15954
147A21690j60810J75894k17693J11816j45902m6841K58576Q7699P6777k40622
137B0584j29345j1693R1584n4602j46982L09121j10152O6213l158j4776J39653
126A56447k65547J36850K0402K02621J0989j03190j76126k3212j66860K07162
116d64J94553j33191q7516Q1048j61156k8690P8324O5408J13569J16951P8701
105C17537j21303o3795J28734L1136k9664k42107m7365l3569J07993J0548j28316
$$ plain form
94 -70171 -45461 65835 247819 261555 281711 210727 84910 62548 231501 151420 210619
83 210619 296618 159878 135638 138621 239069 164403 93303 66763 -62372 -32339 75134
72 75134 188574 302390 90138 160039 273516 373301 185616 133456 266191 265667 206042
61 206042 217075 121508 33226 4985 195065 81921 82890 -6321 -3282 95696 98545 30357
49 30357 -125373 92543 -93671 74556 203674 348064 96463 129058 232720 102725
$$ packed form
94g0171K4710J11296J81984J3736K0156p0984j25817k2362J68953q0081N9199
83B10619Q5999j36740k4240K983J00448p4666p1100k6540j29135L0033J07473
72G5134J13440J13816k12252O9901J13477R9785j87685n2160J32735n24n9625
61B06042J1033r5567q8282k8241J90080j13144R69q9211L039R8978K849o8188
49C0357j55730K17916j86214J68227J29118J44390k51601L2595J03662j29995
$$ [...]
##END NTUPLES=NMR SPECTRUM
##END=
