##TITLE=1H_CA-9379-11-2
 200.13MHz, CDCl3,
 8 sc
 
 12.9.2025
##JCAMPDX= 6.0         $$ Bruker NMR JCAMP-DX V2.0
##DATA TYPE= NMR SPECTRUM
##DATA CLASS= NTUPLES
##ORIGIN= UXNMR, Bruker Analytische Messtechnik GmbH
##OWNER= pz
$$ XWIN-NMR		Version 3.5
$$ Fri Sep 12 13:40:27 2025 Russian Standard Time (UT+4h)  she@DPX200
##.OBSERVE FREQUENCY= 200.1313
##.OBSERVE NUCLEUS= ^1H
##.ACQUISITION MODE= SIMULTANEOUS
##.ACQUISITION SCHEME= undefined
##.AVERAGES= 8
##.DIGITISER RES= 18
##SPECTROMETER/DATA SYSTEM= spect
##.PULSE SEQUENCE= zg30
##.SOLVENT NAME= CDCl3
##.SHIFT REFERENCE= (INTERNAL, CDCl3, 0, 15.4736)
##AUDIT TRAIL= $$ (NUMBER, WHEN, WHO, WHERE, WHAT)
$$ ##TITLE= Audit trail, XWIN-NMR		Version 3.5
$$ ##JCAMPDX= 5.01
$$ ##ORIGIN= Bruker BioSpin GmbH
$$ ##OWNER= she
$$ F:/spectra/data/she/nmr/H-C/1/pdata/1/auditp.txt
$$ ##AUDIT TRAIL=  $$ (NUMBER, WHEN, WHO, WHERE, WHAT)
(   1,<2025-09-12 13:38:56.64 +0400>,<she>,<DPX200>,
      <created by zg, POWCHK disabled, PULCHK disabled
       configuration hash MD5:
       00 E9 B6 7A A2 85 ED C7 34 08 36 98 17 FE 4E 26
       data hash MD5: 16K
       A2 29 95 2E 00 87 C0 73 49 95 C2 67 10 DB E4 46>)
(   2,<2025-09-12 13:38:58.87 +0400>,<she>,<DPX200>,
      <Start of raw data processing
       efp BC_mod = 2 LB = 0.25 FT_mod = 6 PKNL = 1 PHC0 = -1562.031 PHC1 = 9.39226 SI = 16K 
       data hash MD5: 16K
       43 B5 C5 10 E4 C3 BC C1 E1 17 EC 77 BE A2 F2 89>)
(   3,<2025-09-12 13:39:23.60 +0400>,<she>,<DPX200>,
      <pk PHC0 = 2.51001 PHC1 = 2.8 
       data hash MD5: 16K
       1A 22 3A 0C 90 7A BC 1F 8E EC 2A FA A3 BB A9 2F>)
(   4,<2025-09-12 13:39:28.18 +0400>,<she>,<DPX200>,
      <abs ABSG = 5 
       data hash MD5: 16K
       0F 3A 30 89 C7 F5 63 73 F0 9B 94 98 BD 9F 89 77>)
$$ ##END=
$$ 
$$ hash MD5
$$ 76 44 24 76 52 18 E0 1B 8C 27 70 8C E6 85 CC 22
##$RELAX= 
##$RELAX= 
##$RELAX= 
##$RELAX= 
##$RELAX= 
##$RELAX= 
$$ Bruker specific parameters
$$ --------------------------
##$DU= <F:/spectra>
##$EXPNO= 1
##$NAME= <H-C>
##$PROCNO= 1
##$TYPE= <nmr>
##$USER= <she>
##$AMP= (0..31)
100 100 100 100 100 100 100 100 100 100 100 100 100 100 100 100 100 100 
100 100 100 100 100 100 100 100 100 100 100 100 100 100 
##$AQSEQ= 0
##$AQ_mod= 1
##$AUNM= <au_zg>
##$AUTOPOS= <>
##$BF1= 200.13
##$BF2= 200.13
##$BF3= 200.13
##$BF4= 200.13
##$BF5= 200.13
##$BF6= 200.13
##$BF7= 200.13
##$BF8= 200.13
##$BYTORDA= 1
##$CFDGTYP= 0
##$CFRGTYP= 5
##$CHEMSTR= <none>
##$CNST= (0..31)
1 1 145 1 1 1 1 1 1 1 1 1 1 1 1 1 1 1 1 1 1 1 1 1 1 1 1 1 1 1 1 1 
##$CPDPRG= <>
##$CPDPRG1= <>
##$CPDPRG2= <>
##$CPDPRG3= <>
##$CPDPRG4= <mlev>
##$CPDPRG5= <mlev>
##$CPDPRG6= <mlev>
##$CPDPRG7= <mlev>
##$CPDPRG8= <mlev>
##$CPDPRGB= <>
##$CPDPRGT= <>
##$D= (0..31)
0 0.7 0 0 0 0 0 0 0 0 0 0.03 0 0 0 0 0 0 0 0 0 0 0 0 0 0 0 0 0 0 0 0 
##$DATE= 1757669936
##$DBL= (0..7)
120 120 120 120 120 120 120 120 
##$DBP= (0..7)
150 150 150 150 150 150 150 150 
##$DBP07= 0
##$DBPNAM0= <>
##$DBPNAM1= <>
##$DBPNAM2= <>
##$DBPNAM3= <>
##$DBPNAM4= <>
$$ [...]
##$SUBNAM3= <"">
##$SUBNAM4= <"">
##$SUBNAM5= <"">
##$SUBNAM6= <"">
##$SUBNAM7= <"">
##$SUBNAM8= <"">
##$SUBNAM9= <"">
##$SW= 18.0517328524113
##$SWIBOX= (0..15)
0 0 2 0 0 0 0 0 0 0 0 0 0 0 0 0 
##$SW_h= 3612.71676300578
##$TD= 16384
##$TD0= 1
##$TE= 0
##$TE2= 300
##$TE3= 300
##$TEG= 300
##$TL= (0..7)
0 120 120 120 120 120 120 120 
##$TP= (0..7)
150 150 150 150 150 150 150 150 
##$TP07= 0
##$TPNAME0= <>
##$TPNAME1= <>
##$TPNAME2= <>
##$TPNAME3= <>
##$TPNAME4= <>
##$TPNAME5= <>
##$TPNAME6= <>
##$TPNAME7= <>
##$TPOAL= (0..7)
0.5 0.5 0.5 0.5 0.5 0.5 0.5 0.5 
##$TPOFFS= (0..7)
0 0 0 0 0 0 0 0 
##$TUNHIN= 0
##$TUNHOUT= 0
##$TUNXOUT= 0
##$USERA1= <user>
##$USERA2= <user>
##$USERA3= <user>
##$USERA4= <user>
##$USERA5= <user>
##$V9= 5
##$VALIST= <valist>
##$VCLIST= <CCCCCCCCCCCCCCC>
##$VD= 0
##$VDLIST= <DDDDDDDDDDDDDDD>
##$VPLIST= <PPPPPPPPPPPPPPP>
##$VTLIST= <TTTTTTTTTTTTTTT>
##$WBST= 1024
##$WBSW= 4
##$XGAIN= (0..3)
0 0 0 0 
##$XL= 0
##$YL= 0
##$YMAX_a= 464177
##$YMIN_a= -625047
##$ZGOPTNS= <>
##$ZL1= 120
##$ZL2= 120
##$ZL3= 120
##$ZL4= 120
##$ABSF1= 15.47915
##$ABSF2= -2.5727
##$ABSG= 5
##$ABSL= 3
##$ALPHA= 0
##$AQORDER= 0
##$ASSFAC= 0
##$ASSFACI= 0
##$ASSFACX= 0
##$ASSWID= 0
##$AUNMP= <proc_1d>
##$AZFE= 0.1
##$AZFW= 0.1
##$BCFW= 0
##$BC_mod= 2
##$BYTORDP= 0
##$COROFFS= 0
##$CY= -3
##$DATMOD= 1
##$DC= 0
##$DFILT= <>
##$DTYPP= 0
##$F1P= 0
##$F2P= 0
##$FCOR= 1
##$FTSIZE= 16384
##$FT_mod= 6
##$GAMMA= 0
##$GB= 0
##$INTBC= 1
##$INTSCL= 3.241238e-09
##$ISEN= 128
##$LB= 0.25
##$LEV0= 0
##$LPBIN= 0
##$MAXI= 10000
##$MC2= 0
##$MEAN= 0
##$ME_mod= 0
##$MI= 1.114404
##$NCOEF= 0
##$NC_proc= -7
##$NLEV= 6
##$NOISF1= 3.799351
##$NOISF2= 2.8
##$NSP= 0
##$NTH_PI= 0
##$NZP= 0
##$OFFSET= 15.47364
##$PC= 1
##$PHC0= -1559.521
##$PHC1= 12.19226
##$PH_mod= 1
##$PKNL= yes
##$PPARMOD= 0
##$PSCAL= 0
##$PSIGN= 0
##$REVERSE= no
##$SF= 200.130009617709
##$SI= 16384
##$SIGF1= 3
##$SIGF2= 2
##$SINO= 0.751879
##$SIOLD= 32768
##$SREGLST= <19F.Aceton>
##$SSB= 0
##$STSI= 16384
##$STSR= 0
##$SW_p= 3612.71676300578
##$SYMM= 0
##$S_DEV= 0
##$TDeff= 16384
##$TDoff= 0
##$TI= <>
##$TILT= no
##$TM1= 0
##$TM2= 0
##$TOPLEV= 0
##$USERP1= <user>
##$USERP2= <user>
##$USERP3= <user>
##$USERP4= <user>
##$USERP5= <user>
##$WDW= 1
##$XDIM= 16384
##$YMAX_p= 454952928
##$YMIN_p= -805051
$$ End of Bruker specific parameters
$$ ---------------------------------
##NTUPLES= NMR SPECTRUM
##VAR_NAME=  FREQUENCY,     SPECTRUM/REAL,   SPECTRUM/IMAG
##SYMBOL=    X,             R,               I
##VAR_TYPE=  INDEPENDENT,   DEPENDENT,       DEPENDENT
##VAR_FORM=  AFFN,          ASDF,            ASDF
##VAR_DIM=   16384,         16384,           16384
##UNITS=     HZ,            ARBITRARY UNITS, ARBITRARY UNITS
##FACTOR=    0.220516191357247, 1,           1
##FIRST=     3096.73981045732, 0,            0
##LAST=      -515.976952548457, 0,           0
##MIN=       -515.976952548457, -805051,     0
##MAX=       3096.73981045732, 454952928,    0
$$ Real data points
##PAGE= N=1
##DATA TABLE= (X++(R..R)), XYDATA
$$ [...]
7347A016063j073k11522M0827K06802j05184J47206O9001l03431m0864R8327j30508
7336G85644j26348n2160j30602P5203P8862m4722k9078q06J05449r7754J09407
7325F73095K34099R7240j69661k43732j98125K47497k6571k0488J42659m1200
7315F94813P7407l86676l0530J58498J78094L4811N0710J76923r8766k87804J65932
7304G33412Q8491k88169K4560M44455p2109L23546j63268o4067N1289p6746m6202
7293I55192O0605R5869j24935R9888j3508P9130j01265O6630N4796J2562o2241
7282A122723j43119K11182J53204N0188l3838j05282r2043r2241j26835l00300
7272F43639p6580J13936j78345R26K78088J72910J64465R5109P167l18192j30359
$$ y = [1016063, 1014990, 803468, 844295, 1051097, 945913, 1093119, 1162120, 858689, 817825, 916152, 785644, 659296, 607136, 476534, 551737, 630599, 585877, 556799, 555993, 661442, 563688, 673095, 907194, 1004434, 834773, 591041, 392916, 640413, 613842, 593354, 736013, 694813, 772220, 385544, 355014, 513512, 691606, 726417, 777127, 954050, 855284, 567480, 733412, 821903, 533734, 558294, 1002749, 930640, 1254186, 1090918, 1026851, 1078140, 1001394, 955192, 1015797, 1111666, 986731, 1086619, 1073111, 1152241, 1050976, 1117606, 1172402, 1184964, 1122723, 979604, 1190786, 1343990, 1394178, 1360340, 1255058, 1163015, 1070774, 943939, 643639, 567059, 680995, 502650, 503576, 781664, 954574, 1119039, 1214148, 1221315, 903123, 772764]
7261G72764R2178J28034k4195j04232k01358j27345O2472L2332L6778k57062J42669
7250E53035j3076k31244J00832K83961O387j53724J6196k39819L56659M13031
7240A092238k68080k86093o3607N3897J53387O591L4270J46990K28211K7888K6273
7229A151965j5366J22549k99703j63682L70820m4023J5789J55360J413K5444j77911
7218A142655n8321m3586j4954j19117J1328M6815o8832j1920L15104q5916k26302
7207H86954K75335J29858j8872K10633L0689j52389M39956P3012k31609j62243
7197A481324J02057J25526L8978J34520p8358j03429L36895J70292k10396J00816
7187B098225q516J91021J07118P3816k18088J54012J27979P0097J89913J12751
$$ y = [772764, 864942, 992976, 968781, 864549, 663191, 535846, 598318, 630650, 667428, 410366, 553035, 539959, 308715, 409547, 693508, 699895, 546171, 562367, 322548, 679207, 1092238, 824158, 538065, 474458, 528355, 681742, 688333, 722603, 869593, 1097804, 1125692, 1151965, 1136599, 1259148, 959445, 795763, 1166583, 1122560, 1138349, 1293709, 1295122, 1320566, 1142655, 1084334, 1040748, 1025794, 906677, 918005, 964820, 895988, 884068, 1199172, 1113256, 886954, 1162289, 1292147, 1273275, 1483908, 1514597, 1362208, 1802164, 1875176, 1643567, 1481324, 1583381, 1708907, 1747885, 1882405, 1804047, 1700618, 2037513, 2207805, 1997409, 2098225, 2089709, 2280730, 2387848, 2461664, 2243576, 2397588, 2525567, 2595664, 2785577, 2898328]
7177B898328O5620J78545J0581k47073o0378L37129M63554J08609N8574q3781
7167C729708O7392L63782O10412L80744L40327N4026L32696K36484M13933O47024
7157G176528O42479M76477P35502P59734Q99216J040245J291434J428375J447557
7148A5897547J858806J828249J951931K050183K765685L321343L811016M255458
7140C7740218M987072N794164O886397Q214285Q340528P193942L240633l68665
7132H2028574m136018q898931q468145n945170n273964m619397m071735l416655
7124C7198559k952250k555941k701236k890826k358535j688731j727857j468127
7116A8855056j308398j165895r25399r26360q89052q32648p92900q56978p03707
$$ y = [2898328, 2963948, 3142493, 3153074, 2906001, 2845623, 3182752, 3646306, 3754915, 3813489, 3729708, 3797100, 4160882, 4771294, 5152038, 5492365, 5546391, 5879087, 6115571, 6529504, 7176528, 7819007, 8295484, 9030986, 9790720, 10689936, 11730181, 13021615, 14449990, 15897547, 17756353, 19584602, 21536533, 23586716, 26352401, 29673744, 33484760, 37740218, 42727290, 48521454, 55407851, 63622136, 71962664, 79156606, 82397239, 82028574, 77892556, 68993625, 60525480, 54580310, 49306346, 44686949, 40615214, 37198559, 34246309, 31690368, 28989132, 26098306, 23739771, 22051040, 20323183, 18855056, 17546658, 16380763, 15455364, 14529004, 13639952, 12807304, 12014404, 11157426, 10453719]
7107A0453719m57713o11491l58096k82039m78471l29811k49823j32180k97970
7098G256125l68385j63387j60523n80276m53491k39227k20793m20307k92629Q9620
7088D446727j51816j8979n7571j50851k81974k00822J63362j65192J31306k08815
7078C505375k24172M3403m5152M2630l85859k58647j81031j08628K17166R7505
7068B702590j16309j19244j94223j66425J43467M5011q8895k45828R2415P0634
7058B123193Q2387j57615j64449K72666l47350k56619M1253j79058r439j12985
7048A291984L7570n4478K88780L7326l44967N086J71449p3957j97334J27336k96294
7037I92501J24553J0487j04206O7864J1205j04005O6509p5986j99990n5642M5461
$$ y = [10453719, 9996006, 9384515, 9026419, 8744380, 8265909, 7936098, 7686275, 7554095, 7256125, 6887740, 6724353, 6563830, 5983554, 5530063, 5290836, 5070043, 4649736, 4357107, 4446727, 4294911, 4275932, 4218361, 4067510, 3785536, 3584714, 3748076, 3582884, 3714190, 3505375, 3281203, 3324606, 3279454, 3322084, 2936225, 2677578, 2496547, 2387919, 2605085, 2702590, 2586281, 2467037, 2272814, 2106389, 2249856, 2294867, 2205972, 1960144, 2052559, 2123193, 2205580, 2047965, 1883516, 2156182, 1808832, 1552213, 1593466, 1414408, 1404969, 1291984, 1329554, 1275076, 1563856, 1601182, 1256215, 1261301, 1432750, 1358793, 1161459, 1288795, 992501, 1117054, 1127541, 1023335, 1091199, 1102404, 998399, 1064908, 988922, 788932, 733290, 778751]
7026G78751K04850J86934l5258j11493K60457k04663j92942j90065L07266L03521
7016A307358J28376j03184O866j047P0186k89217j17634N7130q0n2441L7855J94014
7004A238182j72175K63402m8218j47425j17761p8423J36478n2713k68849K51895
6994A004393q7547j39920M2227m1862J16595l4312L0669L8009J62709k2642k72860
6983G95459r7552O7532j10351l7000Q2564M7547J8054l53533N7053J09969J22648
6972G02390k4909j89337j88222J71541j7382j4600J46328J15750j4301k36027
6962D51231K09445K07923J6791j45932k7681r4615K1630R6373k34615M0369j42144
6951C98775K187P9909K18192J61810j61772k02640j26609Q0897Q775j40899N4062
$$ y = [778751, 983601, 1170535, 1135277, 1023784, 1284241, 1079578, 886636, 696571, 1003837, 1307358, 1435734, 1332550, 1339416, 1338369, 1408555, 1119338, 1001704, 1058834, 1058754, 1006313, 1044168, 1238182, 1066007, 1329409, 1281191, 1133766, 1016005, 937582, 1074060, 1021347, 752498, 1004393, 916846, 776926, 819153, 777291, 893886, 859574, 890243, 928252, 1090961, 1068319, 795459, 697907, 765439, 655088, 618088, 700652, 748199, 766253, 412720, 469773, 579742, 702390, 677481, 488144, 299922, 471463, 454081, 439481, 585809, 701559, 687258, 451231, 660676, 868599, 885390, 739458, 711777, 617162, 638792, 735165, 500550, 540919, 398775, 400962, 480871, 699063, 860873, 699101, 496461, 369852, 450749, 459524, 318625, 372687]
6940C72687J44930j52927p481J14908J4425n3286K52858j57794l97538P1277O9816
6929B71875r839r4143k2270R6726L01884N5673k13502k44993J53750J40306j35957
6918B99510p7955o3713P0253k4342J72506J07927j11062k87218r9827N0289J07514
6907A43882j59790K51512l1565J57466K2356k53718l0198J41568K69395j05479
6897D05429k1122P6475Q8944m52703P8223L35815M203N8151Q051j74296j49534
6886B57636J07162k4556k4198J40638l21056J10220K65545N0249q6325j90384
6876B84931J66972j01869j43612j8782J42196L00846k50650J5858j003N7029J92252
6865F44168j44843k67073J79161o2423O3394l2941o4044o1076j70578J60614q5426
$$ y = [372687, 517617, 364690, 357209, 472117, 486542, 433256, 686114, 528320, 130782, 202059, 271875, 262036, 167893, 145623, 242349, 544233, 599906, 386404, 141411, 295161, 435467, 299510, 221555, 157842, 228095, 203753, 376259, 484186, 373124, 85906, -13921, 36368, 143882, -15908, 235604, 204039, 361505, 383861, 130143, 99945, 241513, 510908, 405429, 384307, 460782, 549726, 97023, 175246, 511061, 515264, 573415, 581466, 407170, 257636, 364798, 340242, 316044, 456682, 135626, 245846, 511391, 561640, 475315, 284931, 451903, 350034, 206422, 187640, 329836, 630682, 380032, 395890, 394887, 451916, 644168, 499325, 232252, 411413, 348990, 412384, 379443, 315399, 254323, 83745, 244359, 158933]
6854A58933J73671k08169J45275k1862k4327N7623p600n8932O5293q2968j2879
6843A84058R6713O9316j61088J00660j40624j36898m0658J62443Q8840l0141J85806
6832C78427k07396Q768J1718r8957K0710J42274k0385R8901j20637M406Q8255
6821C06084j3294J29886N7403O9543k9729j56114j27060k1747k9253O6257L24064
6810E76040Q2505j90425j0029j62842j17668J62610R1997j26219J63032j70029
6800B98972N0336j2764O6852j6864r8650R1865k909M3267k2141J01117j6241K50229
6788G33069k04319j31473q7005Q0704K1862J39772K08210l09456q5571r0226J4783
6777B90350J77259j9116O443J47016K33808r1191l1258j16489j16090N5513J39038
$$ y = [158933, 332604, 124435, 269710, 247848, 223521, 281144, 273544, 214612, 279905, 196937, 184058, 280771, 350087, 188999, 289659, 149035, 12137, -28521, 133922, 222762, 192621, 378427, 171031, 179799, 191517, 92560, 113270, 255544, 235159, 334060, 213423, 217829, 306084, 292790, 422676, 480079, 549622, 519893, 363779, 236719, 214972, 185719, 251976, 576040, 658545, 468120, 458091, 295249, 177581, 340191, 432188, 305969, 469001, 298972, 349308, 336544, 403396, 386532, 287882, 379747, 376838, 420105, 397964, 499081, 482840, 733069, 528750, 397277, 310272, 390976, 412838, 552610, 760820, 451364, 365793, 275567, 290350, 467609, 448493, 454936, 601952, 835760, 744569, 713311, 596822, 480732, 536245, 675283]
6766F75283j17540m2935k66484j8266n3520k5757K88879j62550L1693J31138r7171
6755C42770O7467k11517M1977J43904j46428k03767L91414J54850k08988M7345
6745D19027j12303J23872m6504p9909l8553Q1874M63954R2276m5889j6156j50135
6734F91554J13089q8277n6447L6763J39236K48677k24266j20263l7722L0157m3106
6723F89395j55739o8118P7236J29628J04986Q3192j30814k51660O0365K1328K7740
6712E87539J3929J09796n8205m1059L2305J07812Q4835L7507L7530l66747J09148
6701F54390N1147j02354L05382M9780k37839k0518J9986L7313N2373j67974k5441
6690F16245M7721o4687L64219k63699l7279p2274K40335l2530p2608K15889k36164
$$ y = [675283, 557743, 514808, 248324, 230058, 176538, 150781, 439660, 277110, 308803, 439941, 342770, 410237, 198720, 240697, 384601, 238173, 34406, 425820, 580670, 371682, 419027, 306724, 430596, 384092, 304183, 265630, 347504, 811458, 903734, 857845, 841689, 691554, 804643, 716366, 659919, 696682, 835918, 1084595, 860329, 740066, 702344, 732501, 689395, 533656, 465538, 542774, 672402, 777388, 860580, 729766, 478106, 538471, 559799, 587539, 601468, 711264, 653059, 612000, 644305, 752117, 836952, 874459, 911989, 545242, 654390, 705537, 603183, 908565, 958345, 720506, 699988, 719974, 757287, 809660, 641686, 616245, 663966, 599279, 963498, 699799, 662520, 590246, 830581, 798051, 725443, 941332, 705168]
6679G05168r0619L19330k31523k7184K7242J43937j45540k75736P3906K48376
6669G47357k6361O9360P8916l4282P6507n1555j85379n8382l354K6054J92515
6658H31396J13649J65572j73200k51818j38319J42135P4991J75471j176j3033
6648I25668J03605l20892k9325L51717L262r0022r5116J36256j71409K10432j26971
6637H97205N1156j2979q3412q4324J32499l053n7741k41935o1186M10626k06168
6626G40688L7959K2694m2535m647o27j34870R8932m3156j99048K69971K44529
6615I89890j9515p9366l98332o4765M23264j5640j46839K17017K70999K28200
6605A404913m6831j08664l1259N8930Q5460k24556q4684R6137n151J55434M1382
$$ y = [705168, 614549, 933879, 702356, 675172, 702414, 846351, 700811, 425075, 498981, 747357, 720996, 790356, 869272, 834990, 911497, 859942, 674563, 616181, 612827, 638881, 831396, 945045, 1110617, 937417, 685599, 547280, 689415, 764406, 939877, 938701, 925668, 1029273, 708381, 679056, 1030773, 1034035, 944013, 848897, 985153, 813744, 1024176, 897205, 948361, 935382, 851970, 767646, 900145, 897092, 839351, 597416, 536230, 946856, 740688, 778647, 801341, 758806, 754159, 753532, 618662, 717594, 674438, 475390, 745361, 989890, 970375, 891009, 492677, 427912, 851176, 835536, 688697, 905714, 1176713, 1404913, 1358082, 1249418, 1218159, 1277089, 1362549, 1137993, 1053309, 1149446, 1144295, 1299729, 1341111]
6594A341111N6127q1079j7605J57528J75120k2695j55632P7554L57655p9063N7210
6583A866231P7141P2678J88979J80618Q6387Q6458K40610K76347J62953m4134
6573C194268L20823K67054Q1764N3002K24020O6307j03280l2685j59799m4988
6563C866486k23769l49294j78236J11291j88769m1014O0483l47048J76025K60727
6553C146882j01043j9891R9410j01718L36204j64754n3407j18174L27824L16718
6543C668051M24556J42247R444J45607K49150M9243P7546j61662k38764k30964
6533D134454j7412O0003n1680L2805Q9856r428k18053K9789k15340j14006q6618
6522C634370p0634k06990k09234P9277J7215k32392j35412l45332j12310K67739
$$ y = [1341111, 1397238, 1316159, 1298554, 1456082, 1631202, 1608507, 1452875, 1530429, 1888084, 1809021, 1866231, 1943372, 2016050, 2205029, 2385647, 2472034, 2558492, 2799102, 3075449, 3238402, 3194268, 3515091, 3782145, 3863909, 3916911, 4140931, 4207238, 4103958, 4071273, 3911474, 3866486, 3642717, 3293423, 3115187, 3226478, 3037709, 2996695, 3057178, 2710130, 2886155, 3146882, 3045839, 3025948, 3125358, 3023640, 3359844, 3195090, 3141683, 3023509, 3351333, 3668051, 4092607, 4234854, 4244298, 4389905, 4639055, 4688298, 4765844, 4604182, 4365418, 4134454, 4117042, 4177045, 4125365, 4158170, 4248026, 4238598, 4020545, 4050334, 3834994, 3720988, 3634370, 3563736, 3356746, 3147512, 3226789, 3244004, 3011612, 2876200, 2530868, 2418558, 2686297]
6512B686297K89106k04294K36826j36896n6530J38295k06139r1312J03169O7453
6502B825975n0073o8684M262m1412l03366j06024P5212j4165j66154K22451m9100
6491B328922m0583j0922j6297K1545m8863J87773N4457k40400j5314J24342m8834
6480B295826J65178P81j80516l2431j28457j70598K7965K59137L1360k3830Q8739
6469B333154j29169r6774J0819K73079k02603K0271j42380k0140j77719J07977
6459A976515J25415j90614j20649K00996M3572j28579l7734K50663K29495k89469
6449B059611n9777p6642j05008j40153M3707J59681J20463l0159O0082L9781J61379
6438B232965l34630j01168N2570N9618K18017j54612n2061N8455k5115m972L2918
$$ y = [2686297, 2975403, 2771109, 3007935, 2871039, 2814509, 2952804, 2746665, 2655353, 2758522, 2825975, 2775902, 2707218, 2711480, 2670068, 2366702, 2260678, 2335890, 2321725, 2155571, 2378022, 2328922, 2288339, 2277417, 2261120, 2282665, 2233802, 2421575, 2476032, 2235632, 2220318, 2344660, 2295826, 2461004, 2461785, 2281269, 2248838, 2120381, 1949783, 1977748, 2236885, 2268245, 2244415, 2333154, 2203985, 2107211, 2118030, 2391109, 2188506, 2208777, 2066397, 2046257, 1868538, 1976515, 2101930, 1911316, 1790667, 1991663, 2035235, 1906656, 1868922, 2119585, 2349080, 2059611, 1999834, 1923192, 1818184, 1678031, 1721738, 1881419, 2001882, 1971723, 2031805, 2071586, 2232965, 1898335, 1797167, 1849737, 1909355, 2127372, 1972760, 1920699, 1979154, 1954039, 1949067, 1981985]
6427A981985l37168k429L89830L35445o3451k1851J13547q3594k65200L17151
6417B364265K39668j71136m15985J37111j0160n6234o3942R5651J1232J58540
6407B289010J03062k18080q4606J20662K49351J32770k54162M28862K83102k20618
6397B829353J32850k27215k7653Q085J93053Q1289L92270J85886J67596O3482
6387C798996r5201O0779K87670J72217N74757Q5346K06553L12666K67889J95192
6377E866864O09146L66024K55730J50658j62834k74694l56385m02376o4597l92068
6367E595468l28346n22417K6939k31193k31686k51579j49744k17867l18957o0206
6357C310412J62465O5227k40865m8599P4031k67399k47588j05356k81083K55808
$$ y = [1981985, 1644817, 1642388, 2032218, 2367663, 2304212, 2282361, 2395908, 2312314, 2047114, 2364265, 2603933, 2432797, 2016812, 2153923, 2143763, 2087529, 2023587, 2119238, 2130470, 2289010, 2392072, 2173992, 2089386, 2210048, 2459399, 2592169, 2338007, 2766869, 3049971, 2829353, 2962203, 2734988, 2707335, 2715420, 2908473, 2989762, 3382032, 3567918, 3735514, 3798996, 3703795, 3764574, 4052244, 4224461, 4799218, 4884564, 5091117, 5403783, 5671672, 5866864, 6476010, 6842034, 7097764, 7248422, 7085588, 6810894, 6454509, 6052133, 5987536, 5595468, 5267122, 4744705, 4771644, 4540451, 4308765, 4057186, 3907442, 3689575, 3370618, 3310412, 3472877, 3538104, 3297239, 3248640, 3322671, 3055272, 2807684, 2702328, 2421245, 2677053]
6347B677053k51339M4418J13219L28095O6314j788k70291j46747j75485j99013
6337B184436P2008K60211R1833r7441j27950k05487j7635q7638o178R0408K14703
6326B371270q9317O3336L8657l23142J19027m2066K11123k05881J13949K17731
6316B474687J47088j87570P1082k33506L288j34240j4285K13462m8435K2199r4168
6305B219602L38698l969R8432J49146O4190j72036O7819J29847r6414O7017J65608
6294C027940k35471J99293M9296k4889K12477J61328k55706P8908m764k68484
6284B939928K90790J74337j10338k4048J2447n7343J83784L8601k5653K65813
6274C688318J23988l7302K78871j29207K55962j05921J24220J28856P0339L35753
$$ y = [2677053, 2425714, 2470132, 2583351, 2911446, 2977760, 2975972, 2705681, 2558934, 2383449, 2184436, 2256444, 2516655, 2608488, 2511047, 2383097, 2177610, 2159975, 2072337, 2066159, 2156567, 2371270, 2281953, 2345289, 2383946, 2060804, 2179831, 2137765, 2348888, 2143007, 2256956, 2474687, 2621775, 2434205, 2505287, 2271781, 2275069, 2140829, 2126544, 2340006, 2291571, 2313770, 2219602, 2558300, 2554331, 2652763, 2801909, 2866099, 2694063, 2761882, 2891729, 2795315, 2862332, 3027940, 2792469, 2991762, 3041058, 3016169, 3228646, 3389974, 3134268, 3213176, 3208412, 2939928, 3230718, 3405055, 3294717, 3270669, 3283116, 3225773, 3409557, 3448158, 3422505, 3688318, 3812306, 3775004, 4053875, 3924668, 4180630, 4074709, 4198929, 4327785, 4398124, 4733877]
6264D733877J19171r4418J92697r758p1546j31214l83452L7343K68942J22674
6254D784316l7074k0314N9168O3067j09384J87258l012J51363J23989J78056R7058
6243E474491K37605O9763J68340J68784M26027R1327j21093L5010J50189o4670
6233F635773j72090q1792j59711M0294q2190k45048j98218p4929K33826p2750
6223E823165k07046J8209K75945K69522J8595p2457J47920K7004j21778q541L5221
6212F205759K24836L37333K45060k09275O147n8126k24542k54390N8882n2995
6202F278689Q012k24479j20362k48543o4370j44961l2582r1137j27772J10184
6192E342679P8036J62917M3631O2418K49710j73998j38387J95930k52666Q8607
$$ y = [4733877, 4853048, 4758630, 4951327, 4941569, 4870023, 4738809, 4355357, 4392700, 4661642, 4784316, 4747242, 4726928, 4786096, 4849163, 4739779, 4927037, 4924025, 5075388, 5199377, 5377433, 5474491, 5712096, 5781859, 5950199, 6118983, 6545010, 6636337, 6515244, 6550254, 6700443, 6635773, 6463683, 6381891, 6222180, 6262474, 6180284, 5935236, 5737018, 5662089, 5895915, 5823165, 5616119, 5634328, 5910273, 6179795, 6198390, 6125933, 6273853, 6300857, 6179079, 6170538, 6205759, 6430595, 6767928, 7012988, 6803713, 6809860, 6751734, 6527192, 6272802, 6331684, 6278689, 6286701, 6062222, 5941860, 5693317, 5628947, 5483986, 5451404, 5360267, 5232495, 5342679, 5420715, 5583632, 5627263, 5689681, 5939391, 5765393, 5627006, 5822936, 5570270, 5658877]
6182E658877N9815j14438K08345l7113k07959j76438n025j17409j96031j25576
6172D947048J15602J78147J10550p9241k02168k5589J2557J4911K61302K01760
6162E534879m16994j18445L9037L89943m3752J24559j69496J72614k17425k11698
6152E083222P9035m3363L24299j87437j52992j42608o2422J90822m1262L7144
6142E084438q2030L42967J00090m31612k9376J44937N7758O4008k4322J97784
6132E424642L04j12573K35424N5924k41397j22396m2899J11809N02425j09083
6122E702180J988M6097J58452Q897K7992O2929r5803j2343j40831J05377K72029
6111F136964J59274m1560N7136Q4389j125R3728O5486J36959p2152J58572L85702
$$ y = [5658877, 5718692, 5604254, 5812599, 5775486, 5567527, 5391089, 5386064, 5268655, 5072624, 4947048, 5062650, 5240797, 5351347, 5272106, 5069938, 5044349, 5056906, 5071817, 5333119, 5534879, 5117885, 4999440, 5038477, 5428420, 5384668, 5509227, 5339731, 5512345, 5294920, 5083222, 5162257, 5118894, 5443193, 5255756, 5102764, 4960156, 4897734, 5088556, 5047294, 5084438, 5002408, 5345375, 5445465, 5013853, 4984477, 5129414, 5187172, 5251180, 5226858, 5424642, 5424946, 5312373, 5547797, 5603721, 5362324, 5239928, 5197029, 5308838, 5811263, 5702180, 5704168, 5750265, 5908717, 5917614, 5945606, 6008535, 5912732, 5900389, 5759558, 5864935, 6136964, 6296238, 6254678, 6311814, 6396203, 6395078, 6488806, 6554292, 6691251, 6619099, 6777671, 7163373]
6100G163373j070k75963K15991K16604J33767K53361j10348j4354J31141M40909
6090H153411J86084p1102O4732L55146J61761j42582O8509O3268m239J82039j60607
6079H856420K2445K39588K1807P2931J34641J45638n5755J14736M97943J78222
6069A0228616r4501M84279J73642K19183K5586l1450O81087O83207L07489N0178
6059A2727316k0996M07608J89745K60443k88648n8565m73907n3827j22613J32223
6049A2698779j31794l34590n5493j69590n1764j8379N8610l1707J96454J08623
6039A2269149M4030J42279K73194k7789K94248N1446K09061K32673J26784j13638
6029A3501437M7800J06053j40602j85950l7771k7027J30700j55086j07606j4005
$$ y = [7163373, 7162303, 6886340, 7102331, 7318935, 7452702, 7706063, 7595715, 7581361, 7712502, 8153411, 8339495, 8268393, 8333125, 8688271, 8850032, 8707450, 8775959, 8839227, 8834988, 9017027, 8856420, 8878865, 9118453, 9140260, 9213191, 9347832, 9493470, 9437715, 9552451, 10050394, 10228616, 10134115, 10618394, 10792036, 11011219, 11036805, 11005355, 11686442, 12369649, 12677138, 12727316, 12706320, 13113928, 13303673, 13564116, 13275468, 13216903, 12742996, 12689169, 12566556, 12698779, 12566985, 12232395, 12176902, 12007312, 11955548, 11937169, 11995779, 11964072, 12160526, 12269149, 12313179, 12455458, 12728652, 12700863, 12995111, 13046557, 13255618, 13488291, 13615075, 13501437, 13549237, 13655290, 13514688, 13328738, 13290967, 13263940, 13394640, 13239554, 13131948, 13117943]
6019A3117943J4964l42637N3167j16215l18583Q631j89039j19575k40847O1212
6009A1929021J35313k37144K2024O37j34907J594M8561n6180Q1069j43977j19795
5998A1526216J29915K13896J28444p5029j52962Q847K03144J739j33063O8264
5988A1919411J18501j74097R7445K16263J42684K24513k77688J22780K39595M069
5978A2633476L18322P9505J03201N06673K14272L64550J89051j2073K06541r3750
5968A4509768K5437J94601o1600j21571j73581k0910p859J49465L18997J31690
5958A4944437K00156P2468J07182K85971L31007O73920M04595K59746M96738M48249
5948A8224469N64185M45408O61758O10659Q29121R88827Q93841J032874J300181
$$ y = [13117943, 13132907, 12790270, 12843437, 12727222, 12408639, 12417270, 12228231, 12108656, 11867809, 11929021, 12064334, 11827190, 11849214, 11849851, 11714944, 11716538, 11765099, 11708919, 11789988, 11646011, 11526216, 11656131, 11870027, 11998471, 11923442, 11770480, 11779327, 11982471, 11984210, 11851147, 11919411, 12037912, 11863815, 11961260, 12177523, 12320207, 12544720, 12267032, 12389812, 12629407, 12633476, 12951798, 13031303, 13134504, 13641177, 13855449, 14219999, 14409050, 14396977, 14603518, 14509768, 14535205, 14729806, 14668206, 14546635, 14373054, 14352144, 14344285, 14493750, 14812747, 14944437, 15144593, 15217061, 15324243, 15610214, 15941221, 16615141, 17019736, 17279482, 17776220, 18224469, 18788654, 19234062, 19895820, 20506479, 21335600, 22324427, 23218268, 24251142, 25551323]
5939B5551323J031583J358969J405065J615335J558013J437699J859415J613395
5931C7430797J324662J057989R84885J146164J055425Q15930Q47623N37166P50842
5922D5951483Q44582L96784M60231j75732L11409K03945Q8849M2154J00773L95200
5912D8619678K24972j17581L28463L27496K11189K83073m0090j08819J54108N01343
5902E0383832K00806O602K40248K55763L41734O34080M83203J21241m9619K08461
5892E2826351k74769p64032j090209j361848j522770j111778j564948j363381
5884D3772616j640907j521379j092143j467911j300150n48789q88239q97550n47955
5875C3867593p68434m34010o87343n46615n66143n83485m58352l22414m59001
$$ y = [25551323, 26582906, 27941875, 29346940, 30962275, 32520288, 33957987, 35817402, 37430797, 38755459, 39813448, 40798333, 41944497, 42999922, 43815852, 44663475, 45200641, 45951483, 46796065, 47192849, 47653080, 47477348, 47788757, 47992702, 48081551, 48123705, 48224478, 48619678, 48844650, 48727069, 49055532, 49383028, 49594217, 49877290, 49837200, 49728381, 49882489, 50383832, 50584638, 50591240, 50831488, 51087251, 51428985, 52063065, 52546268, 52667509, 52617890, 52826351, 52551582, 51787550, 50697341, 49335493, 47812723, 46700945, 45135997, 43772616, 42131709, 40610330, 39518187, 38050276, 36750126, 36201337, 35313098, 34415548, 33867593, 33099159, 32665149, 31977806, 31431191, 30865048, 30281563, 29823211, 29500797, 29041796]
5866B9041796n06564k20118j11611j11679l16323l38529k37840j9481k40198j37512
5856B6801941m0022J75074K25144J63242M17649J99520J75315L74894M22055L72572
5846B9287384N01699N89224L23115L19583M76032O63283M10430L65719M46622
5837C3383091L11208M2172j53249o7690L06957J35722j67506O0786m05645k20702
5827C3225144j92256j06734r3276k73703j61842j98782n10280k98291j98429J700
5817C1193251m52697j31720j4899m57313K14504j47278m63898m346k53585j81216
5807B9300803j05592k09817j00077l38099j34387M2072R9366m909j04840j52365
5797B8292155j27138q6010k64716k03771o2826j93631j91606j03725L0245j72617
$$ y = [29041796, 28535232, 28315114, 28203503, 28091824, 27775501, 27436972, 27199132, 27179651, 26939453, 26801941, 26761919, 26936993, 27162137, 27325379, 27743028, 27942548, 28117863, 28492757, 28914812, 29287384, 29789083, 30378307, 30701422, 31021005, 31497037, 32160320, 32570750, 32936469, 33383091, 33694299, 33736471, 33583222, 33515532, 33822489, 33958211, 33790705, 33851491, 33445846, 33225144, 33032888, 32926154, 32832878, 32559175, 32397333, 32198551, 31688271, 31389980, 31191551, 31193251, 30740554, 30608834, 30593935, 30136622, 30351126, 30203848, 29739950, 29735604, 29482019, 29300803, 29195211, 28985394, 28885317, 28547218, 28412831, 28454903, 28554269, 28549360, 28444520, 28292155, 28165017, 28079007, 27814291, 27610520, 27547694, 27354063, 27162457, 27058732, 27088977, 26916360]
5787B6916360j61914o9150j89224j83333k12835l06094k09573k80949l28548j42683
5777B4832057m4533l87214j94654k68468n00818l65967l90653k20984J28974k74475
5767B2313265j51200m08962k23266j96452m36027r3610j93605j26563L9679j62829
5757B0360430l06331L9730J31769k0128k53170O393p4418j2557M7107p3367j73857
5746A9671601j22064L212q212j83412j89140j74999k0935j71477p1515K47296
5736A8980355L9855l00785j64768N188J90977J357j09491R7534J24769K0183R4295
5725A8979469j7176K89724K22985l01880l4274m6595Q3470M37641m3980o0480
5715A9508904K77245j50401K10955K4651J01092L13619j81676j7144K01818J92048
$$ y = [26916360, 26754446, 26685296, 26496072, 26312739, 26099904, 25793810, 25584237, 25303288, 24974740, 24832057, 24787524, 24400310, 24205656, 23937188, 23436370, 23070403, 22679750, 22458766, 22587740, 22313265, 22162065, 21753103, 21529837, 21333385, 20897358, 20803748, 20610143, 20483580, 20523259, 20360430, 20054099, 20093829, 20225598, 20205470, 19952300, 19958693, 19884275, 19871718, 19918825, 19845458, 19671601, 19549537, 19552749, 19544537, 19361125, 19171985, 18996986, 18976051, 18804574, 18733059, 18980355, 19020210, 18719425, 18554657, 18559845, 18750822, 18752179, 18642688, 18740222, 18864991, 18885174, 18979469, 18962293, 19252017, 19475002, 19173122, 19138848, 19092253, 19175723, 19613364, 19569384, 19508904, 19786149, 19635748, 19846703, 19871354, 19972446, 20286065, 20104389, 20087245, 20289063, 20481111]
5705B0481111K58101L97522R608N5172N17631L37805J24884l8757J85276m09J14286
5694B2442230L2387J12229K40828J8673J8119J58152K4484K91527J05699N8481
5684B3502809L73258K68627K85071K75571N27870N07354L61819O24731P50471
5675B7477581J09330N64460Q02931R29078O24891Q13610P50170L44987M88779
5666C2905817K34247J75289K38768K17219J44960N66831P32981N36089M38697
5657C6190898M96063Q04993P14959O74500P36488M71396O91661R94894L89756
5648D2165608O29108O65529Q79322R66741O93857R63392J277475J222685J529214
5639E0992931J841597J814808K066339K426012K382953K070377K733562L226613
$$ y = [20481111, 20739212, 21136734, 21146342, 21201514, 21719145, 22056950, 22181834, 22143077, 22328353, 22327944, 22442230, 22474617, 22586846, 22827674, 22846347, 22864466, 23022618, 23047102, 23338629, 23444328, 23502809, 23876067, 24144694, 24429765, 24705336, 25233206, 25740560, 26102379, 26727110, 27477581, 27586911, 28151371, 28954302, 29883380, 30508271, 31321881, 32072051, 32417038, 32905817, 33140064, 33315353, 33554121, 33771340, 33916300, 34483131, 35216112, 35752201, 36190898, 36686961, 37491954, 38206913, 38881413, 39617901, 40089297, 40780958, 41775852, 42165608, 42794716, 43460245, 44339567, 45306308, 46000165, 46963557, 48241032, 49463717, 50992931, 52834528, 54649336, 56715675, 59141687, 61524640, 63595017, 66328579, 69555192]
5631F9555192L372753M093476M442312N052258N698654O284394P043056P487471
5623A13029566Q088833Q450586Q770647R224885R242221Q811431Q873066Q505706
5615A82996941P280859O436442M971111K891747Q73072j417012k897908l853099
5607A97282153m785287n774955o554029p047647p533431p973121q087225p729676
5599A41796782p278053p319385p048750o900487n897160n973574n694215n125797
5591I0559361m472499m217602l991245l699519l635327k678855k582234k275833
5583F3006247k173904k113476j646118j597758j580998j225103j056839r28009
5575E0684042j013801p80146r26863j035091p53625q30862o53078p88354o20944
$$ y = [69555192, 72927945, 77021421, 81463733, 86515991, 92214645, 98499039, 105542095, 113029566, 121118399, 129568985, 138339632, 147564517, 156806738, 165618169, 174491235, 182996941, 190277800, 196714242, 201685353, 204577100, 205450172, 204033160, 201135252, 197282153, 192496866, 186721911, 180167882, 173120235, 165586804, 157613683, 149526458, 141796782, 134518729, 127199344, 120150594, 113250107, 107352947, 101379373, 95685158, 90559361, 86086862, 81869260, 77878015, 74178496, 70543169, 67864314, 65282080, 63006247, 60832343, 58718867, 57072749, 55474991, 53893993, 52668890, 51612051, 50684042, 49670241, 48890095, 47963232, 46928141, 46174516, 45343654, 44690576, 43902222, 43281278]
5566D3281278o61965o22355q12550k02621m86826j116672j64962k73327j012436
5557C7927564o43793m70862o90120n30224l89169m74173l77465m66797l04228
5548C3580733m52292m12340l33635m05028n23074k69004k82235j46123l89674
5539C0367328o14128k28114l34211m5006k66602l54038n39718l39793m00721m32512
5529B6812485m49892m51174n00194j22794l17769n24416n85574n77220p6486p6340
5519B3130626l81169k6683j37342k18431o04466k01377J7575l26518Q2943j0893
5509B1324265j56090l56919n3233k5096l77902o3057p0316J05796J5326k46357
5499B0096417j74443j41647j0230O5665l0946j58074j62988K90994k7460n737
$$ y = [43281278, 42619313, 41996958, 41184408, 40981787, 40494961, 39378289, 39213327, 38940000, 37927564, 37283771, 36812909, 36122789, 35592565, 35203396, 34729223, 34351758, 33884961, 33580733, 33128441, 32716101, 32382466, 31977438, 31454364, 31185360, 30903125, 30757002, 30367328, 29753200, 29525086, 29190875, 29145869, 28879267, 28525229, 27985511, 27645718, 27244997, 26812485, 26362593, 25911419, 25411225, 25288431, 24970662, 24446246, 23860672, 23283452, 23206966, 23130626, 22749457, 22722774, 22585432, 22367001, 21762535, 21561158, 21578733, 21252215, 21335158, 21324265, 21168175, 20811256, 20758023, 20732927, 20355025, 20291968, 20221652, 20327448, 20342774, 20096417, 19921974, 19780327, 19770097, 19835762, 19804816, 19646742, 19483754, 19774748, 19747288, 19741551]
5489A9741551j11263j81624j65961k35639J31964k31605o0801J17430M0896m6128
5479A8998820m21242K43982J4455j82941J45847p4930l38771m0817Q1867L28899
5469A8755169r8537r0416m9619l61534J34718q0508o8827L20316j00053l08219
5459A8052490j16776j12056l1029j7543k40550k89135K31815J19409J92900k81567
5449A7507958j55094J05787m3798k6757P9328j88564P8397K81083O5221p6568
5439A7626993Q7931l831o226K51934k00092Q6810r530J55454L13450k2128j17830
5428A8162935o1781J54748n5819l206M9617K29028J73417K12813j24895K35281
5418A8972138M6754L57225R9551M45150M95195K81059L09941L84799O70463K53747
$$ y = [19741551, 19630288, 19448664, 19282703, 19047064, 19179028, 18947423, 18886622, 19004052, 19044948, 18998820, 18577578, 18821560, 18836015, 18653074, 18798921, 18723991, 18385220, 18344403, 18426270, 18755169, 18656632, 18566216, 18516597, 18155063, 18289781, 18209273, 18140446, 18460762, 18360709, 18052490, 17935714, 17823658, 17792629, 17775086, 17534536, 17245401, 17477216, 17596625, 17789525, 17507958, 17352864, 17458651, 17414853, 17388096, 17467424, 17278860, 17357257, 17638340, 17703561, 17626993, 17714924, 17711093, 17704867, 17956801, 17756709, 17843519, 17833989, 17989443, 18302893, 18280765, 18162935, 18101154, 18255902, 18200083, 18196877, 18246494, 18475522, 18648939, 18861752, 18736857, 18972138, 19018892, 19376117, 19475668, 19920818, 20416013, 20697072, 21007013, 21391812, 22062275, 22316022]
5408B2316022r4125J15146K66740K1672m9385L4981j8215J54173J84968Q0976
5398B3012953p3274j49254o8800l30005n10428j61377K19822l40557l85373l40233
5388B0873474J76564J22203q6887o4854K40867J40823n9156K56282L15401L58072
5378B2272789P9967J11944L58683L23043K88351j7947L30786O6316N0300K6318
5368B3890550k3673P2450j69194J08131l9220k48723p6821l37659j85030j13784
5358B2877027j92960k55250k21568n9775j54007m68498k11030J59875Q0933j61111
5348B1393636n463j25576m25549M1876J2815L78490K30474m9031k78630o1019
5338B1112023L2869j03635K77523J88225n9038j59153k27916k93401k22997l25982
$$ y = [22316022, 22221897, 22337043, 22603783, 22625455, 22576070, 22611051, 22592836, 22747009, 22931977, 23012953, 22939679, 22790425, 22721625, 22391620, 21881192, 21719815, 21939637, 21599080, 21213707, 20873474, 21050038, 21172241, 21085354, 21020500, 21261367, 21402190, 21343034, 21599316, 21914717, 22272789, 22352756, 22464700, 22823383, 23146426, 23434777, 23416830, 23747616, 23813932, 23864232, 23890550, 23866877, 23939327, 23770133, 23878264, 23839044, 23590321, 23513500, 23175841, 22990811, 22877027, 22684067, 22428817, 22207249, 22147474, 21993467, 21524969, 21313939, 21473814, 21554747, 21393636, 21388173, 21262597, 20837048, 20878924, 20891739, 21270229, 21500703, 21451672, 21173042, 21112023, 21144892, 21041257, 21318780, 21507005, 21447967, 21288814, 21060898, 20767497, 20544500, 20218518]
5328B0218518j22201k86883m55801n82225j95860k82077m16092m8733k02470j37347
5318A7488829j59662j49749k3380Q8737k92245l51886j20220j80145M4551P2782
5308A6417612k76839j58999j15481j26485j11903k63259o5521j86074q7492j06970
5298A4918589j00273R7069j98049j63325k43171K552j39343k61767m3699j68201
5288A3700382q7769Q3399P1681j73597P9712j32597m39490l2417Q2471j32372
5278A3019403L53011j06857j64990R7282j96873l9675n6713j28854J57492r1288
5268A2841938q120j5r1102R1466l01603J13057l14487O1484L1411J65240J78682
5257A2767951j34473J6735j70579N79j54221J35950J78553J51842R4317j1936
$$ y = [20218518, 20096317, 19809434, 19353633, 18771408, 18575548, 18293471, 17877379, 17828646, 17626176, 17488829, 17329167, 17179418, 17156038, 17244775, 16952530, 16600644, 16480424, 16300279, 16344830, 16417612, 16140773, 15981774, 15866293, 15739808, 15627905, 15364646, 15299125, 15113051, 15025559, 14918589, 14818316, 14915385, 14717336, 14554011, 14310840, 14313392, 14174049, 13912282, 13868583, 13700382, 13612613, 13696012, 13767693, 13594096, 13673808, 13541211, 13101721, 13069304, 13151775, 13019403, 13372414, 13265557, 13100567, 13197849, 13000976, 12961301, 12904588, 12775734, 12933226, 12841938, 12833818, 12833803, 12742701, 12834167, 12532564, 12645621, 12331134, 12392618, 12424029, 12589269, 12767951, 12633478, 12650213, 12479634, 12480213, 12325992, 12461942, 12640495, 12792337, 12886654, 12874718]
5247A2874718r7646k0938o8431j78262N0805J0414L19294j98708J08965L12742
5237A3112953l7700N2823j95166N6408l4761L7835O8772J79703j78891L8660k85548
5226A2815088N8556J85639n3735j00343Q2496J18137r2684M7111j32568K6447
5216A2954144o1593J80323J82221k1733K30547m1659j92023J448Q2799J2246L4009
5205A3360729J51957J93328L5213o3466j54657l9663J50522q1681j35418K36431
5195A3653295p0946k10260M32947l19573j43311J81512o0894L0503p5194l65221
5185A3052858j30988Q1904J44168j65153k67j02016M0242J28859J57294k8459
5175A3178442l60136J26767r3757j86298L64486j57084M8186L18989m10l61997
$$ y = [12874718, 12777072, 12756134, 12687703, 12509441, 12560246, 12570660, 12889954, 12691246, 12800211, 13112953, 13075253, 13128076, 12932910, 12989318, 12954557, 12992392, 13061164, 13240867, 13061976, 13100636, 12815088, 12873644, 13059283, 13005548, 12905205, 12987701, 13105838, 13013154, 13060265, 12927697, 12954144, 12892551, 13072874, 13255095, 13233362, 13463909, 13422250, 13230227, 13231675, 13314474, 13326720, 13360729, 13512686, 13706014, 13741227, 13677761, 13523104, 13483441, 13633963, 13552282, 13416864, 13653295, 13582349, 13372089, 13805036, 13485463, 13342152, 13523664, 13462770, 13493273, 13418079, 13052858, 12921870, 13003774, 13147942, 12982789, 12982522, 12880506, 12920748, 13049607, 13206901, 13178442, 12818306, 12945073, 12851316, 12665018, 13029504, 12872420, 12920606, 13239595, 13239185, 12877188]
5165A2877188P5642O2701O1352j01477J1489L18366M1718M4184J0265R7358J0650
5154A3509436K83932M19521K1560r7369M83283K81599N0375K1489n490K91313
5144A5259649N47449K98491K04337J25675J02713l09356o6005p1900L3462n3650
5134A6070865J9597K09474k14261K0804J48019P5539p4022k84383R5241K81601
5124A6348474K50835J76733N7699L03445M01791K43534K51570Q3782J42342K21246
5114A8481451J3824J03503o3328L3360L4091j43843R6300k6928l40256j77659
5104A8010515j25796M8632K37708k11333k73845R5906k81821m82517Q4098q8114
5094A7013433l46427j55582k21862j78681K58923j4822J46179K67814O2850l8447
$$ y = [12877188, 12952830, 13015531, 13076883, 12975406, 12986895, 13305261, 13346979, 13391163, 13401428, 13498786, 13509436, 13793368, 14212889, 14234449, 14137080, 14620363, 14901962, 14952337, 14973826, 14968336, 15259649, 15807098, 16105589, 16309926, 16435601, 16538314, 16228958, 16162953, 16091053, 16124515, 16070865, 16090462, 16299936, 16085675, 16106479, 16254498, 16330037, 16256015, 15971632, 16066873, 16348474, 16599309, 16776042, 16833741, 17137186, 17538977, 17782511, 18034081, 18117863, 18260205, 18481451, 18495275, 18598778, 18535450, 18568810, 18602901, 18459058, 18555358, 18528430, 18188174, 18010515, 17884719, 17933351, 18171059, 17959726, 17685881, 17781787, 17499966, 17017449, 17101547, 17013433, 16667006, 16511424, 16289562, 16110881, 16369804, 16354982, 16501161, 16768975, 16831825, 16793378]
5084A6793378r028M1898j9892J29799k0687p3361k07139O6677k1805k09646j11916
5073A6358278l28409j10203r6980j86394K9581J5668m0469k98452k85278r3991
5063A4963351R7477k53619Q5442K59588M6315N8588l38084p0531R7895o7581j53825
5052A4725016j53419K3767j5740o5184J48760l57480p4160K01103m8337j24838
5042A4259488j0384q5957J9148j01100l97569K44357J62830K27028q2830n9879
5032A4175132J97798N4515n6994J4929K30084J62767J67511J39954N6279j56845
5022A4985130n4489k19818J1750L45987J30718J9131Q5663P2852J84008J03065
5012A5663997K40034L38062K42520m3155L81004M22065j30998j29120K30532k2465
$$ y = [16793378, 16784350, 16826248, 16806356, 16936155, 16915468, 16842107, 16634968, 16701645, 16679840, 16470194, 16358278, 16029869, 15919666, 15822686, 15636292, 15665873, 15681541, 15641072, 15342620, 15057342, 14963351, 15060828, 14807209, 14892651, 15152239, 15198554, 15257142, 14919058, 14848527, 14946422, 14878841, 14725016, 14571597, 14595364, 14579624, 14514440, 14663200, 14305720, 14231560, 14432663, 14384326, 14259488, 14249104, 14163147, 14182295, 14081195, 13683626, 13927983, 14090813, 14317841, 14235011, 14175132, 14372930, 14427445, 14370451, 14385380, 14615464, 14778231, 14945742, 15085696, 15141975, 14985130, 14930641, 14710823, 14722573, 15068560, 15199278, 15218409, 15304072, 15376924, 15560932, 15663997, 15904031, 16242093, 16484613, 16441458, 16822462, 17244527, 17113529, 16984409, 17214941, 17192476]
5002A7192476m5267K10949J83024J11251k44958K77056k7116q1542K30396o9574
4992A7736695M10613L17543o8321J32239J58929K96730M3769J08540L64689K10776
4982A9712202L7841M7239R5191J29183L49881L06992L06643o6390J08979K78247
4972B1306008K49728J61026J64311K93396k32119N675K77320K8362K54395M86415
4962B2994517K0851J28314J24333L89792K37709l3714K95293M25226K03540L44253
4952B5130114M61858K93027M67942M75135L39355K02573L83889L17338N01361
4943B8572592M50286J97341J33712L59189O37568R6729O5052L76528N99922M75278
4933C1964197K5900M14974L38116K16362L79016K39322M77332K13270L68189K46279
$$ y = [17192476, 17147209, 17358158, 17541182, 17652433, 17407475, 17684531, 17657415, 17575873, 17806269, 17736695, 18147308, 18464851, 18396530, 18528769, 18687698, 18984428, 19028197, 19136737, 19501426, 19712202, 19750043, 19797282, 19892473, 20021656, 20371537, 20678529, 20985172, 20918782, 21027761, 21306008, 21555736, 21716762, 21881073, 22174469, 21942350, 21948025, 22225345, 22253707, 22508102, 22994517, 23015368, 23143682, 23268015, 23657807, 23895516, 23861802, 24157095, 24582321, 24785861, 25130114, 25591972, 25884999, 26352941, 26828076, 27167431, 27370004, 27753893, 28071231, 28572592, 29022878, 29220219, 29353931, 29713120, 30350688, 30447417, 30512469, 30888997, 31488919, 31964197, 31990097, 32405071, 32743187, 32959549, 33338565, 33577887, 34055219, 34268489, 34636678, 34882957]
4923C4882957M23844L71378R3190J15921M24723j6987L31206K12541J46320M34926
4913C7420019K12648N14548L10910L67963K07007K02654L57140L7305K21071M86208
4903D0337473p7907m7390K89595O6610K13276k1334k07857J61276J51759L3441
4893D0898942L02208J18001L0887k3002L97677K15241J29115J00166J38273M64314
4883D2771822M15075J72785p6291K48316j88649M21813O06475N64004L7596L37876
4873D5310822L44943N16652O90078N71926Q80114J019926P92930N50583J093789
4864E1771763R25353Q29299R97869R52651J051914J319554J014992J140232J376041
4855F1379668R30079J171077J279807J290237R85700J313829J247355J503186
$$ y = [34882957, 35306801, 35678179, 35771369, 35887290, 36312013, 36295026, 36626232, 36838773, 36985093, 37420019, 37632667, 38147215, 38458125, 38826088, 39033095, 39235749, 39592889, 39630194, 39851265, 40337473, 40259566, 40212176, 40501771, 40568381, 40781657, 40760323, 40552466, 40713742, 40865501, 40898942, 41201150, 41319151, 41350038, 41327036, 41724713, 41939954, 42069069, 42169235, 42307508, 42771822, 43186897, 43359682, 43283391, 43531707, 43343058, 43764871, 44371346, 44935350, 44972946, 45310822, 45655765, 46172417, 46862495, 47434421, 48314535, 49334461, 50127391, 50677974, 51771763, 52697116, 53526415, 54524284, 55476935, 56528849, 57848403, 58863395, 60003627, 61379668, 62309747, 63480824, 64760631, 66050868, 67036568, 68350397, 69597752, 71100938]
4847G1100938J450736J153544J707161J923054J736305K061536K422379K709630
4839H6265283K993461L064629L594190L735713M054472M976192N437602N704801
4831A19826343O087295P130644O965641P155206O960963O665762O235267N621343
4823A72648464N336762N614128O056373O674404P073202P588209P565947O541660
4815B25099149N794449M126211K273152M60229q77952k778306l700316m636012
4807B25760604n487187n891319o607228o865514o672584o231263n935528o060188
4799A76009793n690266n448055n619091m926966m841519m898496m296200m288314
4791A36000886l797761l766854l230386l065877k766819k235659k188334k025317
$$ y = [71100938, 72551674, 73705218, 75412379, 77335433, 79071738, 81133274, 83555653, 86265283, 89258744, 92323373, 95917563, 99653276, 103707748, 108683940, 114121542, 119826343, 125913638, 133044282, 140009923, 147165129, 154126092, 160791854, 167027121, 172648464, 177985226, 183599354, 189655727, 196330131, 203403333, 210991542, 218557489, 225099149, 230893598, 235019809, 237292961, 237753190, 236875238, 234096932, 230396616, 225760604, 220273417, 214382098, 207774870, 200909356, 194236772, 188005509, 182069981, 176009793, 170319527, 164871472, 159252381, 154325415, 149483896, 144585400, 140289200, 136000886, 132203125, 128436271, 125205885, 122140008, 119373189, 117137530, 114949196, 112923879]
4783A12923879j587935j360824j040745o62547q71885p72541k5916J88559n4874
4774A06735171K80818M00591o2042j59754k57343J20946J18794k98733m60748
4765A06417700q83812n84124r36094j047064q99268j528779j295246j004925j116406
4756I7121982j351174j200705j078674j426575j374412j397013j506859j388681
4748H6397889j328010j306983j671256j427438j479631j385337j794986j559313
4740G4444935j462215j126420j496299j401214j259219j286197j190462j006822
4732F4216087o43281o86810n94950n15187k46821j93492j6319k02750N8876Q5243
4722F1260596L93456J85706L50444N21437L29824P06491L94821K91238P17602
$$ y = [112923879, 111335944, 109975120, 108934375, 108271828, 107399943, 106627402, 106601486, 106790045, 106735171, 107015989, 107416580, 107354538, 107194784, 106937441, 107058387, 107177181, 106878448, 106417700, 105533888, 104949764, 104013670, 102966606, 102067338, 100538559, 99243313, 98238388, 97121982, 95770808, 94570103, 93491429, 92064854, 90690442, 89293429, 87786570, 86397889, 85069879, 83762896, 82091640, 80664202, 79184571, 77799234, 76004248, 74444935, 72982720, 71856300, 70360001, 68958787, 67699568, 66413371, 65222909, 64216087, 63572806, 62885996, 62291046, 61775859, 61529038, 61335546, 61319227, 61116477, 61175353, 61260596, 61654052, 61839758, 62190202, 62711639, 63041463, 63747954, 64142775, 64434013, 65151615]
4713F5151615O4422J93405L10111l54781k72809k11670j63635l39535m49254n12582
4703F3415287m48625m65302n08613n99803o64864q28889q15605p43144p73200
4694E7567242j344060j310848o35839p63866p15718q31925o68260j044098q76702
4685D9375926q59514m45011k73372l82150m10934k23299n16664k90424M1611O9723
4675D6085892J65247K1184K97726K11012N3759O17685L37063O78783M37981N17861
4665D9424193P26766P12376Q10505O69559Q37966J086782J238697J297655J415692
4656E8220191J620183J705026K136896K130277K129156K294769K180949J940059
4648G4357506K275028J963594J476558J492452J368081J008296J366999J663880
$$ y = [65151615, 65216037, 65409442, 65719553, 65364772, 65091963, 64880293, 64716658, 64377123, 63927869, 63415287, 62966662, 62501360, 61992747, 61392944, 60728080, 59899191, 59083586, 58340442, 57567242, 56223182, 54912334, 54276495, 53512629, 52796911, 51964986, 51296726, 50252628, 49375926, 48516412, 48071401, 47798029, 47415879, 47004945, 46781646, 46264982, 45974558, 46016169, 46085892, 46251139, 46272323, 46570049, 46781061, 46834820, 47452505, 47789568, 48468351, 48906332, 49424193, 50150959, 50863335, 51673840, 52343399, 53181365, 54268147, 55506844, 56804499, 58220191, 59840374, 61545400, 63682296, 65812573, 67941729, 70236498, 72417447, 74357506, 76632534, 78596128, 80072686, 81565138, 82933219, 83941515, 85308514, 86972394]
4640H6972394J312475J298394J518437K077874K185924K620660L330358M345466
4632A05661982M562871M980853N304753O259266P185698P994855R176699J0540421
4624A61667398J2258506J4275342J6006932J7524776J9098212J9253312J7106691
4617B77191169J2393098N287354k226694r861159j4880743j6205164j5365620
4610B36332241j3903825j2724130j1757840j0648610r407314q479238q350051
4603A61061233p207463o824955n897014n270090m649073l902333l589442k933980
4595A20786883k871122k464681j936189j714619j031787j025294j050853q97751
4587A07794587l37373P8708L43467M96641N84099R26770J304064J545300J576990
$$ y = [86972394, 88284869, 89583263, 91101700, 93179574, 95365498, 97986158, 101316516, 105661982, 110224853, 115205706, 120510459, 126769725, 133955423, 141950278, 151126977, 161667398, 173925904, 188201246, 204208178, 221732954, 240831166, 260084478, 277191169, 289584267, 294871621, 292644927, 282783768, 267903025, 251697861, 236332241, 222428416, 209704286, 197946446, 187297836, 177890522, 169411284, 161061233, 153853770, 147028815, 141131801, 135861711, 131212638, 127310305, 123720863, 120786883, 117915761, 115451080, 113514891, 111800272, 110768485, 109743191, 108692338, 107794587, 107457214, 107535922, 107879389, 108376030, 108960129, 109886899, 111190963, 112736263, 114313253]
4578A14313253J871688K243342K932222L395070M119321M494119M980873N682901
4570A44032789O575497P173340P679754Q567967R556451J0466209J1736601J2475863
4562B18264471J3294809J3997412J4378349J3765726J2565029J0855483Q525192
4555C05646471P029543N649256N414642O255039P482577R043899J0688310J2141132
4547C69350869J2676186J2521633J1494947J0376959R099663Q127260P098001
4540D40745518O523757N146512K537141j311765n741996j0745219j5596210j9703803
4532D01853935k2301923k3102949k3049492k1880211j9837758j7943295j6754013
4525B56984294j5274252j4342182j2879656j2044016j0944497r751677q987692
$$ y = [114313253, 116184941, 118428283, 121360505, 124755575, 128874896, 133369015, 138349888, 144032789, 150608286, 157781626, 165461380, 174029347, 183585798, 194052007, 205788608, 218264471, 231559280, 245556692, 259935041, 273700767, 286265796, 297121279, 305646471, 312676014, 318325270, 323739912, 329994951, 337477528, 346521427, 357209737, 369350869, 382027055, 394548688, 406043635, 416420594, 425520257, 433647517, 440745518, 447269275, 452415787, 454952928, 453641163, 447899167, 437153948, 421557738, 401853935, 379552012, 356449063, 333399571, 311519360, 291681602, 273738307, 256984294, 241710042, 227367860, 214488204, 202444188, 191499691, 181748014, 172760322]
4518A72760322p796607o878965o256486n562839m906780m860985m403439l902256
4510A28191965l614534l587781l483502l036231k751877k624517k295049k107232
4502A04691242k024113j955845j869977j984545j754885j819062j747498j741367
4494H9793950k089483j868708j870052j567303j516048j513581j106997j109834
4486G7151944j193077q07061o59174q33945j114459p92022l71676j108725j103604
4477F9168201j104509j256752j446083j554589j170845j108625j152071j206240
4469E9168487j347950q30989p46191j030121r21138q82308q35252l35443n86129
4460E1652966m42833m71323o92610l22675n11832k52043k75434l18029m66159
$$ y = [172760322, 164963715, 158084750, 151828264, 146265425, 141358645, 136497660, 132094221, 128191965, 124577431, 120989650, 117506148, 114469917, 111718040, 109093523, 106798474, 104691242, 102667129, 100711284, 98841307, 96856762, 95101877, 93282815, 91535317, 89793950, 87704467, 85835759, 83965707, 82398404, 80882356, 79368775, 78261778, 77151944, 75958867, 75151806, 74492632, 73658687, 72544228, 71752206, 71380530, 70271805, 69168201, 68063692, 66806940, 65360857, 63806268, 62635423, 61526798, 60374727, 59168487, 57820537, 56989548, 56243357, 55213236, 54292098, 53409790, 52574538, 52239095, 51652966, 51210133, 50738810, 50046200, 49723525, 49211693, 48959650, 48684216, 48366187, 47900028]
4451D7900028k95818j0854j06672j59463j26531k7370O1453j8844N0774j7172
4441D7249531K2484Q3235M64995J27713J51329L02435L84275M48593M02133L04221
4431D9940944N68939Q45136N20314K35590J32189J73806j58406q53897q05517
4422E0599098q31032p10830m04989l46994m49121j93135J23412j72186R3332K34858
4412D7942413J83977P69976K53018J36820K32359K06879L73838k2924K97241j01694
4402E0271903j67885k98172p4713O6838k1986K55691j38639n44790n56978o45400
4392D8145869p68888j128676p71046p67771p50424o79785o87913o17581m92637
4383D1481148n48358p31593m32935l86511m36529m63281l74089j97049K0536k21952
$$ y = [47900028, 47604210, 47593356, 47486684, 47327221, 47200690, 47173320, 47234773, 47215929, 47266703, 47249531, 47272015, 47355250, 47820245, 47947958, 48099287, 48401722, 48785997, 49234590, 49636723, 49940944, 50509883, 51355019, 51875333, 52110923, 52243112, 52416918, 52258512, 51404615, 50599098, 49768066, 49057236, 48652247, 48305253, 47856132, 47662997, 47786409, 47614223, 47707555, 47942413, 48126390, 48896366, 49149384, 49286204, 49518563, 49725442, 50099280, 50076356, 50373597, 50271903, 50104018, 49805846, 49731133, 49797971, 49775985, 50031676, 49893037, 49348247, 48791269, 48145869, 47376981, 46248305, 45477259, 44709488, 43959064, 43279279, 42591366, 41973785, 41481148, 40932790, 40201197, 39768262, 39381751, 38945222, 38481941, 38107852, 37910803, 37931339, 37709387]
4373C7709387q6771L02502J65151n211O5286J34208K14317k81106o98659m95532
4363C7023572p05640j100646r49949o44385o58272o22649l72569o17001m83781
4354C0868680k92471l75024m40102m09150m41696l34661k12358k22899j38717
4345B8001602P2656l00990m68787l10058r4547j46485k98982l43959n70253m02819
4335B5137378k65643l06784k08065l1790l32385j12289K3225m0272k07153p1271
4325B3584951L893p5698l58840n3219J60725K68779K39324K993k24614K17944
4315B3766238K93028P0698n328n814M9074o4348l8252J31930L41279j66190J68081
4304B4540396j37635j54799K2615l58549K2147K16599J50346K16764J79010J12402
$$ y = [37709387, 37622616, 37925118, 38090269, 38085058, 38150344, 38284552, 38498869, 38217763, 37519104, 37023572, 36317932, 35217286, 34267337, 33622952, 32964680, 32342031, 31969462, 31352461, 30868680, 30576209, 30201185, 29761083, 29351933, 28910237, 28575576, 28363218, 28140319, 28001602, 28074258, 27773268, 27304481, 26994423, 26899876, 26753391, 26454409, 26110450, 25540197, 25137378, 24871735, 24564951, 24356886, 24325096, 23992711, 23880422, 23903647, 23863375, 23656222, 23584951, 23588844, 23513146, 23154306, 23101087, 23261812, 23530591, 23769915, 23772908, 23548294, 23766238, 24059266, 24129964, 24124636, 24118822, 24167896, 24103548, 24065296, 24197226, 24538505, 24372315, 24540396, 24402761, 24247962, 24270577, 23912028, 23934175, 24150774, 24301120, 24517884, 24696894, 24809296]
4294B4809296O8175J80720L48260K06565K14889J69692K41032K57972L11526K07745
4284B7015872K55711O36966N12070J94534L57637O51293K37533j32335L36568
4275C0065849M24644L82649M23834N06669N94171R860K52850M91856O35194O31657
4265C4419233N67445L89453M5977L92978M17626K77437L57057M16942N20596M06562
4255C8211306J80169N86788O66214O52757J05324L14009L58384J25875K26125
4246D1426951L6595L46373K24511p1329K48236K96511K96155M29205J31788M22525
4236D3787521Q7496n3813K63007K07416J46449M27884K33690J33919K89253n2861
4226D5469961Q1838l9430R8631K24560L8332J10307j68872j7255j2502J66394
$$ y = [24809296, 24877471, 25058191, 25406451, 25613016, 25827905, 25997597, 26238629, 26496601, 26808127, 27015872, 27271583, 27908549, 28420619, 28615153, 28972790, 29624083, 29861616, 29729281, 30065849, 30490493, 30873142, 31296976, 31803645, 32397816, 32407676, 32660526, 33152382, 33787576, 34419233, 34986678, 35376131, 35422108, 35815086, 36232712, 36510149, 36867206, 37284148, 37804744, 38211306, 38391475, 38978263, 39644477, 40297234, 40402558, 40716567, 41074951, 41200826, 41426951, 41463546, 41809919, 42034430, 41963101, 42211337, 42507848, 42804003, 43233208, 43364996, 43787521, 43875017, 43821204, 44084211, 44291627, 44438076, 44865960, 45099650, 45233569, 45522822, 45469961, 45551799, 45512369, 45611000, 45835560, 45873892, 45984199, 45815327, 45798072, 45785570, 45951964]
4216D5951964j02248m81715m82637n85915l17486m45184o83840n48025p71788
4207D1533126k63318n44598m53073o63896m87339o15890n30175p26829q86859
4198C6361149q37706p99163r36975r81748q10663j154728n92567p07375q09942
4189B8730282p82417o50196o85385p67402q32710q75510n98923n08759p34936
4180B2294044p90732k49326l26018q30021o85814k48695j13806j88456k67713
4171A8593463m08284m70232k47444J35250j06736n4871N7518q7658p8146J42917
4161A7475777O3594l4304K27540n2159k58138J61999l16443l91860m09734o04331
4151A5861941m61397k63429p56931j67141m55739n34057k47048o40523m94939
$$ y = [45951964, 45849716, 45368001, 44885364, 44299449, 43981963, 43536779, 42852939, 42304914, 41533126, 41269808, 40725210, 40272137, 39608241, 39120902, 38505012, 37974837, 37248008, 36361149, 35523443, 34724280, 33787305, 32805557, 31994894, 30840166, 30247599, 29540224, 28730282, 27947865, 27297669, 26612284, 25844882, 25012172, 24136662, 23537739, 23028980, 22294044, 21503312, 21253986, 20927968, 20097947, 19412133, 19163438, 19049632, 18861176, 18593463, 18185179, 17714947, 17467503, 17602753, 17496017, 17441146, 17498664, 17411006, 17332860, 17475777, 17539371, 17505067, 17732607, 17680448, 17422310, 17584309, 17267866, 16876006, 16466272, 15861941, 15400544, 15137115, 14380184, 14213043, 13757304, 13223247, 12976199, 12335676, 11840737]
4142A1840737l65539j35183m4224k76486R5332k75310k20928k52633l56229k16873
4132I792664k08521k15283m1659j53167j18360k21531L6330l66516o5621K5731
4122H464067j19940N7057o64O8292k88542k68828j48110j11821j62710l55283
4112G133518Q3041J19579Q8301j8035j49058K02679l87552k7329k68038J0338
4102F787444j55034Q8619k51505M0677j07881j87899k61295K7354j75228r6024
4092E709228J27106k37336j8626J7756l6j60585k4588p0617j00091K5331R8199
4081E365741j63672l2141j06361q0825K53349k2498j28319P7672j48116q0011
4071D934819N5776j41441j38545k0477J4281P7163J2689j23999j54357j15699
$$ y = [11840737, 11475198, 11340015, 11295791, 11019305, 11114637, 10839327, 10618399, 10365766, 10009537, 9792664, 9584143, 9368860, 9327201, 9174034, 9055674, 8834143, 8870473, 8503957, 8438336, 8464067, 8344127, 8401184, 8400520, 8468812, 8180270, 7911442, 7763332, 7651511, 7488801, 7133518, 7216559, 7336138, 7424439, 7406404, 7257346, 7460025, 7072473, 7045144, 6777106, 6787444, 6632410, 6721029, 6469524, 6510201, 6402320, 6214421, 5953126, 5980480, 5805252, 5709228, 5836334, 5598998, 5580372, 5598128, 5598092, 5437507, 5412919, 5342302, 5242211, 5267542, 5365741, 5202069, 5169928, 5063567, 4982742, 5236091, 5213593, 5085274, 5162946, 5014830, 4934819, 4990595, 4849154, 4710609, 4690132, 4704413, 4781576, 4794265, 4670266, 4515909, 4400210]
4061D400210q9050J79428Q4271k01760k2370P8095N6891j66344J48167j3274j76642
4050D277622k91966l4487j31934j23247J66272K20567j28349j74943l5696j12402
4040C631437O4262J59117m323l86479p5431K41593L4135k40966O2854J5804r7060
4029C404943R2904o0119O4424J33296j8077r5364l11311j12055L4429q484J7713
4018C142299l8448J19977K38988k38362j75174k47494L71585j0825n369N2222
4008C209399R6942J93980l88134l5867K84174o9517o5855J16176j53173l478l75688
3997B808959o3741K51625J144J51744m4463J38745l1271j25015j18492M35134
3987C404369J49390n14285M1679L8592j18577k63384o788J90272J0357J29641
$$ y = [4400210, 4311160, 4490588, 4574859, 4373099, 4350729, 4428824, 4485715, 4319371, 4467538, 4454264, 4277622, 3985656, 3951169, 3819235, 3695988, 3862260, 4082827, 3954478, 3779535, 3743839, 3631437, 3695699, 3854816, 3850493, 3464014, 3388583, 3630176, 3664311, 3423345, 3486199, 3502003, 3404943, 3497847, 3437728, 3502152, 3635448, 3617371, 3522007, 3210696, 3098641, 3133070, 3124586, 3142299, 3103851, 3223828, 3462816, 3224454, 3049280, 2801786, 3173371, 3162546, 3157177, 3209399, 3306341, 3500321, 3112187, 3076320, 3360494, 3290977, 3225122, 3341298, 3188125, 3184647, 2808959, 2745218, 2996843, 2997987, 3149731, 3105268, 3244013, 3212742, 3087727, 2969235, 3404369, 3553759, 3039474, 3081153, 3119745, 3001168, 2737784, 2730996, 2921268, 2931625, 3061266]
3977C061266Q023k1801J7256l8546L164o8465j86131P892K73337j58423J0453
3966B908025N2766q4069L2397J68621J09999l20431k72173K296J69815J98262
3956B965508l1308r2643j2326j66214N3768n3965j87250O5592k33594o2706M30954
3945B675816J23893l8215J22710k30430J63533p1235j06289j57492J13431L9776
3935B635498L0774J36453j87596l4676j37144L20881J28923l2934r8164k20389
3925B541626j89709K9883J76090j21889L13166Q7190k3202r0045l22341J02162
3915B502931n7730J30822N6143r9993J92218J23804l48408j48010M44973J35863
3905B932613l30819K89378k4321k60510m98k8286j46767q9495J26277J39767L3344
$$ y = [3061266, 3069289, 3047488, 3064744, 3026198, 3029362, 2960897, 2774766, 2782658, 3055995, 2897572, 2908025, 2960791, 2876722, 2909119, 3077740, 3187739, 2867308, 2595135, 2597431, 2767246, 2965508, 2934200, 2841557, 2829231, 2663017, 2716785, 2662820, 2475570, 2541162, 2307568, 2244862, 2675816, 2799709, 2761494, 2884204, 2653774, 2817307, 2746072, 2639783, 2482291, 2595722, 2635498, 2666272, 2802725, 2615129, 2580453, 2443309, 2764190, 2893113, 2860179, 2762015, 2541626, 2351917, 2381800, 2557890, 2436001, 2749167, 2836357, 2813155, 2723110, 2400769, 2502931, 2445201, 2576023, 2632166, 2532173, 2724391, 2848195, 2499787, 2351777, 2796750, 2932613, 2601794, 2891172, 2866851, 2606341, 2605843, 2577557, 2430790, 2341295, 2467572, 2607339, 2640683]
3894B640683k13662K58549J2764R9221J33592J3847O9048P1517Q6615P3229J6617
3883C262020M1869M8929r3603J4803j50174k06517j12036J89917J40433N7525
3873C193166j64704r0371O9057K79425j00347k22469J48322P8139p2653J35645
3863C253210j51931j16224K36391m1336p1186J08389q9341j33907R1805p6478
3853C009392l8768J21983r6733L165k22170k20642K88769k0486K1250K2537k72477
3842B595820o133L59120j03156L7733K44759j90092m8194J18685J80036j60348
3832C028230J19706n698m5070J01973j27760Q7966j13066q2431J46816j53045
3822B957621R7244m3547J11542J35768J0955J30140j24189J69636m9235j24071
$$ y = [2640683, 2427021, 2685570, 2698334, 2797555, 2931147, 2944994, 3014042, 3085559, 3172174, 3245403, 3262020, 3303889, 3352818, 3259215, 3274018, 3123844, 2917327, 2805291, 2995208, 3135641, 3193166, 3028462, 2938091, 3007148, 3286573, 3186226, 2963757, 3112079, 3190218, 3117565, 3253210, 3101279, 2985055, 3221446, 3180110, 3108924, 3217313, 3127972, 2994065, 3085870, 3009392, 2970624, 3092607, 2995874, 2999039, 2776869, 2556227, 2844996, 2824510, 2845760, 2868297, 2595820, 2589687, 2948807, 2845651, 2883384, 3128143, 2938051, 2889857, 3008542, 3188578, 3028230, 3147936, 3142238, 3097168, 3199141, 3071381, 3159347, 3046281, 2963850, 3110666, 2957621, 3054865, 3011318, 3122860, 3258628, 3269583, 3399723, 3275534, 3445170, 3395935, 3271864]
3812C271864J33529j43168N109k5844J43381K87531k61736j87382J01304J58144
3802C482732k39769J53036J34621k8687o011j2004j0574K61856K11205N0755j14082
3791C883078j59740r5128J19395Q9724L26021J6452L9221N9781j69165k02984
3781C906655L47111N4037j58154J65662R1412j49411J92678K43211n0923r6296
3771D545982J15916N3781J99066J18353m3068J26951L6686K6353J06124K50921
3761E537065k3654M9783j5372M6403q060L91915K01189j28597K6385P9547Q4919
3750F241523K69981K25585j05342p5594K94360J53447J49273j06729l05296R6199
3740F837407R9796r3159J95914J75446j62704J36072K20652k257j22569J42065
$$ y = [3271864, 3405393, 3262225, 3267334, 3241490, 3384871, 3672402, 3410666, 3223284, 3324588, 3482732, 3242963, 3395999, 3530620, 3501933, 3495922, 3483918, 3473344, 3735200, 3946405, 3997160, 3883078, 3723338, 3628210, 3747605, 3837329, 4163350, 4179802, 4219023, 4278804, 4109639, 3906655, 4253766, 4307803, 4149649, 4315311, 4406723, 4257312, 4449990, 4693201, 4642278, 4545982, 4661898, 4715679, 4914745, 5033098, 4990030, 5116981, 5153667, 5180020, 5286144, 5537065, 5513411, 5563194, 5547822, 5594225, 5586165, 5978080, 6179269, 6050672, 6077057, 6156604, 6241523, 6511504, 6737089, 6631747, 6556153, 6850513, 7003960, 7153233, 7046504, 6741208, 6837407, 6937203, 6844044, 7039958, 7215404, 7052700, 7188772, 7409424, 7407167, 7284598, 7426663]
3730G426663K40747p3880M7265j73876J34412Q1157Q3804J9445L80137K57850
3720H423724j3062L26707K62916M1079J2293O8213p2411L90109J90982l3378L62881
3709I960053j3591J44411L23102J24782L33279L86125P0336j19r4055J89177K23025
3698A1646525K42139L93515K06997L2054K29702K00309L15475K86497L58306J61791
3688A4073310L21651N14579L65863K02579M56886R030o5348L61167K87226L61164
3678A6888107M43060M45365K25744K21600N39528N85461R1055M08865K67433P1437
3668B0187655L45180N08136K56495K61256N90132K02662J78250L40949J49037
3659B3019752N41894K52942K25371L06212O5189O4081J98149J23954K34733R0179
$$ y = [7426663, 7667410, 7593530, 7640795, 7466919, 7601331, 7682488, 7766292, 7785737, 8165874, 8423724, 8410662, 8737369, 9000285, 9041364, 9053657, 9121870, 9049459, 9439568, 9630550, 9597172, 9960053, 9946462, 10090873, 10413975, 10538757, 10872036, 11258161, 11328497, 11328378, 11234323, 11423500, 11646525, 11888664, 12282179, 12489176, 12521230, 12750932, 12951241, 13266716, 13553213, 13911519, 14073310, 14394961, 14909540, 15275403, 15477982, 15934868, 15943898, 15878550, 16239717, 16526943, 16888107, 17331167, 17776532, 18002276, 18223876, 18763404, 19348865, 19439920, 19848785, 20116218, 20187655, 20532835, 21040971, 21297466, 21558722, 22148854, 22351516, 22529766, 22870715, 23019752, 23561646, 23814588, 24039959, 24346171, 24411360, 24475441, 24673590, 24797544, 25032277, 25122456]
3649B5122456J93079L44526J5271j9245L59105L1273J99557P6567l9252l7011
3639B6246326J83964j65800j00964O3780j67580l19449l59752p8532R3028k64344
3629B5130677l07239O1480j9964j91122q776l04750k84597Q4330r8885j66299
3619B3894855n7069K1097Q5k81717k44359K53609K23599R9674q6850L70468K61543
3608B4454935K78672L32411M08314J74581M59591K49612k1939K74503N30514M51235
3598B7592429K11770J99236Q9294L21475K59873J21498M71027K59963L31598M52980
3588C0311143J98680K17226J15432J54195m9112K58613K67407p5574k51534k4628
3578C1121848K27615P9476J42128R0030j35570J84240N9477K63274M94841K60134
$$ y = [25122456, 25315535, 25660061, 25675332, 25656087, 26015192, 26046465, 26246022, 26322589, 26283337, 26246326, 26430290, 26264490, 26163526, 26227306, 26059726, 25740277, 25380525, 25301993, 25395021, 25130677, 24823438, 24884918, 24864954, 24673832, 24665056, 24360306, 24075709, 24160039, 24061154, 23894855, 23837786, 23858883, 23858968, 23577251, 23332892, 23586501, 23810100, 23909774, 23822924, 24193392, 24454935, 24733607, 25066018, 25474332, 25648913, 26108504, 26358116, 26336177, 26610680, 27141194, 27592429, 27804199, 28003435, 28092729, 28414204, 28674077, 28795575, 29266602, 29526565, 29858163, 30311143, 30509823, 30727049, 30842481, 30996676, 30947564, 31206177, 31473584, 31398010, 31146476, 31121848, 31349463, 31428939, 31571067, 31661097, 31525527, 31709767, 31769244, 32032518, 32527359, 32787493]
3568C2787493J54074j93941L27233M27690J86339K57769L52516M30519M04036
3559C5133728N36081M93958M13391Q78546J005361J210337J037319Q23793J241126
3550D2773640J412211J445932J472362J690143J920125K041658K102489K544791
3542E7403351K486752K812206K888956L028313L173378L173349L152612L463290
3534H1582207L369607L375262L326087L306604L180548K670624K832904K697718
3526A06341561K220807K097688J995285J998282J875713J585698J526468J467646
3518A21109148J198388J063203J124326J055721P18033P42561N91761M65560M25430
3509A28494131J31072K89219J78032O55151J31257O16917O50948Q23353J263294
$$ y = [32787493, 32941567, 32747626, 33074859, 33502549, 33688888, 33946657, 34299173, 34729692, 35133728, 35669809, 36163767, 36577158, 37455704, 38461065, 39671402, 40708721, 41532514, 42773640, 44185851, 45631783, 47104145, 48794288, 50714413, 52756071, 54858560, 57403351, 59890103, 62702309, 65591265, 68619578, 71792956, 74966305, 78118917, 81582207, 84951814, 88327076, 91653163, 94959767, 98140315, 100810939, 103643843, 106341561, 108562368, 110660056, 112655341, 114653623, 116529336, 118115034, 119641502, 121109148, 122307536, 123370739, 124495065, 125550786, 126268819, 127011380, 127603141, 128068701, 128494131, 128625203, 128914422, 129092454, 129747605, 129878862, 130495779, 131146727, 131970080, 133233374]
3500A33233374J565737J243905J816247J571594J642126J692953J737363K356208
3492A46859507K379548K610791K391984K899074L032791L130503L386788L744315
3484A70435301L612266L995508M042231L977190L921583M241901M297638M569169
3476B03092787M447784M647681N090739N268320N195835N298900N428593M808631
3468B43279270M514205M021391L431631K594675J866376J103010K98531k89155
3460B60819934p97596r51615q77936j579888k135962k376151l135295l748577
3452B45216914m679400n641127n843721o265327o870483p432406p589697p691764
3444A93202989p624030p288289p399597p018944o358852o220738n891343n546108
$$ y = [133233374, 134799111, 136043016, 137859263, 139430857, 141072983, 142765936, 144503299, 146859507, 149239055, 151849846, 154241830, 157140904, 160173695, 163304198, 166690986, 170435301, 174047567, 178043075, 182085306, 186062496, 189984079, 194225980, 198523618, 203092787, 207540571, 212188252, 217278991, 222547311, 227743146, 233042046, 238470639, 243279270, 247793475, 251814866, 255246497, 257841172, 259707548, 260810558, 261109089, 260819934, 260022338, 259070723, 258192787, 256612899, 254476937, 252100786, 248965491, 245216914, 240537514, 234896387, 229052666, 222787339, 215916856, 208484450, 200894753, 193202989, 185578959, 178290670, 170891073, 163872129, 157513277, 151292539, 145401196, 139855088]
3436A39855088m882330m345820m630116m205405l309991l064824k721086k369740
3428A10325776k120267j602884j380068j373655j157723j122517j670822j993907
3420I7903933j867202j481730j067871j184702r90079r70580q79445r32029r67444
3411H7562851r13863j059691j077194j309737j087899r80625r86375p48594o42199
3402G8756674o27188l21423m12934R5291k68130j65405K07844M79701N90248M88506
3392G8823184J91769j18471M4318j21729m33094l61244r7164r0621j94060J30989
3382G7773877L40018q6412j56067J8136J01318J4240P56696N15774O16327R02688
3372H0796595J203975P66246J060510J383310J317500J354691J254910J430997
$$ y = [139855088, 134972758, 130626938, 125996822, 121791417, 118481426, 115416602, 112695516, 110325776, 108205509, 106602625, 105222557, 103848902, 102691179, 101568662, 99897840, 97903933, 96036731, 94555001, 93487130, 92302428, 91312349, 90341769, 89462324, 88530295, 87562851, 86648988, 85589297, 84512103, 83202366, 82114467, 81133842, 80147467, 79398873, 78756674, 78129486, 77808063, 77395129, 77490420, 77222290, 77056885, 77264729, 77744430, 78334678, 78823184, 79014953, 78896482, 78940800, 78819071, 78385977, 78024733, 77927569, 77836948, 77642888, 77773877, 78113895, 78027483, 77871416, 77889552, 77990870, 78005110, 78761806, 79277580, 79893907, 80796595, 82000570, 82766816, 83827326, 85210636, 86528136, 87882827, 89137737, 90568734]
3364I0568734J326748J063493O69847J367569P86107N19524K61911O5962L46949
3355I6976844n1631L3610K58258M00430O18891O72074J138263J238355J309318
3346A02594412J701895K150496K380732K558145K966283L448615L626509L752150
3338A25179237M500174N016853M879129M682850M732834M776333M741916M719419
3330A63228745M236535L675498L127266K964854K417813J955477J596331R34854
3322A84137373O54207J32407j62297r9917l96450o50108n00384q35888j125296
3313A81153647j097010j514365j614872j694508k280965k294976k640975l144343
3305A64871633l176930l566661l782587l880992l643698l797390l903239l393385
$$ y = [90568734, 91895482, 92958975, 93628822, 94996391, 95782498, 96302022, 96563933, 96629895, 96976844, 96925213, 96958823, 97217081, 97617511, 98236402, 98908476, 100046739, 101285094, 102594412, 104296307, 106446803, 108827535, 111385680, 114351963, 117800578, 121427087, 125179237, 129679411, 134696264, 139575393, 144258243, 148991077, 153767410, 158509326, 163228745, 167465280, 171140778, 174268044, 177232898, 179650711, 181606188, 183202519, 184137373, 184791580, 184923987, 184761690, 184661773, 184265323, 183615215, 183114831, 182278943, 181153647, 180056637, 178542272, 176927400, 175232892, 172951927, 170656951, 168015976, 164871633, 161694703, 158128042, 154345455, 150464463, 146820765, 143023375, 139120136, 135726751]
3297A35726751l210621l134128l139896k886730k414486k300073k518988k358957
3289A13762872k046384k119736k303667k370720k590286k119215k531341k440707
3281I5240816k612457k905837k286086k606850k556333k504943k132139k115291
3273G5520880k089919j770373k007546j693224j521751j611213j718081j076388
3265F2032385r92898q03330j024448j168760j297491j058875q41508r65872r47627
3256E2931576r50574p37299j376630r50965j176732j060655j074991r06026q31254
3247D3866450p65306r83831j035161n98812q01452p77324p66279l89432p64975
3238C6983878k74507m78660l69596l36667l83051k73913m89895p24761l74104
$$ y = [135726751, 132516130, 129382002, 126242106, 123355376, 120940890, 118640817, 116121829, 113762872, 111716488, 109596752, 107293085, 104922365, 102332079, 100212864, 97681523, 95240816, 92628359, 89722522, 87436436, 84829586, 82273253, 79768310, 77636171, 75520880, 73430961, 71660588, 69653042, 67959818, 66438067, 64826854, 63108773, 62032385, 61039487, 60236157, 59211709, 58042949, 56745458, 55686583, 54845075, 53879203, 52931576, 51981002, 51243703, 49867073, 48916108, 47739376, 46678721, 45603730, 44697704, 43866450, 43101144, 42117313, 41082152, 40483340, 39681888, 38904564, 38138285, 37748853, 36983878, 36709371, 36230711, 35861115, 35524448, 35141397, 34867484, 34377589, 33652828, 33278724]
3229C3278724l01925l97069o87588k89320o21695o82514n09321q53174n21171
3220B8414947m11570m02430m07516o19269o49664l28952m41433n28974k24709
3211B4400430l54081l30093o10528n68521j1813k80117k26334k32713j45483n85436
3201B1055311k43892k36826J01769j29018q6544k74373j98264j8664l01621j78523
3191A9489355n8440m53849k6561j67072R8004r4775J02069j9294Q1617j23695
3181A8827359q823P351j46207k51325K64141L4450m371M00232k0827J44083k14762
3170A9031301L55157J64250K20917J44098O5348J3016J09999K42345L43880p6651
3160B0613660K96926M44211K27410j0642K46234L50652J16903L04089N98990N30680
$$ y = [33278724, 32976799, 32579730, 31892142, 31602822, 30981127, 30298613, 29789292, 28936118, 28414947, 28003377, 27600947, 27193431, 26574162, 25924498, 25595546, 25154113, 24625139, 24400430, 24046349, 23716256, 23105728, 22537207, 22525394, 22245277, 22018943, 21786230, 21640747, 21055311, 20811419, 20574593, 20676362, 20547344, 20460800, 20186427, 19988163, 19969499, 19667878, 19489355, 19430915, 18977066, 18950505, 18783433, 18881437, 18786662, 18888731, 18869437, 18951054, 18827359, 18818536, 18825887, 18679680, 18428355, 18692496, 18726946, 18722575, 19122807, 19101980, 19246063, 19031301, 19386458, 19550708, 19771625, 19915723, 19981071, 19994087, 20104086, 20346431, 20690311, 20613660, 20910586, 21354797, 21582207, 21571565, 21817799, 22168451, 22285354, 22589443, 23188433, 23719113]
3150B3719113M04428K86297L93694L56653L25971P36865L03261N85204Q53762
3141B7965248O09181N03987N36761N48105N21901J004556O90566R67754R36781
3132C4284840J118934J004807Q32527J225984J276575J524079J695135J623099
3124D4585980J958207K131508K062537K308468K500184K538310K939821L009662
3116F4034677L512697L516322L901496M342207M484273M889232N071340N731900
3108I9484144N972448O002990O115605N916623N796441N735520O045450O221856
3100A47291077O377655O777959O757758P183622P608308Q333374Q862057R263754
3092B08455564R499866R745237R968218R956282R429665R345192Q937903Q398637
$$ y = [23719113, 24123541, 24409838, 24803532, 25160185, 25486156, 26223021, 26526282, 27111486, 27965248, 28574429, 29078416, 29615177, 30163282, 30685183, 31689739, 32380305, 33348059, 34284840, 35403774, 36408581, 37241108, 38467092, 39743667, 41267746, 42962881, 44585980, 46544187, 48675695, 50738232, 53046700, 55546884, 58085194, 61025015, 64034677, 67547374, 71063696, 74965192, 79307399, 83791672, 88680904, 93752244, 99484144, 105456592, 111459582, 117575187, 123491810, 129288251, 135023771, 141069221, 147291077, 153668732, 160446691, 167204449, 174388071, 181996379, 190329753, 199191810, 208455564, 217955430, 227700667, 237668885, 247625167, 257054832, 266400024, 275337927, 283736564]
3084B83736564Q198761Q088867P980786Q389446P978218Q087650P969251P655167
3076C48084710Q703684J0077398J1323565J1839445J1016478Q846023N230083
3069D15121386k57186o523837j2562419j7337480k0147090k1076844k1303377
3062C15913153k0481395j9101532j7791046j6710849j5674816j4620696j3678443
3055A97854376j2166765j1262959j0465688r264415q438990p569527p081808o511211
3047A25093013n677618n099120n199305m736386m280805m096087l851192l929770
3039H8222730l306018l231830l073773k882687k834952k493623k466413k198074
3031F5735360k193743k358104k247192j975417j879725j872770j755897j601237
$$ y = [283736564, 291935325, 300024192, 308004978, 316394424, 324372642, 332460292, 340429543, 348084710, 356788394, 366865792, 378189357, 390028802, 401045280, 409891303, 415121386, 414864200, 408340363, 395777944, 378440464, 358293374, 337216530, 315913153, 295431758, 276330226, 258539180, 241828331, 226153515, 211532819, 197854376, 185687611, 174424652, 163958964, 154694549, 146255559, 138686032, 131604224, 125093013, 119415395, 114316275, 109116970, 104380584, 100099779, 96003692, 92152500, 88222730, 84916712, 81684882, 78611109, 75728422, 72893470, 70399847, 67933434, 65735360, 63541617, 61183513, 58936321, 56960904, 55081179, 53208409, 51452512, 49851275]
3023D9851275j732037j671232j262445j260873r47788r09069j399543j207476
3015C9460812q93506r21516r71691r21023q38929q93717p55695p57134n79641
3006C1927960p60478q81766n79151m58986o99819o57472p80794o57239j34840
2997B6317415m80634m46089o64372o11896p52781o94228l60281n54806n850j42462
2987B1604016l73415k27054n84402k79594n81634l63831j02117j56018l86856
2978A8549095n02198l87322l65420m94870l30300j46529j78917j50434k98089
2969A5695016l33570j37644k54378j44307l43044k04249k75465l44156o9532k53968
2959A3334703m52498m01949K6859j86765n9791j92859j56489K0086q9127m80648
$$ y = [49851275, 48119238, 46448006, 45185561, 43924688, 42976900, 42067831, 40668288, 39460812, 38567306, 37645790, 36674099, 35753076, 34914147, 34020430, 33264735, 32507601, 31927960, 31167482, 30285716, 29706565, 29247579, 28547760, 27890288, 27109494, 26452255, 26317415, 25836781, 25390692, 24726320, 24114424, 23361643, 22667415, 22307134, 21752328, 21746478, 21604016, 21230601, 21003547, 20419145, 20139551, 19557917, 19194086, 19091969, 18935951, 18549095, 18046897, 17659575, 17294155, 16799285, 16468985, 16322456, 16143539, 15993105, 15695016, 15361446, 15223802, 14969424, 14825117, 14482073, 14277824, 14002359, 13658203, 13588671, 13334703, 12882205, 12480256, 12507115, 12320350, 12260559, 12067700, 11911211, 11931297, 11842170, 11361522]
2949A1361522m30985k63429j19905o7616j65208q9530k22812k59707O1771j62429
2939I641672k26369j63414k65055k12942p5514k22280Q2901l02016j2360M2777
2929H287400j2233j30369m32454O3791j08135j6356l06335R2060O4557J45082
2919G647008n09406l63272J9918N3811k57857k79892J97632j45925q9015N1270
2909F324272L3583k20776k0229n4280J4153l69245L5579P2076j22078J915J14232
2898E809202j73018j10554K982J85749O5120L5310j73239k84202j808M5459j26939
2887E274062n4195K50678j91215m2933J92599N605k16416p3199j36696K982k80674
2876D730598j65883J89010J83418j22919j96566j40332m3063K63090l6132J0384
$$ y = [11361522, 10930537, 10667108, 10547203, 10479587, 10314379, 10224849, 10002037, 9742330, 9804101, 9641672, 9415303, 9251889, 8986834, 8773892, 8698378, 8476098, 8558999, 8256983, 8244623, 8287400, 8275167, 8144798, 7712344, 7776135, 7668000, 7651644, 7345309, 7437369, 7501926, 7647008, 7137602, 6774330, 6794248, 6848059, 6590202, 6310310, 6507942, 6362017, 6273002, 6324272, 6357855, 6137079, 6116850, 6062570, 6076723, 5707478, 5743057, 5815133, 5693055, 5694970, 5809202, 5636184, 5525630, 5528612, 5714361, 5779481, 5814791, 5641552, 5357350, 5355542, 5401001, 5274062, 5219867, 5470545, 5279330, 5236397, 5428996, 5434601, 5218185, 5144986, 5008290, 5011272, 4730598, 4564715, 4753725, 4937143, 4814224, 4617658, 4477326, 4434263, 4697353, 4661221, 4671605]
2866D671605j73603j27648j23065m1359K2413o0009p3839J822K1964k07984K37155
2855D147452j49561r6804j69790k62278K6420p658r1551r9603J38309R7571j09878
2844C422629q2432L6755j4933j8604k44181R0304J70863K1557k47896J16939K98542
2833C549543k6936K7796j25655j28981N641n9383K44161N1829j74518N014J14053
2822C482564j8987K287J49072k08865j36319N7095p2131k44281J90904J21045
2812C322384M834K14625j22153J59257L23730k01830P936l45102J92006J08257
2802C663944j15757j5369J47504L6941J05536J94899k40371M19781J43212k78305
2792D062015r3397K12214n8660L3N03105j69773j15776k12223l4175k86604j80290
$$ y = [4671605, 4498002, 4370354, 4247289, 4205930, 4228343, 4168334, 4094495, 4096317, 4118281, 3910297, 4147452, 3997891, 3901087, 3731297, 3469019, 3495439, 3487781, 3396230, 3296627, 3434936, 3532507, 3422629, 3340197, 3376952, 3362019, 3343415, 3099234, 3189538, 3360401, 3381958, 3134062, 3251001, 3549543, 3522607, 3550403, 3424748, 3295767, 3301408, 3242025, 3486186, 3538015, 3363497, 3368511, 3482564, 3463577, 3465864, 3614936, 3406071, 3269752, 3326847, 3254716, 3010435, 3201339, 3322384, 3327218, 3541843, 3419690, 3578947, 3902677, 3700847, 3708783, 3363681, 3555687, 3663944, 3548187, 3532818, 3680322, 3717263, 3822799, 4017698, 3777327, 4197108, 4340320, 4062015, 3968618, 4180832, 4122172, 4122205, 4625310, 4455537, 4339761, 4127538, 4093363, 3806759, 3626469]
2781C626469R4113j19750j95694j80978J13001k33268k37799P5691m052p504m73693
2770B456536j81694K86317K49078j59825R711j83598J1813R2029m30599R9760
2760B249528Q7463p613p1595p0034o8682M1534J01327O1107j50934O457J11611
2749B290169j00259k28134J35571p6525O1854k98385N0662J80684N777k2484m8189
2738A950741K389j57585j93159R2378P8457J65055k84884m4305K19344O9127q3703
2727A813855j34175j21565K71529k62214j08674J02244j06122J14431j86701j3999
2717A368609j13583q2342L1592K31757J08983j97275m8401k8155r709j6126j66496
2706A078854L9567O1597j17781R2883J71873k55654O0872j40150K54701j42958
$$ y = [3626469, 3720582, 3600832, 3405138, 3224160, 3337161, 3103893, 2866094, 2941785, 2937733, 2930229, 2456536, 2274842, 2561159, 2810237, 2650412, 2660123, 2476525, 2488338, 2580367, 2149768, 2249528, 2336991, 2329378, 2257783, 2187749, 2119067, 2160601, 2261928, 2323035, 2172101, 2178558, 2290169, 2189910, 1961776, 2097347, 2020822, 2082676, 1784291, 1834953, 2015637, 2021414, 1998930, 1950741, 1953130, 1795545, 1602386, 1694764, 1773221, 1938276, 1653392, 1609087, 1828431, 1897558, 1813855, 1679680, 1558115, 1829644, 1567430, 1458756, 1561000, 1454878, 1569309, 1382608, 1368609, 1255026, 1172684, 1204276, 1436033, 1545016, 1347741, 1299340, 1271185, 1261476, 1245350, 1078854, 1118421, 1180018, 1062237, 1155120, 1326993, 1071339, 1132211, 992061, 1246762, 1103804]
2696A103804p7729k6889l7333o349O6252R2217J00423J18870Q5509L3858m33214
2685A019419m190M5720R9944j63158j38410N1580J87555j58932J9264N6925p8504
2674I37213Q0088j15714j19061n5988L3510P4942K90493J5689j08016j97854m4070
2663G91232q4688n1618L5778m1143K00119L42971j21807o2807j03666k79138J5253
2652F40486j69923J32767K21719l6963n5060K56913m7091k13399O3200j01682
2642F90967j5922J82247K6592Q4560k4556j09906J59849J44010N5430k61703J11293
2631A042861r6267J25064J97808j67975m0486j0370j01755j56122L8913l3129
2621G98542K40032J71366k63223J93308Q7563l7190j63090j43127K52371j24917
$$ y = [1103804, 1026075, 999186, 961853, 955504, 1021756, 1113973, 1214396, 1333266, 1418775, 1452633, 1019419, 1015229, 1060949, 1160893, 997735, 859325, 910905, 1098460, 939528, 958792, 1015717, 937213, 1017301, 901587, 782526, 726538, 760048, 834990, 1125483, 1141172, 1033156, 835302, 791232, 706544, 654926, 690704, 649561, 849680, 1192651, 1070844, 1008037, 904371, 625233, 640486, 470563, 603330, 825049, 788086, 733026, 989939, 942848, 729449, 792649, 690967, 675045, 857292, 883884, 968444, 943888, 833982, 993831, 1137841, 1193271, 931568, 1042861, 946594, 1071658, 1269466, 1101491, 1061005, 1050635, 948880, 792758, 831671, 798542, 1038574, 1209940, 946717, 1140025, 1227588, 1190398, 1027308, 884181, 1136552, 1011635]
2611A011635k18724J54138P1785l81970j15545K64753q0626R806r0930L05409
2601I29731J45130j92816Q9740P6769n9549k27941j81046L3717J24035R6403L1228
2590H65401j97525J2785J84910N0764K44870J70988l90351j44986j11010k1675
2580F64171j8462j20484m6257J12631J13720Q046k5575p5781q8882j04442p5616
2569C43069K43651J07860J99852p9040j9928k9037R4814k6514k26050j79404O3794
2558D93067K67289O0240j26286P4196k0921j28815K77735j88462k46018Q6368
2548E48393j65510J44016Q3782o2807M2008P4676p5380J9040r9312k34379P1896
2537C46423K31093P1572n5407K78555l8814k60095m1921q4979j24744J95920J49501
$$ y = [1011635, 792911, 947049, 1018834, 636864, 521319, 786072, 705446, 715252, 624322, 929731, 1074861, 882045, 971785, 1048554, 989005, 761064, 580018, 613735, 737770, 834173, 865401, 667876, 680661, 865571, 916335, 1161205, 1332193, 941842, 796856, 685846, 664171, 645709, 525225, 478968, 591599, 705319, 713365, 687790, 612009, 523127, 418685, 343069, 586720, 694580, 894432, 815392, 795464, 766427, 861241, 834727, 608677, 429273, 493067, 760356, 820596, 694310, 768506, 747585, 618770, 896505, 708043, 462025, 548393, 382883, 526899, 610681, 547874, 589882, 664558, 589178, 608218, 508906, 274527, 346423, 577516, 649088, 593681, 872236, 833422, 573327, 531406, 446427, 321683, 517603, 667104]
2526F67104q0230m7283j97920K10716K82613K2188p2604l88096N2666K8744J35456
2515F13354o6601J0628k07630K50558o727O7192J16093N1317r6182J56065o8978
2504H19089p697J00063j23138n2553l7490J06491j5401N3035k25656l6358K3721
2493F04106J08168j169J23482j72103k48901P6393O2346K5413p765j27777L31163
2482G73356M9786k46859k97622n5135J31772j62830q6108L42080K15792o2448
2472F01784k27696j05670J72452J9k10789q8346K87136J62962o4264k02063q3382
2461B42143L25360j92172q1029N2727K5971P1373n5894J96368k58820k35934J26455
2450B16548q72J75919K48924j82023l23772k43592Q2920M23933K40008K6480l11416
$$ y = [667104, 586874, 539591, 341671, 552387, 835000, 857188, 784584, 396488, 449154, 477898, 613354, 546753, 557381, 349751, 600309, 593582, 660774, 776867, 828184, 732002, 888067, 819089, 811392, 911455, 788317, 735764, 698274, 804765, 789364, 842399, 616743, 580385, 604106, 712274, 711105, 834587, 662484, 413583, 489976, 552322, 577735, 569970, 442193, 773356, 823142, 576283, 278661, 223526, 355298, 192468, 106360, 448440, 664232, 601784, 374088, 268418, 440870, 440889, 230100, 141754, 428890, 591852, 527588, 325525, 242143, 567503, 375331, 294302, 347029, 373000, 444373, 388479, 584847, 326027, 90093, 216548, 215676, 391595, 640519, 458496, 134724, -108868, -25948, 397985, 637993, 664473, 353057]
2439C53057K05644K85924j17954j04692r0325R064L3340L0263o7351q8511L6183
2428D84642L0396J84636j86043j65341K65534M6346k17731j06827n6895p3336
2418B05381L29913L7058k10308J24681l9765j63696J43935J63397j7082j7681
2408E55833J17990j55706R2837k38318N0072K05619k10903K1272K25803J22662
2398G87161o8118m8454O4232K51652Q4220J8790r3409k47177J10059K44197j09826
2387I93327j74427J87604J22007j00508K10842j23164j41678M1350j98011J1866
2377H29208M59012p3857j29140K10688L3159L4652J54092q2917J09028K90170
2367A834095m6877K40310R3658M68459j09694K01652L09512J48257L44374K92329
$$ y = [353057, 558701, 844625, 726671, 621979, 531654, 540718, 574058, 604321, 536970, 448459, 484642, 515038, 699674, 513631, 348290, 613824, 660170, 442439, 335612, 278717, 205381, 535294, 572352, 362044, 486725, 446960, 283264, 427199, 590596, 573514, 555833, 673823, 518117, 610954, 372636, 422708, 628327, 417424, 438696, 664499, 787161, 719043, 670589, 734821, 986473, 1070693, 1089483, 996074, 748897, 858956, 1103153, 993327, 818900, 1006504, 1128511, 1028003, 1238845, 1115681, 974003, 1015353, 817342, 829208, 1288220, 1214363, 1085223, 1295911, 1329070, 1363722, 1517814, 1434897, 1543925, 1834095, 1787218, 2027528, 2121186, 2589645, 2479951, 2681603, 2991115, 3139372, 3483746, 3776075]
2357C776075L72998M88293L43665K63670N53111O01322N63847Q30578J142410
2348H935969J146812J454895J652722J822485J770642J171581K16606l05930j500868
2339A6364914k180265j558756j224896r42280j001656r29056n33302p83001n69323
2330F642379o45181m93445m72512m87245k35648m15060l86074m85702J06544j10838
2320C017218k96323k63208j14721Q6478q8602p2718k97056j68395j29427P8346
2310A751592l173O4491j08587j30640J67420j73373j23418J64861m25046j04650
2300A079477J74292k5110l23476p0578J06727J88962j61502K3418n3548j63871
2290G74791j21360J3814R5898O7106o2898j20919J73325J27852L62158k30278
$$ y = [3776075, 4149073, 4637366, 4981031, 5244701, 5797812, 6399134, 6962981, 7793559, 8935969, 10082781, 11537676, 13190398, 15012883, 16783525, 17955106, 18171712, 17865782, 16364914, 14184649, 12625893, 11400997, 10458717, 9457061, 8528005, 7994703, 7211702, 6642379, 5997198, 5503753, 5031241, 4543996, 4308348, 3893288, 3507214, 3021512, 3128056, 3017218, 2720895, 2457687, 2342966, 2429444, 2340842, 2268124, 1971068, 1802673, 1673246, 1751592, 1748419, 1812910, 1704323, 1573683, 1741103, 1567730, 1444312, 1609173, 1184127, 1079477, 1253769, 1228659, 905183, 834605, 941332, 1130294, 968792, 992210, 938662, 774791, 653431, 667245, 763143, 830249, 767351, 646432, 819757, 947609, 1309767, 1079489]
2280A079489j45338j24655j57940j3567J77824J30601j94112j16907J43498N6336
2270H35229k43176O4532M1456r493j5691J14751j72403n5728K0731J43585P5353
2259G99146j98051J38589j93772k30183J90005J69623K4754r3512k74463K35426
2249E67562o2933Q5482J0924k11329q1509O8789J23483r0684l3681k08065p1041
2238I6998J04538P4205K07447o1202m0371R5781j57079p5558O7269k23551j02080
2227a3603J39316J99888M2986j62127p3361L1013Q5741L16181j6556r6605j19934
2216C32939o9802n101R1459R6520P9418J41955j43245m1311j41821j881L8501
2205C77631j11590J94100o9762L9324p3360k65963n924M4713q3140k2596j88071
$$ y = [1079489, 934151, 809496, 651556, 637989, 815813, 946414, 752302, 635395, 778893, 835229, 592053, 656585, 698041, 688548, 672857, 787608, 615205, 559477, 580208, 723793, 799146, 601095, 739684, 545912, 315729, 505734, 675357, 700111, 606599, 332136, 567562, 504629, 590111, 601035, 389706, 308197, 376986, 500469, 409785, 376104, 168039, 96998, 201536, 275741, 483188, 421986, 381615, 477396, 320317, 244759, 312028, 88477, -13603, 125713, 325601, 368587, 206460, 133099, 164112, 249853, 566034, 549478, 452873, 332939, 263137, 258036, 349495, 446015, 525433, 667388, 524143, 482832, 341011, 339130, 377631, 266041, 460141, 390379, 429703, 356343, 90380, 84456, 129169, 46029, 23433, -164638]
2194a64638P1826K3371J88404K37613k97738L1601K8938J55088j2016N3985J50381
2183D66815m7332j98221j20072P7711J39741j93206K49389l021j96629P1560k15548
2172C1187J42282k7851L7621j12416j58728J86616K02394J45959J03848j74213
2162C76699k78279L782J12482n710j17586P5546r3301n4839J91983K04851k47271
2151A68357k954K01341K6729j82370q0544j97613L5386J91705J12837j19864J42439
2140B95449n6968L6524m6467j89692K60723l09627Q1346p6397P5381J19065l1193
2129A58144o9834k9911j0437j05534J62952J18766L0004K7396k0223k84804J11754
2118H8273R8029j1789J81101j36746j84219M0495K34849j50589m32928M0951J64444
$$ y = [-164638, -92812, -69441, 118963, 356576, 58838, 90439, 119377, 274465, 262449, 316434, 466815, 419483, 221262, 101190, 178901, 318642, 125436, 374825, 371804, 175175, 246735, 31187, 173469, 145618, 183239, 70823, -87905, 98711, 301105, 447064, 550912, 376699, 98420, 102202, 214684, 208974, 91388, 166934, 73633, 18794, 210777, 415628, 168357, 165403, 366744, 393473, 211103, 130559, -67054, -31668, 160037, 272874, 153010, 295449, 238481, 275005, 228538, 38846, 299569, -10058, 71288, -5109, 70272, 189337, 158144, 88310, 58399, 47962, -57572, 105380, 224146, 254150, 281546, 261323, -23481, 88273, 186302, 174513, 355614, 218868, 34649, 75144, 309993, 159404, -273524, -232573, -68129]
2107f8129N8922L59781K1922m7919N7546k66547j68930L6204J30165J79313O0953
2096C53281o3050j27144q6239J05935J10603O6305j83255J11448J10685k30032
2086A68537j83894k189J9460M37547o1047k37009N1536K0923j0630o8994J67899
2075C02139j91727J33218r8586L4103j13693m38891K54837L46837L2461k32327
2065B8371j7118O961q737M6944k01034Q6785K6681J11657O2137j21822q106p1661
2053e8942n0261K6132p9392Q1729L03797r6370k9508j92404p8770l1847L57304
2042A51468m6092k54189J40312O440o5776k3813j4305M2388K38610N0138j06034
2031A19147N2022o218j53167K7240M697o312K9068k19090n5403J49113j91448
$$ y = [-68129, -9207, 350574, 372496, 324577, 382123, 115576, -53354, -17150, 113015, 292328, 353281, 290231, 163087, 76848, 182783, 293386, 359691, 176436, 287884, 398569, 168537, -15357, -17546, 1914, 439461, 378414, 141405, 192941, 213864, 203234, 134240, 302139, 110412, 243630, 145044, 179147, 65454, -373437, -118600, 228237, 260698, 28371, 11253, 18214, 9477, 56421, -144613, -57828, -31147, 80510, 142647, 20825, 12719, -58942, -109203, -83071, -162463, -80734, 223063, 126693, 97185, -95219, -173989, -205836, 151468, 105376, -148813, -8501, -2061, -67837, -91650, -105955, -63567, 175043, 225181, 119147, 171169, 164951, 11784, 39024, 43721, 37409, 66477, -152613, -208016, -58903, -250351]
2020b50351K30022Q6976L2747K8483n4467j47253K71367j42730J09560k9150q767
2009A26437M5519o8580N2852j8369R6960j88708j55576J01827K72893O3296j88220
1998A40331J72716Q4207j87039k9879j34082j22382R0450J4880K818J20610J69523
1987C22153j44316L5683J08754J48345L2405p6185j08857r4268K22202n240l7397
1976D03279k60690P7358J27837J15127j71913l1834j3217m4516J52498j78801
1966A75128k45569K47524J5871j79920m13398L3145M2338j2955J71549K63359
1956I7072O3993N6706M8654j96596j30793q8765J05260J2671j18882O9105j29079
1945b10654j46719J49805J9058p8685R3493j39277J93041N4842j05065Q0180o5631
$$ y = [-250351, -20329, 66647, 99394, 127877, 73410, -73843, 197524, 54794, 164354, 135204, 126437, 171956, 103376, 156228, 137859, 234819, 46111, -109465, -7638, 265255, 328551, 140331, 313047, 397254, 210215, 180336, 46254, -76128, 14322, 29202, 32020, 152630, 322153, 177837, 213520, 322274, 470619, 503024, 426839, 317982, 223714, 445916, 440676, 403279, 142589, 219947, 347784, 462911, 290998, 259164, 245947, 201431, 353929, 175128, -70441, 177083, 192954, 13034, -400364, -367219, -324881, -337836, -166287, 97072, 161065, 217771, 266425, 69829, -60964, -149729, -44469, -31798, -150680, -81575, -210654, -357373, -207568, -188510, -267195, -173702, -312979, -119938, -65096, -170161, -89981, -155612]
1934a55612J873K7134m585j2696m4453j73356J16003O0049Q3049j06142K93527
1923H4791l1719r7969J76515K7644j96839j29973K34119J23155j65505J12654
1913A36873K1041J20772m5319l33884O0648K08155K8447N3062J2200k31792l0670
1902d67j72192M6029J60258P4270R5708Q3552n4974k5289j92794J36866j48569
1891B398R1345J41235m3222J35369k4046j31882j44077P3971J48485K23693M6127
1880E19396k52178p9800p2232j36309J4621J54525K7554k928J20257p9552j07489
1869A05865q9923K355k4958p6111k6509K4264J27166J04263O2183O5834M5155
1858C19584j52554J5262J03744j68633n112k60370L0090l0859o9264Q4273K30917
$$ y = [-155612, -153739, -126605, -131190, -143886, -188339, -361695, -245692, -185643, -102594, -208736, 84791, 53072, -44897, 131618, 159262, -37577, -167550, 66569, 189724, 24219, 136873, 157914, 278686, 233367, -100517, -39869, 168286, 196733, 249795, 261995, 30203, -467, -172659, -126630, 33628, 107898, 203606, 287158, 232184, 206895, 14101, 150967, 2398, 93743, 234978, 191756, 327125, 303079, 171197, 27120, 101091, 249576, 473269, 519396, 267218, 187418, 115186, -21123, -6502, 148023, 175577, 172649, 292906, 213354, 105865, 15942, 18297, -6661, -82772, -109281, -85017, 42149, 146412, 208595, 274429, 319584, 167030, 182292, 286036, 117403, 112291, -148079, -117989, -148848, -218112, -133839, 97078]
1847I7078l0172l13860j68456J48953K45485Q0080Q1890k29950m68K64240q1298
1836I3522j2006j43597J01357k59367k24375K26901J05654o4369q8622R6711K24303
1825E6112j30409o2099J66067J32967j54822p6118N672J42103J5827j76328m3037
1814a24065p1640K739M2044L18886n5270Q9284j07917n3547r4568j52812p0381
1803b77247J74809J40423J17909M2040k23227k65751J17698K55194K6341J29218
1793B37407j34776p8243J88439o3035j00494L7733j49996J42740K44569j64837
1783A59507j35805l8226P0769k4292N3562J18758k21486K95462K02124O4059l36491
1772B07941K4035j39774j07337L39729j02402j14964j3009L4979j67912j32724
$$ y = [97078, 66906, -246954, -415410, -266457, -20972, 59108, 140998, -88952, -89420, 174820, 93522, 81516, -62081, 39276, -220091, -444466, -217565, -111911, -176280, -264902, -168191, 56112, -74297, -136396, 29671, 162638, 7816, -68302, -62630, 79473, 95300, -81028, -124065, -195705, -192966, -150922, 167964, 112694, 201978, 94061, 40514, -54054, -206866, -277247, -102438, 37985, 155894, 197934, -25293, -291044, -173346, 81848, 108189, 237407, 102631, 24388, 212827, 149792, 49298, 87031, -62965, 79775, 324344, 159507, 23702, -14524, 56245, 31953, 85515, 204273, -17213, 278249, 480373, 544432, 207941, 231976, 92202, -15135, 324594, 222192, 107228, 94219, 129198, -38714, -171438]
1762a71438K08961J29157O9228k02903n7609K72531p2470j70726j44548J15082
1752b4735K2769o187j92268Q4033K1315J88891J22814M5917l52321q5773M7969
1741a27576L2325M1682O1625q994J29505J2593j06495J20551m8484L3671k13760
$$ y = [-171438, 37523, 166680, 235908, 33005, -24604, 247927, 175457, 4731, -139817, -24735, -1966, -8153, -200421, -116388, -95073, 93818, 216632, 262549, -89772, -175545, -127576, -95251, -53569, 8056, -938, 128567, 141160, 34665, 155216, 106732, 140403, -73357]
$$ [...]
##END NTUPLES=NMR SPECTRUM
##END=
