##TITLE=1H_CA-9379-11-1
 200.13MHz, CDCl3,
 8 sc
 
 11.9.2025
##JCAMPDX= 6.0         $$ Bruker NMR JCAMP-DX V2.0
##DATA TYPE= NMR SPECTRUM
##DATA CLASS= NTUPLES
##ORIGIN= UXNMR, Bruker Analytische Messtechnik GmbH
##OWNER= pz
$$ XWIN-NMR		Version 3.5
$$ Thu Sep 11 15:30:35 2025 Russian Standard Time (UT+4h)  she@DPX200
##.OBSERVE FREQUENCY= 200.1313
##.OBSERVE NUCLEUS= ^1H
##.ACQUISITION MODE= SIMULTANEOUS
##.ACQUISITION SCHEME= undefined
##.AVERAGES= 8
##.DIGITISER RES= 18
##SPECTROMETER/DATA SYSTEM= spect
##.PULSE SEQUENCE= zg30
##.SOLVENT NAME= CDCl3
##.SHIFT REFERENCE= (INTERNAL, CDCl3, 0, 15.4791)
##AUDIT TRAIL= $$ (NUMBER, WHEN, WHO, WHERE, WHAT)
$$ ##TITLE= Audit trail, XWIN-NMR		Version 3.5
$$ ##JCAMPDX= 5.01
$$ ##ORIGIN= Bruker BioSpin GmbH
$$ ##OWNER= she
$$ F:/spectra/data/she/nmr/H-C/1/pdata/1/auditp.txt
$$ ##AUDIT TRAIL=  $$ (NUMBER, WHEN, WHO, WHERE, WHAT)
(   1,<2025-09-11 15:28:53.40 +0400>,<she>,<DPX200>,
      <created by zg, POWCHK disabled, PULCHK disabled
       configuration hash MD5:
       00 E9 B6 7A A2 85 ED C7 34 08 36 98 17 FE 4E 26
       data hash MD5: 16K
       64 3C 81 A7 0D 33 F5 BE 29 7F 07 20 6C C8 B0 39>)
(   2,<2025-09-11 15:28:56.06 +0400>,<she>,<DPX200>,
      <Start of raw data processing
       efp BC_mod = 2 LB = 0.25 FT_mod = 6 PKNL = 1 PHC0 = -1570.89 PHC1 = 38.99226 SI = 16K 
       data hash MD5: 16K
       8A FC B2 2E CE 72 24 46 BC 62 60 2D F6 E4 41 D3>)
(   3,<2025-09-11 15:29:30.73 +0400>,<she>,<DPX200>,
      <pk PHC0 = -155.8467 PHC1 = -18.2 
       data hash MD5: 16K
       2E 57 2F 41 79 A4 EA E7 08 E2 B6 E5 75 FA 91 BD>)
(   4,<2025-09-11 15:29:35.15 +0400>,<she>,<DPX200>,
      <abs ABSG = 5 
       data hash MD5: 16K
       E0 0B 3B 6C 8B F2 EC 1A 65 42 00 A4 2B 13 D0 8C>)
(   5,<2025-09-11 15:29:58.75 +0400>,<she>,<DPX200>,
      <abs ABSG = 5 
       data hash MD5: 16K
       A4 9D 8B 5A 90 16 EC 0F 86 55 84 AE F7 BD F5 7C>)
$$ ##END=
$$ 
$$ hash MD5
$$ 94 6D 76 33 20 1C 93 86 F9 98 7D E5 02 EB A5 CB
##$RELAX= 
##$RELAX= 
##$RELAX= 
##$RELAX= 
##$RELAX= 
##$RELAX= 
$$ Bruker specific parameters
$$ --------------------------
##$DU= <F:/spectra>
##$EXPNO= 1
##$NAME= <H-C>
##$PROCNO= 1
##$TYPE= <nmr>
##$USER= <she>
##$AMP= (0..31)
100 100 100 100 100 100 100 100 100 100 100 100 100 100 100 100 100 100 
100 100 100 100 100 100 100 100 100 100 100 100 100 100 
##$AQSEQ= 0
##$AQ_mod= 1
##$AUNM= <au_zg>
##$AUTOPOS= <>
##$BF1= 200.13
##$BF2= 200.13
##$BF3= 200.13
##$BF4= 200.13
##$BF5= 200.13
##$BF6= 200.13
##$BF7= 200.13
##$BF8= 200.13
##$BYTORDA= 1
##$CFDGTYP= 0
##$CFRGTYP= 5
##$CHEMSTR= <none>
##$CNST= (0..31)
1 1 145 1 1 1 1 1 1 1 1 1 1 1 1 1 1 1 1 1 1 1 1 1 1 1 1 1 1 1 1 1 
##$CPDPRG= <>
##$CPDPRG1= <>
##$CPDPRG2= <>
##$CPDPRG3= <>
##$CPDPRG4= <mlev>
##$CPDPRG5= <mlev>
##$CPDPRG6= <mlev>
##$CPDPRG7= <mlev>
##$CPDPRG8= <mlev>
##$CPDPRGB= <>
##$CPDPRGT= <>
##$D= (0..31)
0 0.7 0 0 0 0 0 0 0 0 0 0.03 0 0 0 0 0 0 0 0 0 0 0 0 0 0 0 0 0 0 0 0 
##$DATE= 1757590132
##$DBL= (0..7)
$$ [...]
##$SUBNAM3= <"">
##$SUBNAM4= <"">
##$SUBNAM5= <"">
##$SUBNAM6= <"">
##$SUBNAM7= <"">
##$SUBNAM8= <"">
##$SUBNAM9= <"">
##$SW= 18.0517328524113
##$SWIBOX= (0..15)
0 0 2 0 0 0 0 0 0 0 0 0 0 0 0 0 
##$SW_h= 3612.71676300578
##$TD= 16384
##$TD0= 1
##$TE= 0
##$TE2= 300
##$TE3= 300
##$TEG= 300
##$TL= (0..7)
0 120 120 120 120 120 120 120 
##$TP= (0..7)
150 150 150 150 150 150 150 150 
##$TP07= 0
##$TPNAME0= <>
##$TPNAME1= <>
##$TPNAME2= <>
##$TPNAME3= <>
##$TPNAME4= <>
##$TPNAME5= <>
##$TPNAME6= <>
##$TPNAME7= <>
##$TPOAL= (0..7)
0.5 0.5 0.5 0.5 0.5 0.5 0.5 0.5 
##$TPOFFS= (0..7)
0 0 0 0 0 0 0 0 
##$TUNHIN= 0
##$TUNHOUT= 0
##$TUNXOUT= 0
##$USERA1= <user>
##$USERA2= <user>
##$USERA3= <user>
##$USERA4= <user>
##$USERA5= <user>
##$V9= 5
##$VALIST= <valist>
##$VCLIST= <CCCCCCCCCCCCCCC>
##$VD= 0
##$VDLIST= <DDDDDDDDDDDDDDD>
##$VPLIST= <PPPPPPPPPPPPPPP>
##$VTLIST= <TTTTTTTTTTTTTTT>
##$WBST= 1024
##$WBSW= 4
##$XGAIN= (0..3)
0 0 0 0 
##$XL= 0
##$YL= 0
##$YMAX_a= 666242
##$YMIN_a= -524861
##$ZGOPTNS= <>
##$ZL1= 120
##$ZL2= 120
##$ZL3= 120
##$ZL4= 120
##$ABSF1= 15.47915
##$ABSF2= -2.5727
##$ABSG= 5
##$ABSL= 3
##$ALPHA= 0
##$AQORDER= 0
##$ASSFAC= 0
##$ASSFACI= 0
##$ASSFACX= 0
##$ASSWID= 0
##$AUNMP= <proc_1d>
##$AZFE= 0.1
##$AZFW= 0.1
##$BCFW= 0
##$BC_mod= 2
##$BYTORDP= 0
##$COROFFS= 0
##$CY= -3
##$DATMOD= 1
##$DC= 0
##$DFILT= <>
##$DTYPP= 0
##$F1P= 0
##$F2P= 0
##$FCOR= 1
##$FTSIZE= 16384
##$FT_mod= 6
##$GAMMA= 0
##$GB= 0
##$INTBC= 1
##$INTSCL= 3.241238e-09
##$ISEN= 128
##$LB= 0.25
##$LEV0= 0
##$LPBIN= 0
##$MAXI= 10000
##$MC2= 0
##$MEAN= 0
##$ME_mod= 0
##$MI= 1.114404
##$NCOEF= 0
##$NC_proc= -7
##$NLEV= 6
##$NOISF1= 3.799351
##$NOISF2= 2.8
##$NSP= 0
##$NTH_PI= 0
##$NZP= 0
##$OFFSET= 15.47915
##$PC= 1
##$PHC0= -1726.737
##$PHC1= 20.79226
##$PH_mod= 1
##$PKNL= yes
##$PPARMOD= 0
##$PSCAL= 0
##$PSIGN= 0
##$REVERSE= no
##$SF= 200.130008515694
##$SI= 16384
##$SIGF1= 3
##$SIGF2= 2
##$SINO= 0.751879
##$SIOLD= 32768
##$SREGLST= <19F.Aceton>
##$SSB= 0
##$STSI= 16384
##$STSR= 0
##$SW_p= 3612.71676300578
##$SYMM= 0
##$S_DEV= 0
##$TDeff= 16384
##$TDoff= 0
##$TI= <>
##$TILT= no
##$TM1= 0
##$TM2= 0
##$TOPLEV= 0
##$USERP1= <user>
##$USERP2= <user>
##$USERP3= <user>
##$USERP4= <user>
##$USERP5= <user>
##$WDW= 1
##$XDIM= 16384
##$YMAX_p= 443834619
##$YMIN_p= -285872
$$ End of Bruker specific parameters
$$ ---------------------------------
##NTUPLES= NMR SPECTRUM
##VAR_NAME=  FREQUENCY,     SPECTRUM/REAL,   SPECTRUM/IMAG
##SYMBOL=    X,             R,               I
##VAR_TYPE=  INDEPENDENT,   DEPENDENT,       DEPENDENT
##VAR_FORM=  AFFN,          ASDF,            ASDF
##VAR_DIM=   16384,         16384,           16384
##UNITS=     HZ,            ARBITRARY UNITS, ARBITRARY UNITS
##FACTOR=    0.220516191357247, 1,           1
##FIRST=     3097.84238497618, 0,            0
##LAST=      -514.8743780296, 0,             0
##MIN=       -514.8743780296, -285872,       0
##MAX=       3097.84238497618, 443834619,    0
$$ Real data points
##PAGE= N=1
##DATA TABLE= (X++(R..R)), XYDATA
$$ [...]
5738B2778171j3301n2385K1472K1096L9599N1862M1764J2268O5368N5904L1256
5727B3053074Q117R9152O14l8976j4120J7091M4764M2284L7757J8820K6103M2205
5715B3336885R9233R2238J03700J2140N3275P5445O6222J00699J35036J64980
5705B4239853K30058K02204J54017J88767J92888K60748K45716K31844J67973
5696B6114068K86170L35629K33305K66219L37722K87469K60009K49187K52132
5687B8621910K72257K16521K47534K96779K66438L60506L55988K96395K96329
5678C1230657L11159L19815L10427L25158K62962K45512K08412K03774R5928O3281
5668C3577085J81896L553K9619Q299q9761p5565j20792m6253k6268r3512j15209
$$ plain form
5738 22778171 22764870 22712485 22733957 22755053 22794652 22846514 22888278 22900546 22965914 23021818 23053074
5727 23053074 23061191 23160343 23160957 23121981 23107861 23124952 23169716 23212000 23249757 23268577 23294680 23336885
5715 23336885 23436118 23528356 23632056 23644196 23697471 23772916 23839138 23939837 24074873 24239853
5705 24239853 24469911 24672115 24826132 25014899 25207787 25468535 25714251 25946095 26114068
5696 26114068 26400238 26735867 26969172 27235391 27573113 27860582 28120591 28369778 28621910
5687 28621910 28894167 29110688 29358222 29655001 29921439 30281945 30637933 30934328 31230657
5678 31230657 31541816 31861631 32172058 32497216 32760178 33005690 33214102 33417876 33513804 33577085
5668 33577085 33758981 33762534 33792153 33800452 33710691 33635126 33514334 33468081 33441813 33348301 33233092
5657C3233092j14507r1986n1372q0359j27460j01739j25638j57324q1163j02626
5647C2198918r2533o3565q1719o8530L8521o844m6453M697J67711J69664Q9986
5636C2309853J33757J60241K67464L01653K48774K91750K45759K87579L89931
5627C4636761L61494L83553L68899M62035N12907N04365M64553M99582N36361
5618C8730510N87404N94393P18533O76596O70946P82467P71231P62662O34954
5609D4929696O42294N65121N12035M69537K95080J33265P1331p8845j56628l10815
5599D7072071l26969m52078n18220n04803n86664o73668o31520o40224p58131
5590D1979794p93482q57615q54732q53584q37661p59296o66192n81577m69540
$$ plain form
5657 33233092 33118585 33026599 32975227 32894868 32767408 32665669 32540031 32382707 32301544 32198918
5647 32198918 32106385 32042820 31961101 31892571 31931092 31924248 31877795 31882492 32050203 32219867 32309853
5636 32309853 32443610 32603851 32871315 33172968 33421742 33713492 33959251 34246830 34636761
5627 34636761 34998255 35381808 35750707 36212742 36725649 37230014 37694567 38194149 38730510
5618 38730510 39317914 39912307 40630840 41307436 41978382 42760849 43532080 44294742 44929696
5609 44929696 45571990 46137111 46649146 47118683 47413763 47547028 47618359 47539514 47382886 47072071
5599 47072071 46745102 46293024 45774804 45270001 44683337 44009669 43378149 42737925 41979794
5590 41979794 41186312 40328697 39473965 38620381 37782720 37023424 36357232 35775655 35306115
5581C5306115m32004l81357k98490k55973j76604m9612p1338N8987J51434K15422
5571C4066580L24504L24372N07788O32987O86254P31219Q02930Q93935R33114
5562C9903683J059981J117294J074753J026009R98703P89795P28819O47674N42421
5553D7889132M98855L38165Q2516q0127k49185m22879o23867p43065q28055r40534
5543D4920956j019057j062188j015643j238442j112124j070332j093780r82341
5535C6327049q70613r20028r14419p79389o74460n90825o13338o21019n29421
5526B9813537m62964m71502m55314m31132l21897l23705j91640j43737n1815m0877
5516B6918954n8620j8876o4887Q0445J37721J50667L08116K15301K14475L66131
$$ plain form
5581 35306115 34874111 34492754 34194264 33938291 33761687 33712075 33640737 33699724 33851158 34066580
5571 34066580 34391084 34715456 35223244 35856231 36542485 37273704 38076634 38970569 39903683
5562 39903683 40963664 42080958 43155711 44181720 45180423 45970218 46699037 47346711 47889132
5553 47889132 48387987 48726152 48808668 48728541 48479356 48056477 47432610 46689545 45861490 44920956
5543 44920956 43901899 42839711 41824068 40585626 39473502 38403170 37309390 36327049
5535 36327049 35456436 34536408 33621989 32842600 32168140 31577315 30963977 30342958 29813537
5526 29813537 29350573 28879071 28423757 27992625 27670728 27347023 27155383 27011646 26959831 26918954
5516 26918954 26860334 26841458 26776571 26857016 26994737 27145404 27453520 27668821 27883296 28249427
5506B8249427M06262L69385L56049L62665L95970M75298L90810M52652M68035
5497C1926553M91355N67007N03690N78151M99073M97886M22781L59821L38856
5488C6185173J63093J26342L9465j73519k57466k82053l82912n58032o36652o48100
5478C3575339p41697p42229o96734p16990p58815p66505p17652o21492n72326
5469B7240899o02514n77304n16197m22268m71811m14205k95850m29234m24961
5460B3086555l31586l42250l72065l37688l16692k50508k83847k65021k29371
5451B0357527k30900j58168j39964j32082j23632j39725r1509j16236q1589J9058
5441A9162780N7903l1510j7894P7747M1207O2457R4899O9273J28555R1964N0186
$$ plain form
5506 28249427 28655689 29025074 29381123 29743788 30139758 30615056 31005866 31458518 31926553
5497 31926553 32417908 32984915 33488605 34066756 34565829 35063715 35486496 35846317 36185173
5488 36185173 36348266 36474608 36514073 36340554 36083088 35801035 35418123 34860091 34223439 33575339
5478 33575339 32833642 32091413 31394679 30677689 29918874 29152369 28434717 27813225 27240899
5469 27240899 26638385 26061081 25544884 25122616 24650805 24236600 23940750 23511516 23086555
5460 23086555 22754969 22412719 22040654 21702966 21386274 21135766 20851919 20586898 20357527
5451 20357527 20126627 19968459 19828495 19696413 19572781 19433056 19341547 19225311 19143722 19162780
5441 19162780 19220683 19189173 19171279 19249026 19290233 19352690 19447589 19516862 19645417 19737381 19787567
5430A9787567O7281J45132Q6887K3683o2283j57782j56346k06454k10202k96674
5420A9020809l41457l82416l86688l36984m53836m05624m16343m61485l27054
5411A5508922l10744l85376k90050k78334l62927k69812k03884k69366k30509
5402A2907920j27226k26283j57740j82853j17716j18824j20604j2609j02438j29738
5392A1611889j10549q5512j16182l9747k8177J63m8185j48312J598m8903N4780
5381A1042863J4624r4404p1763n0622p933j7700j10539K7198k677n1099k9009
5370A0648939n48K8440P6566J1826l8271O4309K7457L7905l2165P9568K5599j4548
5358A0915077M714n8016P111j8447J8651M970n9411p9027m4915j5002m325r3904
$$ plain form
5430 19787567 19854848 19999980 20086867 20110550 20048267 19890485 19734139 19527685 19317483 19020809
5420 19020809 18679352 18296936 17910248 17573264 17119428 16713804 16297461 15835976 15508922
5411 15508922 15198178 14812802 14522752 14244418 13881491 13611679 13407795 13138429 12907920
5402 12907920 12780694 12554411 12396671 12213818 12096102 11977278 11856674 11844065 11741627 11611889
5392 11611889 11501340 11415828 11299646 11259899 11231722 11231885 11183700 11035388 11036986 10988083 11042863
5381 11042863 11057487 10963083 10891320 10840698 10832765 10815065 10704526 10731724 10729047 10677948 10648939
5370 10648939 10648391 10676831 10753397 10765223 10726952 10791261 10818718 10856623 10824458 10904026 10929625 10915077
5358 10915077 10919791 10861775 10868886 10850439 10869090 10874060 10814649 10735622 10690707 10675705 10671380 10577476
5346A0577476o4264m0797o9987O8299p3846k0227n5889j1140m2989p0858L0252
5335A0226030L2538p994q6282m0218J3455l8453m0306q4715m8828o4283p1924
5324I789020n8133k2943m6577k1111p3901p4103L4488K9082L719o6934j19741
5313I372866M2023M9705j3569l9008l9463O938R0597k8813n6073P8107M4876K1634
5301I529820n2945J5968k5364K0435m7930j4386l3431m8414m3016l5766l6988
5290I227983o176K214k870k3086l2900p4595m2055q8682m1779M8587l4791N9568
5278H991418n3359o7523n783M429r3206n2524j017j660j7408p1928m3588l3935
5266H553916L3606m6323n1881k7855K6268K0173l8154k3949k798k5898l3577L0726
$$ plain form
5346 10577476 10513212 10472415 10402428 10470727 10396881 10376654 10320765 10309625 10266636 10195778 10226030
5335 10226030 10258568 10250574 10164292 10124074 10137529 10099076 10058770 9974055 9925227 9860944 9789020
5324 9789020 9730887 9707944 9661367 9640256 9566355 9492252 9526740 9555822 9559541 9492607 9372866
5313 9372866 9414889 9464594 9451025 9412017 9372554 9379492 9470089 9441276 9385203 9463310 9508186 9529820
5301 9529820 9476875 9492843 9467479 9487914 9439984 9425598 9392167 9343753 9300737 9264971 9227983
5290 9227983 9221807 9224021 9221151 9198065 9165165 9090570 9048515 8959833 8918054 8966641 8931850 8991418
5278 8991418 8938059 8870536 8864753 8869182 8775976 8723452 8722435 8720775 8703367 8631439 8587851 8553916
5266 8553916 8587522 8541199 8489318 8461463 8487731 8507904 8469750 8445801 8443003 8417105 8383528 8414254
5254H414254K8820o1154N10j6478J12927P0178j886j3937J0892j120N2654Q6691
5242H682351N458Q8532J13237K8928j3121l0251R7597n695l1883N5707J694p2171
5230H920383J1331L3651P658m217L1981N7881K6694Q2042O071K570M2260L7252
5218I255557L3703R5548k1299O0225K9080K5339Q033Q2094K738J17214Q2331K1574
5206I792137K3810J02946Q3591O2025M9968Q9814L0364Q3351q06k4236Q0735l8115
5194A0335584R0197O0080M1694K0518P5289L9874P7119Q8454J34112L2288R8439
5183A1093648J81262J17030J31932J40206Q3878Q7143N2020O6265R0828M8971
5173A2093183Q0708N7573J14442k8461k2962N977k658K8743M5731K7187L065P1858
$$ plain form
5254 8414254 8443074 8381920 8382430 8365952 8478879 8549057 8547171 8533234 8544126 8543006 8595660 8682351
5242 8682351 8687809 8776341 8889578 8918506 8905385 8875134 8972731 8967036 8935153 8990860 8992554 8920383
5230 8920383 8931714 8965365 8973023 8968806 9000787 9058668 9085362 9167404 9173475 9176045 9218305 9255557
5218 9255557 9289260 9384808 9363509 9423734 9452814 9478153 9486186 9568280 9571018 9688232 9770563 9792137
5206 9792137 9815947 9918893 10002484 10064509 10114477 10204291 10234655 10318006 10317200 10292964 10373699 10335584
5194 10335584 10425781 10485861 10527555 10548073 10623362 10663236 10740355 10828809 10962921 10995209 11093648
5183 11093648 11274910 11391940 11523872 11664078 11747956 11835099 11887119 11953384 12044212 12093183
5173 12093183 12173891 12231464 12345906 12317445 12294483 12300460 12297802 12326545 12372276 12399463 12402528 12474386
5161A2474386K0784j9837q403O4463O0712K0060J0638K5629N1392k7784r097Q8508
5149A2751451j801M0060R2606j81P3786R635J0400N668L8150J09821j4640m6486
5137A3068469p982O3168l127M3026r28P0446J24522N3420K6216J0018J23344N4343
5125A3624935M0915J00055O0076J24849J10763Q7572j5481K9861J40710J53744
5115A4457999O5250K8770J07304P8273J17415J47634J08584O3860J47651J04250
5105A5426990J69796J95679J35440J59761J67823J51532K53773J28038K02609
5096A6991441J99925Q5188K40436Q3837J03346J21887J38604J75130J52091J75937
5086A8467822J57855O0847K29076J44681K3121P1152K298j5825p8054o1485o2603
$$ plain form
5161 12474386 12495170 12475333 12466930 12531393 12592105 12612165 12622803 12648432 12699824 12672040 12662943 12751451
5149 12751451 12749650 12789710 12882316 12882135 12955921 12965556 12975956 12981624 13019774 13129595 13114955 13068469
5137 13068469 13060487 13123655 13120528 13163554 13162626 13233072 13357594 13411014 13437230 13447248 13570592 13624935
5125 13624935 13665850 13765905 13825981 13950830 14061593 14149165 14133684 14163545 14304255 14457999
5115 14457999 14523249 14552019 14659323 14737596 14855011 15002645 15111229 15175089 15322740 15426990
5105 15426990 15596786 15792465 15927905 16087666 16255489 16407021 16660794 16788832 16991441
5096 16991441 17191366 17276554 17516990 17600827 17704173 17826060 17964664 18139794 18291885 18467822
5086 18467822 18625677 18686524 18915600 19060281 19083402 19154554 19156852 19141027 19062973 19001488 18938885
5075A8938885o3835q7983L8907r197L3035P7236j8001O5124Q3046R1379Q8768
5064A9237364P2168J27544K08681J61754J76982J37481J54689J73289K26320J96655
5054B0872927J07113J61136J83009J79160J86184O9635J1140j840m278p2248m6025
5043B1645913N143l1115l7150o5987r2308L9000j0482n6288o1892N2211j5812
5032B1371233o1857J1088m0190q452k5895N5954L699P7622O7556Q1239m9483P4227
5020B1556741O8207k5704N4327K4291r420P252l3616J3302L6621L7095J7356L5506
5008B1781958O6029J6610Q5567J99927J33266J34512J64815J79820Q3032N1123
4998B2896659O6115N7654N6415Q252L4401O8495P1139J28713R8796J25374J44091
$$ plain form
5075 18938885 18875050 18787067 18825974 18816777 18849812 18927048 18909047 18974171 19057217 19148596 19237364
5064 19237364 19309532 19437076 19645757 19807511 19984493 20121974 20276663 20449952 20676272 20872927
5054 20872927 20980040 21141176 21324185 21503345 21689529 21759164 21770304 21768464 21764186 21691938 21645913
5043 21645913 21651056 21619941 21582791 21516804 21424496 21463496 21453014 21396726 21334834 21387045 21371233
5032 21371233 21309376 21320464 21280274 21271822 21245927 21301881 21305580 21383202 21450758 21531997 21482514 21556741
5020 21556741 21624948 21599244 21653571 21677862 21668442 21675694 21642078 21655380 21692001 21729096 21746452 21781958
5008 21781958 21847987 21864597 21950164 22150091 22283357 22417869 22582684 22762504 22845536 22896659
4998 22896659 22962774 23020428 23076843 23085095 23119496 23187991 23259130 23387843 23486639 23612013 23756104
4987B3756104K03525J21986J88091L56673J97563K68651K77943L50428L67985
4978B6088949L79221L35547K14734K49876L23627K74931K10716J25626J31523
4969B8334750J93418J97971K25379J30797J51057K10085K63239L45794L36438
4960C0388928L52410M48484M72953M67209M57506M60875O60549N99811O25356
4951C4934081O90698P44557P71768Q71287R25752J056691J179523J377132J499449
4942D4050938J482085J695938J811516J996603K314253K701277K984111L202489
4934F2239210L459147L746904M238943M580499M790875M404599L581568K545607
4926I3587352Q97399j086150k804243m044047m540568m216136l562604k884693
$$ plain form
4987 23756104 23959629 24081615 24269706 24626379 24823942 25092593 25370536 25720964 26088949
4978 26088949 26468170 26803717 27018451 27268327 27591954 27866885 28077601 28203227 28334750
4969 28334750 28528168 28726139 28951518 29082315 29233372 29443457 29706696 30052490 30388928
4960 30388928 30741338 31189822 31662775 32129984 32587490 33048365 33708914 34308725 34934081
4951 34934081 35624779 36369336 37141104 38012391 38938143 39994834 41174357 42551489 44050938
4942 44050938 45533023 47228961 49040477 51037080 53351333 56052610 59036721 62239210
4934 62239210 65698357 69445261 73684204 78264703 83055578 87460177 91041745 93587352
4926 93587352 94484751 93398601 90594358 86550311 82009743 77793607 74231003 71346310
4918G1346310k269853j862572j543639j184378r56365p40668n20941j47768L8239
4909F2158365L38180M89548N26159O83406P79942R10252J059669J105636J293875
4900F9345032J630988J985066K339636K568496L041046L429504L739132L938873
4892I2017773L926021L450714K607463J330210n57399k104772l332633m406486
4884I2930891m827456m623890l929557l432341k884932k485626k158115j898537
4876F6690437j666275j329830j206429r31264p80467p21757o35129o57047o96799
4867E8065440o26502o21620n62932n24238m24070l64835k54844k61632j51179
4858E4273588j31832K3520K23092J88439K78651K88047K82291L24494L10365L58802
$$ plain form
4918 71346310 69076457 67213885 65670246 64485868 63529503 62788835 62267894 62120126 62158365
4909 62158365 62496545 62986093 63512252 64195658 64975600 65885852 66945521 68051157 69345032
4900 69345032 70976020 72961086 75300722 77869218 80910264 84339768 88078900 92017773
4892 92017773 95943794 99394508 102001971 103332181 102774782 100670010 97337377 92930891
4884 92930891 88103435 83479545 79549988 76117647 73232715 70747089 68588974 66690437
4876 66690437 65024162 63694332 62487903 61556639 60776172 60054415 59419286 58762239 58065440
4867 58065440 57438938 56817318 56254386 55730148 55306078 54941243 54686399 54424767 54273588
4858 54273588 54141756 54165276 54388368 54576807 54855458 55143505 55425796 55750290 56060655 56419457
4848E6419457K99085J96379J57406L8610l8828n7145j53089k01919j71350k70012
4838E6218594j78341j26764j65490r5083k0489P1510J5179q757j3020n5587Q587
4827E5650339N5549o6517r7547j59404k01115k63146l02465m20205m39903n37576
4817E3218010n42558n51502n63397n35754n86049m60285l28290l77889l04084
4808D8968202j91518j93941j22626j73588j81493j58133k68083k48362k55857
4799D7174601k80599l35886l72439k76972k93012k19357l35597l14938k44696
4790D4501105k31453k53255l01078k63572k81137l08360k01322k23066j25604
4781D2312258j29368j83423j50037l6529n8023j0212j11853j10447M0707J33793
$$ plain form
4848 56419457 56718542 56914921 57072327 57110937 57072109 57014964 56861875 56659956 56488606 56218594
4838 56218594 56040253 55913489 55747999 55652916 55632427 55703937 55719116 55710359 55697339 55641752 55650339
4827 55650339 55705888 55639371 55541824 55382420 55181305 54918159 54615694 54195489 53755586 53218010
4817 53218010 52675452 52123950 51560553 51024799 50438750 49978465 49650175 49272286 48968202
4808 48968202 48776684 48582743 48460117 48286529 48105036 47946903 47678820 47430458 47174601
4799 47174601 46894002 46558116 46185677 45908705 45615693 45396336 45060739 44745801 44501105
4790 44501105 44269652 44016397 43715319 43451747 43170610 42862250 42660928 42437862 42312258
4781 42312258 42182890 41999467 41849430 41812901 41754878 41744666 41632813 41522366 41563073 41696866
4771D1696866J21055J8043J01668J26632J11950J94964J77457J93618K85506J77709
4761D3205468K23231K54918K08716K44121L39840K75895K48248L17142M04810
4752D5722389M76246L53616L85427L54395M05699M28721L01369L43105L98208
4743D9169175L65736M23906M05038L28789M03495M42347M41309M07943M21893
4734E2809631L25621L03945K94953J81458P3235N7730J21485P4572k7635o8035
4724E4146960n9587n1735r7469j51599N298p3103j77001o7509q3192j22082j03121
4713E3165860j69533j27501j55824j63260j61670j22134j69774j85828j22202
4704E1788134q9944j07459k26566j59946j33898r2484p5543l4541q4852K2546
$$ plain form
4771 41696866 41817921 41835964 41937632 42064264 42176214 42371178 42548635 42742253 43027759 43205468
4761 43205468 43428699 43683617 43892333 44136454 44476294 44752189 45000437 45317579 45722389
4752 45722389 46198635 46552251 46937678 47292073 47697772 48126493 48427862 48770967 49169175
4743 49169175 49534911 49958817 50363855 50692644 51096139 51538486 51979795 52387738 52809631
4734 52809631 53135252 53439197 53734150 53915608 53988843 54046573 54168058 54242630 54214995 54146960
4724 54146960 54087373 54035638 53938169 53786570 53791868 53718765 53541764 53474255 53391063 53268981 53165860
4713 53165860 52996327 52868826 52713002 52549742 52388072 52265938 52096164 51910336 51788134
4704 51788134 51698190 51590731 51364165 51204219 51070321 50977837 50902294 50867753 50782901 50805447
4694E0805447k1519l3461J33097J22998J85766J81854K15476K27717K68736K83951
4684E2370062K88784L96087M70030M15385M87529O00820O02767O84592P40264
4675E7056320P74756Q60176Q94229R19502J021588J031647J062105J120868J060648
4666F5801839J049509J083726J047320J079786R77643J000697R69071R88135R16793
4657G4914519Q49261P33591P01211O56965O02421M36293M09007K34195J21485
4648G9658948k9363r6116r3034r8664j59547j67390j13933p1462j77328k14653
4638G8437458k28906k48315k47156k52949k37972j36497O0574J85604K12444K08033
4628G7752318L55457K80387L68735M20465M66937M44877O32127O87161P66934
$$ plain form
4694 50805447 50783928 50750467 50883564 51006562 51192328 51374182 51589658 51817375 52086111 52370062
4684 52370062 52658846 53054933 53524963 53940348 54427877 55028697 55631464 56316056 57056320
4675 57056320 57831076 58691252 59585481 60504983 61526571 62558218 63620323 64741191 65801839
4666 65801839 66851348 67935074 68982394 70062180 71039823 72040520 73009591 73997726 74914519
4657 74914519 75763780 76497371 77198582 77855547 78457968 78894261 79303268 79537463 79658948
4648 79658948 79629585 79533469 79440435 79341771 79182224 79014834 78900901 78829439 78652111 78437458
4638 78437458 78208552 77960237 77713081 77460132 77222160 77085663 77146237 77331841 77544285 77752318
4628 77752318 78107775 78388162 78756897 79177362 79644299 80089176 80721303 81408464 82175398
4619H2175398Q79181R92763J121492R98042J053379R32928R24194J026033J041419
4610I1144829J099323J182347J311301J401895J655281J723200J856643J939264
4602A03314083K150132K144426K125469K071267K113176J985533J671188J243794
4594A18819068P82521K80530j71259n09743p23968p74544o43146o39004m28869
4585A15991586k94485j52490R3399J68053L31956M35177O09784P66333R94024
4576A18943337J123728J160408J260659J446097J608286J695129J875045K017350
4568A31130039K234212K316700K395892K483413K566951K693035K734950K788525
4560A51343717K838129L073180L155329L121844L169758K949052K645062K253007
$$ plain form
4619 82175398 83054579 84047342 85168834 86166876 87220255 88153183 89077377 90103410 91144829
4610 91144829 92244152 93426499 94737800 96139695 97794976 99518176 101374819 103314083
4602 103314083 105464215 107608641 109734110 111805377 113918553 115904086 117575274 118819068
4594 118819068 119601589 119882119 119710860 119201117 118477149 117702605 117059459 116420455 115991586
4585 115991586 115697101 115544611 115638010 115806063 116138019 116573196 117182980 117949313 118943337
4576 118943337 120067065 121227473 122488132 123934229 125542515 127237644 129112689 131130039
4568 131130039 133364251 135680951 138076843 140560256 143127207 145820242 148555192 151343717
4560 151343717 154181846 157255026 160410355 163532199 166701957 169651009 172296071 174549078
4552A74549078J722537J228120O36793J00239k59435o01527q93958q49395q38862
4543A74793590p55096n14394k35231R4965O51334J160369J671713K142695K669254
4534A81679199L080898L455360L703983M079829M140822M278410M282843M106939
4526B12808283L815392L474601L173270K659942K319035J629719R11100M998j330914
4517B29465426k588679l892442n168290o067231o778005p198320p229902p049311
4509A83493246o939799o758571o464986o134808n877990n427288m927217m547297
4501A36415290m006405l611903l192580k830190k529307k284442k086514j951613
4493A13922336j928629j842622j870125j892909k003783k011827j966195j949424
$$ plain form
4552 174549078 176271615 177499735 178136528 178236767 177977332 177375805 176481847 175632452 174793590
4543 174793590 174038494 173524100 173288869 173383834 174035168 175195537 176867250 179009945 181679199
4534 181679199 184760097 188215457 191919440 195999269 200140091 204418501 208701344 212808283
4526 212808283 216623675 220098276 223271546 225931488 228250523 229880242 230791342 230796340 229465426
4517 229465426 226876747 222984305 217816015 211748784 204970779 197772459 190542557 183493246
4509 183493246 176553447 169794876 163329890 157195082 151317092 145889804 140962587 136415290
4501 136415290 132408885 128796982 125604402 122774212 120244905 117960463 115873949 113922336
4493 113922336 111993707 110151085 108280960 106388051 104384268 102372441 100406246 98456822
4485I8456822j898217j835746j670348j489991j417427j370637j386941j256662
4477H6130853j137952j216814j258767j232647j146034j116462j028275j009515
4469G6984387r29301r20745q65987p49008p41516q29890p33988o62446p12666
4460F9838840o58067o95570o21582o25235n91430n66020n40869n12955m15842
4451F4611270l87044l49869k90098k92816k13086j80940j09103O6234J4138j3770
4441F2854916J51555K27305K35154L61046L80446M71714N83091O28637P22749
4432F6616613P74223Q27386R22030R91968J103304J278852J337383J548919J617156
4423G7017834J672817J894744K046149K115166K288095K415869K511964K738557
$$ plain form
4485 98456822 96558605 94722859 93052511 91562520 90145093 88774456 87387515 86130853
4477 86130853 84992901 83776087 82517320 81284673 80138639 79022177 77993902 76984387
4469 76984387 76055086 75134341 74268354 73519346 72777830 71947940 71213952 70551506 69838840
4460 69838840 69180773 68485203 67863621 67238386 66646956 66080936 65540067 65027112 64611270
4451 64611270 64224226 63874357 63584259 63291443 63078357 62897417 62788314 62854548 62868686 62854916
4441 62854916 63006471 63233776 63468930 63829976 64210422 64682136 65265227 65893864 66616613
4432 66616613 67390836 68218222 69140252 70132220 71235524 72514376 73851759 75400678 77017834
4423 77017834 78690651 80585395 82631544 84746710 87034805 89450674 91962638 94701195
4415I4701195K903252L068221L245970L442962L674267L788088L992635M259766
4407A23076356M427613M446201M486759M228575L975303L489647K822374J982614
4399A52935442R12327j08055j205176k424100l378236m023733m523574m758860
4391A33426035m763596m675732m465478m078431l797639l553357l150909k873283
4383A02067610k637637k479331k338022k083264k059650j979641j880645j720437
4375H4888983j584217j406080j220665j009829q94450p97076o70083n37175m83156
4366G6286252l86772m47085l90559m44364n18420m14979m02431m57848m83769
4357G2340025m82732n35453o94522p29829q18471j011933j037627j143162j138345
$$ plain form
4415 94701195 97604447 100672668 103918638 107361600 111035867 114823955 118816590 123076356
4407 123076356 127503969 131950170 136436929 140665504 144640807 148130454 150952828 152935442
4399 152935442 153847769 153739714 152534538 150110438 146732202 142708469 138184895 133426035
4391 133426035 128662439 123986707 119521229 115442798 111645159 108091802 104940893 102067610
4383 102067610 99429973 96950642 94612620 92529356 90469706 88490065 86609420 84888983
4375 84888983 83304766 81898686 80678021 79668192 78773742 77976666 77306583 76769408 76286252
4366 76286252 75899480 75452395 75061836 74617472 74099052 73684073 73281642 72823794 72340025
4357 72340025 71857293 71321840 70627318 69897489 69079018 68067085 67029458 65886296 64747951
4348F4747951j225448j227181j085003j133848j047793r32818p93606p48228p11574
4339E5842452n05839l43581j79475r4738m6782R5804P2452J01338l4270j45547
4329E4761814l74296o66583q84421j016384j086125j187360j096953j013076j037753
4320D6398863j011257q81635q69970q07599o53998n44122n38573m23603l52671
4311D0315435k93124j96395k05960j67841j16424j59383j12017j30429j34994
4302C8798868o7419p1051j69984j30132p9483R192o2694j8662K1256P0120J48567
4291C8448578J66686J45545K45887K84024L15630L39545L14583L78618M45824
4282D1084920M74563M86882N75555O92231P43840Q47163Q78301R92448J060767
$$ plain form
4348 64747951 63522503 62295322 61210319 60076471 59028678 58095860 57302254 56554026 55842452
4339 55842452 55336613 54993032 54813557 54718819 54672037 54767841 54840293 54941631 54907361 54761814
4329 54761814 54387518 53720935 52836514 51820130 50734005 49546645 48449692 47436616 46398863
4320 46398863 45387606 44505971 43636001 42828402 42174404 41630282 41091709 40668106 40315435
4311 40315435 40022311 39825916 39619956 39452115 39335691 39176308 39064291 38933862 38798868
4302 38798868 38731449 38660398 38490414 38360282 38280799 38289991 38227297 38208635 38229891 38300011 38448578
4291 38448578 38615264 38760809 39006696 39290720 39606350 39945895 40260478 40639096 41084920
4282 41084920 41559483 42046365 42621920 43314151 44057991 44905154 45783455 46775903 47836670
4273D7836670J069353J173788J208323J216807J374703J681664J980000K167993
4265E9709301K740966K722630K778405L324972L810463L889343L564924L149820
4257H5690824J882483R00463r20941l345402m583613m229705l595415l010738
4249F8787956k424480j958967j655365j388020j400772j215864r39409p79838
4241E7025241n47396l46054l24232l28143k48153k74273q4212p8400n2565k7121
4231E4714692N5661P304N0709J02950J97560J51935J27163J19184J15613J83475
4221E5826246J79738J48732J56375J82777K44161K11132J86918K04181K39421
4212E7579681K71403K21141J91492J05112J12449Q4985Q6625O0390J0750k5319
$$ plain form
4273 47836670 48906023 50079811 51288134 52504941 53879644 55561308 57541308 59709301
4265 59709301 62450267 65172897 67951302 71276274 75086737 78976080 82541004 85690824
4257 85690824 87573307 88473770 87552829 84207427 79623814 75394109 71798694 68787956
4249 68787956 66363476 64404509 62749144 61361124 59960352 58744488 57805079 57025241
4241 57025241 56477845 56131791 55807559 55479416 55231263 54956990 54872778 54794378 54741813 54714692
4231 54714692 54770353 54777657 54828366 54931316 55128876 55280811 55407974 55527158 55642771 55826246
4221 55826246 56005984 56154716 56311091 56493868 56738029 56949161 57136079 57340260 57579681
4212 57579681 57851084 58072225 58263717 58368829 58481278 58566263 58652888 58713278 58724028 58698709
4202E8698709k1670l2136p3455j19855k09687k74569l78837m65173n35284p06901
4192E5881142q09707q37804p17990q12650p54407p39779p14074p57638q40386
4183D8896707o89565p76477q40799p90286p46795q36010q41854q60410q77414
4174D1637097q26122p90979p22742p72724p46550p39757o94196o84755p16959
4165C4942313o32651o20614p10593o06505o20303n43375n53034n16144m92152
4156B9646942n90400m95842m08837m74857l81841m18378m53643l50234l65748
4147B5707162l49407l30033m06896l68998k20963l60596l72039l93408k61223
4138B2643599k64187l34239k94713k82241k91466k01234l25796k92886k64847
$$ plain form
4202 58698709 58677039 58644903 58571448 58451593 58241906 57967337 57588500 57123327 56588043 55881142
4192 55881142 55071435 54233631 53515641 52702991 51948584 51208805 50494731 49737093 48896707
4183 48896707 48207142 47430665 46589866 45799580 45052785 44216775 43374921 42514511 41637097
4174 41637097 40810975 40019996 39297254 38524530 37777980 37038223 36344027 35659272 34942313
4165 34942313 34309662 33689048 32978455 32371950 31751647 31208272 30655238 30139094 29646942
4156 29646942 29056542 28560700 28151863 27677006 27295165 26876787 26423144 26072910 25707162
4147 25707162 25357755 25027722 24620826 24251828 24030865 23670269 23298230 22904822 22643599
4138 22643599 22379412 22045173 21750460 21468219 21176753 20975519 20649723 20356837 20091990
4129B0091990k49336k60876l10374k48799k92776k31859k74201m29679l20995
4120A7473095k11912k22060l17348k46897j89796k09316j78812j90325k00198
4111A5506431k53433k20205j04503k15478j91660j88634j43024j28960k04096
4102A3856438j23530q7549k16961j49594j13627j83111r6880j20134j41707k44377
4092A2378968k07242j39941j19578j53202j99333j53291k47355j81982j59894
4083A0817150o8676n5725j69615k03298k28222r9006p0744p9257j17649j44559
4073I580399j46640r5960k9385m6457j54371j14315o7704j50423r1538l9516q9105
4062H554985l4620J3037j34245m1912n9844j31537k9854o3162n6484o9666J129
$$ plain form
4129 20091990 19842654 19581778 19271404 19022605 18729829 18497970 18223769 17794090 17473095
4120 17473095 17261183 17039123 16721775 16474878 16285082 16075766 15896954 15706629 15506431
4111 15506431 15252998 15032793 14928290 14712812 14521152 14332518 14189494 14060534 13856438
4102 13856438 13732908 13645359 13428398 13278804 13165177 12982066 12885186 12765052 12623345 12378968
4092 12378968 12171726 12031785 11912207 11759005 11559672 11406381 11159026 10977044 10817150
4083 10817150 10748474 10692749 10523134 10319836 10091614 9992608 9921864 9842607 9724958 9580399
4073 9580399 9433759 9337799 9308414 9261957 9107586 8993271 8925567 8775144 8683606 8644090 8554985
4062 8554985 8520365 8533402 8399157 8357245 8297401 8165864 8136010 8072848 8016364 7946698 7947827
4051G947827o6580k8665r0815j00168j2287p1344l8475k4436n3308l2222n5252
4040G374275J3899q2948m5100l1620K3594n4099Q499r4532r9266m1441k1723k1066
4028F928472k8601j13452o788l2619j03796J426M3454K8795j5308j01492m3261
4017F556830K1056R866j6300j12476M0421P9o9421J0797M5684M1139N5232n999
4005F576908M4634q1047p8185k3343J6356m1958p3403j55923j7464K8928L1744
3994F227247l3680m2780l4641l6210o0672L8351K1449p2125r2825j2940J7606
3983E918780N373Q3352l7467M3797K3175J7409o5407j3514j6273O063j460j4640
3971E949188M1595N8419N1365l023m7142r7141j9824l3691k0411j7661j3155M3476
$$ plain form
4051 7947827 7881247 7852582 7761767 7661599 7649312 7577968 7539493 7515057 7461749 7429527 7374275
4040 7374275 7388174 7305226 7260126 7228506 7252100 7198001 7206500 7111968 7012702 6971261 6949538 6928472
4028 6928472 6899871 6786419 6779631 6747012 6643216 6644642 6688096 6716891 6701583 6600091 6556830
4017 6556830 6577886 6587752 6571452 6458976 6499397 6499476 6430055 6440852 6486536 6527675 6582907 6576908
4005 6576908 6621542 6540495 6462310 6438967 6455323 6413365 6339962 6184039 6166575 6195503 6227247
3994 6227247 6193567 6150787 6116146 6079936 6019264 6057615 6079064 6006939 5914114 5901174 5918780
3983 5918780 5924153 6007505 5970038 6013835 6037010 6054419 5989012 5975498 5959225 5965288 5963828 5949188
3971 5949188 5990783 6049202 6100567 6097544 6050402 5953261 5933437 5899746 5879335 5861674 5848519 5891995
3959E891995l9731o3670m2634n3595L8251o645o0754N0903l1650j6724L1734q495
3947E688985O3310M784K785o4771M0468l441m018J8475K3406K5110P5896P879
3935E878868K8035p3181n5618J13345N0115k7443n925l6522L7836P0441k9136
3924E950815n4974Q2948l9369K5530k9526K1714N2230j1733P8l9582L8637J5126
3912F011894k9386n069M4033L3885k4307k4197L8508m0474L3411j2151j7566o7023
3900E941558N2742J3066l4347M7979K2897k7728L04M8264N2445k770j7557q868
3888F087985l9393M0991N2600K8927R310j02454M6482P0393J5811j0092R511k160
3876F207911K4663M7000K6426J418l4393q721J5709J3884K6547K365K7527L7711
$$ plain form
3959 5891995 5852264 5788594 5745960 5692365 5730616 5723971 5663217 5714120 5682470 5665746 5697480 5688985
3947 5688985 5752295 5757079 5759864 5695093 5735561 5732120 5728102 5746577 5769983 5795093 5870989 5878868
3935 5878868 5906903 5833722 5778104 5891449 5941564 5914121 5908196 5871674 5909510 5979951 5950815
3924 5950815 5895841 5978789 5939420 5964950 5935424 5957138 6009368 5997635 5997713 5958131 5996768 6011894
3912 6011894 5982508 5977439 6021472 6055357 6031050 6006853 6045361 6004887 6038298 6026147 6008581 5941558
3900 5941558 5994300 6007366 5973019 6020998 6043895 6016167 6016471 6064735 6117180 6114410 6096853 6087985
3888 6087985 6048592 6089583 6142183 6171110 6180420 6077966 6124448 6194841 6210652 6200560 6210071 6207911
3876 6207911 6232574 6279574 6306000 6307418 6273025 6264304 6280013 6293897 6320444 6322809 6350336 6388047
3864F388047K4215o408L5437K6446N1841l7643L8323J61457L4592l2943L2822
3853F716186j15023M8903K6572N7710n6311M0586N7331M2017k519k5408Q3954
3842F873998n6713P1996N2136j0265N6965L8478M6686N478J8730J0288J6858P0666
3830G195301M332N0917M2031L3776L0782l387O4047N8290O7181J080K7360m2397
3818G529313L7635Q1185R437O6422P5368J01540K135M6283M8458R2952R9147J435
3806H191310M1982R9083m340Q8644K8352J17429K8082J2599K7909n394k1795J05782
3794H709643M0362Q2038P8967M3582P2893Q7249m216J0381K1710Q3328P1992n1313
3782I246616j943O2163Q4992L9681J4682O4383R5141J04794Q2099R5490L0997
$$ plain form
3864 6388047 6412262 6405854 6441291 6467737 6519578 6481935 6520258 6681715 6716307 6683364 6716186
3853 6716186 6601163 6650066 6676638 6734348 6678037 6718623 6775954 6817971 6815452 6790044 6873998
3842 6873998 6817285 6889281 6941417 6931152 6988117 7026595 7073281 7078759 7097489 7107777 7124635 7195301
3830 7195301 7199633 7250550 7292581 7326357 7357139 7353752 7417799 7476089 7543270 7544350 7571710 7529313
3818 7529313 7566948 7648133 7657570 7723992 7799360 7900900 7903035 7949318 7997776 8090728 8189875 8191310
3806 8191310 8233292 8332375 8328035 8416679 8445031 8562460 8590542 8603141 8631050 8625656 8603861 8709643
3794 8709643 8750005 8832043 8911010 8954592 9027485 9114734 9110518 9120899 9142609 9225937 9297929 9246616
3782 9246616 9244673 9306836 9391828 9431509 9446191 9510574 9605715 9710509 9792608 9888098 9919095
3771I919095L3836N6560Q0062J02584J47633J14462J09466P8252J04833J18911
3761A0865694M4014Q6494K12802J58362J45154J61536O6005J14570K33966J39820
3751A2228417J40194J81686J85333J23855K03259J94862O7858K05286K35001J95458
3741A3961209J60975K09113J90441K16339K69355K45993K10631J99228L25372
3732A5988656L57902K24130L53942L41682L28106M32411L95542M90448M95903
3723A9408722M25150M29062L90128N61921M41531M16366L98793L80624L81186
3714B3233483L57716K81347L13815K58624K48334K28854K83643K47482K03687
3705B5656985J91100J39581J45699O2936K02392J39139Q7043L8609q860R252P7664
$$ plain form
3771 9919095 9952931 10009491 10089553 10192137 10339770 10454232 10563698 10641950 10746783 10865694
3761 10865694 10909708 10996202 11209004 11367366 11512520 11674056 11740061 11854631 12088597 12228417
3751 12228417 12368611 12550297 12735630 12859485 13062744 13257606 13325464 13530750 13765751 13961209
3741 13961209 14122184 14331297 14521738 14738077 15007432 15253425 15464056 15663284 15988656
3732 15988656 16346558 16570688 16924630 17266312 17594418 18026829 18422371 18912819 19408722
3723 19408722 19833872 20262934 20653062 21214983 21656514 22072880 22471673 22852297 23233483
3714 23233483 23591199 23872546 24186361 24444985 24693319 24922173 25205816 25453298 25656985
3705 25656985 25848085 25987666 26133365 26196301 26398693 26537832 26624875 26663484 26654624 26663876 26741540
3694B6741540m2461l745M1129n0431j5456k4673J7800P3486R5169Q3981P8106
3683B6994445P4049N8287J02131J61436J46894J84196J48738J52591K27141L11863
3673B8561771L52868L14899J98035L07853L54707M56631L47885M00961M12553
3664C1708163M14275M93477N08659M81762M69754L72030M80497N79796M77704
3655C5986117M72467M16222N95151O43085M96700M51457M86445N17339N56931
3646D0621914N77691M92580N46375N91864N41054N38897N54513N17150M53775
3637D5435813M13452L94684L21176L11413K95077J89861J75984J48684J03648
3628D7789792J12651N1695J1740j2177N3924n1856r3651r6158j45649j25736k25648
$$ plain form
3694 26741540 26699079 26695334 26736463 26686032 26670576 26645903 26663703 26737189 26832358 26916339 26994445
3683 26994445 27068494 27126781 27228912 27390348 27537242 27721438 27870176 28022767 28249908 28561771
3673 28561771 28914639 29229538 29427573 29735426 30090133 30546764 30894649 31295610 31708163
3664 31708163 32122438 32615915 33124574 33606336 34076090 34448120 34928617 35508413 35986117
3655 35986117 36458584 36874806 37469957 38113042 38609742 39061199 39547644 40064983 40621914
3646 40621914 41199605 41692185 42238560 42830424 43371478 43910375 44464888 44982038 45435813
3637 45435813 45849265 46243949 46565125 46876538 47171615 47361476 47537460 47686144 47789792
3628 47789792 47902443 47954138 47965878 47953701 48007625 47955769 47862118 47765960 47620311 47494575 47268927
3617D7268927k00046l28949l37719k82932l24945l71830l47141l20604l90853
3608D4363908k91996l09276k58557k95621l66812k09450k65991k15746j95475
3599D1954984j67416j31835p4679j38364o6403o268n245o1912l6079O6716J16874
3588D1450373J21917Q6544J61818K10431J97788K31198J91419K83859K51137K95246
3578D3481730L53736L45070L43636L48759L96635M43956L62413L92010M10952
3569D6878897M67047M88028N06942M45228M53663M63137N81395O02161O38775
3560E1525273O65875P05259O89283O64659Q99505Q20585Q09983Q85101Q81233
3551E8546756R77721R96314R43537J003759R75787R81890J058226J018002J031220
$$ plain form
3617 47268927 47068881 46739932 46402213 46119281 45794336 45422506 45075365 44754761 44363908
3608 44363908 44071912 43762636 43504079 43208458 42841646 42632196 42366205 42150459 41954984
3599 41954984 41787568 41655733 41581054 41442690 41376287 41370019 41364774 41302862 41266783 41333499 41450373
3588 41450373 41572290 41658834 41820652 42031083 42228871 42460069 42651488 42935347 43186484 43481730
3578 43481730 43835466 44180536 44524172 44872931 45269566 45713522 46075935 46467945 46878897
3569 46878897 47345944 47833972 48340914 48786142 49239805 49702942 50284337 50886498 51525273
3560 51525273 52191148 52896407 53585690 54250349 55149854 55970439 56780422 57665523 58546756
3551 58546756 59524477 60520791 61464328 62468087 63443874 64425764 65483990 66501992 67533212
3542F7533212J066744J068718J093047J075070J108218J096043J105843J156485
3534G6303380J189013J328500J250972J335748J453618J417733J509679J592677
3526H7381320J748821J745427J783480J889312J928097K027178K159578K205990
3518A02869203K124184K281633K302689K335083K444470K486249K543682K598642
3510A21985835K751092K894198L102083L067914L155011L293030L502295L572160
3502A47323618L687841L756262L866172L878015L961935M077884M035564M057265
3494A78644556M164135M237967M175358M228903M301694M333948M406081M440977
3486B12933619M577584M511319M446999M400346M249097M128130M008502L843626
$$ plain form
3542 67533212 68599956 69668674 70761721 71836791 72945009 74041052 75146895 76303380
3534 76303380 77492393 78820893 80071865 81407613 82861231 84278964 85788643 87381320
3526 87381320 89130141 90875568 92659048 94548360 96476457 98503635 100663213 102869203
3518 102869203 104993387 107275020 109577709 111912792 114357262 116843511 119387193 121985835
3510 121985835 124736927 127631125 130733208 133801122 136956133 140249163 143751458 147323618
3502 147323618 151011459 154767721 158633893 162511908 166473843 170551727 174587291 178644556
3494 178644556 182808691 187046658 191222016 195450919 199752613 204086561 208492642 212933619
3486 212933619 217511203 222022522 226469521 230869867 235118964 239247094 243255596 247099222
3478B47099222L709064L546745L433108L343236L181350L003110L008742K905256
3470B73229833K799340K722378K532447K392456K384415K373783K313915K294244
3462B93042811K270703K213518K325693K291134K204521K099603J937372J671063
3454C10056418J453668J073709O48278L52898o3231m87913r01320j271341j580753
3445C09280413j837115k154227k514730k690680k920629l371511l653650l984742
3437B86153129m249124m588053m850401n140811n357397n469481n438654n464925
3429B45594283n549703n474695n353434n274978n128682n059769m921892m685788
3421B04145342m473037m239861m068579l780827l582512l321359l052007k945615
$$ plain form
3478 247099222 250808286 254355031 257788139 261131375 264312725 267315835 270324577 273229833
3470 273229833 276029173 278751551 281283998 283676454 286060869 288434652 290748567 293042811
3462 293042811 295313514 297527032 299852725 302143859 304348380 306447983 308385355 310056418
3454 310056418 311510086 312583795 313232073 313584971 313521740 313033827 312132507 310861166 309280413
3445 309280413 307443298 305289071 302774341 300083661 297163032 293791521 290137871 286153129
3437 286153129 281904005 277315952 272465551 267324740 261967343 256497862 251059208 245594283
3429 245594283 240044580 234569885 229216451 223941473 218812791 213753022 208831130 204145342
3421 204145342 199672305 195432444 191363865 187583038 184000526 180679167 177627160 174681545
3413A74681545k776440k588037k470155k340223k148305k116115k080975j968732
3405A56192563j890257j840893j875115j941718j901342j955262j963753j901785
3397A40922438j796946j633867j636786j593029j461319j484420j374369j239082
3389A28702620j213222j147998j078379r40665q95728q73543p94315o37798n73464
3380A20547508n95176m63086l70695l82857k09076k07117k87073k67732l65488
3371A17399208m24808n33090p07338q27535p76870o82854o32522n39146m62613
3362A11812432k96684j03609k02134r8347J05138J64541J64113L22178M13681
3353A12281309M43732N31760N65530O25022O49831P21819P97906P39182P30779
$$ plain form
3413 174681545 171905105 169317068 166846913 164506690 162358385 160242270 158161295 156192563
3405 156192563 154302306 152461413 150586298 148644580 146743238 144787976 142824223 140922438
3397 140922438 139125492 137491625 135854839 134261810 132800491 131316071 129941702 128702620
3389 128702620 127489398 126341400 125263021 124322356 123426628 122553085 121758770 121120972 120547508
3380 120547508 119952332 119489246 119118551 118735694 118526618 118319501 118032428 117764696 117399208
3371 117399208 116974400 116441310 115733972 114906437 114129567 113446713 112814191 112275045 111812432
3362 111812432 111515748 111412139 111210005 111111658 111216796 111381337 111545450 111867628 112281309
3353 112281309 112725041 113256801 113822331 114447353 115097184 115819003 116616909 117356091 118086870
3344A18086870P77716P78282P60621P08197O38825O82036N69471N73084N61656
3335A24136758O17619P81370J015932J096877J186874J374706J426747J428379
3327A33065262J427923J410037J431132J440576J368866J286480J290006J213301
3319A43933583J173279J182037J182417J133879J097214J184000J369879J348840
3311A53605128J325376J506178J650171J762008J794782J839587J974155K043694
3303A67501079K031080K120690K126743K058734K172338K097693J850651J792570
3295A83751578J636047J406686J094115P29387M59258J10357l36448n36865r88240
3286A87325875j216208j514914j791915j976154k159748k275213k391466k488849
$$ plain form
3344 118086870 118864586 119642868 120403489 121111686 121750511 122432547 123002018 123575102 124136758
3335 124136758 124754377 125535747 126551679 127648556 128835430 130210136 131636883 133065262
3327 133065262 134493185 135903222 137334354 138774930 140143796 141430276 142720282 143933583
3319 143933583 145106862 146288899 147471316 148605195 149702409 150886409 152256288 153605128
3311 153605128 154930504 156436682 158086853 159848861 161643643 163483230 165457385 167501079
3303 167501079 169532159 171652849 173779592 175838326 178010664 180108357 181959008 183751578
3295 183751578 185387625 186794311 187888426 188617813 189077071 189187428 188850980 188314115 187325875
3286 187325875 186109667 184594753 182802838 180826684 178666936 176391723 174000257 171511408
3278A71511408k588228k701925k768438k767285k887667k957029l102456l250095
3270A48488285l244564l372394l380920l485200l569038l493741l466134l444875
3262A21031419l317296l216177l088420k974202k876766k711655k517509k411391
3254I7918003k272997k243586j958600j904951j829865j662605j629678j470981
3246H2944740j327864j230764j099988j048139j091559r86036p32059p24026o98291
3237G4006014o26850n04934m56638l78673l58181k63092k83819k57984j54769
3228G0721074j80073k27334k12739j80901k40941k67773l62380l60110m49560
3219F8239263m07801m98872n76630o16466p22146p85497p65442q08832q38578
$$ plain form
3278 171511408 168923180 166221255 163452817 160685532 157797865 154840836 151738380 148488285
3270 148488285 145243721 141871327 138490407 135005207 131436169 127942428 124476294 121031419
3262 121031419 117714123 114497946 111409526 108435324 105558558 102846903 100329394 97918003
3254 97918003 95645006 93401420 91442820 89537869 87708004 86045399 84415721 82944740
3246 82944740 81616876 80386112 79286124 78237985 77146426 76160390 75428331 74704305 74006014
3237 74006014 73379164 72874230 72417592 72038919 71680738 71417646 71133827 70875843 70721074
3228 70721074 70541001 70313667 70100928 69920027 69679086 69411313 69048933 68688823 68239263
3219 68239263 67831462 67332590 66755960 66139494 65417348 64631851 63866409 63057577 62218999
3210F2218999q92862q97258r11081q73373q52281q66553q03017p64246p06726
3201E4651602o73594p18803n34669m51403m82184n29143l58064l81038l51096
3192E0171608l03582k74706j95390k70824k81453j47364j86790j95110j30730
3183D8185659k03466j85298j01417j79093q7676r3273j43409j18456j64625r7004
3173D6811942J9402j03564p8571j1376M771M3731P6332J36331K25910J58725K01154
3162D7484787J91618K69717K36945J78142K24788K32025K49438K57656L02754
3153D9627870K90194K74367L05362L61986M13971L81511L98357N30002N37728
3144E3121348N99803O46069P26355Q16949Q37530R55410J076540J132845J168094
$$ plain form
3210 62218999 61326137 60428879 59517798 58644425 57792144 56925591 56122574 55358328 54651602
3201 54651602 53978008 53259205 52724536 52273133 51790949 51261806 50903742 50522704 50171608
3192 50171608 49868026 49593320 49397930 49127106 48845653 48698289 48511499 48316389 48185659
3183 48185659 47982193 47796895 47695478 47516385 47428709 47335436 47192027 47073571 46908946 46811942
3173 46811942 46831344 46727780 46649209 46637833 46642604 46686335 46762667 46898998 47124908 47283633 47484787
3162 47484787 47676405 47946122 48183067 48361209 48585997 48818022 49067460 49325116 49627870
3153 49627870 49918064 50192431 50497793 50859779 51273750 51655261 52053618 52583620 53121348
3144 53121348 53721151 54367220 55093575 55910524 56748054 57703464 58780004 59912849 61080943
3135F1080943J196272J289074J311945J327994J176703J047990R62796R57819
3127G0351536R65099R42354R66937J030135J177361J360045J278804J487612J582279
3118H1142162J751725J872412J993584K197639K435109K696075K953907L179484
3110A00222097L507129L901079M173254M448551M850964N371613N798649O113738
3102A38387074O503514O792859P077662P350721P367851P295905P011465O679504
3094A94466555O037095N431663M807013M502168M431377M566084M803345M987398
3086B34032698N219292N386583N502218N699721O027298O264673O607362P104070
3078B81843915P456610P846089Q181071Q458689Q853905Q986511R130914R170086
$$ plain form
3135 61080943 62277215 63566289 64878234 66206228 67382931 68430921 69393717 70351536
3127 70351536 71316635 72258989 73225926 74256061 75433422 76793467 78072271 79559883 81142162
3118 81142162 82893887 84766299 86759883 88957522 91392631 94088706 97042613 100222097
3110 100222097 103729226 107630305 111803559 116252110 121103074 126474687 132273336 138387074
3102 138387074 144890588 151683447 158761109 166111830 173479681 180775586 187787051 194466555
3094 194466555 200503650 205935313 210742326 215244494 219675871 224241955 229045300 234032698
3086 234032698 239251990 244638573 250140791 255840512 261867810 268132483 274739845 281843915
3078 281843915 289300525 297146614 305327685 313786374 322640279 331626790 340757704 349927790
3070C49927790R157346R259758R428444R430880R410602R263739Q890152Q420857
3062D23189568P526201O229976M575466K313408j16995k878732n784422q652559
3054D26401911j1178427j3344384j4912346j5919200j6703960j7127866j7123321
3047C20092407j6624974j5615298j4461571j3106984j1809526j0623328r433335
3040B28417391q441087p514694o714827n904735n264377m837773m457849m156168
3032A81125881m014246m064947m030441m094668m144788m336904m471049m586520
3024A47382318m873965m907887m893277m928886m863054m622547m586508m479164
3016A09227030m208999m152276m016661l798866l648439l546545l364083l163220
$$ plain form
3070 349927790 359085136 368344894 377773338 387204218 396614820 405878559 414768711 423189568
3062 423189568 430715769 436945745 441521211 443834619 443717624 440838892 435054470 426401911
3054 426401911 415223484 401879100 386966754 371047554 354343594 337215728 320092407
3047 320092407 303467433 287852135 273390564 260283580 248474054 237850726 228417391
3040 228417391 219976304 212461610 205746783 199842048 194577671 189739898 185282049 181125881
3032 181125881 177111635 173046688 169016247 164921579 160776791 156439887 151968838 147382318
3024 147382318 142508353 137600466 132707189 127778303 122915249 118292702 113706194 109227030
3016 109227030 105018031 100865755 96849094 93050228 89401789 85855244 82491161 79327941
3008G9327941k960188k851397k775311k476327k332686k244431k140954j967713
3000E9578934j844105j753556j655490j508171j457549j323979j286232j179773
2992D7570079j115389j066379r56960q48870r21437p96893p54071q67347p98146
2983C9444587o32368p37727p59742p85446p39792o79734p03206o81619p23729
2974C3001224o84174n57086n57782n40628n31178n68170m47534l65888m58050
2965B8290734m51451m98902m21810m74928n84520n11192m88645n20560n14730
2956B3823996m36027m53608n18657m64407l27438m54312l73319l87743l63377
2947B0045108l28190l41941k94429k74466l17978l99771k28875l25717k58327
$$ plain form
3008 79327941 76367753 73516356 70741045 68264718 65932032 63687601 61546647 59578934
3000 59578934 57734829 55981273 54325783 52817612 51360063 50036084 48749852 47570079
2992 47570079 46454690 45388311 44431351 43582481 42661044 41864151 41110080 40242733 39444587
2983 39444587 38812219 38074492 37314750 36529304 35789512 35109778 34406572 33724953 33001224
2974 33001224 32317050 31759964 31202182 30661554 30130376 29562206 29114672 28748784 28290734
2965 28290734 27839283 27340381 26918571 26443643 25859123 25347931 24859286 24338726 23823996
2956 23823996 23387969 22934361 22415704 21951297 21623859 21169547 20796228 20408485 20045108
2947 20045108 19716918 19374977 19080548 18806082 18488104 18088333 17859458 17533741 17275414
2938A7275414k10266k35837k43055k33066k18117k22006j89085k78642k73296
2929A5172044k31780j34126k31994j94142k08272j47836j74354j62851q9214r2755
2919A3504720k35710j58445j10275j51891k03029j51090j39372j25432j52042
2910A2077434j58833j46074j77642j20609p3039r5358m5493j54965j33008j33422
2900A0838991r8597j15795j12262p5901j06628j17892j53766r9720j38227n1041
2890I769162j64086q8438k3074o9108j20942j38307m4752k1618l9407j15008j18086
2879H826336J1185k1827r9906j16097j06890q6743j35191n172q3028r8121p1358
2868H013188Q191j40584q9535j2763j66887r2516p9172m1605n4870m4052n8946
$$ plain form
2938 17275414 17065148 16829311 16586256 16353190 16135073 15913067 15723982 15445340 15172044
2929 15172044 14940264 14806138 14574144 14380002 14171730 14023894 13849540 13686689 13597475 13504720
2919 13504720 13269010 13110565 13000290 12848399 12645370 12494280 12354908 12229476 12077434
2910 12077434 11918601 11772527 11594885 11474276 11401237 11305879 11260386 11105421 10972413 10838991
2900 10838991 10740394 10624599 10512337 10436436 10329808 10211916 10058150 9958430 9820203 9769162
2890 9769162 9605076 9516638 9493564 9424456 9303514 9165207 9120455 9098837 9059430 8944422 8826336
2879 8826336 8837521 8815694 8715788 8599691 8492801 8406058 8270867 8265695 8182667 8084546 8013188
2868 8013188 8021379 7880795 7791260 7778497 7611610 7519094 7439922 7398317 7343447 7299395 7240449
2857G240449j25872m0875k3577m8220n5371r4416k8763k5015r3863n9906l93r5031
2845F549147l524m3639j4854k3652k5264q5268k3217m0418p7495j5836l3406K0370
2833F182944n7810j52896j8128O928l0688j3721J0911O738k1734p0548k9764J6766
2821E828998L5399l1237n2331k9458P2299j3092l6253L7253R15n2506k46m9678
2809E710063k5179J2481K0994o0000k5022J9120l7570M55N0061k4146N6009M3242
2797E740508n6960l2752j99O4796l5186N9839M365M3576m3781M6970N3599L2448
2785E877223j1421l1728O426K1994L0701L4178Q38o1553j8218j3152R900K9798
2773E874986j13566k2691O079j49674j67617j16631p9866q7620o2666r5996j20678
$$ plain form
2857 7240449 7114577 7073702 7050125 7001905 6946534 6852118 6823355 6798340 6704477 6644571 6644178 6549147
2845 6549147 6545623 6501984 6487130 6463478 6438214 6352946 6329729 6289311 6211816 6195980 6162574 6182944
2833 6182944 6125134 5972238 5954110 5961038 5930350 5916629 5927540 5934278 5912544 5841996 5812232 5828998
2821 5828998 5864397 5833160 5780829 5751371 5823670 5810578 5774325 5811578 5812493 5759987 5759741 5710063
2809 5710063 5684884 5697365 5718359 5658359 5633337 5652457 5614887 5615342 5665403 5641257 5697266 5740508
2797 5740508 5683548 5650796 5650597 5715393 5680207 5740046 5744411 5787987 5744206 5791176 5844775 5877223
2785 5877223 5865802 5834074 5840500 5862494 5893195 5927373 5928211 5866658 5848440 5835288 5845188 5874986
2773 5874986 5761420 5738729 5744808 5595134 5427517 5310886 5231020 5143400 5080734 4984738 4864060
2762D864060l3877o4141j64263q2984k6261r3489J7933o4438l3491m9999j10865
2751D158185m0741L0944r4677j12602m4361r893q166n4609p2644m7190K654j8835
2739C688065o3764l8006r9948J7144M0345j06959p8705j12169q033M0070j1761
2728C266279q1947J7760n0621j7738k5155m5488m4038m8019o7271n6789R863j6656
2716B840180n4458L6228m4998l1803J7470k9609p44k9477k0361r154o3890J039
2704B610423m8799L5087J9347m2928J2825j1177k7987K442j2085l3015j164N1481
2692B554450o8807o9039l9429O919k1618o2022L5831J4473k8377K5058R7257l4785
2680B409911j06697L922J0472p8705n2266N421J4921M4334K2724q9889J0023n1406
$$ plain form
2762 4864060 4830183 4766042 4601779 4518795 4492534 4399045 4416978 4352540 4319049 4269050 4158185
2751 4158185 4117444 4148388 4053711 3941109 3896748 3886855 3878689 3824080 3751436 3704246 3706900 3688065
2739 3688065 3624301 3586295 3486347 3503491 3543836 3436877 3358172 3246003 3237970 3278040 3266279
2728 3266279 3184332 3202092 3151471 3133733 3108578 3063090 3019052 2971033 2903762 2846973 2856836 2840180
2716 2840180 2785722 2821950 2776952 2745149 2762619 2733010 2732266 2702789 2682428 2673274 2609384 2610423
2704 2610423 2561624 2596711 2616058 2573130 2585955 2574778 2546791 2549233 2537148 2504133 2502969 2554450
2692 2554450 2485643 2416604 2377175 2384094 2362476 2300454 2336285 2350758 2322381 2347439 2444696 2409911
2680 2409911 2303214 2307136 2317608 2238903 2186637 2192058 2206979 2251313 2274037 2184148 2194171 2142765
2668B142765l2649K9529k3368j9159k9223j6074k8192O8345l2938m7025K432K5270
2656B039713j5568l6756k9814o545L0834l9670k5754n3195O8856j1608n5854j4601
2644A850038j0923j3612Q3683l6481o6737j1328J0772K6746m3294l9937r8P610
2632A756439m6069j7330P1885q8633n7685k2450L8031O7104m0511m4850j1571
2621A604360R8515J2912l7235o1423k5248k1518j471P1575j8741J169j01130K3182
2609A544947m0304j5879p819J8548K9855K7513n051O260O421p3718m7114k8265
2597A415394N1501J9583J0197n0322j2400j9480j6491P8069K5732l3959M6941
2586A514765l9861J3043n7435l2103J2877l4904k0532M469O569M7183J8561m7004
$$ plain form
2668 2142765 2110116 2139645 2116277 2097118 2067895 2051821 2023629 2091974 2059036 2012011 2014443 2039713
2656 2039713 2024145 1987389 1957575 1951030 1981864 1942194 1916440 1863245 1932101 1920493 1864639 1850038
2644 1850038 1839115 1825503 1909186 1872705 1805968 1794640 1805412 1832158 1788864 1748927 1748829 1756439
2632 1756439 1710370 1693040 1764925 1676292 1618607 1596157 1634188 1701292 1660781 1615931 1604360
2621 1604360 1702875 1715787 1678552 1617129 1591881 1570363 1568892 1640467 1621726 1622895 1521765 1544947
2609 1544947 1504643 1488764 1480945 1499493 1529348 1556861 1551810 1558070 1564491 1490773 1443659 1415394
2597 1415394 1466895 1486478 1496675 1446353 1433953 1414473 1397982 1476051 1501783 1467824 1514765
2586 1514765 1474904 1487947 1430512 1398409 1411286 1376382 1355850 1360319 1366888 1414071 1432632 1385628
2574A385628p9224N8215N4848N2807q0851j6785l1112m6029O3408n580l0882K7943
2562A352386l3504P266M667k906j2873n3960J2858J6766k6738j961J4136J953
2550A278090J7953q6355J140j2311K2609J5608p0289M512J5259L3449m0964r705
2538A168996m0186j3627N0721K9800l3504L2620k7679m4137J3767M0361L2618
2527A209750k7805p7844k54N5330j2209L441j6529K9575r8232l2448R2227p066
2515A117936l9907k3501n6848P0969L3100M5218m7165j652L2841J0475m1273k4458
2503A075735n622J2043k1046k260K1973m9411k4042K4723n0836k0505m7424l6867
2491H76461J8775J3696M3151k0260Q336k5532k5619R0727j2165j2065l2749o2114
$$ plain form
2574 1385628 1306404 1364619 1419467 1472274 1391423 1374638 1343526 1297497 1360905 1355325 1324443 1352386
2562 1352386 1318882 1326148 1330815 1327909 1315036 1261076 1273934 1290700 1263962 1262001 1276137 1278090
2550 1278090 1296043 1209688 1210828 1198517 1221126 1236734 1166445 1170957 1186216 1219665 1178701 1168996
2538 1168996 1128810 1115183 1165904 1195704 1162200 1194820 1167141 1123004 1136771 1177132 1209750
2527 1209750 1181945 1104101 1103847 1159177 1146968 1150409 1133880 1163455 1065223 1032775 1125002 1117936
2515 1117936 1078029 1054528 997680 1068649 1101749 1146967 1099802 1098150 1130991 1141466 1100193 1075735
2503 1075735 1070113 1082156 1061110 1058850 1080823 1031412 1007370 1032093 981257 960752 913328 876461
2491 876461 895236 908932 952083 931823 940159 914627 889008 979735 967570 955505 922756 860642
2479H60642K0710K8747R2603o4402j8895M7507M1571j7120m3095j3165m5795n2937
2467H36371K5297P9106J1217J3628K0859k3260p0499p5162N535N6829O5540p6583
2455H68878l1807N9198K4580L7253J0644m5861o7433J3183j5899L1343N9482n7203
2443H86358K006M3695q177k7882K9621R451l3836J3300o2208M3528m133j0845
2431H80878m737o4770K0058L3798k3388j1577K6810L8621r772l0125n5127Q316
2419H08985M1509j3163j7484M774M2540J3708m9438l2312M7003l8313M1262J5829
2407H64900l8540k8522k1920L7009j0827L1993k5454J4069K2939m339j0076m2273
2395G88959P4972M8288J3677k0216q3858j5637J4498o543P8200j5897p5177o1961
$$ plain form
2479 860642 881352 910099 1002702 938300 919405 966912 1008483 991363 948268 935103 889308 836371
2467 836371 861668 940774 951991 965619 986478 963218 892719 817557 823092 879921 945461 868878
2455 868878 837071 896269 920849 958102 968746 922885 855452 868635 852736 884079 943561 886358
2443 886358 888364 932059 923882 896000 925621 935072 901236 914536 852328 895856 891723 880878
2431 880878 876141 811371 831429 865227 841839 830262 857072 895693 885921 855796 800669 808985
2419 808985 850494 837331 819847 824621 867161 880869 831431 799119 846122 807809 849071 864900
2407 864900 826360 797838 775918 812927 802100 834093 808639 822708 845647 841308 831232 788959
2395 788959 863931 912219 925896 905680 821822 806185 820683 814140 892340 876443 801266 739305
2383G39305L9861P0384j098j2299J9476k0787j8329O2859R183k5798N2941M119
2371I19817k1531p0875r253K7724O6613m7507L603k78K4311P380r9258J12097
2359I12843K2801k0945P3672M5950l1584M9565R3395O1040O1039O643O31P2551
2347A347601L1810P1369Q1083J165P7578J73300J16425J35573K42310K02104J41861
2336B622179J65638J57253O6886M6640k7900j98319k45666k98731k20978k24150
2326A842852j69003l0417l5269j12572n9888q2251r3349n6221m4041q3162m1886
2315A034793j0244l5845j8316l8318r749p521m5326n5263L154k5842j7754K4280
2303G98049N5934k595m5941m5396o5605m6088M5489L3199l4958m8062O106k6721
$$ plain form
2383 739305 779166 849550 848452 836153 855629 834842 816513 879372 888555 862757 915698 919817
2371 919817 898286 827411 818158 845882 912495 864988 868591 868313 892624 900004 800746 912843
2359 912843 935644 914699 988371 1034321 1002737 1052302 1145697 1206737 1267776 1274419 1275050 1347601
2347 1347601 1379411 1450780 1531863 1533028 1610606 1783906 1900331 2035904 2278214 2480318 2622179
2336 2622179 2787817 2945070 3011956 3058596 3030696 2832377 2586711 2287980 2067002 1842852
2326 1842852 1673849 1643432 1608163 1495591 1435703 1353452 1260103 1203882 1159841 1076679 1034793
2315 1034793 1024549 988704 970388 932070 922321 914800 869474 814211 817365 791523 773769 798049
2303 798049 853983 851388 805447 760051 694446 648358 693847 727046 692088 644026 650132 623411
2291F23411O3838O9971J8416p3598k2142k665q4537Q5372l450j02190J23574M3237
2279G39237o414K2556j16271M2934j1670p3719L3017O1203l9741r3141L2767k9353
2267E61405M0050l1988K224M7894j8411l2916O0080L7105l3094J3984q3712M7511
2255F10132R322K5471l4817p3025J570Q9716q383n7038o366k4569m2377L8328
2243E27964j8829O2640O197l2233m8675N6328L7120m3307J3392M3064k4538k8787
2231E50336P117p6749J0577O5322j2337l3635K8956n3805J0089j2143N0576l6006
2219D98298k932r567L0465J1283l1548K5627n2280p949M1441J2940K9578k4872
2207E20484r1431k6668q333N4692P8945l747k9642K0529m8642k82m0412j5775
$$ plain form
2291 623411 687249 757220 775636 702038 679896 677231 592694 678066 674616 572426 696000 739237
2279 739237 732823 755379 639108 682042 670372 596653 629670 690873 651132 557991 590758 561405
2267 561405 601455 569467 571691 619585 601174 568258 628338 665443 632349 646333 562621 610132
2255 610132 619454 644925 610108 537083 538653 628369 619986 562948 556582 532013 489636 527964
2243 527964 509135 571775 577972 545739 497064 553392 590512 547205 560597 603661 579123 550336
2231 550336 557453 480704 491281 556603 544266 510631 539587 485782 495871 483728 534304 498298
2219 498298 495366 485799 516264 527547 495999 521626 469346 461397 502838 515778 545356 520484
2207 520484 429053 402385 394052 448744 527689 523942 494300 514829 466187 465905 425493 409718
2195D09718k8102p947J09566q140o9628K3976K6424l4532O0173K6807k704J2857
2183E18468P840m7818K4413q52p3453p208k2510M1010K0838K537j6803n2885L48
2170C93925n0294L6138N9348J908K8982k4976k1813M3289m1469n7249P1528M7414
2158D86731k2228l6110K8080j887l2439J0325l0276J5115J3088J6704k8768q223
2146D10112Q10K4746k654O305j3486l8567L7824P927K6042o1709J836J8635J0086
2133D27907l4189P232j0059k987k616J5340N556j5705J052P007O4605R931J7995
2120D91069o1765m5793L9895M1179k3967K5270j2675n23l9022j5752m2680j9366
2108C35870M6954m9390l2802P5669L3364j0831l753J5568q467k6499k9399K9289
$$ plain form
2195 409718 381616 373669 483235 475095 405467 429443 455867 421335 481508 508315 505611 518468
2183 518468 526308 478490 502903 502051 428598 421390 398880 439890 460728 463265 446462 393577 393925
2170 393925 343631 379769 439117 441025 470007 445031 423218 466507 425038 367789 439317 486731
2158 486731 464503 428393 456473 454586 422147 432472 402196 417311 430399 447103 418335 410112
2146 410112 410922 435668 433014 439319 425833 387266 425090 433017 459059 397350 399186 417821 427907
2133 427907 393718 400950 390891 387904 385288 400628 406184 390479 391531 398538 463143 473074 491069
2120 491069 429304 383511 423406 464585 440618 465888 453213 452690 413668 397916 355236 335870
2108 335870 382824 333434 300632 376301 409665 398834 395081 410649 402182 375683 346284 375573
2096C75573O7567L14o5219J4731n0418K9607k1682p9400J1179J7040j223l5679
2084B62390j0123N0406J4415O5086K6171q0604J0859q9615O6489j5919q2622J0889
2072B27822M7294M5460k7368K459L1737J875N794m0365K5438Q22j2648k376p2682
2059B33262N5620N3196j7944l3432R44k8072L97L359J9721M5385J3820P570l4051
2046C19775p4826L3055M589M3159m5453l9719J6549J4199O5906l1042M7049l932
2034C49309O16o9056K7475r17L8172o3429p387J1487l630j9592K992M6578N6397
2021C69015p2569J4240J42q0603J5972Q0368O6545p457n0602j8704l8171L6641
2009C14817k2101N6238K571m1166N5004n4675j9690n3602M5383L8020l9557k222
$$ plain form
2096 375573 443140 443454 378235 392966 342548 372155 350473 271073 282252 299292 298069 262390
2084 262390 252267 302673 317088 382174 408345 327741 338600 248985 315474 299555 216933 227822
2072 227822 275116 320576 293208 295667 327404 329279 335073 294708 320146 320968 308320 305944 233262
2059 233262 288882 342078 324134 290702 291646 263574 263971 267330 287051 332436 346256 353826 319775
2046 319775 244949 278004 282593 325752 280299 240580 257129 271328 337234 306192 353241 349309
2034 349309 349925 280869 308344 307427 345599 282170 274783 286270 282640 263048 266040 312618 369015
2021 369015 296446 310686 310828 230225 246197 326565 393110 385653 335051 316347 278176 314817
2009 314817 292716 348954 351525 310359 365363 310688 290998 237396 282779 320799 281242 279020
1997B79020M0654M272n4940m511K0844R099J8309k7230k2694M195k2322J191K8866
1984B74753l4325j4397k0701K3912P9397j0364p4790J5453K3718m6546K7819l8784
1972B05145K9934K4533m7831J1264K1907Q9689n1470K617J5821J0769r9184l982
1960B09212q266M5553j2107o7805N6652N8307j0687L018p7432N8848k0458N1791
1948B86626j6061K081N0826j9411k1156k4514j4419j3741m399J70m6458Q1733
1936B61277M6291l4534K1169M040m0115m6795J8151M9244m0591l3943M5146k0774
1924B28566J2392J9096l8268j0400M8192J2186l7069n9023L9232K97l162k9844
1912A82195L5848Q5036M5047n6929k7446l2666j680p9128M0389R904K9766m7491
$$ plain form
1997 279020 319674 323946 269006 264495 285339 294438 312747 285517 262823 267018 244696 245887 274753
1984 274753 240428 226031 205330 229242 308639 298275 223485 238938 262656 216110 243929 205145
1972 205145 235079 259612 211781 223045 244952 334641 283171 285788 301609 312378 213194 209212
1960 209212 200946 246499 234392 166587 223239 281546 270859 273877 196445 255293 234835 286626
1948 286626 270565 272646 323472 304061 282905 258391 243972 230231 225832 226002 179544 261277
1936 261277 307568 273034 294203 298243 258128 211333 229484 278728 238137 204194 249340 228566
1924 228566 240958 260054 221786 211386 259578 271764 234695 175672 214904 215201 212039 182195
1912 182195 218043 303079 348126 291197 263751 231085 229405 150277 190666 200570 230336 182845
1900A82845j1821L246J4960K4871O617L7035j9288o0946K9656M7203k7369J704
1888B28713k9381K5442K1889J5776m4912N4594J8534J7738m7203L5233J3891q0895
1876B29419k1965j4926L430J2809P3490n7998k0341j9928K2145K1724o3978K4578
1864A88459n249J8047N7215j1628L1150O5818k3864j06957K3393M4779j4212K392
1852B69343m9560n2964o7573O618j8712N7682M5506m1675l0232q922M3548l6656
1840A16403K4458k4436K6467N266P9306N8561r1586r736Q41j6479M1070m8251
1828A61884n894L5864j20832L1974R8219l5214P16L953J8460K3876K252l3562
1816A81696j4870m36l2885n1200K3875L4184L2083K9517n9391R248m4463M4063
$$ plain form
1900 182845 171024 174270 189230 214101 220718 257753 238465 177519 207175 254378 227009 228713
1888 228713 199332 224774 246663 262439 217527 272121 290655 308393 261190 296423 310314 229419
1876 229419 207454 192528 195958 208767 282257 224259 203918 183990 206135 227859 163881 188459
1864 188459 183210 201257 258472 246844 277994 343812 319948 212991 236384 281163 266951 269343
1852 269343 219783 166819 99246 105864 87152 144834 190340 148665 118433 109511 153059 116403
1840 116403 140861 116425 142892 148158 227464 286025 194439 184703 185544 169065 210135 161884
1828 161884 155990 191854 71022 102996 201215 166001 166717 170670 189130 213006 215258 181696
1816 181696 166826 166390 133505 82305 106180 140364 172447 201964 142573 151821 107358 151421
1804A51421J9734m1351M0214o1035P2396L0967r5252K5129J1082M4301l4203l2941
1792A30462N8495K9999J9858n2827r025n2874L6825J6237l4562R121j2490o413
1780A32806K4978P3848p5020l5506l3586j6688J3905P527L683L4992L7769O840
1768A75548j590p8514L2165K1469o39O5543m9432K9441k2756j6725o4965l767
1756H5778J5882P289m2111N1587N9695q793m1746j0878R566l2650O9322K382k9174
1743A36149m6276L9319j3881m9346K1744O4694m4371m216J424L3739K1804j2374
1731A48409p3864o961N0399M7848J7295j7119j3566K9450j4026o3090k8083m9192
1719B7500L5697J17656j5298l8202l4361l629J8208Q2474M2026p7392N324l0491
$$ plain form
1804 151421 171155 129804 170018 108983 181379 212346 117094 142223 153305 197606 163403 130462
1792 130462 188957 218956 238814 185987 176962 124088 160913 177150 142588 151709 139219 132806
1780 132806 157784 231632 156612 121106 87520 70832 84737 92264 95947 130939 168708 175548
1768 175548 173958 95444 127609 149078 148439 213982 164550 193991 171235 154510 89545 85778
1756 85778 101660 108949 66838 118425 178120 169327 127581 116703 126269 93619 162941 165323 136149
1743 136149 89873 129192 115311 65965 87709 152403 108032 103816 105240 138979 160783 148409
1731 148409 74545 67584 117983 165831 183126 166007 152441 181891 167865 104775 76692 27500
1719 27500 63197 180853 165555 127353 92992 89363 107571 190045 232071 154679 160003 129512
1707A29512O797j8480l5279L1233M7803k5232l0205L064O3634m0854k6063J7147
1695A23077l1685L0014R1966K3132n2353n2731Q579l2494j6291j5141L4797l6222
1683G4648J6770M7986n2956J2466R93o7627L7416O5915J6984n8690M9300K7117
1671A70322k7177j8620Q361p0987m9367M2591K7954l2752L0308L0095q5505L7586
1659F2809P3712k0605J2146J3028K7772K5445l1206m1079K8K0399l727k6731p2924
1646C9067M1960Q039J1729J5238m6029k2279K6170o5204R6662K0477m6899M5186
1634A24117L9105M2562p5982k532P4K1589M3587n106m1671l1402L5155k6948J1759
1621A34307J5702o5672m1390Q9884K3614l7977o5534J5547J4532O7533l5053m232
$$ plain form
1707 129512 136309 117829 82550 113783 161586 136354 106149 109213 172847 131993 105930 123077
1695 123077 91392 121406 213372 236504 184151 131420 139999 107505 91214 76073 110870 74648
1683 74648 91418 139404 86448 98914 99907 32280 69696 135611 152595 93905 143205 170322
1671 170322 143145 124525 132886 61899 12532 55123 83077 50325 80633 110728 25223 62809
1659 62809 136521 115916 128062 141090 168862 194307 163101 122022 122050 142449 138722 111991 39067
1646 39067 81027 89066 100795 116033 70004 47725 73895 8691 105353 125830 78931 124117
1634 124117 163222 205784 129802 127270 127344 148933 192520 187414 145743 114341 149496 122548 134307
1621 134307 150009 84337 42947 132831 156445 118468 52934 68481 83013 150546 115493 111261
1609A11261J6199P901k3017n4524K7489j206O0414o676j2802L4804p7476l2542
1597D9825l6768K8980J4666k1499J7345P8562k9923J4282n0324m47O8527k382
1585A30844m1146j081L3646k2751k9518L7081J5436J2318J8497m7765P1503o4353
1573A12711l423L7603n1470L853j1143J1041M3700J808K4547q3393k1074J8809
1561H3569j6983N5106q307k8351j080J1835L6978m155k2321o1459J0135N5330
1549A10297M8656n6322k3124N7955m9266P724K5115k4730J3454K7371j6808k5483
1537I4839K0212M9913r666J9886m8865r2317N056J8069O5972r3116L1204J2106
1525G3293j902J8820j681q925n7815M1502J8834o635K936K6401J6957m6797k9182
$$ plain form
1609 111261 127460 135361 112344 57820 85309 84103 144517 137841 125039 159843 82367 49825
1597 49825 13057 42037 56703 35204 52549 131111 101188 115470 65146 64699 133226 130844
1585 130844 89698 88617 122263 99512 69994 107075 122511 134829 153326 105561 177064 112711
1573 112711 109288 146891 95421 99274 88131 99172 142872 144680 169227 85834 64760 83569
1561 83569 66586 121692 113385 85034 83954 95789 132767 128612 106291 44832 54967 110297
1549 110297 158953 102631 79507 137462 88196 95920 121035 96305 109759 137130 120322 94839
1537 94839 115051 164964 155298 175184 126319 34002 39058 57127 123099 29983 61187 73293
1525 73293 71391 90211 88530 79605 21790 63292 82126 75491 78427 104828 121785 74988 45806
1512D5806j5045J55M3994j2700j5458l2052p306K983L9719K2855K7290M2013j6636
1499A25618j6353p6742O171J1094q998n338j5668N4032K3748J712j3378j7371
1487F8527K4902j0328K3007N688m350m3273m644j4627k051O831P3528m1423K3005
1474A04792j3855m035m1430l7113K4753O1250k0146j6975q1803j2691M3472R4537
1462A00756Q0355k3358m0015m2507J0072K190r079n1204q9857R5291O5435j00488
1450b409M3156p939K9011m6874m3490N3817L9145k5462J7629j9687L540O5099
1438A05536l6658l0937L8242m0246L044J03119p80o9496N6848n7641J5106J8917
1426A05054j5091p893K5151l5933L3753M0014M4541m8371l8730j2958j1170l5058
$$ plain form
1512 45806 30761 30916 74910 62210 46752 14700 7394 10377 50096 72951 100241 142254 125618
1499 125618 109265 32523 38694 49788 40790 35452 19784 73816 97564 99276 85898 68527
1487 68527 93429 83101 106108 111796 107446 64173 59529 44902 42851 49682 123210 81787 104792
1474 104792 90937 86902 45472 8359 33112 94362 74216 57241 -24562 -37253 6219 100756
1462 100756 181111 157753 117738 75231 85303 87493 78414 27210 -62647 32644 98079 -2409
1450 -2409 40747 32808 61819 14945 -28545 25272 64417 38955 56584 36897 40437 105536
1438 105536 68878 37941 76183 35937 38981 142100 141320 71824 128672 71031 86137 105054
1426 105054 89963 82070 107221 71288 105041 145055 189596 141225 102495 89537 78367 43309
1414D3309J4902k8374R763J9922o963l7218k3773K3165J1237L0991Q1828P908
1402A46697k0191J1899j6933n5734m3731n634O3017O830k2702M499N4631o6230
1390E6418l0416J8749m8578L3763k8798k222k9444K2905J6996J7093N8006j0410
1378G4062L1996j693m8939K8531Q832K716l4443l2179R780l9K0776j4789l4333
1365A0278L1347J1651k3103k1281j2624L8830J2636K9659k272m619l6069o6766
1353c2333M0636j9035J4709q936J3962O0933O475l3194L8534L432K1706L6367
1341A43256p314j08673j4540N8661l6642j3941k4602N216q025K7047J00650K9644
1329A50737N685o2913j7315j4419l0721J7860j189r7191P299L6282K5157k2598
$$ plain form
1414 43309 58211 29837 39600 59522 52559 15341 -8432 14733 25970 56961 138789 146697
1402 146697 126506 138405 121472 65738 22007 16373 79390 86220 63518 68017 122648 56418
1390 56418 26002 44751 -3827 29936 1138 -1084 -30528 -7623 9373 26466 84472 74062
1378 74062 106058 104365 55426 83957 92789 95505 61062 28883 38663 38624 59400 44611 10278
1365 10278 41625 53276 30173 8892 -3732 35098 47734 77393 75121 70502 34433 -32333
1353 -32333 8303 -10732 3977 -4959 9003 69936 76411 43217 81751 85183 106889 143256
1341 143256 135942 27269 12729 71390 34748 20807 -3795 1421 -6604 20443 121093 150737
1329 150737 156422 93509 76194 61775 31054 48914 47725 -49466 -42167 -5885 19272 -3326
1317c326M9523L9307j3551j0971k0008k602J5988n2601l0776K2888j3247P2903
1305E3527J4592l0681l9414l883J2651j1339J1517P353P296k859q113p318M9655
1292E2984M1769q1183m2098M7560O5662r5861j2902Q7939m4475J400L4605j8982
1280C6418n6447j2650J8925k6433J1382M1029k2133Q2269n3490j4889o39k188
1268A154m8432O5790k1020q271N2263k5086k8319k1014L3827k7289l8669k9168
1256i4234P8480O0130j7044r1677J6598O993Q732K6705M7578N3769J6240n4238
1244E8032k3183l0645K0683N8744M7932n6238l9532J6158K8693n3166m1481J9166
1232E163L5147K2255k1391M0890o5644k6692L6466L9487J196n5828L803j7177
$$ plain form
1317 -3326 46197 85504 71953 60982 40974 38372 54360 1759 -29017 -6129 -19376 53527
1305 53527 68119 37438 -1976 -5859 6792 -4547 6970 14323 21619 18760 10647 3329 52984
1292 52984 94753 13570 -28528 19032 84694 -11167 -24069 63870 19395 20795 55400 36418
1280 36418 -20029 -32679 -13754 -40187 -28805 12224 -9909 72360 18870 3981 3342 1154
1268 1154 -47278 18512 -2508 -10779 41484 16398 -11921 -32935 892 -26397 -65066 -94234
1256 -94234 -15754 44376 27332 -64345 -47747 -40754 -32022 -5317 42261 96030 112270 58032
1244 58032 34849 4204 24887 83631 131563 75325 35793 51951 80644 27478 -14003 5163
1232 5163 40310 62565 41174 82064 16420 -10272 26194 65681 66877 11049 14852 -2325
1220b325l0587K89K4050K0171j8436j6796J3483J3590M4976l8660k2470N101M3825
1207C6211J5530l55n6750N358Q1563k9381o5573n0437K069Q0368R905k6590P628
1194I546M6702n1418k1259K5264L6005k7326l8477M8789j1509k3500m4288J7998
1182c3473L7545M3724l3309q1747L3690M0185m7068K7940j178l0571N4556k1797
1170a1503J9829P178o6158O598K5054m9451j8549O6258L4227n9399R095J2660
1158b4161m9964k6734L5683L8140n3357r585L5653P548n5179M2524L3902o393
1146c1923j809K0832L199k3466J4411k0547r638J1046n8428O0306P7560q266N520
1133C8797J5387r721k6987J0123J5787J4869k7407p962m7677L9246K4959m975
$$ plain form
1220 -2325 -32912 -32623 -8573 11598 -6838 -23634 -10151 3439 48415 9755 -12715 -7614 36211
1207 36211 51741 51386 -5364 -6 81557 52176 -13397 -63834 -61765 18603 28508 1918 9546
1194 9546 56248 4830 -16429 8835 44840 17514 -20963 27826 16317 -7183 -51471 -33473
1182 -33473 4072 47796 14487 -67260 -33570 6615 -40453 -12513 -13691 -44262 10294 -11503
1170 -11503 8326 15504 -50654 -44056 -19002 -68453 -87002 -20744 13483 -45916 -36821 -24161
1158 -24161 -74125 -100859 -65176 -27036 -80393 -89978 -54325 -46777 -101956 -59432 -25530 -31923
1146 -31923 -33732 -12900 -9701 -33167 -18756 -39303 -48941 -37895 -96323 -36017 41543 33277 38797
1133 38797 54184 44463 17476 27599 43386 58255 30848 22886 -24791 14455 39414 34439
1121C4439m89p726L0330k4332m3568M8793L5487p6190R224k9170l4716K4731K3267
1108i920K2011n1647K4419R4243j6747m4504k2838k5030L414l2021N1625K08J2542
1095E755K2611K0054k6281k0158M0778p1941L5572l1440L0575M3384p4265j6825
1083d2181J2044K0552L3387Q313k436k5664J4603m372p9991j8053K7789J4262
1071d1747K4k4095O4144L7730K7679Q622l9221k8540J1350q2495L1560P601n4877
1058h2265q102R5034J1587k2977K034o8660j6788M6485J792q5201K7494K0255
1046g9312K7001P719k1301N5361K6220j1050k3837J0984k1424n0877o242L0124
1034e6634k3924O7859P3560n9528l7800l2658K8731j8357j9296P5937n8777j9709
$$ plain form
1121 34439 33950 26224 56554 32222 -11346 37447 72934 -3256 5968 -23202 -57918 -33187 -9920
1108 -9920 12091 -39556 -15137 79106 62359 17855 -4983 -30013 -26599 -58620 -6995 -6787 5755
1095 5755 28366 48420 22139 1981 42759 -29182 6390 -25050 5525 48909 -25356 -42181
1083 -42181 -30137 -9585 23802 32115 29679 4015 18618 14246 -65745 -83798 -56009 -41747
1071 -41747 -41723 -65818 -1674 36056 63735 72357 33136 4596 15946 -66549 -34989 -27388 -82265
1058 -82265 -90367 4667 16254 -6723 -4689 -73349 -90137 -43652 -41860 -127061 -99567 -79312
1046 -79312 -52311 -44592 -65893 -10532 15688 4638 -19199 -8215 -29639 -80516 -86758 -56634
1034 -56634 -80558 -12699 60861 1333 -36467 -69125 -40394 -58751 -78047 -2110 -60887 -80596
1022h0596r273n8522M9978O9678o8926j6160P782k3397Q4395N0158r56k4009m5717
1009f5565L3782J04469K0426l9447q2940M105M8917m6180l2697q706J7079M7595
997H38Q348k45O2810J838q6772M7430O102o7910m4907K2369L5385Q6748q7451
984a5417L8455k5680k6838J4538L2966k4716k8598o606M0334m2542k3023J9884
972d7243L5721j0081k5867N21P865J4814k3101k7193J3889L6566m632K4550n8104
959f2295k9027M2427O0910P970l276o3061Q2475j2804n9817p344k8748O7395m7436
946e2631m6802L6042j708K5362k8468k8464p652M1525N2250Q805q520m1581O550
933d5292J1808j2548L3209o7216j8834M4682Q763J6759j7096J5473j869K3456
$$ plain form
1022 -80596 -89869 -148391 -98413 -28735 -97661 -113821 -106039 -129436 -45041 5117 4161 -19848 -65565
1009 -65565 -31783 72686 93112 53665 -29275 -25170 23747 -22433 -55130 -63836 -46757 838
997 838 9186 8941 71751 73589 -13183 34247 40349 -27561 -72468 -50099 -14714 72034 -15417
984 -15417 23038 -2642 -29480 -14942 18024 -6692 -35290 -41896 -1562 -44104 -67127 -47243
972 -47243 -11522 -21603 -47470 -46949 -39084 -24270 -47371 -74564 -60675 -24109 -28741 -4191 -62295
959 -62295 -91322 -48895 12015 19985 16709 -46352 36123 23319 -36498 -43842 -72590 -5195 -52631
946 -52631 -99433 -63391 -65099 -39737 -68205 -96669 -104321 -62796 -10546 -1741 -10261 -51842 -45292
933 -45292 -33484 -46032 -12823 -80039 -98873 -54191 -45428 -28669 -45765 -30292 -32161 -8705
921h705L399n622L5188l0715o7446l764k795n1415N1263K9865N5254N4878j4808
908D4577o6640p7420Q2950J0606o6465N1955m2432J4320m257m0023J7841K3862
896e1126L1447j8249N0639r4254p5095L6419J1282k2680O538J8685P180R1673
884g541o6150M234L4084k046k1528j0890j2715J7392N6004l9349J5573j0053m9357
871i2342L8794L476k0730J8492j448m1413J8116J4172k909O0386k5006j4770m1681
858h6863j5847M067K7099O1913o2305k8621J2404K1979O9346m5057o8155M8192
846f1848L0518L1235K762J6084n2377p7490N2826l499K0077J4986m3277J7689
834e2314L1811K2252j6696M749k4178k6439m8874L2903K7370J3514m99k2902J8424
$$ plain form
921 -8705 -5306 -10928 24260 -6455 -73901 -77665 -80460 -131875 -80612 -50747 4507 59385 44577
908 44577 -22063 -99483 -16533 -5927 -72392 -20437 -62869 -48549 -52806 -92829 -74988 -51126
896 -51126 -19679 -37928 12711 -81543 -156638 -120219 -108937 -131617 -125079 -106394 -99214 -7541
884 -7541 -73691 -69457 -35373 -37419 -58947 -69837 -82552 -65160 -9156 -48505 -32932 -42985 -92342
871 -92342 -53548 -50072 -70802 -52310 -53758 -95171 -77055 -62883 -65792 -5406 -30412 -45182 -86863
858 -86863 -102710 -98643 -71544 -9631 -71936 -100557 -88153 -66174 3172 -41885 -110040 -61848
846 -61848 -31330 -95 2667 18751 -33626 -111116 -58290 -61789 -41712 -26726 -70003 -52314
834 -52314 -20503 1749 -14947 -10198 -34376 -60815 -109689 -76786 -49416 -35902 -36401 -59303 -40879
821d0879K4291M6479o2422q2597L4080O192M6753M8194n7363J6043J2981m5767
809e4015M0307k2969o251q241j48K0557n1058M2500M1478k1995m4493J4501O7321
796A7494r256n0524k4528k9139L3880K4230J7845m896j8358N2901K8342l9853
784a862n2931k2469Q2328L8757r4606j6167K3438j2964J0011L1070j2442k0306
772d8143r219k1755o2647L204O1404o2316R2530K3506J7601J114n2982j9520L1823
759d5400l5773m6953K0649o5501n769O8592o708j4208n072J8754K5510O2207M7838
746A8166k6289r881K4436l3759j0684J2131l7345K0138J5815k1042K8858K0893
734A437l2980j296j8428j4702m293L4387M255k4565o2779k6478J4501N2018J7915
$$ plain form
821 -40879 -16588 29891 -32531 -115128 -81048 -74856 -28103 20091 -37272 -21229 -8248 -54015
809 -54015 -13708 -36677 -42928 -51169 -51317 -30760 -81818 -39318 2160 -19835 -64328 -49827 17494
796 17494 8238 -42286 -66814 -95953 -62073 -37843 -19998 -24894 -43252 9649 37991 -1862
784 -1862 -54793 -77262 5066 43823 -50783 -66950 -43512 -56476 -46465 -15395 -27837 -48143
772 -48143 -57362 -79117 -141764 -138560 -77156 -139472 -46942 -23436 -5835 -4721 -57703 -77223 -45400
759 -45400 -81173 -128126 -107477 -172978 -178747 -110155 -116863 -131071 -136143 -117389 -91879 -29672 18166
746 18166 -8123 -18004 6432 -27327 -38011 -25880 -63225 -43087 -27272 -48314 -19456 1437
734 1437 -31543 -32839 -51267 -65969 -70262 -35875 -31620 -56185 -118964 -145442 -130941 -78923 -61008
721f1008j5795L8299j3225N2904j3145l1734l5217j0699N814K0988o4562J8850
709a08530O3985j5682k4329j7576o962j4380M2327N1175l0619l2936J3668l9267
697a19126j4405N9978L4212l0278l7475R324M9109p6335O3916K2203n560J2317
685c2120K2794k815k5200L4858l0730o6464n9713M0516P1364K9604m6005r937
673g3848m165j1461M1155L3889n2087l4513L3457K7764L2917q417j4709k9382
661e9400l8124N7007P341m8081N0463m4144J3191L8550o4971n8849J549j363M045
648a42786M5606k0863j2921K5799O0507J3570K29L1728k7221M0640O650M416m9743
635b4389j0685m7200j9842M3624M167m7814J0198o747J448j6128J62n091L5939
$$ plain form
721 -61008 -76803 -38504 -51729 1175 -11970 -43704 -78921 -89620 -83806 -62818 -127380 -108530
709 -108530 -44545 -60227 -84556 -102132 -109094 -123474 -81147 -29972 -60591 -93527 -79859 -119126
697 -119126 -133531 -73553 -39341 -69619 -107094 -97770 -48661 -124996 -61080 -38877 -44437 -32120
685 -32120 -9326 -12141 -37341 -2483 -33213 -99677 -159390 -118874 -47510 -17906 -63911 -73848
673 -73848 -78013 -89474 -48319 -14430 -66517 -101030 -67573 -39809 -6892 -15309 -30018 -59400
661 -59400 -97524 -40517 -33176 -81257 -30794 -74938 -61747 -23197 -88168 -147017 -145468 -146831 -142786
648 -142786 -97180 -118043 -130964 -105165 -44658 -31088 -30859 869 -26352 14288 20938 25354 -24389
635 -24389 -35074 -82274 -102116 -58492 -54325 -102139 -91941 -98688 -97240 -113368 -113206 -118297 -82358
622h2358L5357q408M3885R327K018l5437k5629n227L7343R328o8462K6041P2065
609I843r061n2055j0768O8888R796n264k8514K0532m5578l5884R4692J1947p8123
596d9549M3110p3821j6976J9676l995k571L2790N7166m0000L0121N8492k9423
584B5020j57790L7334N4383M5891m7471n2212m9743L7589M5772K733N7698o2418
572f3214l4815N268K2782N9107R591j6757j6399j8730p806l6657O4001K457l0694
559f1866Q6235j2228j12177P4717n6334k0601P332l7234R9468j1351j8040j10
547f2189J811L9972Q174J1729r645K2769j9229k5625J0086M5823J7936p0326K1023
534g691j0825o9179l240k4444Q5211k698n7909l853K5376l7453P4402N280n5156
$$ plain form
622 -82358 -47001 -55409 -11524 -2197 -179 -35616 -61245 -66472 -29129 -19801 -88263 -62222 9843
609 9843 782 -51273 -62041 6847 16643 11379 -17135 3397 -42181 -78065 16627 28574 -49549
596 -49549 -6439 -80260 -97236 -77560 -81555 -84126 -51336 5830 -34170 -4049 54443 25020
584 25020 -132770 -95436 -41053 4838 -42633 -94845 -144588 -106999 -61227 -58494 -796 -63214
572 -63214 -98029 -92761 -69979 -10872 -1281 -18038 -34437 -53167 -60973 -97630 -33629 -31172 -61866
559 -61866 24369 12141 -100036 -25319 -81653 -102254 -94922 -132156 -32688 -44039 -62079 -62189
547 -62189 -60378 -20406 -12232 -503 -10148 12621 -6608 -32233 -22147 23676 41612 -28714 -7691
534 -7691 -18516 -87695 -90935 -115379 -30168 -32866 -90775 -94628 -69252 -106705 -32303 -27023 -82179
521h2179L777O983l4520p020L1858j4288o49j1027m7579m204O1066j7131K8528
508h6385J25291k5428l8140k0774l9416k4536q203J6899K5815O0413q9197L5841
496f7820M8091j2277J9374n6553n5990K1404p963J7288L3060j7981k1770n118
484a06255L4230L2928n2782n6283N0552k9247p824O4638l1443M2488M2659N6013
472C9674j2942o1848n0936m4082j4717N722M5417N7469j4423n5831L2649M5824
460b8024m9209j8497n225K8770l2517q8721N0973P9121m7100R813K8368K7192
448d5056n5508k630O6638m6780O4809K7134o8720K5830K1089q5064P792N2785
436c7681p6407l2386p974P4364L1134l9466k4898J6833M5943n4715k7487m5394
$$ plain form
521 -82179 -78402 -71419 -105939 -112959 -81101 -95389 -96038 -107065 -154644 -158848 -97782 -114913 -86385
508 -86385 38906 13478 -24662 -45436 -84852 -109388 -117591 -100692 -74877 -14464 -103661 -67820
496 -67820 -19729 -32006 -12632 -69185 -125175 -103771 -111734 -94446 -61386 -79367 -101137 -106255
484 -106255 -72025 -39097 -91879 -148162 -97610 -126857 -134681 -70043 -101486 -58998 -16339 39674
472 39674 26732 -35116 -86052 -130134 -144851 -139129 -93712 -36243 -50666 -106497 -73848 -28024
460 -28024 -77233 -95730 -100955 -72185 -104702 -193423 -142450 -63329 -110429 -100616 -72248 -45056
448 -45056 -100564 -103194 -36556 -83336 -18527 8607 -60113 -34283 -13194 -98258 -90466 -37681
436 -37681 -114088 -146474 -154448 -80084 -48950 -88416 -113314 -96481 -50538 -105253 -132740 -178134
424a78134L0872P0816K3224j9289k4492k0120K1268K9169K9862k5642P567o3628
412a18527j6716K4559l0604P9337L9458M2821m0911K3619J2180p9062l7863k6274
400a27983K2188Q132j1407N0259L1306p3940l6038N0195L4111R694r7699N349
388a35833J001J5964J5837K446N6963m7324M6669l0752k7803M4581N1830l260
376i681L921L2074m2653l4247J0209l0374J4471k6240J0478k3718o08M6311k465
363e2522n572j5450P7052p5898J5174q834j0913L4331n0225k8682K5576M9441
351d6522M2150J3181L96L4598n7785r7949M7270j8240N4103k5166k2407L9670
339c6701N443r314o3707N7069j1755n6159K548L656o394J6024j4576J4929j4718
$$ plain form
424 -178134 -147262 -76446 -53222 -72511 -97003 -117123 -95855 -66686 -36824 -62466 -54899 -118527
412 -118527 -135243 -110684 -141288 -61951 -22493 20328 -20583 3036 15216 -63846 -101709 -127983
400 -127983 -105795 -97663 -109070 -58811 -27505 -101445 -137483 -87288 -53177 -43483 -141182 -135833
388 -135833 -134832 -118868 -103031 -100585 -43622 -90946 -44277 -75029 -102832 -58251 -6421 -9681
376 -9681 -5760 26314 -16339 -50586 -40377 -70751 -56280 -82520 -72042 -95760 -96368 -50057 -52522
363 -52522 -58094 -73544 3508 -72390 -57216 -66050 -76963 -42632 -92857 -121539 -95963 -46522
351 -46522 -4372 8809 9205 43803 -13982 -111931 -64661 -82901 -28798 -53964 -76371 -36701
339 -36701 -31258 -40572 -104279 -47210 -58965 -115124 -112576 -108920 -115314 -99290 -113866 -98937 -113655
326a13655R0114l3454m522K7821m9555k4941k4077K982J8590J6169K4243K1528
314d8757O039l0837J3606l9609K4621P4237R81r19j6116J772N074j430q4408Q349
300h7397J0813j5809K9030L5503j5289q2226m9359O8342m080R700N3132O861J0214
287c0565k5178m3974p7572L49m9828K9352N9705N6303L1847K6004r448M1091p2118
274f4032m6482l869j9164J26604K5223m3394k1631n6783K2509Q561q3746L7753
262a18451K9762l6031K5206K7527J8486l2276r125K4830M2376L0367p7954N694
250f9589j983n311P964m648J6447l0672p0906P223L9919K8080K1862l5215k1385
237a18214M9043K33K3695m009K3044n4761K3487Q682J1399m7153o8974M0811n53
$$ plain form
326 -113655 -23541 -56995 -61517 -33696 -83251 -108192 -132269 -129287 -110697 -94528 -70285 -48757
314 -48757 -42718 -73555 -59949 -99558 -74937 -700 281 -638 -16754 -14982 -9908 -11338 -95746 -87397
300 -87397 -76584 -92393 -63363 -27860 -43149 -125375 -174734 -106392 -110472 -100772 -47640 -40779 -30565
287 -30565 -55743 -99717 -177289 -176940 -226768 -197416 -137711 -81408 -49561 -23557 -33005 8086 -64032
274 -64032 -110514 -114383 -133547 -6943 18280 -25114 -46745 -103528 -81019 -72458 -156204 -118451
262 -118451 -88689 -124720 -99514 -71987 -53501 -85777 -94902 -70072 -27696 2671 -75283 -69589
250 -69589 -71572 -76883 -68919 -73567 -57120 -87792 -158698 -151475 -111556 -83476 -61614 -96829 -118214
237 -118214 -69171 -68938 -45243 -49252 -26208 -80969 -57482 -48800 -37401 -84554 -153528 -112717 -113270
224a13270M4010O1819j9774m8771J4555L4382j12345P967j108O5565M352j3568
212g6186N3021l5665M9205l4346k4037J6416K4600n4289p871L2630o3113K9364
200i0271N7544l9589J5621J0025p0042l2325K7666L4152J5718m9777L7988J7184
188f6106N1397j1344o5091K6175Q0096k4239j12691M8927N1236p288k8546l6874
176i4348P950p6024L573Q9783L263m416J621O002j9800J5443L9988j6958k4062
163f7985L7561k9639k9260O16J7397L3617j7757J2955r05m6721l8860O3710j2345
150g7616k1357M1480k5358P149J0796k3655O3232J1437o4034j8092j3755Q542
138a01231k0913j0587j6514j4029l24m5264N66L5899P1313m2546L1677M0502p9549
$$ plain form
224 -113270 -69260 -7441 -27215 -75986 -61431 -27049 -139394 -131427 -132535 -66970 -62618 -76186
212 -76186 -23165 -58830 -9625 -43971 -68008 -51592 -26992 -81281 -89152 -56522 -119635 -90271
200 -90271 -32727 -72316 -56695 -46670 -116712 -149037 -121371 -87219 -71501 -121278 -83290 -66106
188 -66106 -14709 -26053 -91144 -64969 15127 -9112 -121803 -72876 -21640 -28928 -57474 -94348
176 -94348 -86398 -162422 -158849 -69066 -65803 -70219 -68598 -62596 -82396 -66953 -26965 -43923 -67985
163 -67985 -30424 -60063 -89323 -88707 -71310 -37693 -55450 -42495 -43400 -90121 -128981 -65271 -77616
150 -77616 -98973 -57493 -82851 -75702 -64906 -88561 -25329 -13892 -77926 -96018 -109773 -101231
138 -101231 -122144 -132731 -149245 -163274 -163598 -208862 -208296 -172397 -101084 -143630 -111953 -71451 -151000
125a51000L4583L4407m3335J5350N5056k360J1907J3557j6460l6154J3011j6369
113h7807k8479q606k1628K8459r237k404M0419P7249n8861k0179K6531k1866M832
100h1577j4119l4812Q5449m73n4515L6297j3629l0625K4064K2351k2263J8349
88f5503J625k518n0111J9856J1327K1797J1018m2490k3291K9237L062j2895K6938
75g1948m690P933R947j8826J3260k3118Q421J0699q027l0767l6488j9292J7498
62a45398J9188J1010K2777r175n1235N6049N6682K2887p5250K138M7638m9651
50i2340J493j3610L066Q647Q079r558j5538N3646j7529j1506J4791k2987N167
37h8179J8q671J0825L9232m2959k7899j090M2937J9090L4970l6232K2603j529
$$ plain form
125 -151000 -116417 -82010 -125345 -109995 -54939 -57299 -45392 -31835 -48295 -84449 -71438 -87807
113 -87807 -116286 -124892 -146520 -118061 -127298 -129702 -89283 -12034 -70895 -91074 -64543 -86409 -81577
100 -81577 -95696 -130508 -45059 -45532 -100047 -63750 -77379 -108004 -83940 -61589 -83852 -65503
88 -65503 -63878 -66396 -116507 -96651 -85324 -63527 -52509 -94999 -118290 -89053 -85991 -98886 -71948
75 -71948 -76638 -68705 -58758 -77584 -64324 -87442 -79021 -68322 -76349 -107116 -143604 -162896 -145398
62 -145398 -126210 -115200 -92423 -101598 -152833 -96784 -40102 -17215 -92465 -90327 -42689 -92340
50 -92340 -90847 -104457 -101391 -92744 -84665 -94223 -109761 -56115 -73644 -85150 -70359 -93346 -88179
37 -88179 -88161 -96832 -86007 -46775 -89734 -117633 -118723 -75786 -56696 -21726 -57958 -35355 -36884
24c6884m8389J2022p1305J1322L9210m233M210L2224j4803M71K3213j2246j1777
11g6965l7746J1912l5381K310M5409q55j7337j6666K5727m4316J4229
0a29679
$$ plain form
24 -36884 -85273 -73251 -144556 -133234 -94024 -98257 -94047 -61823 -76626 -76155 -52942 -65188 -76965
11 -76965 -114711 -102799 -138180 -135870 -90461 -91316 -108653 -125319 -99592 -143908 -129679
0 -129679
$$ Imaginary data points
##PAGE= N=2
##DATA TABLE= (X++(I..I)), XYDATA
16383d442627P6020M2452J17341M8811M2021M9801J13475R3604O4179N7049P1566
16372c666308O4291N0939J25883N9840K8954M8518J05430N9581O1425N5858P5431
16361b930158P0569Q0021L3281M8583P2151L0463Q0678J77161J06739J2349J13618
16350b104545L9827O1947M3045J7382Q1680Q5091O8399O0903R9143L0873O5112
16339a451143Q7629M4024R0950P9255K3571M6102M6278J53908M0564K4783P1309
16328g42770R7977L8807K3525R0831R0479J6416M7348N6588J18754N4725K9296
16317g8024M9813J06786N9592o506P0569P5915O5614K1412M7956P3056M5841P8096
16305F10120O8291N5071O1990R2604J6527J7178P8324J10780L2182j6219Q1989
$$ plain form
16383 -4442627 -4366607 -4324155 -4206814 -4158003 -4115982 -4066181 -3952706 -3859102 -3794923 -3737874 -3666308
16372 -3666308 -3602017 -3551078 -3425195 -3365355 -3336401 -3287883 -3182453 -3122872 -3061447 -3005589 -2930158
16361 -2930158 -2859589 -2779568 -2746287 -2697704 -2625553 -2595090 -2514412 -2337251 -2230512 -2218163 -2104545
16350 -2104545 -2064718 -2002771 -1959726 -1942344 -1860664 -1775573 -1707174 -1646271 -1547128 -1516255 -1451143
16339 -1451143 -1363514 -1319490 -1228540 -1149285 -1125714 -1079612 -1033334 -879426 -838862 -814079 -742770
16328 -742770 -644793 -605986 -582461 -491630 -401151 -384735 -337387 -280799 -162045 -107320 -78024
16317 -78024 -28211 78575 138167 131661 202230 278145 343759 365171 413127 486183 532024 610120
16305 610120 678411 733482 795472 888076 904603 921781 1000105 1110885 1143067 1126848 1208837
16294A208837Q7859J11035M5800K1408M8182L6304O4156P8181l863P8792j1306
16283A765385M8096P6494M3897N6429L0885O5088R4240N175K8211J8986J24932
16272B357818Q5587K5538M0709O5771Q4325L1795J7959N0213M1684K726N4270
16261B858395J12993J8933J9429J9587P4059L5411K3190P1034q931O6751N3206
16250C344057L3533L4779N1054K4234M3664M6228q484Q3198M2313K2984K1022
16239C738582j0928P7354L9799m696J08899Q2709k9431P6316L6895L6768L713
16228D155980r918Q0637l877L1823O7000J1755L3835K5895O4235J3131K502J7323
16216D490321K9553R7509J0058k5489O6627J9479J9377K7312L9453O1970J11693
$$ plain form
16294 1208837 1296696 1407731 1453531 1474939 1523121 1559425 1623581 1701762 1697899 1776691 1765385
16283 1765385 1813481 1889975 1933872 1990301 2021186 2086274 2180514 2185689 2213900 2232886 2357818
16272 2357818 2443405 2468943 2509652 2575423 2659748 2691543 2709502 2759715 2801399 2804125 2858395
16261 2858395 2971388 2990321 3009750 3029337 3103396 3138807 3161997 3233031 3224100 3290851 3344057
16250 3344057 3377590 3412369 3463423 3487657 3531321 3577549 3569065 3652263 3694576 3717560 3738582
16239 3738582 3727654 3805008 3844807 3840111 3949010 4031719 4002288 4078604 4115499 4152267 4155980
16228 4155980 4146062 4226699 4222822 4254645 4321645 4333400 4367235 4393130 4457365 4470496 4472998 4490321
16216 4490321 4519874 4617383 4627441 4601952 4668579 4688058 4707435 4734747 4774200 4836170 4947863
16205D947863J5700K6601M335l5370J2696M018J1809M5222N7585n961K1145P394
16193E113037K7718o561L5772L9646M2089K8262L0985K7608K0828O017L059L9933
16181E408393J1464L8511M3046n9405L2648M1044o079MK4059K0980K726n3683
16169E503708O6840P4696M4207J2053l5707l0069m529R9449P5898k3678j0580
16158E772288O2906j7532N4261k2931k1569j0104M1013P3653m592K621L8725k7973
16146E940766J7757Q372K436P970J5143J5710M341K8521K6691L6999O9001k8050
16134F145657o7033l8424N2468J8201j4204L8258k0076O157M2834J072L5349J1440
$$ plain form
16205 4947863 4963563 4990164 4994499 4959129 4971825 4975843 4987652 5032874 5090459 5084498 5105643 5113037
16193 5113037 5140755 5134194 5169966 5209612 5251701 5279963 5310948 5338556 5359384 5365401 5368460 5408393
16181 5408393 5419857 5458368 5501414 5442009 5474657 5515701 5509622 5509626 5533685 5554665 5557391 5503708
16169 5503708 5570548 5645244 5689451 5701504 5665797 5635728 5631199 5730648 5806546 5782868 5772288
16158 5772288 5835194 5817662 5871923 5848992 5827423 5817319 5858332 5931985 5927393 5930014 5968739 5940766
16146 5940766 5958523 5966895 5969331 5977301 5992444 6008154 6012495 6041016 6067707 6104706 6173707 6145657
16134 6145657 6078624 6040200 6092668 6110869 6096665 6134923 6114847 6121004 6163838 6164910 6200259 6211699
$$ [...]
##END NTUPLES=NMR SPECTRUM
##END=
