##TITLE=1H_CA-9378-2
 200.13MHz, CDCl3,
 8 sc
 
 8.9.2025
##JCAMPDX= 6.0         $$ Bruker NMR JCAMP-DX V2.0
##DATA TYPE= NMR SPECTRUM
##DATA CLASS= NTUPLES
##ORIGIN= UXNMR, Bruker Analytische Messtechnik GmbH
##OWNER= pz
$$ XWIN-NMR		Version 3.5
$$ Mon Sep  8 15:28:53 2025 Russian Standard Time (UT+4h)  she@DPX200
##.OBSERVE FREQUENCY= 200.1313
##.OBSERVE NUCLEUS= ^1H
##.ACQUISITION MODE= SIMULTANEOUS
##.ACQUISITION SCHEME= undefined
##.AVERAGES= 8
##.DIGITISER RES= 18
##SPECTROMETER/DATA SYSTEM= spect
##.PULSE SEQUENCE= zg30
##.SOLVENT NAME= CDCl3
##.SHIFT REFERENCE= (INTERNAL, CDCl3, 0, 15.5243)
##AUDIT TRAIL= $$ (NUMBER, WHEN, WHO, WHERE, WHAT)
$$ ##TITLE= Audit trail, XWIN-NMR		Version 3.5
$$ ##JCAMPDX= 5.01
$$ ##ORIGIN= Bruker BioSpin GmbH
$$ ##OWNER= she
$$ F:/spectra/data/she/nmr/H-C/1/pdata/1/auditp.txt
$$ ##AUDIT TRAIL=  $$ (NUMBER, WHEN, WHO, WHERE, WHAT)
(   1,<2025-09-08 15:27:15.48 +0400>,<she>,<DPX200>,
      <created by zg, POWCHK disabled, PULCHK disabled
       configuration hash MD5:
       00 E9 B6 7A A2 85 ED C7 34 08 36 98 17 FE 4E 26
       data hash MD5: 16K
       56 BD EA 23 96 9F B2 15 DE 72 C3 9F EF 7B ED 08>)
(   2,<2025-09-08 15:27:20.64 +0400>,<she>,<DPX200>,
      <Start of raw data processing
       efp BC_mod = 2 LB = 0.25 FT_mod = 6 PKNL = 1 PHC0 = -1716.283 PHC1 = 7.19228 SI = 16K 
       data hash MD5: 16K
       D5 A8 05 9D C9 4D 4D 84 42 D7 76 29 17 66 34 BF>)
(   3,<2025-09-08 15:27:54.39 +0400>,<she>,<DPX200>,
      <pk PHC0 = -1.706249 PHC1 = 1.8 
       data hash MD5: 16K
       62 3B E4 BF 68 03 C7 0B F9 3E 33 0F 38 88 FF A0>)
(   4,<2025-09-08 15:27:58.96 +0400>,<she>,<DPX200>,
      <abs ABSG = 5 
       data hash MD5: 16K
       A3 6C 3F 97 E2 FC 98 FE 89 B9 13 1C 79 D1 DC 42>)
$$ ##END=
$$ 
$$ hash MD5
$$ 63 3B 54 CC 9A 27 9C B3 86 28 2D 51 57 B5 FD D3
##$RELAX= 
##$RELAX= 
##$RELAX= 
##$RELAX= 
##$RELAX= 
##$RELAX= 
$$ Bruker specific parameters
$$ --------------------------
##$DU= <F:/spectra>
##$EXPNO= 1
##$NAME= <H-C>
##$PROCNO= 1
##$TYPE= <nmr>
##$USER= <she>
##$AMP= (0..31)
100 100 100 100 100 100 100 100 100 100 100 100 100 100 100 100 100 100 
100 100 100 100 100 100 100 100 100 100 100 100 100 100 
##$AQSEQ= 0
##$AQ_mod= 1
##$AUNM= <au_zg>
##$AUTOPOS= <>
##$BF1= 200.13
##$BF2= 200.13
##$BF3= 200.13
##$BF4= 200.13
##$BF5= 200.13
##$BF6= 200.13
##$BF7= 200.13
##$BF8= 200.13
##$BYTORDA= 1
##$CFDGTYP= 0
##$CFRGTYP= 5
##$CHEMSTR= <none>
##$CNST= (0..31)
1 1 145 1 1 1 1 1 1 1 1 1 1 1 1 1 1 1 1 1 1 1 1 1 1 1 1 1 1 1 1 1 
##$CPDPRG= <>
##$CPDPRG1= <>
##$CPDPRG2= <>
##$CPDPRG3= <>
##$CPDPRG4= <mlev>
##$CPDPRG5= <mlev>
##$CPDPRG6= <mlev>
##$CPDPRG7= <mlev>
##$CPDPRG8= <mlev>
##$CPDPRGB= <>
##$CPDPRGT= <>
##$D= (0..31)
0 0.7 0 0 0 0 0 0 0 0 0 0.03 0 0 0 0 0 0 0 0 0 0 0 0 0 0 0 0 0 0 0 0 
##$DATE= 1757330834
##$DBL= (0..7)
120 120 120 120 120 120 120 120 
##$DBP= (0..7)
150 150 150 150 150 150 150 150 
##$DBP07= 0
##$DBPNAM0= <>
##$DBPNAM1= <>
##$DBPNAM2= <>
##$DBPNAM3= <>
##$DBPNAM4= <>
$$ [...]
##$SUBNAM3= <"">
##$SUBNAM4= <"">
##$SUBNAM5= <"">
##$SUBNAM6= <"">
##$SUBNAM7= <"">
##$SUBNAM8= <"">
##$SUBNAM9= <"">
##$SW= 18.0517328524113
##$SWIBOX= (0..15)
0 0 2 0 0 0 0 0 0 0 0 0 0 0 0 0 
##$SW_h= 3612.71676300578
##$TD= 16384
##$TD0= 1
##$TE= 0
##$TE2= 300
##$TE3= 300
##$TEG= 300
##$TL= (0..7)
0 120 120 120 120 120 120 120 
##$TP= (0..7)
150 150 150 150 150 150 150 150 
##$TP07= 0
##$TPNAME0= <>
##$TPNAME1= <>
##$TPNAME2= <>
##$TPNAME3= <>
##$TPNAME4= <>
##$TPNAME5= <>
##$TPNAME6= <>
##$TPNAME7= <>
##$TPOAL= (0..7)
0.5 0.5 0.5 0.5 0.5 0.5 0.5 0.5 
##$TPOFFS= (0..7)
0 0 0 0 0 0 0 0 
##$TUNHIN= 0
##$TUNHOUT= 0
##$TUNXOUT= 0
##$USERA1= <user>
##$USERA2= <user>
##$USERA3= <user>
##$USERA4= <user>
##$USERA5= <user>
##$V9= 5
##$VALIST= <valist>
##$VCLIST= <CCCCCCCCCCCCCCC>
##$VD= 0
##$VDLIST= <DDDDDDDDDDDDDDD>
##$VPLIST= <PPPPPPPPPPPPPPP>
##$VTLIST= <TTTTTTTTTTTTTTT>
##$WBST= 1024
##$WBSW= 4
##$XGAIN= (0..3)
0 0 0 0 
##$XL= 0
##$YL= 0
##$YMAX_a= 751780
##$YMIN_a= -628547
##$ZGOPTNS= <>
##$ZL1= 120
##$ZL2= 120
##$ZL3= 120
##$ZL4= 120
##$ABSF1= 15.51441
##$ABSF2= -2.537439
##$ABSG= 5
##$ABSL= 3
##$ALPHA= 0
##$AQORDER= 0
##$ASSFAC= 0
##$ASSFACI= 0
##$ASSFACX= 0
##$ASSWID= 0
##$AUNMP= <proc_1d>
##$AZFE= 0.1
##$AZFW= 0.1
##$BCFW= 0
##$BC_mod= 2
##$BYTORDP= 0
##$COROFFS= 0
##$CY= -3
##$DATMOD= 1
##$DC= 0
##$DFILT= <>
##$DTYPP= 0
##$F1P= 0
##$F2P= 0
##$FCOR= 1
##$FTSIZE= 16384
##$FT_mod= 6
##$GAMMA= 0
##$GB= 0
##$INTBC= 1
##$INTSCL= 3.241238e-09
##$ISEN= 128
##$LB= 0.25
##$LEV0= 0
##$LPBIN= 0
##$MAXI= 10000
##$MC2= 0
##$MEAN= 0
##$ME_mod= 0
##$MI= 1.114404
##$NCOEF= 0
##$NC_proc= -7
##$NLEV= 6
##$NOISF1= 3.799351
##$NOISF2= 2.8
##$NSP= 0
##$NTH_PI= 0
##$NZP= 0
##$OFFSET= 15.52433
##$PC= 1
##$PHC0= -1717.989
##$PHC1= 8.99228
##$PH_mod= 1
##$PKNL= yes
##$PPARMOD= 0
##$PSCAL= 0
##$PSIGN= 0
##$REVERSE= no
##$SF= 200.12999947426
##$SI= 16384
##$SIGF1= 3
##$SIGF2= 2
##$SINO= 0.751879
##$SIOLD= 32768
##$SREGLST= <19F.Aceton>
##$SSB= 0
##$STSI= 16384
##$STSR= 0
##$SW_p= 3612.71676300578
##$SYMM= 0
##$S_DEV= 0
##$TDeff= 16384
##$TDoff= 0
##$TI= <>
##$TILT= no
##$TM1= 0
##$TM2= 0
##$TOPLEV= 0
##$USERP1= <user>
##$USERP2= <user>
##$USERP3= <user>
##$USERP4= <user>
##$USERP5= <user>
##$WDW= 1
##$XDIM= 16384
##$YMAX_p= 519435217
##$YMIN_p= -385138
$$ End of Bruker specific parameters
$$ ---------------------------------
##NTUPLES= NMR SPECTRUM
##VAR_NAME=  FREQUENCY,     SPECTRUM/REAL,   SPECTRUM/IMAG
##SYMBOL=    X,             R,               I
##VAR_TYPE=  INDEPENDENT,   DEPENDENT,       DEPENDENT
##VAR_FORM=  AFFN,          ASDF,            ASDF
##VAR_DIM=   16384,         16384,           16384
##UNITS=     HZ,            ARBITRARY UNITS, ARBITRARY UNITS
##FACTOR=    0.220516191357247, 1,           1
##FIRST=     3106.88418258836, 0,            0
##LAST=      -505.83258041742, 0,            0
##MIN=       -505.83258041742, -385138,      0
##MAX=       3106.88418258836, 519435217,    0
$$ Real data points
##PAGE= N=1
##DATA TABLE= (X++(R..R)), XYDATA
$$ [...]
5664D1825572J826710J643822J335495Q77390M57660O6685l42914p36827q36497
5655D6117096p83570q18987p24155n96788l84871k45508R040J50309L53838N11917
5645D3588321P08702P49098Q30853Q09776P13984N85237K68395J4811m27691p39794
5635D7101692j168565j297631j479665j630344j725840j555475j485981j490272
5627C5267919j417814j293568j123308r85791r76091r76501p88985o64869n92781
5618B6448211n44636m70504l91937l11909k64249j15116m3552j18230j05080l1474
5608B4051524J41601O9377J05235J87577J79816K02103K31327J89953J34333J8148
5598B5510994L0785N4348p0170k0221J1926K1939M3940O2296M7035Q4029N6810
$$ plain form
5664 41825572 43652282 45296104 46631599 47508989 47966649 48033334 47690420 46953593 46117096
5655 46117096 45333526 44514539 43790384 43193596 42808725 42563217 42572257 42722566 43076404 43588321
5645 43588321 44297023 45046121 45876974 46686750 47400734 47985971 48254366 48269177 47841486 47101692
5635 47101692 45933127 44635496 43155831 41525487 39799647 38244172 36758191 35267919
5627 35267919 33850105 32556537 31433229 30447438 29471347 28494846 27705861 27040992 26448211
5618 26448211 25903575 25433071 25041134 24729225 24464976 24349860 24306308 24188078 24082998 24051524
5608 24051524 24193125 24262502 24367737 24555314 24735130 24937233 25168560 25358513 25492846 25510994
5598 25510994 25541779 25596127 25525957 25505736 25517662 25539601 25583541 25645837 25692872 25776901 25833711
5587B5833711J78669N3926J26157J98671J42282J02220J53058J50815J91757L05168
5577B7436434K07146K81448M47985M64069M61865M28271L70274L89594L49600
5568C0836686K36215J88145m286n6148l3898J56849K78457K86200M48455N42484
5558C2879159O06550O07023P71643Q78876R77879J063238J121986J316588J471993
5549D1694935J597210J662762J787041K016211K140905K275024K404827K542333
5541E8121248K527489K640722K663875K638349K634712K433802K430440K223587
5533G8314224K227666K310676K263052K277051K171668K059903J809414J557999
5525I4991653J267922P95982L53579r5323n36995r30559j327943j557388j839532
$$ plain form
5587 25833711 26012380 26066306 26192463 26391134 26533416 26635636 26788694 26939509 27131266 27436434
5577 27436434 27643580 27925028 28373013 28837082 29298947 29727218 30097492 30487086 30836686
5568 30836686 31072901 31261046 31256760 31200612 31166714 31323563 31602020 31888220 32336675 32879159
5558 32879159 33485709 34092732 34864375 35743251 36721130 37784368 38906354 40222942 41694935
5549 41694935 43292145 44954907 46741948 48758159 50899064 53174088 55578915 58121248
5541 58121248 60648737 63289459 65953334 68591683 71226395 73660197 76090637 78314224
5533 78314224 80541890 82852566 85115618 87392669 89564337 91624240 93433654 94991653
5525 94991653 96259575 97055557 97409136 97313813 96776818 95846259 94518316 92960928 91121396
5516I1121396k153989k240949k311902k430452k423645k392888k331341k333423
5508G2502807k229450k252378k125393j952355j979677j858556j808731j779007
5500E6517260j603017j469209j364104j317198j301358j260493j116434j237374
5492D5848073j203086j174460j160887j051856j150360j071438j046072j023764
5484C6966150r17932q74991q14899q38794q70741p41500o99298o69161n85842
5475B9952992o19178o04759n05694n58323n23595m63558m16554m67770m03454
5466B5390107m03078l69949l02733k85650k36013k18487k59159k32557k22753
5457B2859728k19657k17062l12554l22476k62961k30438k50417l56652l14932
$$ plain form
5516 91121396 88967407 86726458 84414556 81984104 79560459 77167571 74836230 72502807
5508 72502807 70273357 68020979 65895586 63943231 61963554 60104998 58296267 56517260
5500 56517260 54914243 53445034 52080930 50763732 49462374 48201881 47085447 45848073
5492 45848073 44644987 43470527 42309640 41257784 40107424 39035986 37989914 36966150
5484 36966150 36048218 35173227 34358328 33519534 32648793 31907293 31207995 30538834 29952992
5475 29952992 29333814 28729055 28223361 27665038 27141443 26677885 26261331 25793561 25390107
5466 25390107 24987029 24617080 24314347 24028697 23792684 23574197 23315038 23082481 22859728
5457 22859728 22640071 22423009 22110455 21787979 21525018 21294580 21044163 20687511 20372579
5448B0372579k35426l45242k45934l44494l17651k02463l02918l14228k05227
5439A7858996k11897k30742k68405j86979j73653k49875k39046k54497j51847
5430A5892055j49512j77712j97319j50440k25691j43098j43404r3652j39859j71764
5420A4299604j74090p7189l7337q5807j21835m3512L0369j4974j08207m5204M5750
5409A3667568k4009l9110J3853o403k3030J4936o486m9286M3978R5938n9137n5780
5397A3573032K4102j07061q6921n9342m7200K0279o1862k6417j8031l988L4519
5386A3241110J8305m211l401R027Q9229O31M1139R0248J54617J00017J22436J86325
5374A4045472K39169J85558L14457K84917L17581L92133L49787M07119M33123
$$ plain form
5448 20372579 20137153 19791911 19545977 19201483 18883832 18681369 18378451 18064223 17858996
5439 17858996 17647099 17416357 17147952 16960973 16787320 16537445 16298399 16043902 15892055
5430 15892055 15742543 15564831 15367512 15217072 14991381 14848283 14704879 14611227 14471368 14299604
5420 14299604 14125514 14048325 14010988 13925181 13803346 13759834 13790203 13775229 13667022 13621818 13667568
5409 13667568 13643559 13604449 13618302 13611899 13588869 13603805 13597319 13548033 13592011 13687949 13628812 13573032
5397 13573032 13597134 13490073 13403152 13343810 13296610 13316889 13255027 13228610 13210579 13206591 13241110
5386 13241110 13259415 13255204 13251803 13260830 13350059 13350690 13391829 13482077 13636694 13736711 13859147 14045472
5374 14045472 14284641 14470199 14784656 15069573 15387154 15779287 16129074 16536193 16969316
5365A6969316M42180N22254M82333M59865L89164M68789L59520K88229K69993
5356B0651643K31125J30452R7209O5209Q9532O9120L232L0516k7195J6460R0462
5345B1447765P5198L3710K48528K21445L05672L85514M44638M84050N69231P17014
5335B4932765P95230P79103P52974Q11599Q11605Q00600P03822O47980O24199
5326C1659877N14367N34465M21428L05971R6110P0706m3142q1241j68351l09076
5316C3001114l15194l05960k22070k05811j292K24442L13559L28529J92336K13877
5306C3223530K09474o3477m19428o49093r07439r19964p85139o86743o13671m56385
5296B7931665m95628m62596l63766n12515m47438o12014o39302o44775o92526
$$ plain form
5365 16969316 17411496 17933750 18416083 18875948 19265112 19733901 20093421 20381650 20651643
5356 20651643 20882768 21013220 21110429 21175638 21265170 21334290 21337522 21368038 21340843 21357303 21447765
5345 21447765 21522963 21556673 21805201 22026646 22332318 22717832 23162470 23646520 24215751 24932765
5335 24932765 25727995 26507098 27260072 28071671 28883276 29683876 30387698 31035678 31659877
5326 31659877 32174244 32708709 33130137 33436108 33532218 33602924 33559782 33478541 33310190 33001114
5316 33001114 32685920 32379960 32157890 31952079 31950787 32175229 32488788 32817317 33009653 33223530
5306 33223530 33433004 33369527 32950099 32301006 31393567 30473603 29688464 29001721 28388050 27931665
5296 27931665 27436037 26973441 26609675 26097160 25649722 25037708 24398406 23753631 23061105
5287B3061105o62258o64862p38283p04990o23567o81884o90275o21629m91161
5278A7182196m61436m78049n25780m40102m14451m63503m16653l78046l67406
5269A3236770l80965k72239l55534l43325k71038k46907j61809k36511j51592
5260A0816850j31201k09159j41535j69455j63104r1119j80448j14575m3239n3329
5250I519686j78174j54092j12622p6338q6340j31952r8048l7150k2696p2801j31271
5239H418202j19782m5669o9111r5923q253o8276j08022k9356L2148r418o6698
5228G829842K0173r865l3462m7747k1866K5120P5925q2043l378k7487j2522j0385
5216G702305J4727J653r8749n6856J3996k6735Q186j4071j5329Q0390n8124p4476
$$ plain form
5287 23061105 22398847 21733985 20995702 20290712 19667145 18985261 18294986 17673357 17182196
5278 17182196 16720760 16242711 15716931 15276829 14862378 14398875 13982222 13604176 13236770
5269 13236770 12855805 12583566 12228032 11884707 11613669 11366762 11204953 10968442 10816850
5260 10816850 10685649 10476490 10334955 10165500 10002396 9911277 9730829 9616254 9573015 9519686
5250 9519686 9341512 9187420 9074798 8998460 8912120 8780168 8682120 8644970 8622274 8549473 8418202
5239 8418202 8298420 8252751 8183640 8087717 8079464 8011188 7903166 7873810 7905958 7896540 7829842
5228 7829842 7850015 7840150 7806688 7758941 7737075 7762195 7838120 7756077 7752699 7725212 7712690 7702305
5216 7702305 7717032 7718685 7619936 7563080 7577076 7550341 7558527 7544456 7529127 7609517 7551393 7476917
5204G476917J1207K1047q69k4649K6891K7442l495M3676L4103K9709k3061k6289
5192G592629Q2159P626L9690J0773p2308J05944N2653j651N4395Q2072N8138K2371
5180H034491Q1255J15630R8752N4128K9299K1533J04352Q4385Q8120Q2768R6845
5169H891558J30543O8995P2913K1440J29164J10356J27387J54711P7141J61907
5159I946115J34374J45268J57889J94808J97297J70678K13426K43157K91742K38725
5149A1933479L49433L36346K92845L73667M01308M24034M69757N36567O03575
5140A5721011N51633O25657O78530P28686O44302O63344P64140O03867O21529
5131B1602699N53237M56012K46199K16971J29483J60479J59072o610j5935n8464
$$ plain form
5204 7476917 7488124 7509171 7508302 7483653 7510544 7537986 7534491 7578167 7612270 7641979 7618918 7592629
5192 7592629 7674788 7682414 7722104 7732877 7660569 7766513 7819166 7817515 7871910 7953982 8012120 8034491
5180 8034491 8115746 8231376 8330128 8384256 8413555 8435088 8539440 8623825 8711945 8794713 8891558
5169 8891558 9022101 9091096 9164009 9185449 9314613 9424969 9552356 9707067 9784208 9946115
5159 9946115 10080489 10225757 10383646 10578454 10775751 10946429 11159855 11403012 11694754 11933479
5149 11933479 12282912 12619258 12912103 13285770 13687078 14111112 14580869 15117436 15721011
5140 15721011 16272644 16898301 17576831 18305517 18949819 19613163 20377303 20981170 21602699
5131 21602699 22155936 22611948 22858147 23075118 23204601 23365080 23524152 23517542 23501607 23443143
5121B3443143l0311L034R5034P3715N5497K6383Q5954K12235L09478L55048M11662
5110B5040872M16579M73290N63078N38522N73909O35789N21633N70414M40291
5101B9774377L52585K61803J49501J4585K1727R710j77275j83088k53547k62490
5091B9707888m21180n23248n47461n41313o63952n74617n01269o20673n89923
5082B4724252n26354m31602l26114l06450l05524k33536j58170N043q0451j08737
5072B2252357q1997Q232K9488M830n2262m7610j499j10195k29033k73430l58207
5061B1140674m70384l33409m38359m95767m64595m77112n38034m68841l42627
5052A7111546l67537m27808l07402l48752l31240l04277j88036j99083j92339
$$ plain form
5121 23443143 23412832 23415866 23510900 23584615 23640112 23666495 23752449 23964684 24274162 24629210 25040872
5110 25040872 25457451 25930741 26493819 27032341 27606250 28242039 28763672 29334086 29774377
5101 29774377 30126962 30388765 30538266 30552851 30574578 30584288 30407013 30223925 29970378 29707888
5091 29707888 29286708 28763460 28215999 27674686 27010734 26436117 25934848 25314175 24724252
5082 24724252 24197898 23766296 23440182 23133732 22828208 22594672 22436502 22441545 22361094 22252357
5072 22252357 22170360 22178592 22208080 22212910 22160648 22113038 22111539 22001344 21772311 21498881 21140674
5061 21140674 20670290 20336881 19898522 19402755 18938160 18461048 17923014 17454173 17111546
5052 17111546 16744009 16316201 16008799 15660047 15328807 15024530 14836494 14637411 14445072
5043A4445072k21350j01363j37892j48256q8781j53724j18825r1120m5014m4000
5033A3294747l1906k0805l8651j06654j13872m5729J1931r721K78l0369K857l7419
5021A2874687k1216K9621L3409L2955j34J8647o1624J677M7541l9347R099J1750
5009A2937065K9833J8808R2885m3204N1847O6360Q7375l5810o3983L8565M0685
4998A3220426L7810O1900l6405K2102J6391n8302R1801J04883N6154J1907O3440
4987A3592107Q3460L6842L6660J23762J07597R4531K7186P2226J06082M6904L3728
4976A4361085K7959P9583J02298Q7544O6911P9971Q8088O523P3937Q3482Q3420
4965A5140801R3825J05912J17882L7887J37102R6570P9709J11823J06563K13739
$$ plain form
5043 14445072 14223722 14122359 13984467 13836211 13747430 13593706 13474881 13383761 13338747 13294747
5033 13294747 13262841 13242036 13203385 13096731 12982859 12937130 12949061 12939340 12939618 12909249 12912106 12874687
5021 12874687 12853471 12883092 12916501 12949456 12949322 12967969 12906345 12908022 12955563 12916216 12925315 12937065
5009 12937065 12966898 12985706 13078591 13035387 13087234 13153594 13240969 13205159 13141176 13179741 13220426
4998 13220426 13258236 13320136 13283731 13305833 13322224 13263922 13355723 13460606 13516760 13528667 13592107
4987 13592107 13675567 13712409 13749069 13872831 13980428 14074959 14102145 14174371 14280453 14327357 14361085
4976 14361085 14389044 14468627 14570925 14658469 14725380 14805351 14893439 14899962 14973899 15057381 15140801
4965 15140801 15234626 15340538 15458420 15496307 15633409 15729979 15809688 15921511 16028074 16241813
4955A6241813J18934J94506J35884J31790K16533J58564K00916J43927J38883
4946A7681750K28404K87191J72696J34641K09058J96476J60219J31329J98995
4937A9400759K41905J49606J25372J58904J64683K09688K34311J17259J60819
4928B0963306K78059K25738K71337L02386L25576M24937L56126L14346M26879
4919B3888690L89497L21618K28082K84760L08714K65681K16000L10422M12982
4910B6626446L79773N42846O14792O45764O67803N24882N29473N28371M48548
4901C1508698K82938R4894M5305M2124M5421J81697J97434J80363L46402K38340
4891C3163616J89456K54102K71917K57330K63717K48750L32214K46061L53600
$$ plain form
4955 16241813 16360747 16555253 16691137 16822927 17039460 17198024 17398940 17542867 17681750
4946 17681750 17910154 18197345 18370041 18504682 18713740 18910216 19070435 19201764 19400759
4937 19400759 19642664 19792270 19917642 20076546 20241229 20450917 20685228 20802487 20963306
4928 20963306 21241365 21467103 21738440 22040826 22366402 22791339 23147465 23461811 23888690
4919 23888690 24278187 24599805 24827887 25112647 25421361 25687042 25903042 26213464 26626446
4910 26626446 27006219 27549065 28163857 28809621 29477424 30002306 30531779 31060150 31508698
4901 31508698 31791636 31886530 31931835 31973959 32019380 32201077 32398511 32578874 32925276 33163616
4891 33163616 33353072 33607174 33879091 34136421 34400138 34648888 34981102 35227163 35580763
4882C5580763M23293L99047N34628N76758O09911O94829P24895Q47813R86636
4873D1378573R96310R99781J014164J133935J015873J029856R21115R87584Q30264
4864E0307455N88263N31071L92195L45561J71446k0091j08364j87201l23317l51619
4854E1345399l43294j19683M458J17278J80147L05025M69776O25764O55682P99447
4844E4039999R65453R69352R45358Q70026Q22047O56992M01974J44403k01303
4835E9614301m01680o19288p61308r09816r92643p77907p74691o77302o52976
4826E3046690m61767l76659l02052j53628p5576N5921R8058M7964M4890O8006
4816E1991847j63893k03257l61539n14497n82430o44997o89515p44418p38247
$$ plain form
4882 35580763 36004056 36403103 36937731 37514489 38124400 38819229 39544124 40391937 41378573
4873 41378573 42374883 43374664 44388828 45522763 46538636 47568492 48489607 49477191 50307455
4864 50307455 50895718 51426789 51818984 52164545 52335991 52315900 52207536 52020335 51697018 51345399
4854 51345399 51002105 50882422 50886880 51004158 51184305 51489330 51959106 52584870 53240552 54039999
4844 54039999 55005452 55974804 56920162 57790188 58612235 59269227 59671201 59815604 59614301
4835 59614301 59212621 58593333 57832025 56922209 55929566 55151659 54376968 53699666 53046690
4826 53046690 52584923 52208264 51906212 51752584 51677008 51732929 51830987 51878951 51923841 51991847
4816 51991847 51827954 51624697 51263158 50748661 50166231 49521234 48831719 48087301 47349054
4807D7349054o19695n73748n43802m61622m90051l70543l46143k39238k22330
4798D3481882j14182m7364m6040j6937R3836P4150K33914L25603K68029L86905
4788D4639796L36414L07340M32957M27608L95886M26534M10756L22450M07765
4779D8107506M35637N45975M72679N33160N40106M60444M75811M48511N30998
4770E2550827M67768N48118N06265N77473N10590M67009N83432N42556N88920
4761E7342958P12130O99011O28213N60532O34048P64988P21065O87943P73358
4752F3524246Q26369Q21806Q88239J120059J172721J178617J418964J521964J618364
4743G4091349J795489J984471K232330K370555K614833K729091K958186L324974
$$ plain form
4807 47349054 46729359 46155611 45611809 45150187 44660136 44289593 43943450 43704212 43481882
4798 43481882 43367700 43320336 43274296 43257359 43351195 43425345 43659259 43984862 44252891 44639796
4788 44639796 44976210 45283550 45716507 46144115 46540001 46966535 47377291 47699741 48107506
4779 48107506 48543143 49089118 49561797 50094957 50635063 51095507 51571318 52019829 52550827
4770 52550827 53018595 53566713 54072978 54650451 55161041 55628050 56211482 56754038 57342958
4761 57342958 58055088 58754099 59382312 59942844 60576892 61341880 62062945 62750888 63524246
4752 63524246 64350615 65172421 66060660 67180719 68353440 69532057 70951021 72472985 74091349
4743 74091349 75886838 77871309 80103639 82474194 85089027 87818118 90776304 94101278
4735I4101278L612234L723681L890520L945580M033120M087071L936216L731292
4727A25060992L570219L183281K776826K234308J616639J007038L46402l06399
4719A39489306q87004j389862j721060k045252k366110k501157k570903k540921
4711A23467037k506402k383984k234938k217831k049810j917393j875219j761376
4703A06520084j616628j509552j554388j456955j351534j366010j362082j198535
4695I5104400j206971j215331j120313j081875j088730j157501j175016j131279
4687H5927384j119194j146655j048003j095584j060377r51661r01434r31801r02410
4678G6770265q00699p58194p51151o27204n95805o27134m81364n08080m46333
$$ plain form
4735 94101278 97713512 101437193 105327713 109273293 113306413 117393484 121329700 125060992
4727 125060992 128631211 131814492 134591318 136825626 138442265 139449303 139795705 139489306
4719 139489306 138602302 137212440 135491380 133446128 131080018 128578861 126007958 123467037
4711 123467037 120960635 118576651 116341713 114123882 112074072 110156679 108281460 106520084
4703 106520084 104903456 103393904 101839516 100382561 99031027 97665017 96302935 95104400
4695 95104400 93897429 92682098 91561785 90479910 89391180 88233679 87058663 85927384
4687 85927384 84808190 83661535 82613532 81517948 80457571 79505910 78604476 77672675 76770265
4678 76770265 75969566 75211372 74460221 73833017 73237212 72610078 72128714 71620634 71174301
4669G1174301m18654l61610l72479l44607j94099j29900j69329j12767l8094l5240
4659F8997522j5368Q8973K5348M7433J17226J32989k5900k6757k49J2811M9718
4648F9403746p0993j08544m6936n0864j78548k26856k52891k72214l45914l61141
4638F7488845m80265n74021n53991p02229o75004o66831p13769p23202o96342
4629F1703191p04798n39369n14393n98177n42493n04922m78210m66305l56627
4620E6997897m09653k98557k40245k11227j15782k35194j00661n5463l0134K79
4610E5301260J14760J77546J86255K08968K17193K71126J96461K79152K17346
4601E7170067J04243M7953n8243p8743j90873p4706j18898k65404k15265j46159
$$ plain form
4669 71174301 70755647 70394037 70021558 69676951 69482852 69352952 69183623 69070856 69032762 68997522
4659 68997522 68982154 69071127 69096475 69143908 69261134 69394123 69368223 69341466 69341217 69354028 69403746
4648 69403746 69332753 69224209 69177273 69126409 68947861 68721005 68468114 68195900 67849986 67488845
4638 67488845 67008580 66434559 65880568 65178339 64503335 63836504 63122735 62399533 61703191
4629 61703191 60998393 60459024 59944631 59346454 58803961 58299039 57820829 57354524 56997897
4620 56997897 56588244 56289687 56049442 55838215 55722433 55487239 55386578 55331115 55300981 55301260
4610 55301260 55416020 55593566 55779821 55988789 56205982 56477108 56673569 56952721 57170067
4601 57170067 57274310 57322263 57264020 57185277 56994404 56919698 56800800 56535396 56320131 56173972
4591E6173972j67800j03401j46796j27162r6924j16913l7628l2025J03o6962O9306
4580E5347770R9908J38146J91035K44174L07289M06521L61287L46122L05225J84240
4570E7931717J74748J30836Q9050J19299Q2888J16784J46834J75877L31329K82095
4560E9581457L81090M54264M66006O22788O18656O99418Q25323R08172R31694
4551F5488868J052945J078938J194427J291200J339080J392043J515386J773461
4543G6126348J883576K023093K288236K455377K763811L009153L109412L474825
4535I7133831L939069M220530M676420N072148N488491N910136O240621O459658
4527A39140904O468509O075243N392468M483565L318669J854832L80692r91022
$$ plain form
4591 56173972 56006172 55902771 55755975 55628813 55531889 55414976 55377348 55345323 55345426 55278464 55347770
4580 55347770 55447678 55585824 55776859 56021033 56328322 56734843 57096130 57442252 57747477 57931717
4570 57931717 58106465 58237301 58326351 58445650 58528538 58645322 58792156 58968033 59299362 59581457
4560 59581457 59962547 60416811 60882817 61505605 62124261 62823679 63649002 64557174 65488868
4551 65488868 66541813 67620751 68815178 70106378 71445458 72837501 74352887 76126348
4543 76126348 78009924 80033017 82321253 84776630 87540441 90549594 93659006 97133831
4535 97133831 101072900 105293430 109969850 115041998 120530489 126440625 132681246 139140904
4527 139140904 145609413 151684656 157077124 161560689 164879358 166734190 167114882 166123860
4519A66123860k039916k661490k980428k889502k679437k390907k045911j668012
4511A46768257j357571j069200q15875m09909j44781K41726P06787J107536J568643
4502A46595613K055125K544991L049563L597553M019638M507626N130022N606762
4494A77106893O169251O759281P364464P851056Q082583Q282141Q234949Q030890
4486B37881508P684972P148104O682830O173923N888061N817203O010378O273052
4478B89560031O651390O756772O396225N756193M246085K359239j24795k931589
4470C18669551n515644q122850j0204438j1660272j2495890j2735789j2525897
4463B45408771j1942884j1383747j0456176r847033r216723q536224q070238p524133
$$ plain form
4519 166123860 164083944 161422454 158442026 155552524 152873087 150482180 148436269 146768257
4511 146768257 145410686 144341486 143525611 143115702 142970921 143212647 143919434 145026970 146595613
4502 146595613 148650738 151195729 154245292 157842845 161862483 166370109 171500131 177106893
4494 177106893 183276144 190035425 197399889 205250945 213333528 221615669 229850618 237881508
4486 237881508 245566480 252714584 259397414 265571337 271459398 277276601 283286979 289560031
4478 289560031 296211421 302968193 309364418 315120611 319366696 321725935 321601140 318669551
4470 318669551 313153907 305031057 294826619 283166347 270670457 257934668 245408771
4463 245408771 233465887 222082140 211625964 201778931 192562208 184025984 175955746 168431613
4455A68431613p030519o459547n973692n543839n034215m547844m132282l685740
4447A26023935l274803k854207k548471k231381j968753j725073j701204j400660
4439A08319383j243576j186492r84040r37731r04963q28054p26524p94898o93970
4430A00019135o65203o94248p33207o88964o39374o10269n28774m82962m81924
4421I4494210m25109m12214m75004n36399n91925p03818q07172p84736r65068
4412H8792765r32370r55574r33007j023987j081908r78395q54174r38096r03202
4403H0192052p57854o70018o73684n12503l77471k30551p2360O8412J25468L85206
4393G7476697N76949O67088P47520R00247J135833J199045J325818J588412J801665
$$ plain form
4455 168431613 161401094 154941547 148967855 143424016 138389801 133841957 129709675 126023935
4447 126023935 122749132 119894925 117346454 115115073 113146320 111421247 109720043 108319383
4439 108319383 107075807 105889315 104905275 103967544 103062581 102234527 101508003 100713105 100019135
4430 100019135 99353932 98659684 97926477 97237513 96598139 95987870 95459096 94976134 94494210
4421 94494210 94069101 93656887 93181883 92645484 92053559 91349741 90542569 89757833 88792765
4412 88792765 87860395 86904821 85971814 84947827 83865919 82887524 82033350 81095254 80192052
4403 80192052 79434198 78764180 78090496 77577993 77200522 76969971 76897611 76966023 77091491 77476697
4393 77476697 78053646 78720734 79468254 80368501 81504334 82703379 84029197 85617609 87419274
4384H7419274J666918J857951J947766J988894K156536K362467K465486K737442
4376A04602734L020724L267568L531357L875508M344117M831413N271927N766271
4368A38511619O421738P156107Q141498R120777J0445810J1960783J3546901J4609946
4360B19915179J4531747J3479891J1838762R419704N987842J553874l441370p836552
4352B65449077j0508889j1425895j1029997j0206915r564157q828427q172553
4345A95712244p769491p719197p744727p853629p815302p474858p019464o422820
4337A35892756n752517n192731m671776m246463l815742l559971l415505l165712
4329A02072339k907068k620082k322202k162305j742054j575344j307800j148430
$$ plain form
4384 87419274 89086192 90944143 92891909 94880803 97037339 99399806 101865292 104602734
4376 104602734 107623458 110891026 114422383 118297891 122642008 127473421 132745348 138511619
4368 138511619 144933357 152089464 160230962 169351739 179797549 191758332 205305233 219915179
4360 219915179 234446926 247926817 259765579 269185283 275173125 276726999 273285629 265449077
4352 265449077 254940188 243514293 232484296 222277381 212713224 203884797 195712244
4345 195712244 187942753 180223556 172478829 164625200 156809898 149335040 142315576 135892756
4337 135892756 130140239 124947508 120275732 116029269 112213527 108653556 105238051 102072339
4329 102072339 99165271 96545189 94222987 92060682 90318628 88743284 87435484 86287054
4321H6287054q31549o10431m88646k32350m1474J24901L59555N48567Q59785J127960
4311H7103372J354580J704210K216844K738267L260956L804028M353795M589254
4303A11125306M467266L998003L108537J931502M86661j391399l224762m638130
4295A15862984n388751n649710n478750n081076m723510m355190m002966l677119
4287G7505912l451916l181206k956588k807597k626020k357373k098193j810308
4279E6216711j683089j527658j319319j229641j138180j023517j018798q96392
4271D6380117p46343o78719o77107n38723o03135m54220m66617m11602l50786
4262D1452865k03592k19279k25252j39601p0053K302M4720L1100Q57J01780J45276
$$ plain form
4321 86287054 85455505 84845074 84356428 84124078 84082604 84207505 84567060 85115627 85975412 87103372
4311 87103372 88457952 90162162 92379006 95117273 98378229 102182257 106536052 111125306
4303 111125306 115592572 119590575 122699112 124630614 125117275 123725876 120501114 115862984
4295 115862984 110474233 104824523 99345773 94264697 89541187 85185997 81183031 77505912
4287 77505912 74053996 70872790 67916202 65108605 62482585 60125212 58027019 56216711
4279 56216711 54533622 53005964 51686645 50457004 49318824 48295307 47276509 46380117
4271 46380117 45633774 44955055 44277948 43739225 43136090 42681870 42215253 41803651 41452865
4262 41452865 41249273 41029994 40804742 40665141 40595088 40597390 40642110 40673210 40674067 40775847 40921123
4251D0921123J29675R8978J49450K66913K65502L28689L13240L68497M09169M87976
4241D3739212O03158O76772P45416P23280P37617Q24974Q55914R27170Q84773
4232E0718286Q90833R40371Q67321R16698R13232R51560R46713R22097J001961
4223E9069072J046585R86447R98439R53545Q55769Q26674O91710N80839N79211
4214F6588291N29168M57305M56026M30826M57370L52921K67949L09730J73253
4205G0022839J51734R0210q8318j01364j28512k15670l42225l49728m61402l58554
4195F8219010m48945o22551m85495n17898o14987o04025n26040p21930o47982
4186F3029157o72769p04091p31761o54749p09648o43004o35420p08810o24082
$$ plain form
4251 40921123 41050798 41149776 41299226 41566139 41831641 42160330 42473570 42842067 43251236 43739212
4241 43739212 44342370 45019142 45764558 46487838 47225455 48050429 48906343 49833513 50718286
4232 50718286 51609119 52549490 53416811 54333509 55246741 56198301 57145014 58067111 59069072
4223 59069072 60115657 61102104 62100543 63054088 63909857 64736531 65428241 66009080 66588291
4214 66588291 67117459 67574764 68030790 68461616 68918986 69271907 69539856 69849586 70022839
4205 70022839 70174573 70264783 70176465 70075101 69946589 69730919 69388694 69038966 68577564 68219010
4195 68219010 67770065 67147514 66662019 66144121 65529134 64925109 64399069 63677139 63029157
4186 63029157 62356388 61652297 60920536 60265787 59556139 58913135 58277715 57568905 56944823
4177E6944823o69179o42759o94003o78032o51991o29511o81890p17750n83622
4168E0996086n32462o02275n46986o12325o76719o64567o73731o73162o04173
4159D5409686p29349q15061p25727p41969p67995p23055o64599p24188o85893
4150C8831850o46175o90434p76840q19190p52440q30295q36764q09466p66383
4141C1903863q02031p81063p40189q03870o74599p59266p11406p18267p34594
4132B5178578o38748o27658o32789o35503n86010n72672n96206n73505n40357
4123A9775130l82651m45140m67382l71106l50942m33641m41337l80250k47022
4114A6255659l41164l19856k50102l00966k10118l36731k94024j75187j73362
$$ plain form
4177 56944823 56275644 55632885 54938882 54260850 53608859 52979348 52297458 51579708 50996086
4168 50996086 50463624 49861349 49314363 48702038 48025319 47360752 46687021 46013859 45409686
4159 45409686 44680337 43865276 43139549 42397580 41629585 40906530 40241931 39517743 38831850
4150 38831850 38185675 37495241 36718401 35899211 35146771 34316476 33479712 32670246 31903863
4141 31903863 31101832 30320769 29580580 28776710 28102111 27342845 26631439 25913172 25178578
4132 25178578 24539830 23912172 23279383 22643880 22057870 21485198 20888992 20315487 19775130
4123 19775130 19392479 18947339 18479957 18108851 17757909 17324268 16882931 16502681 16255659
4114 16255659 15914495 15594639 15344537 15043571 14833453 14496722 14202698 14027511 13854149
4105A3854149j96521j97500k17003j52168j46194j73367j31202j19437j23948
4096A2396809r2807r1824q0280q6190j49153r414j8916j13319o0964p1806L4161
4085A1656297q1940p2900L370j6560L1301j3544o4103o326L937o5010m0232p0127
4073A1264163m4033q1251j55693j56792j13728k21098j34862j01494j70732r4706
4063I989774j69835j50041o6588o3596q4374k5696r3985k9818r7985p2138n6749
4052I078969j18110j23094j33972m5862l1589j22236j83987j40311p8248j21791
4042G979769j39720j22679j07929j14275j51936j05776j54190j7087l8306j77161
4032F850710j34843k4752L710m9134o8329j11579j13028k2173q8891l9919j29059
$$ plain form
4105 13854149 13657628 13460128 13243125 13090957 12944763 12771396 12640194 12520757 12396809
4096 12396809 12304002 12212178 12131898 12045708 11896555 11887141 11868225 11754906 11693942 11622136 11656297
4085 11656297 11574357 11501457 11504827 11488267 11519568 11506024 11441921 11435595 11439532 11374522 11334290 11264163
4073 11264163 11220130 11138879 10983186 10826394 10712666 10491568 10356706 10255212 10084480 9989774
4063 9989774 9819939 9669898 9603310 9539714 9455340 9429644 9335659 9305841 9207856 9135718 9078969
4052 9078969 8960859 8837765 8703793 8657931 8626342 8504106 8320119 8179808 8101560 7979769
4042 7979769 7840049 7717370 7609441 7495166 7343230 7237454 7083264 7066177 7027871 6850710
4032 6850710 6715867 6691115 6694825 6645691 6577362 6465783 6352755 6330582 6241691 6201772 6072713
4021F072713L8693j17324o402K0822k4634l5012r2364n4247n7643p679l5458K5707
4009E727172l3868l5660n6081N8508R9039j4632J7712Q125J448J6395j8577n523
3997E764058J4398O594n3372j8668K9731M5811n8525R0702J803o9660q5694L0790
3985E697968M897M2098k5755M2057J1281o6891K0194L2218q3836J3811l1246N2572
3973E709368Q1171k5479q6128m7261m3123k7519m1042m146l8394j9073L6669m4388
3961E450655l7078K2257o5935n4925r64k9936m2493N1307L3790o4066n9903r496
3949E193213J4167J6777j4534n4791j2941p7421l8481O9218l3564M1578O7097
3938E170318n258J8779l7266K8620m4130j8289o374K1912N6914L6082q8825N6550
$$ plain form
4021 6072713 6111406 5994082 5987680 6008502 5983868 5948856 5856492 5802245 5744602 5736923 5701465 5727172
4009 5727172 5693304 5657644 5601563 5660071 5759110 5744478 5762190 5770315 5771763 5788158 5769581 5764058
3997 5764058 5778456 5785050 5731678 5713010 5742741 5788552 5730027 5820729 5822532 5752872 5667178 5697968
3985 5697968 5702865 5744963 5719208 5761265 5772546 5705655 5725849 5758067 5674231 5688042 5656796 5709368
3973 5709368 5790539 5765060 5678932 5631671 5588548 5561029 5519987 5515841 5477447 5458374 5495043 5450655
3961 5450655 5413577 5435834 5369899 5314974 5314010 5284074 5241581 5292888 5326678 5262612 5202709 5193213
3949 5193213 5207380 5224157 5209623 5154832 5141891 5064470 5025989 5095207 5061643 5103221 5170318
3938 5170318 5165060 5183839 5146573 5175193 5131063 5112774 5106400 5128312 5185226 5221308 5132483 5189033
3926E189033N6340R597l5302M9271l7701o656j9009k3908r241n2437O0078M1122
3914E221187O5030N1089n6735k726J0321J0307q4609O449O0995O7129m8936K2282
3902E321783n1747R190M4547K2771l5162L3033J6950K038j1170O2342K3949m9263
3890E389261J3159K7455O9702L9749J1856j3541K8934P1900P6811q871m1954J04164
3878E768625J13592K0354K7604P9626N5938P048N4639j3114J12362M3268M4406
3867F314348J01951J9704J7253R3035J11034J28333k1333K6438P3733J24780K7533
3856G016809O7310J13092Q9760R3638R2084P5386R9828J00892J14941J61519K4936
3845H050195J18610J06371J21316J51692J19722J06421J18954R3275M916K7330
$$ plain form
3926 5189033 5245373 5254970 5219668 5268939 5231238 5224582 5205573 5181665 5172424 5119987 5180065 5221187
3914 5221187 5286217 5337306 5280571 5277845 5288166 5298473 5213864 5220313 5281308 5348437 5299501 5321783
3902 5321783 5270036 5279226 5323773 5346544 5311382 5344415 5361365 5363403 5352233 5414575 5438524 5389261
3890 5389261 5402420 5429875 5499577 5539326 5551182 5537641 5566575 5638475 5715286 5706415 5664461 5768625
3878 5768625 5882217 5902571 5930175 6009801 6065739 6072787 6127426 6114312 6226674 6269942 6314348
3867 6314348 6416299 6436003 6453256 6546291 6657325 6785658 6764325 6790763 6864496 6989276 7016809
3856 7016809 7084119 7197211 7286971 7380609 7472693 7548079 7647907 7748799 7863740 8025259 8050195
3845 8050195 8168805 8275176 8396492 8548184 8667906 8774327 8893281 8986556 8991472 9018802
3835I018802R3051J00836J35100R0089L1974l431O8708L3502j9087m188l806L4801
3823I576351J9051N2536k6973M2272K9687j4549r1484j134k6965n4069j47845
3812I356878j27108j3497J5790j2470o9561r5752q6851q4775k7152L2406r4274
3801H793634l0211l8903o679O4170m8166O3988J2065n848j12935J7098P0222l409
3789H775026K657J8809K0637N1503M861j1786J5706k2881L3478O8755m1866m7156
3777H867743J43942N4974k0772L6880O0738j3892L8081R7446N6525O9672K8384
3766I419721L462P1786N1306N8755r218L9752P3735J10390L3708J05143P7080
3755A0035620L187O7595J33720N3046J29646J13896P0909J25037J56834J75477
$$ plain form
3835 9018802 9111853 9212689 9347789 9437878 9469852 9466421 9535129 9568631 9549544 9545356 9541550 9576351
3823 9576351 9595402 9647938 9620965 9663237 9692924 9678375 9586891 9585757 9558792 9504723 9356878
3812 9356878 9229770 9216273 9232063 9219593 9150032 9054280 8967429 8882654 8855502 8887908 8793634
3801 8793634 8763423 8724520 8717841 8782011 8733845 8797833 8809898 8804050 8691115 8708213 8778435 8775026
3789 8775026 8777683 8796492 8817129 8868632 8873493 8861707 8877413 8854532 8888010 8956765 8914899 8867743
3777 8867743 9011685 9066659 9045887 9082767 9143505 9129613 9167694 9265140 9321665 9391337 9419721
3766 9419721 9423183 9494969 9546275 9605030 9595812 9635564 9709299 9819689 9853397 9958540 10035620
3755 10035620 10038807 10106402 10240122 10293168 10422814 10536710 10607619 10732656 10889490 11064967
3745A1064967J19395R7011J36902J54203K14041K01584J57861J58695J99654J58743
3735A2663056K13145K56847K81486K08321J10324J85245K80154K45231J92075
3726A4635884K34235J98135K38920K21776K25101J40896J82939J80089J08898
3717A6366873J60098J76713J94217K15306J64453J53667J63262J68663K00495
3708A7963747J51552K04215K57342J48056J40863J39592K39349K09482J91107
3699A9645305J26594K15112K40321K79225K16160K59819K88348J87563K56203
3690B1714650K74176L50283L98986L42060L97086L27412L69966M10446M68358
3681B5053423N14503N84411M68418N48863N78644O54789O65913O89891P58397
$$ plain form
3745 11064967 11184362 11281373 11418275 11572478 11786519 11988103 12145964 12304659 12504313 12663056
3735 12663056 12876201 13133048 13414534 13622855 13733179 13918424 14198578 14443809 14635884
3726 14635884 14870119 15068254 15307174 15528950 15754051 15894947 16077886 16257975 16366873
3717 16366873 16526971 16703684 16897901 17113207 17277660 17431327 17594589 17763252 17963747
3708 17963747 18115299 18319514 18576856 18724912 18865775 19005367 19244716 19454198 19645305
3699 19645305 19771899 19987011 20227332 20506557 20722717 20982536 21270884 21458447 21714650
3690 21714650 21988826 22339109 22738095 23080155 23477241 23804653 24174619 24585065 25053423
3681 25053423 25567926 26152337 26620755 27169618 27748262 28403051 29068964 29758855 30517252
3672C0517252O95105Q13246P85627R35211Q21864R64735R21089R48480R92935
3663C8395544J157180J162467J240619J177945J320923J424049J539942J572795
3655D8991464J603309J713306J794725J821491J945108J995295K003808K139158
3647F4007664K270235K361550K319731K245987K319958K357134K170126K065898
3639H2118283J834806J663794J399764J203088Q86673O34316M32925K04573P5618
3630I0453840m7297j94815l07656l87795n33179o74486q62435j017809j217746
3621H5210622j480023j652845j829587j981256k031818k135014k063991k024059
3613G0012029j982780j886623j896457j739872j640996j546005j495212j364890
$$ plain form
3672 30517252 31212357 32025603 32811230 33746441 34568305 35533040 36454129 37402609 38395544
3663 38395544 39552724 40715191 41955810 43133755 44454678 45878727 47418669 48991464
3655 48991464 50594773 52308079 54102804 55924295 57869403 59864698 61868506 64007664
3647 64007664 66277899 68639449 70959180 73205167 75525125 77882259 80052385 82118283
3639 82118283 83953089 85616883 87016647 88219735 89106408 89740724 90173649 90378222 90453840
3630 90453840 90406543 90211728 89904072 89516277 88983098 88308612 87446177 86428368 85210622
3621 85210622 83730599 82077754 80248167 78266911 76235093 74100079 72036088 70012029
3613 70012029 68029249 66142626 64246169 62506297 60865301 59319296 57824084 56459194
3605E6459194j251603j146553j168915j093413r36549q69715q34300p38519p10400
3596D7709227o42565n27599n44081m79956l41353l22515k13961j91813j86459
3587D4258925r2754q2162r0845N2701M9400P2523J25467J90752K72613K39105
3577D4995725L41644M12786M74646M56738M82469M88364M64426M27530M88449
3568D9032777L66250M02552M14795L85562L50592K97642K53352L38633L26016
3559E2168171K68717L31569M11776L20813K40418L63037L42308M04007K73113
3550E5123929L14680L01218L27138L13580L46325L08495L25816L42785L71750
3541E8075716L14286M39190M80527N06692N63042O28617O77964P23989P56424
$$ plain form
3605 56459194 55207591 54061038 52892123 51798710 50862161 49992446 49158146 48419627 47709227
3596 47709227 47066662 46539063 45994982 45515026 45173673 44851158 44637197 44445384 44258925
3587 44258925 44166171 44084009 43993164 44045865 44095265 44167788 44293255 44484007 44756620 44995725
3577 44995725 45337369 45750155 46224801 46681539 47164008 47652372 48116798 48544328 49032777
3568 49032777 49399027 49801579 50216374 50601936 50952528 51250170 51503522 51842155 52168171
3559 52168171 52436888 52768457 53180233 53501046 53741464 54104501 54446809 54850816 55123929
3550 55123929 55438609 55739827 56066965 56380545 56726870 57035365 57361181 57703966 58075716
3541 58075716 58390002 58829192 59309719 59816411 60379453 61008070 61686034 62410023 63166447
3532F3166447Q31296Q95195R88272R14011J016455J096190J088132J285829J349379
3523G2631206J354238J484303J630675J632139J739961J834766J969058J988031
3515H6264377K092185K145876K288286K401475K470588K498068K493156K613278
3507A05267289K739086K821604K973799L177134L223588L206187L347424L431578
3499A30187689L425082L504285L604393L498603L352191L252525L282899L005107
3491A57112774K838025K677275K537745K506051K411401K345670K206135K288761
3483A76923837K329792K314444K295661K295969K277913K320226K297474K247192
3475A95302508K352371K388815K464201K780550L055221L357963L841671M323959
$$ plain form
3532 63166447 63997743 64892938 65881210 66795221 67811676 68907866 69995998 71281827 72631206
3523 72631206 73985444 75469747 77100422 78732561 80472522 82307288 84276346 86264377
3515 86264377 88356562 90502438 92790724 95192199 97662787 100160855 102654011 105267289
3507 105267289 108006375 110827979 113801778 116978912 120202500 123408687 126756111 130187689
3499 130187689 133612771 137117056 140721449 144220052 147572243 150824768 154107667 157112774
3491 157112774 159950799 162628074 165165819 167671870 170083271 172428941 174635076 176923837
3483 176923837 179253629 181568073 183863734 186159703 188437616 190757842 193055316 195302508
3475 195302508 197654879 200043694 202507895 205288445 208343666 211701629 215543300 219867259
3467B19867259M937733N569621O135344O784593P365171P830258Q374450Q624453
3459B75488882Q832624Q803968Q854430Q682003Q249804P924424P532959P186364
3451C41555458O771024O265118N832296N229349M653646M015331L151025K292413
3443C79765660J332187K94252p47552j814928k745606l571403m414731n057315
3435C63040564n494736n878899o030658o125673o050380n936293n693012n296781
3427C16534132m843632m409472l921541l317219k726921k193578j688092j195987
3419B92237690p73041m93426j71776O190J59544R9492N010j14967j62161k64962
3409B90527593n23934o27792r32584j181421j485182j710097k049255k462882
$$ plain form
3467 219867259 224804992 230374613 236509957 243294550 250659721 258489979 266864429 275488882
3459 275488882 284321506 293125474 301979904 310661907 318911711 326836135 334369094 341555458
3451 341555458 348326482 354591600 360423896 365653245 370306891 374322222 377473247 379765660
3443 379765660 381097847 381392099 380644547 378829619 376084013 372512610 368097879 363040564
3435 363040564 357545828 351666929 345636271 339510598 333460218 327523925 321830913 316534132
3427 316534132 311690500 307281028 303359487 300042268 297315347 295121769 293433677 292237690
3419 292237690 291464649 290971223 290799447 290805637 290965181 291064673 291069683 290954716 290792555 290527593
3409 290527593 290003659 289375867 288443283 287261862 285776680 284066583 282017328 279554446
3401B79554446k834077l200046l671769l970683m495430m785601n004094n128489
3393B46464257n324623n507983n627913n647385n644009n568772n590313n505795
3385B02047464n329288n200852m995493m735402m348150m169836m000843l667226
3377A65600374l543441l384143l253405l253489l225870l119056k944441k725011
3369A40151518k530296k348707k204769k034370j926649j754907j635047j459239
3361A24257534j253839j184945j001900q80882o47464n05502m48106k97345r2811
3352A17944740K4624J70295L85783N39774M69357M82095L88648L39390P2548j88465
3342A20628789o49696r60138j023613r41392q51379p79699n47289l98804l27030
$$ plain form
3401 279554446 276720369 273520323 269848554 265877871 261382441 256596840 251592746 246464257
3393 246464257 241139634 235631651 230003738 224356353 218712344 213143572 207553259 202047464
3385 202047464 196718176 191517324 186521831 181786429 177438279 173268443 169267600 165600374
3377 165600374 162056933 158672790 155419385 152165896 148940026 145820970 142876529 140151518
3369 140151518 137621222 135272515 133067746 131033376 129106727 127351820 125716773 124257534
3361 124257534 123003695 121818750 120816850 119935968 119288504 118783002 118334896 118037551 117944740
3352 117944740 117969364 118139659 118525442 119065216 119534573 120016668 120405316 120744706 120817254 120628789
3342 120628789 119979093 119018955 117995342 117053950 116202571 115422872 114875583 114476779 114149749
3333A14149749k02379n5325O9329K00386K66912L65605N19392O88226P88637R52173
3323A17742705J082440J199439J403283J638057J833773K024475K237181K351728
3315A31513081K571610K718848K768604K891648K951827L081204L006807L095242
3307A54598871L325357L469982L692246L833423L958200M113550M124964M213268
3299A85329861M159667M183804M100469M104101L883929L685002L450147L211136
3291B16108116K903097K486611K043027J573331J176066O08628K05229k34833
3283B26869272p59655j184389j668168k098415k479426k979534l200369l459401
3275B09039915l679891l882032l995317m042943m009366l930076l925372l809541
$$ plain form
3333 114149749 113947370 113892045 113961374 114161760 114428672 114794277 115313669 116001895 116790532 117742705
3323 117742705 118825145 120024584 121427867 123065924 124899697 126924172 129161353 131513081
3315 131513081 134084691 136803539 139572143 142463791 145415618 148496822 151503629 154598871
3307 154598871 157924228 161394210 165086456 168919879 172878079 176991629 181116593 185329861
3299 185329861 189489528 193673332 197773801 201877902 205761831 209446833 212896980 216108116
3291 216108116 219011213 221497824 223540851 225114182 226290248 226898876 227104105 226869272
3283 226869272 226109617 224925228 223257060 221158645 218679219 215699685 212499316 209039915
3275 209039915 205360024 201477992 197482675 193439732 189430366 185500290 181574918 177765377
3267A77765377l624959l468558l289908l069664k910338k692633k524815k396982
3259A53787520k263467k165754k086121k018339j961204j861798j917373j835232
3251A37678232j829688j788731j632167j605697j569978j426528j262590j188346
3243A25374507j074525q96531p73542p52930n90850o04496n08497n58731o79155
3234A18935250p07607p92072j040114j155003j283047j515466j625975j835809
3226A08980157j941862k095066k166202k180335k280218k307361k268144k363288
3218I1377681k307530k219816k410637k289625k357143k238118k176290k164485
3210G3214037k172977k053707k049387j989997j848236j794352j722080j601169
$$ plain form
3267 177765377 174140418 170671860 167381952 164312288 161401950 158709317 156184502 153787520
3259 153787520 151524053 149358299 147272178 145253839 143292635 141430837 139513464 137678232
3251 137678232 135848544 134059813 132427646 130821949 129251971 127825443 126562853 125374507
3243 125374507 124299982 123403451 122629909 121876979 121286129 120681633 120173136 119614405 118935250
3234 118935250 118227643 117435571 116395457 115240454 113957407 112441941 110815966 108980157
3226 108980157 107038295 104943229 102777027 100596692 98316474 96009113 93740969 91377681
3218 91377681 89070151 86850335 84439698 82150073 79792930 77554812 75378522 73214037
3210 73214037 71041060 68987353 66937966 64947969 63099733 61305381 59583301 57982132
3202E7982132j469579j394775j344271j218849j076216j062296j010054q97668
3194D8508424q26491p65121o10000o23313o18838m57654m09355m16938k85163
3185D3495551j88454k11129j20529j35632r9772j19942j6349m8268j03617q907
3175D2442952j51849j43032j26019j85834j79675j73417l10217j69994k16494
3166D0786421k43283k04001j12825k13381j09050M0820o9169k20402k47644k00859
3156C9206627k52464l21148l75999m45460m08583l40179l17041k34772k31623
3147C6279358j72838r0743j2362J6470k5204M9878J32545J71506K53097K98765
3137C6900472K96411L09783L80849M38132N08711N43199O52253P79996P72651
$$ plain form
3202 57982132 56512553 55117778 53773507 52554658 51478442 50416146 49406092 48508424
3194 48508424 47681933 46916812 46306812 45683499 45064661 44607007 44197652 43780714 43495551
3185 43495551 43307097 43095968 42975439 42839807 42740035 42620093 42603744 42555476 42451859 42442952
3175 42442952 42291103 42148071 42022052 41836218 41656543 41483126 41172909 41002915 40786421
3166 40786421 40543138 40339137 40226312 40012931 39903881 39944701 39875532 39655130 39407486 39206627
3156 39206627 38954163 38633015 38257016 37811556 37402973 37062794 36745753 36510981 36279358
3147 36279358 36106520 36015777 36003415 36019885 35994681 36044559 36177104 36348610 36601707 36900472
3137 36900472 37196883 37506666 37887515 38325647 38834358 39377557 40029810 40809806 41582457
3128D1582457Q15386Q03168Q58758P48523N92837L96809L56218K05812J89494
3119D6549462K19882L67556L60284M55942N69175O67111O78672P31120Q45763
3110E1444967R51390R87261R20277J046059J042877J051643J003736J027568J088908
3101F0564686J081246J173184J256400J305528J299918J319950J330266J230719
3093G0561897J179314J042903J046152R55096J076791J033151J114072J170520
3085G9179896J464798J592564J680762J962777K095146K406967K633243K875556
3077I5891709L107709L380141L755956M117717M462405M919690N290879N793363
3069A30719569O315252P021390P714991Q435548R193710J0075510J1021493J1987347
$$ plain form
3128 41582457 42397843 43201011 44059769 44808292 45401129 45797938 46154156 46359968 46549462
3119 46549462 46769344 47136900 47497184 47953126 48522301 49189412 49868084 50599204 51444967
3110 51444967 52396357 53383618 54303895 55349954 56392831 57444474 58448210 59475778 60564686
3101 60564686 61645932 62819116 64075516 65381044 66680962 68000912 69331178 70561897
3093 70561897 71741211 72784114 73830266 74785362 75862153 76895304 78009376 79179896
3085 79179896 80644694 82237258 83918020 85880797 87975943 90382910 93016153 95891709
3077 95891709 98999418 102379559 106135515 110253232 114715637 119635327 124926206 130719569
3069 130719569 137034821 144056211 151771202 160206750 169400460 179475970 190497463 202484810
3061B02484810J3065393J4088304J5294359J6496946J7880873J9426070K0764241
3054C19500996K2050436K2609011K2615419K1782642K0181975J8128582J5378709
3047D62247770J2512419R752551P651840O441037N918714N529296M800514L322945
3039E18177086J258131j311417m266699p149827r572237j1454597j2396313j2702004
3031D60582123j2149729j1392745j0365608r087251p844080o727610n597329m612374
3023C92805397l811593l410583l374005l748403m470555n329079o594350p866690
3015C54200139q821340r437951r636787r457473r172147q866839q741216q760424
3007B81305962q878715r267315j0073501j0642399j1220563j1446321j1080245
$$ plain form
3061 202484810 215550203 229638507 244932866 261429812 279310685 298736755 319500996
3054 319500996 341551432 364160443 386775862 408558504 428740479 446869061 462247770
3047 462247770 474760189 484512740 492164580 498605617 504524331 510053627 514854141 518177086
3039 518177086 519435217 518123800 513857101 506707274 497135037 485680440 473284127 460582123
3031 460582123 448432394 437039649 426674041 417586790 409742710 403015100 397417771 392805397
3023 392805397 388993804 385583221 382209216 378460813 373990258 368661179 362066829 354200139
3015 354200139 345378799 335940848 326304061 316846588 307674441 298807602 290066386 281305962
3007 281305962 272427247 263159932 253086431 242444032 231223469 219777148 208696903
3000B08696903j0632713j0065163r288856q692137q168344p528288p109214o688813
2992A40523375o231459n967176n573147n205204m885797m491741m217577l972598
2984I9978676l758807l481367l339688l096099k900533k771492k644208k443564
2976G5542918k352283k252106k126851j968028j912063k036201j770121j575042
2968E9550223j736166j759102j550156j509926j390042j363249j410475j240523
2960D7590584j122852j196423j088946j039060j036811r93788r52079r18953q84983
2951C8356689q57630p92494p89062o96276p04649p61574o70749o22793o82316
2942C1779146o63181o09574n89520m96831n46651n87093m71365m76268n10955
$$ plain form
3000 208696903 198064190 187999027 178710171 170018034 161849690 154321402 147212188 140523375
2992 140523375 134291916 128324740 122751593 117546389 112660592 108168851 103951274 99978676
2984 99978676 96219869 92738502 89398814 86302715 83402182 80630690 77986482 75542918
2976 75542918 73190635 70938529 68811678 66843650 64931587 62895386 61125265 59550223
2968 59550223 57814057 56054955 54504799 52994873 51604831 50241582 48831107 47590584
2960 47590584 46467732 45271309 44182363 43143303 42106492 41112704 40160625 39241672 38356689
2951 38356689 37499059 36706565 35917503 35221227 34516578 33755004 33084255 32461462 31779146
2942 31779146 31115965 30506391 29916871 29420040 28873389 28286296 27814931 27338663 26827708
2933B6827708m04171m08382m50940m55105m20398m07195m51605m10081l79370
2924B3040461m10932l91361m41290l74854k64756l53779l10418k91044l41945
2915A9860082l60281l29554l34017k74086l36055l52870k75437k98889l30070
2906A6968823k42739k62935k54985k37692k56876k45236k47074j69919j31098
2897A4920269k10771k00077k40638k78154k07643k14243j93282j47126k28180
2888A3000155j64870j98096k36953j87203k21546k15579j57972r0690k07358j65912
2878A1153976j40160k03056j36267k36003j70077m9218j54475j29507r6589k08706
2868I629918k00991j10020j10661j86323j83348q0996j04826j33152o3868j72936
$$ plain form
2933 26827708 26423537 26015155 25564215 25109110 24688712 24281517 23829912 23419831 23040461
2924 23040461 22629529 22238168 21796878 21422024 21157268 20803489 20493071 20202027 19860082
2915 19860082 19499801 19170247 18836230 18562144 18226089 17873219 17597782 17298893 16968823
2906 16968823 16726084 16463149 16208164 15970472 15713596 15468360 15221286 15051367 14920269
2897 14920269 14709498 14509421 14268783 13990629 13782986 13568743 13375461 13228335 13000155
2888 13000155 12835285 12637189 12400236 12213033 11991487 11775908 11617936 11527246 11319888 11153976
2878 11153976 11013816 10810760 10674493 10438490 10268413 10219195 10064720 9935213 9838624 9629918
2868 9629918 9428927 9318907 9208246 9021923 8838575 8757579 8652753 8519601 8455733 8282797
2858H282797j48726p8011j81794o5940j31317q8650j20336q6182o4186p5964p1477
2847G170214j46336j53436r3725o2156m9870q1883j09586j09853p0598j34837
2837F157934j0232q163j4442q5335j25963j52299l2152m2904m6931r3057q962
2826E537494k8599o4732j49279p4348P408r6610n2943r6528o9088p5228p2035
2815D765512n9646k6620L6700k3739o9523j1901q5057k0428r0170l2163k768l009
2803D377188j00229N30j801k7978o406j6119n1864k7853j0651O5901k9418P148
2791D178448j2723N5454O933K0841J5622k0131M2798M0376J8248M7491J6281k746
2779D406892M6811P8568O6556N5248M6073R3330P0620L2231J22499J04286R1328
$$ plain form
2858 8282797 8134071 8056060 7874266 7808326 7677009 7588359 7468023 7381841 7317655 7241691 7170214
2847 7170214 7023878 6870442 6776717 6714561 6664691 6582808 6473222 6363369 6292771 6157934
2837 6157934 6147702 6139539 6125097 6039762 5913799 5761500 5729348 5686444 5639513 5546456 5537494
2826 5537494 5508895 5444163 5294884 5220536 5227944 5131334 5078391 4981863 4912775 4837547 4765512
2815 4765512 4705866 4679246 4715946 4692207 4622684 4610783 4525726 4505298 4415128 4382965 4380197 4377188
2803 4377188 4276959 4277489 4275688 4247710 4241304 4225185 4173321 4145468 4134817 4200718 4171300 4178448
2791 4178448 4165725 4221179 4228112 4248953 4264575 4244444 4287242 4327618 4345866 4393357 4409638 4406892
2779 4406892 4453703 4532271 4598827 4654075 4700148 4793478 4864098 4896329 5018828 5123114 5214442
2768E214442K1522O1524R3508O2369k5620R7122O2913J6287N304Q854N5602m4749
2756E629078o3964k7931m8259o0018n0603n9857j1562m3029j52628l9643L517
2745E075101r8420r8988l3948k6641n0752r5831n0769q8965j6916m8948o6257
2734D398666o3312j04258r5922J676j05105r9604k4418o4623j2117m8386j10897
2723C671700n7342j23412q0546r3607j04819n5991m4233r5559j16337m4558K628
2712B857924m0818q3619r5569R590l2465p0505o1959n3668m0802j7705l2743l4043
2700B303618q3769j31485J0681m0767q7922j2454m6022l2083L7110p6092L0096
2689A870911n9735n9001N4900m7105o0512L143j08147N6171m3349j2722J5739
$$ plain form
2768 5214442 5235964 5297488 5390996 5453365 5427745 5524867 5587780 5604067 5609371 5618225 5673827 5629078
2756 5629078 5565114 5537183 5488924 5428906 5378303 5318446 5306884 5263855 5111227 5071584 5075101
2745 5075101 4976681 4877693 4843745 4817104 4766352 4670521 4619752 4530787 4513871 4464923 4398666
2734 4398666 4335354 4231096 4135174 4136850 4031745 3932141 3907723 3843100 3830983 3782597 3671700
2723 3671700 3614358 3490946 3410400 3316793 3211974 3155983 3111750 3016191 2899854 2855296 2857924
2712 2857924 2817106 2733487 2637918 2647508 2615043 2544538 2482579 2428911 2388109 2370404 2337661 2303618
2700 2303618 2219849 2088364 2099045 2058278 1970356 1957902 1911880 1879797 1916907 1840815 1870911
2689 1870911 1811176 1752175 1807075 1759970 1699458 1702601 1594454 1650625 1607276 1594554 1610293
2678A610293q519J205m8476m6578N7507l6558k1125q6664J699J6685k6831N5730
2666A468368k4697l4378J4300j0368o8222K4202j8535k1066j0105k1206m0714
2655A257579R686m5431m8001N893n6183n847J458k4666L820l6511L4854J5015
2643A111666m9856L862L275k1301j7856j8059J5440l7872k56O0741r6476n5982
2631H97326L377J2676J9941r638k730m5152J4815l6289N876N566L4476L786j7486
2618H86544l5316J5068l8969l0663n024K0338J8340k1903J6432L1572o0694n0956
2606G44769J00030j04905k8263J08856J018o5867o1323K5769j085j3900K1708
2595G26807m4695J3728L7472o6525q4895O5628j6076n5443J0608k9949j0802P2166
$$ plain form
2678 1610293 1601774 1602979 1554503 1507925 1565432 1528874 1507749 1421085 1422784 1439469 1412638 1468368
2666 1468368 1443671 1409293 1423593 1413225 1345003 1369205 1350670 1329604 1319499 1298293 1257579
2655 1257579 1267265 1221834 1173833 1179726 1123543 1117696 1119154 1094488 1098308 1061797 1096651 1111666
2643 1111666 1061810 1065672 1068947 1047646 1029790 1011731 1027171 989299 989043 1049784 953308 897326
2631 897326 900703 913379 933320 923682 920952 875800 890615 854326 860202 865768 900244 904030 886544
2618 886544 851228 866296 827327 796664 791640 811978 830318 808415 824847 856419 795725 744769
2606 744769 844799 739894 711631 820487 821505 755638 694315 720084 718999 705099 726807
2595 726807 682112 695840 733312 666787 581892 647520 631444 576001 586609 556660 545858 618024
2583F18024j656j31832K8464P6842K73n9721J6066l404j5268M0712k4914q147
2571E35439N2712p819o1129K1700l6178k2393M6847J080M7073j0750j5160J5552
2559E66974n6605J7819J6026q3908L2480L0867k5625o8825J5140L5607J4560J545
2547D96055n5940K2304L2649m1615K887K4762J3735l3001l4883o2761L8936M976
2535D08104m0755Q5664N8146l5272l5336K2846l4342m215L5706J8565K6360m9060
2523D56411m7907L9151o709m2495M7157L5142r2186K783j090J9506l7669K856
2511C74950L7206K5605l7752m1970L6002k2644j9471m642O854L3645l6334J1240
2499C62689j088K7765j2951n3997j2565j7403K9741q0M0721o325j12560K1136
$$ plain form
2583 618024 616368 484536 513000 589842 590115 530394 546460 543056 527788 568500 543586 535439
2571 535439 588151 580332 519203 540903 504725 482332 529179 530259 577332 566582 551422 566974
2559 566974 510369 528188 544214 460306 492786 523653 498028 429203 444343 479950 494510 496055
2547 496055 440115 462419 495068 453453 456340 481102 494837 461836 426953 364192 403128 408104
2535 408104 367349 453013 511159 475887 440551 463397 429055 424840 460546 479111 505471 456411
2523 456411 408504 447655 440946 398451 445608 480750 388564 391347 390257 409763 372094 374950
2511 374950 412156 437761 400009 358039 394041 371397 351926 347284 354138 387783 351449 362689
2499 362689 361601 389366 376415 322418 309853 292450 322191 322111 362832 356507 243947 265083
2487B65083k9762j5779Q9197N4256l6774m3565n613k955O995j8321j9252j7087
2475B26423N1369j5933O8623l5082l0416n446l9548J4989l308K0503N946m2286
2463B15834L3022L5317J2952l7233j4398k7914k9651N0308QR7694o3189n3145
2451B19605k9576m0091L3194J5713o9011K596K1205P712j9707M642q318k8823
2439A09141O8122N3655o9463l6683J9102m4751j050L3748Q1264K700j3096p5553
2427A27136J9502L4980K6073l9445J7324N0421R337j0808l8820p1872L6469J2779
2415A73076k4578k7023N6981R2208j0308l151r7922J3046K0224q6060L3895L0800
2403A71188K3530L4213j3822K8315n9264O537L4120K8384k5067j12109k4813K9671
$$ plain form
2487 265083 235321 219542 308739 362995 326221 282656 277043 274088 281083 262762 243510 226423
2475 226423 277792 261859 330482 295400 264984 259538 219990 234979 231671 252174 258120 215834
2463 215834 248856 284173 297125 259892 245494 217580 187929 238237 238245 335939 272750 219605
2451 219605 190029 149938 183132 198845 129834 132430 153635 161347 141640 146282 137964 109141
2439 109141 177263 230918 161455 124772 143874 99123 98073 131821 213085 215785 202689 127136
2427 127136 146638 181618 207691 168246 185570 235991 245328 234520 195700 123828 160297 173076
2415 173076 148498 121475 178456 270664 260356 257205 159283 172329 192553 106493 140388 171188
2403 171188 194718 228931 215109 243424 184160 190697 224817 253201 228134 116025 91212 120883
2391A20883J6636l836J8514O8392m7334l5421J5898j1294J3837k2691J5965L0274
2379A79823J8330m0620m8324j1375O6917P040K8126M7584l0211O3979k0934k0346
2367B39989k1849L2688l1447p8779l3867L8437J8223J3924j7302m0899O0880J2382
2355A92380o1490r592J9124o683n278N0289j4850o8049Q090K5742p980r518L4571
2342A46756J5438j47987K2479N7159K5579L6023J483J1921J1800Q701l1817M7899
2330B05434j3662n2484m054P7207N1671m0388P69K7557k2126P3168J3975r8066
2318B19001l4716N0486J01383N7638N2369m32M4977P5731j5244P5183K1955K8555
2306F76886J29029Q0283J13729J95602K59945K45336K92962J95605J52078J62956
$$ plain form
2391 120883 137519 133683 152197 220589 173255 137834 153732 142438 156275 133584 149549 179823
2379 179823 198153 157533 109209 97834 164751 171791 199917 247501 217290 281269 260335 239989
2367 239989 218140 250828 219381 140602 106735 145172 163395 177319 160017 119118 179998 192380
2355 192380 130890 121298 140422 133739 128461 178750 163900 95851 103941 129683 121703 112185 146756
2342 146756 162194 14207 36686 93845 119424 155447 156930 168851 180651 189352 157535 205434
2330 205434 191772 139288 135234 212441 264112 223724 224493 252050 229924 303092 317067 219001
2318 219001 184285 234771 336154 393792 446161 445729 490706 566437 551193 626376 648331 676886
2306 676886 805915 886198 999927 1195529 1455474 1700810 1993772 2189377 2341455 2504411
2296B504411M739J5116j52013k63923k69135j79556j60524j34829j25020m5070
2286A194196j70449o0359q7880j03071j28279l6019K4294o5509n8178p2526n2913
2275C83307J812o5783o6180J9187m4229m1499j6381O5510l6529K022o0077J6029
2263A57189K5030m7381K0196J148l3620K571P7918m5577p1531J3001k6280o5394
2251G270o524J5034o178K6449m3441R0010r103R463L1999j4560m6089j22449R294
2238e8825O1270L3672k7386O1526m8635o9683N2633N6147k1308m5484j8529L0778
2226F176p704l3604K352J1347L8994o3126n0810P7454J30156o964j703k4474j02531
2213b4437j3670L100m8957m312L1601M056K9427J4245n034l3440j08844J5011
$$ plain form
2296 2504411 2509150 2524266 2372253 2108330 1839195 1659639 1499115 1364286 1239266 1194196
2286 1194196 1023747 963388 875508 772437 644158 608139 632433 566924 508746 436220 383307
2275 383307 385119 319336 253156 272343 228114 186615 170234 235744 199215 201237 141160 157189
2263 157189 182219 134838 155034 156182 122562 125133 203051 157474 85943 98944 72664 7270
2251 7270 746 15780 9602 36051 -7390 82620 73517 82980 114979 100419 54330 -68119 -58825
2238 -58825 2445 36117 8731 70257 21622 -48061 4572 60719 39411 -6073 -24602 6176
2226 6176 -1528 -35132 -32780 -21433 17561 -45565 -96375 -18921 111235 104271 102568 78094 -24437
2213 -24437 -38107 -35007 -83964 -88276 -56675 -52619 -23192 -8947 -13981 -47421 -156265 -141254
2201a41254N5912M1038J3082j418M0507J6473j9187k6082j4076K3051P188o3286
2189f8052o850P700J8232r623P461l2715L2156J5525k1095p2354L8019n159m1051
2176a37806M2391j721m1843k7260N4932K9990L0710r692K7971j4616L053l1932
2164g5823K8433j7409l1900J8600j8524n1929J28598l5804K7278K4923l6033k6444
2152f6034M0938J4676k6168K2169m6121n3267L7644K2115N3683n3097n2799L4341
2140g1920K6576j7253n7044L2664K0924l1774n0895N749J2851N0421M6604n5912
2128h9009M2785L9855o7708k9733Q656L8028k7136L1739K354q3023J3074L6728
2116h3390k2518L915P774O2411k0571l2560m87p069r7136K8488J5354r649L0601
$$ plain form
2201 -141254 -85342 -44304 -31222 -32640 7867 24340 5153 -20929 -35005 -11954 -4766 -68052
2189 -68052 -74902 -67202 -48970 -58593 -51132 -83847 -51691 -36166 -57261 -129615 -91596 -96755 -137806
2176 -137806 -95415 -97136 -138979 -166239 -111307 -81317 -50607 -60299 -32328 -46944 -43891 -75823
2164 -75823 -47390 -64799 -96699 -78099 -96623 -148552 -19954 -55758 -28480 -3557 -39590 -66034
2152 -66034 -25096 -10420 -36588 -14419 -60540 -113807 -76163 -54048 -365 -53462 -106261 -71920
2140 -71920 -45344 -62597 -119641 -86977 -66053 -97827 -148722 -142973 -130122 -79701 -33097 -89009
2128 -89009 -46224 -6369 -74077 -103810 -95154 -57126 -84262 -52523 -50169 -133192 -120118 -83390
2116 -83390 -105908 -101993 -94219 -31808 -52379 -84939 -85426 -92495 -189631 -161143 -145789 -155438 -124837
2103a24837j5727k8421j7868P204P5084O0990j4514o2079m025j6728P7408O6559
2091C046O826o5562P7194m5091m7810n9500L7144p0926J2832Q4040J197l9688
2079a06298o8047O8103P3028J0718o2552n3261m8803K2028L0859K1139Q2790N767
2067b4529n0064J4595k1673j8485J8776j6332L2663Q403o7103L259j3139K3625
2055a10004Q3191j7319q225N9829j25470q4530J5367N7463k8667l3768N2388J1522
2043a28223j7294k2221L0565J367l2473J2331l4669J5573N2407J7107k7606j6428
2031a49564M1302K0143m3321k1528J859J1694O1112M2690k8497o306k0621l4344
2019a25381o5357P248M7815L3577l0107L46p684m5J8553N320k4492N0136l5547
$$ plain form
2103 -124837 -140564 -168985 -186853 -179649 -104565 -43575 -58089 -120168 -124193 -140921 -63513 3046
2091 3046 9872 -55690 21504 -23587 -71397 -130897 -93753 -164679 -151847 -67807 -66610 -106298
2079 -106298 -174345 -106242 -33214 -22496 -85048 -138309 -187112 -165084 -134225 -113086 -30296 -24529
2067 -24529 -74593 -59998 -81671 -100156 -81380 -97712 -65049 -56646 -123749 -120490 -133629 -110004
2055 -110004 -26813 -44132 -52357 7472 -117998 -202528 -187161 -129698 -158365 -192133 -139745 -128223
2043 -128223 -145517 -167738 -137173 -135806 -168279 -155948 -190617 -175044 -122637 -105530 -133136 -149564
2031 -149564 -108262 -88119 -131440 -152968 -151109 -139415 -78303 -35613 -64110 -70416 -91037 -125381
2019 -125381 -190738 -183490 -135675 -102098 -132205 -131859 -139543 -139588 -121035 -115715 -140207 -90071 -125618
2006a25618R513n51k8499J8327K9110k354j0011O3232n7559p703L9437k2433K3587
1993g1522q43k1387o0287O1511K8266j2310l5259m0399M3479K9021l7198J5524
1981a01404N5855j00939O469Q4861K836m6280m1813R1262j6591r853P352K584
1969f5661J4483K1568l3134m5189j2618o0027L5195Q3045M168m960n4138j8632
1957a35900n52k560O401J2276p993k4528L2555l2775K8989L6603N210K1771m982
1944f5485J1535l7300q3215m328N0318K9360k9106j1237R091N5989J442n1089
1932a24025o1263K477J06182L7794l0366K1721l2917l0346j1519J0534k103K6762
1920h7069j7950L27m8024k6512Q37j0300J0765J2706r373L9409O411n5113j6395
$$ plain form
2006 -125618 -116105 -116656 -145155 -126828 -97718 -100072 -110083 -46851 -104410 -112113 -72676 -95109 -71522
1993 -71522 -72365 -93752 -154039 -92528 -64262 -76572 -111831 -152230 -108751 -79730 -116928 -101404
1981 -101404 -45549 -146488 -140019 -55158 -52322 -98602 -140415 -49153 -65744 -75597 -68245 -65661
1969 -65661 -51178 -29610 -62744 -107933 -120551 -180578 -145383 -62338 -58170 -63130 -117268 -135900
1957 -135900 -136452 -139012 -132611 -120335 -128328 -152856 -120301 -153076 -124087 -87484 -82274 -60503 -65485
1944 -65485 -53950 -91250 -174465 -178793 -128475 -99115 -128221 -139458 -130367 -74378 -72936 -124025
1932 -124025 -185288 -182811 -76629 -38835 -69201 -47480 -80397 -110743 -122262 -111728 -113831 -87069
1920 -87069 -105019 -104692 -152716 -179228 -178391 -188691 -177926 -165220 -174593 -135184 -128773 -183886 -200281
1907b00281O4773m518j5533n1449R7524N1613n2222q817M3202j3976j2235J587
1895a00332o6196M350P1182l0238n1065j8075L3850M6380m229O4204m8131r0397
1883a88697M4083O76L4813o860m8480M8933K5528Q637m4073l5294M2709M1426
1871g6599l4506n6118m301K312N0709P7953k4692m501j1102J076k4125M5042j2413
1858g1265n001K2391K86m3152L6862M543j4215l8780l0228K1714j1849k9277R315
1845a48656L0462R5489l9745r2351N4091j1250J9158K2433j3442M268Q43j4876
1833i3576J6669j7653k6493J6897Q4170L6647q4026m5811L9619O635M633L3787
1821b8502q5483p4260O2305J1862m1011L3543Q243K80L2212o6525R238R0369J8028
$$ plain form
1907 -200281 -135508 -140026 -155559 -207008 -109484 -57871 -110093 -118910 -75708 -89684 -101919 -100332
1895 -100332 -166528 -162178 -90996 -121234 -172299 -190374 -156524 -110144 -114373 -50169 -98300 -188697
1883 -188697 -144614 -143938 -109125 -115985 -164465 -115532 -90004 -81367 -125440 -160734 -118025 -76599
1871 -76599 -111105 -167223 -171524 -169212 -118503 -40550 -65242 -69743 -80845 -79769 -103894 -58852 -71265
1858 -71265 -76266 -53875 -53589 -96741 -59879 -55336 -69551 -108331 -138559 -116845 -128694 -157971 -148656
1845 -148656 -118194 -22705 -62450 -154801 -100710 -111960 -92802 -70369 -83811 -79543 -78700 -93576
1833 -93576 -76907 -94560 -121053 -104156 -19986 16661 -67365 -113176 -73557 -66922 -62289 -28502
1821 -28502 -113985 -188245 -125940 -114078 -155089 -121546 -113303 -113023 -80811 -147336 -138098 -47729 -29701
1808b9701n363n5633m2316r734q435M914j3547J4201N730q22O1493Q4254k992
1795B049l2268k6411m4496q0588k8823L284O1528O3018L2347J165j1313K485p5933
1782a33956K5210m902q743j6346J4979K4953K4661m2242l1315j7637m0710J876
1770b04172K2154Q5318L1643o2373M3863J2927l1012K036J8662j9952k0677R915
1758a11668k3072J8120n1360o4479M3475R1929n761o4627M3563J8408J2875n6491
1746a49088m9318j1971M1054N6726k2228k4795k345O1789n5326K9867K5451o677
1734a06861J4730L3799k7485j5447J7097O4112J9274l2135l673j6537J6289k9141
1722f5978J5644K0888p2814l6320M079J1935r885N1884j7415l5887J1608R895
$$ plain form
1808 -29701 -35064 -90697 -133013 -142747 -151182 -146268 -159815 -145614 -139884 -140706 -79213 5041 2049
1795 2049 -30219 -56630 -101126 -181714 -210537 -207253 -145725 -82707 -50360 -49195 -60508 -58023 -133956
1782 -133956 -108746 -113648 -122391 -138737 -123758 -98805 -74144 -116386 -147701 -165338 -206048 -204172
1770 -204172 -182018 -96700 -65057 -127430 -83567 -70640 -101652 -99616 -80954 -100906 -121583 -111668
1758 -111668 -134740 -116620 -167980 -232459 -188984 -97055 -102816 -167443 -123880 -105472 -92597 -149088
1746 -149088 -198406 -210377 -169323 -112597 -134825 -159620 -161965 -100176 -155502 -125635 -100184 -106861
1734 -106861 -92131 -58332 -85817 -101264 -84167 -20055 -781 -32916 -36589 -53126 -36837 -65978
1722 -65978 -50334 -29446 -102260 -138580 -134501 -122566 -132451 -80567 -97982 -133869 -122261 -112366
1710a12366J2933m0287m191R010J7670K7725M2408L6240l1521j8723r741J5031
1698e5812k418o0803J3059l891M4201L5208K5531m1656J0375k7483k9420L7810
1686e5299j970l4936o3194J6539J0257m0836M4966l1222k8135l5993O296M8262
1674a65265r018J5598R454R812j1428K3055M465k6563j7272J23047l4426q5715
1662a64256K3065L04M2955m1601O0024j0097p9649J07P754M0235m218j7410O210
1649a36577J1587k1691K8804m823m0440p182P121k9333r0450m311J15260K4155
1637a47880K4136P533K7685n1205k4656J9317K6206l1431l2180Q7988j1401o4768
1625a70656N1683M6304k0487j1363P3828m7588r307J9347j2559j9420J3545K9657
$$ plain form
1710 -112366 -99433 -139720 -143911 -134901 -117231 -89506 -47098 -10858 -42379 -61102 -70843 -55812
1698 -55812 -58230 -119033 -105974 -109865 -65664 -30456 -4925 -46581 -36206 -63689 -93109 -55299
1686 -55299 -57269 -92205 -155399 -138860 -128603 -169439 -124473 -155695 -183830 -219823 -213527 -165265
1674 -165265 -174283 -158685 -149231 -139419 -150847 -127792 -123327 -149890 -167162 -44115 -78541 -164256
1662 -164256 -141191 -140887 -97932 -139533 -79509 -89606 -169255 -169148 -161394 -121159 -125377 -142787 -136577
1649 -136577 -124990 -146681 -117877 -122700 -163140 -170322 -163201 -192534 -282984 -287295 -172035 -147880
1637 -147880 -123744 -116211 -88526 -139731 -164387 -145070 -118864 -150295 -182475 -94487 -105888 -170656
1625 -170656 -118973 -72669 -93156 -104519 -30691 -78279 -87586 -68239 -80798 -100218 -86673 -57016
1613e7016l092j2758J6260m84J7939M0839q3622k2999M476l7852J0739J3617J765
1600a12188M827J532k6386P0519K5290j3201k005K0712j6664L3107j0538k3734
1588d8729K472m381j0185q8280M2622K548M6509K4194m1285j532L5993k6724k7555
1575i4333L8374J1148l4672K2117q3080j0888J4604L6638k5619n94O1816k0776
1563h5265K4374M2972l6014o98k0428r738m0556N5096J9454j328p707m6711k454
1550a09003N963L0160k3511R304R866m7409n0004k2985O4044j1295K9733l4068
1538a49205O8307P935k1520p0825l5576N3679O0820K3631n564K0372l0701K648
1526g5999p9451J3868P5673P6342n2611o8019j699N0432m7697j680J6362K6417
$$ plain form
1613 -57016 -60108 -72866 -56606 -57090 -39151 1688 -81934 -104933 -100457 -138309 -127570 -113953 -112188
1600 -112188 -107361 -105829 -132215 -61696 -36406 -49607 -51612 -30900 -47564 -14457 -24995 -48729
1588 -48729 -46257 -50638 -60823 -149103 -106481 -103933 -57424 -33230 -74515 -76047 -40054 -66778 -94333
1575 -94333 -55959 -44811 -79483 -57366 -140446 -151334 -136730 -100092 -125711 -126305 -64489 -85265
1563 -85265 -60891 -17919 -53933 -54631 -75059 -84797 -125353 -70257 -50803 -52131 -59838 -106549 -109003
1550 -109003 -103040 -72880 -96391 -87087 -77221 -124630 -174634 -197619 -133575 -144870 -115137 -149205
1538 -149205 -80898 -72963 -94483 -165308 -200884 -147205 -86385 -62754 -68318 -47946 -78647 -75999
1526 -75999 -155450 -141582 -65909 10433 -42178 -110197 -111896 -61464 -109161 -110841 -94479 -68062
1514f8062K8898q8082J9011N2741j01608L6474Q8579r531N7184l3403n8379L0190
1502d5988n8061K3157O7840k795m6755J2577j2038o0116j48l968J7209J0393J8289
1489h0404M0601J0412k1722k2609N4657o2310K0647N5888q4090q4268K0313Q8885
1477f4000K9532o1190k7407k7156k5217M8047O7329M8210M479p7641k4999r748
1465a19761J8138J1760R468j6442j9149Q7629j0168q3784j0828K4156m7834Q6516
1453g0299L4977L1131J994n8438o3244K5173O6313n5329L1963m9209L9850R9505
1441C4387p6687l4287J0013J3389o1163L1462J800k8601O2582K7489l8161j4781
1429g2558l5498r456J6665L6002k2290j8987J5915J7949j203n6163L0174j0077
$$ plain form
1514 -68062 -39164 -127246 -108235 -55494 -157102 -120628 -32049 -41580 15604 -17799 -76178 -45988
1502 -45988 -104049 -80892 -13052 -15847 -62602 -50025 -62063 -122179 -122327 -126295 -109086 -98693 -80404
1489 -80404 -39803 -29391 -51113 -73722 -19065 -81375 -60728 -4840 -88930 -173198 -152885 -64000
1477 -64000 -34468 -95658 -123065 -150221 -175438 -127391 -60062 -11852 -7373 -85014 -110013 -119761
1465 -119761 -101623 -89863 -80395 -96837 -115986 -28357 -38525 -122309 -133137 -108981 -156815 -70299
1453 -70299 -35322 -4191 -2197 -60635 -123879 -98706 -32393 -87722 -55759 -104968 -65118 34387
1441 34387 -42300 -76587 -66574 -53185 -114348 -82886 -81086 -109687 -47105 -19616 -57777 -72558
1429 -72558 -108056 -117512 -100847 -64845 -87135 -106122 -90207 -72258 -73461 -129624 -99450 -109527
1417a09527N6663m155m3484o4038R283N187L0911N2117K8367j2808J1216m4962
1405h5230o952N2933m1856j30M5831k6812N9152l3747p2057L1764O580q6033L0032
1392a26525Q5021M077l6373L3469k6685k6819J5363m3899K4806k352O656K3705
1380f9556j9456l3732M1978o467n029N534J8977n2076J7169Q6579N3790J371k2627
1367A6455K9148j7501J2830m8302m1207o867q87O6348k6783m4396j7138O1277
1355a7023K0965K6625N8846n2041m1986L5806m6418j7403j47k736l419M7721l4577
1342b5787K3489O5805n5682l1875m4651m7626L2106L1229K4602m1675L2293O0928
1330B3156O3610k7939j5933q5871p536o1354k1000J43094N7845n5411l8613k9823
$$ plain form
1417 -109527 -52864 -57019 -100503 -164541 -155258 -150071 -119160 -67043 -38676 -51484 -40268 -85230
1405 -85230 -92182 -39249 -81105 -81235 -35404 -62216 -3064 -36811 -108868 -77104 -70524 -156557 -126525
1392 -126525 -41504 -37427 -73800 -40331 -67016 -93835 -78472 -122371 -97565 -99917 -93261 -69556
1380 -69556 -89012 -122744 -80766 -87233 -92262 -86728 -67751 -119827 -102658 -16079 37711 39082 16455
1367 16455 45603 28102 40932 -7370 -48577 -55444 -56331 10017 -16766 -61162 -78300 -17023
1355 -17023 3942 30567 89413 37372 -4614 31192 -15226 -32629 -32776 -35512 -38931 8790 -25787
1342 -25787 -2298 63507 7825 -24050 -68701 -116327 -84221 -52992 -28390 -70065 -37772 23156
1330 23156 86766 58827 42894 -42977 -50513 -111867 -132867 10227 68072 12661 -25952 -55775
1318e5775l755O1594N9161q2792p518m155k1161k7588k836K1014k0498L8064O3481
1305A7236K537p7782O4097m0609K4527m0393l9102M6570m4282j5866L0624l0834
1293a03277L0824K4643L3536J271n8224M3784M5729m6251m4946M438K2082j1476
1281e7867j00039J7286R5574l6672K303k9236J422M4039k1397k2834Q6619q107
1269b8909K0205k7219Q328n257K4982j8660n0890k3509Q2010m4459l9232J3473
1257h9137L9911M3991M869k2286K8752J383m6097j4627L0235O243q5669O7062
1245c5370J5997m5467l7737K9330k0019o32j2926N9494O4666R69o0996n1503k1386
1232a15580K3357j401J2483l6903K4409P8252J1661m337l1986M1245J8833j07776
$$ plain form
1318 -55775 -59530 2064 61225 -21567 -29085 -33240 -54401 -81989 -84825 -63811 -84309 -46245 17236
1305 17236 19773 -58009 6088 -34521 -9994 -50387 -89489 -42919 -87201 -103067 -72443 -103277
1293 -103277 -72453 -47810 -14274 -13003 -71227 -27443 18286 -27965 -72911 -68473 -46391 -57867
1281 -57867 -157906 -140620 -45046 -81718 -79415 -108651 -107229 -63190 -84587 -107421 -20802 -28909
1269 -28909 -8704 -35923 -27595 -32852 -7870 -26530 -77420 -100929 -18919 -63378 -102610 -89137
1257 -89137 -49226 -5235 -366 -22652 6100 7483 -38614 -53241 -23006 -16763 -102432 -35370
1245 -35370 -19373 -64840 -102577 -73247 -93266 -93898 -106824 -47330 17336 18305 -42691 -94194 -115580
1232 -115580 -92223 -93624 -81141 -118044 -93635 -15383 -3722 -8059 -40045 1200 20033 -87743
1220h7743j0065K4991l8363M3498Q8557l483m3307K2346j7689m8202l127l152
1208g5739L4891j311j7179l0449L3126O0324Q887l8601k3449r639J5768N040j6194
1195e4525J5572P937Q130m4224N1116P785n0559l0497L0377J9003M2875n240o335
1182h585j5951k0419K1951j6343p2292N1076O3807l5910l1305j2587k3026O7740
1170c1844O0574n4449n8748l353N0465n3507J1362J5309j60l8302K2718q664K9665
1157e8934M9329j81l4103l8027L4N3845O8594j101o2102m1715r988R0400L8847
1144E4898J5414o2050k9805M126p6918N6564L0202O606l0633K7914J4953n2588
1132d1317o2257K0048L0879K1176J9975K4270R517J3192j436P986j5620k4125
$$ plain form
1220 -87743 -97808 -72817 -111180 -67682 20875 17392 -25915 -3569 -21258 -69460 -72587 -75739
1208 -75739 -40848 -42159 -59338 -89787 -56661 3663 12550 -26051 -49500 -59139 -43371 -38331 -54525
1195 -54525 -38953 -31016 -22886 -67110 -15994 -8209 -58768 -89265 -58888 -39885 2990 -2250 -8585
1182 -8585 -24536 -44955 -23004 -39347 -111639 -60563 3244 -32666 -63971 -76558 -99584 -31844
1170 -31844 28730 -25719 -84467 -87820 -37355 -90862 -79500 -64191 -64351 -102653 -79935 -88599 -58934
1157 -58934 -9605 -9786 -43889 -81916 -81882 -28037 40557 39456 -22646 -64361 -74349 16051 54898
1144 54898 70312 8262 -21543 -17417 -94335 -37771 -7569 -963 -31596 -3682 11271 -41317
1132 -41317 -103574 -83526 -52647 -31471 -11496 12774 22291 35483 34047 42033 26413 2288
1120B288m0585j2917M0636J5753l6555l552j9405L5531K644l2680j0339L5587
1108b3594J2342L5738K8870m7570k8545p2660K5176P4609N733l2890k6271k8987
1096g8049M0320k2460l833O5371M23J327q670k117M7757m7937J4389j3549J9358
1083A2330j6610M0626o4117j4859M1926n489Q0603j9870n9247k37j3906j1137
1071b9987l4642m4084L6222Q4349Q087m7357N5957p205P2466k0996n5644r506
1059G660M843n1899O0477R784n7976M5812J119k4636m2822Q964K878K8581M1641
1046C4426m107p3524n7692J8085M6298n8290N2693l3353M352L1602m2327K1283
1034f0554M0034L1410j1712M4552l4682j6486L8839K2156j1413m1317j67N7093
$$ plain form
1120 2288 -38297 -51214 -10578 5175 -31380 -34932 -54337 -18806 -16162 -48842 -59181 -23594
1108 -23594 -11252 24486 53356 5786 -22759 -95419 -70243 4366 10099 -22791 -49062 -78049
1096 -78049 -37729 -60189 -64022 1349 1772 3099 -5571 -7688 40069 -7868 6521 -7028 12330
1083 12330 -4280 36346 -27771 -42630 -704 -6193 74410 54540 -4707 -4944 -18850 -29987
1071 -29987 -64629 -108713 -72491 11858 19945 -27412 28545 21340 93806 72810 17166 7660
1059 7660 12503 -39396 21081 30865 -27111 18701 19820 -4816 -47638 -38674 -35796 -7215 34426
1046 34426 30319 -43205 -100897 -82812 -36514 -94804 -42111 -75464 -71112 -39510 -81837 -60554
1034 -60554 -20520 10890 -822 43730 9048 -7438 31401 53557 42144 827 660 57753
1022E7753m3682o5840L6831j8619N3568k5336n734j5698K1035O8216j7569M9755
1010I4680l1551q0270L2315P0141O141q343j38910L6800J4892j1486P8564m373
998E8600o7365K9240J4787j9803P752k0816L075l3406j6773J3414Q882N5604N5757
985H8948n1652L2125J0197n5893J9896o2985k1172k7103K3482L1644L7735l0275
973e053m1070M1403O0079r163p9466J5731N179J7691L6670K3994k7568j5290M4931
960F8068o401m1115o089P465n3423K8375N5640R495j4518m7598M3422l7869p6708
947g1256J5284J1426J8069p3853k1589M1680M0497K7102M6966J8556J4251L0065
935I7198m5362j36775P856N7523k1106j4883M760L2603m4411N1511L7973j6647
$$ plain form
1022 57753 14071 -51769 -14938 -33557 20011 -5325 -11059 -26757 -5722 62494 44925 94680
1010 94680 63129 -17141 15174 85315 91456 83113 -55797 -18997 -4105 -15591 62973 58600
998 58600 -8765 20475 35262 15459 23211 2395 5470 -27936 -44709 -31295 -22413 33191 88948
985 88948 37296 69421 79618 23725 43621 -19364 -40536 -67639 -44157 -12513 25222 -5053
973 -5053 -46123 -4720 55359 46196 -33270 -17539 -12360 5331 42001 65995 38427 23137 68068
960 68068 61667 20552 14463 21928 -31495 -3120 52520 62015 47497 -101 43321 5452 -71256
947 -71256 -55972 -44546 -26477 -100330 -121919 -80239 -39742 -12640 34326 52882 67133 97198
935 97198 51836 -84939 -77083 -19560 -40666 -55549 -50789 -18186 -62597 -11086 26887 10240
923A0240n4451l4375O8157M57m1173J38260M1002k5162j30255k2651L9521L8842
911B8412K284k7135k3261j6934J1213J1183N0530j694N34K8787m7346n9635M0957
898b105j8065Q9250Q259k8694n871n2868K1422L9310M8518l7554n2817l1312K4587
885B060K4412r421j13j6728N8885n6012n9359K6562J9060L6881P270j9781o4883
872e1167O8229M0300l2060K742M0451J1353K1115m3665m9692m2088N070J46386
860A16974j4194k0119l9389l5813o3132m4251J40451K1108n8919n6472O972J07385
848F0601L1766k6020M3278n6135K6909l8766o86k2101q0986m684M8856M2282l068
835B1246K6765O8706k028o5947N9952n7571j8620j5376M563J7727n218J1017j649
$$ plain form
923 10240 -44211 -78586 -10429 -9972 -51145 87115 128117 102955 -27300 -49951 -10430 28412
911 28412 30696 3561 -19700 -36634 -25421 -14238 36292 34598 35132 63919 16573 -43062 -2105
898 -2105 -20170 69080 77339 48645 42774 -10094 11328 50638 99156 61602 8785 -22527 2060
885 2060 26472 17051 16938 210 59095 3083 -56276 -29714 -10654 26227 33497 13716 -51167
872 -51167 17062 57362 25302 28044 68495 79848 100963 57298 7606 -34482 -29412 116974
860 116974 102780 82661 43272 7459 -55673 -99924 40527 61635 2716 -53756 -46784 60601
848 60601 92367 66347 109625 53490 80399 41633 40947 18846 -62140 -66824 -17968 24314 21246
835 21246 48011 116717 114689 48742 108694 51123 32503 17127 21690 39417 34199 45216 43567
822D3567J2955J0703J092j755M8029J3323k7103m9711r302L6425J8876p9732l0930
809a3563M1041j324M211J6435J4869l8529N8326J1137k5836l9672P5603Q388m5144
796F5942l2755J102n1732L0019K445m3120l72O7286P2986k5326j5551M4059j6111
783I8872l0984O521L0354j4895n5061J5123l8629J4189n633K6682N8235l2506
771G2268o2141M7262m543J3139M6901j2909p4968J9290J5636j09871M5351N8481
759E3896p820j5305N1467J3463l094K8707m000l7210l1J273n4719p827P160L5246
745F1206l0607M8157m1746N8889N9613m1104L99P314j1137m3419J9784J4321n2691
732D8979j553L491J493k2198J7311K8115N918K3513j2259n639m8494K1463N9358
$$ plain form
822 43567 56522 67225 68317 66562 114591 127914 100811 51100 41798 78223 97099 17367 -13563
809 -13563 27478 26154 30365 46800 61669 23140 81466 92603 66767 27095 102698 111086 65942
796 65942 33187 34289 -17443 12576 15021 -28099 -28471 38815 111801 86475 70924 114983 98872
783 98872 67888 74409 104763 89868 34807 49930 11301 25490 19857 46539 104774 72268
771 72268 10127 57389 52846 65985 112886 99977 25009 44299 59935 -49936 -4585 53896
759 53896 46076 30771 82238 95701 92607 121314 117314 80104 80073 81346 26627 18800 25960 61206
745 61206 30599 78756 37010 95899 155512 114408 114807 122121 110984 67565 87349 101670 48979
732 48979 47426 50917 52410 30212 47523 75638 81556 105069 92810 87171 38677 60140 119498
719A19498o810J8607m9687J8780M6669k0446L9075o5642P936M7177R15o6259m984
706H4829J8323O0369N507K1054j2959j0261p715j13414L3274m0946m192P3648
694A07517M69J0723q0379L5233j8628J7062k0863l1721O6611K3554m6141k5723
682C7714M8014P1060k0942l3312k1653M925K7304J2128Q81p0724M5016q1683J0858
669B9586M2512k2662j3618O159k7970j0367L1869O285l1395O874O8300L2581l6129
656H2025n356M914k5324j353L7939q193M3408k078l8040l9377K2649r861j4912
643D6441K4691K4976j9436j3929J2061K822m4537j643j3213N2904M8094q2069
631C7162J69L6737l0678o483M9980m8192k374N7125N0898M7422q0372r2093O5574
$$ plain form
719 119498 112688 131295 81608 100388 147057 126611 165686 100044 107980 155157 156072 89813 84829
706 84829 103152 163521 169028 190082 177123 166862 159147 45733 79007 38061 33869 107517
694 107517 107986 118709 38330 73563 54935 71997 51134 19413 86024 109578 63437 37714
682 37714 85728 156788 135846 102534 80881 85806 113110 125238 126119 55395 100411 18728 29586
669 29586 72098 49436 35818 41977 14007 3640 35509 41794 10399 17273 85573 118154 82025
656 82025 76669 81583 56259 54906 92845 84652 128060 125982 87942 48565 71214 61353 46441
643 46441 71132 96108 76672 62743 74804 77626 33089 31446 18233 71137 119231 37162
631 37162 37331 74068 43390 36907 86887 38695 36321 93446 144344 191766 111394 19301 84875
618H4875L2851m3184j6255n256K0359j3768L656N4195o7323J3541Q82J0367k2423
605E2517J6044M8618m3086p063N3755N8168j8417j09924J76J6885p166J825j0975
592E1357J571Q801L157l941n837J1335o4568k440P4854J01499p180n2960k9230
579H6418j0808L3468l9000p570l5941l7980P0351N2621m3444k8739k3113O3440
567G9703M4339l2903j3177J1669L5977m7129k5461O7610R357L2310j3729p7024
555G1542m6130j3356J1487N3378q558J7703p232m4788M8373N0882M415j4590K335
542A25461L8666k1906n0600k6031K4335L5418o1265P6670M0505k5180k2307m6000
530H7766k5134P394L0113k3286L2472M0285j223q995m611j4765o4579K3674j5932
$$ plain form
618 84875 117726 74542 58287 53031 73390 59622 63278 117473 50150 63691 64573 74940 52517
605 52517 68561 117179 74093 67030 120785 178953 160536 50612 50788 67673 60507 62332 51357
592 51357 52928 61729 64886 60945 55108 66443 1875 -565 74289 175788 168608 115648 86418
579 86418 75610 109078 70078 62508 26567 -11413 58938 111559 68115 39376 16263 79703
567 79703 124042 91139 77962 89631 125608 78479 53018 120628 129985 162295 148566 71542
555 71542 25412 12056 23543 76921 68363 86066 78834 34046 82419 133301 137716 123126 125461
542 125461 164127 142221 91621 65590 89925 125343 64078 140748 181253 156073 133766 87766
530 87766 62632 70026 100139 76853 109325 149610 148387 139392 134781 120016 55437 79111 63179
517F3179K3874m0143O4744M5882p0184J21216l8579o3114j0210j6700j6456J4087
505G7596M0994M0061m2463J1509L2863j6925l5574R5704J0474j32110o532J5134
493I0731p297l9788L0694l5001n879O7980m8126k3336K1299R493K815k6223O3415
480A00777n1458r693J9514L4480j3892L2845O6003l6015l5009J7323Q0829k0360
468A85344r1503j0468L994p074J609J0109M9892k4765m763K7008K9333m2901j7471
455A08344L0534K5076k9387K7983l0357l962L7946L0061m8905J3234M874j6318
443A49123L0861L2983o1947k8571J4057j2569J209K8604J3406n0896m7648J196
431F9808J9613J8274K6579n50O958q051j3160K9857J03130o1096o1515r817P0012
$$ plain form
517 63179 87053 46910 111654 157536 87352 208568 169989 106875 96665 79965 63509 77596
505 77596 118590 158651 116188 127697 160560 143635 108061 203765 214239 82129 75597 90731
493 90731 83434 43646 74340 39339 33460 101440 53314 29978 51277 60770 63585 37362 100777
480 100777 49319 39626 59140 93620 79728 112573 178576 142561 107552 124875 205704 185344
468 185344 93841 83373 87367 80293 81902 92011 141903 117138 112375 139383 168716 125815 108344
455 108344 138878 163954 134567 162550 132193 128231 166177 196238 147333 160567 165441 149123
443 149123 179984 212967 151020 122449 136506 123937 125146 153750 167156 116260 68612 69808
431 69808 89421 107695 134274 133724 140682 132631 119471 149328 252458 191362 129847 120030 190042
418A90042j07953o8625O310L7870L0372j7023N6648L7841l0596L195O201j127
406A43155j576j1346L8543k3917j2215N5849k9653J8391j452k09k3973j6754K0182
393A55025l2100P78O7274l2377p0521Q5784M3204l2916m8146L4656l3945M1478
381A78194l6165j0042O7744K64k4283k6764L3184l3735o3031l6076N1293L3813
369A34396p7043M168l287J0388N9177j964k8479P7718k0J5226l0742n0201L1712
356A41049N2671j0509L4502r10n8133l6668K9696P0075J9778n1621K9304k9965
344A89269j3160L1126M590k2376q387K3499q9937Q0513J2310M055m6953m2982
332A21567L5151R759l5033J605J6522L3174K0942R701J3563j7223l8023L6903
$$ plain form
418 190042 82089 13464 19774 57644 88016 70993 127641 165482 134886 138081 144282 143155
406 143155 141579 130233 168776 144859 132644 188493 158840 177231 175779 175570 151597 134843 155025
393 155025 122925 123703 190977 158600 88079 173863 217067 184151 136005 170661 136716 178194
381 178194 142029 131987 199731 199995 175712 148948 182132 148397 85366 49290 100583 134396
369 134396 57353 61521 58234 68622 127799 125835 97356 175074 175054 190280 159538 109337 141049
356 141049 193720 183211 217713 216803 158670 122002 151698 221773 241551 189930 219234 189269
344 189269 176109 207235 211825 189449 181062 204561 114624 195137 207447 211502 164549 121567
332 121567 156718 166477 131444 133049 149571 182745 203687 213388 226951 209728 171705 208608
320B08608m0023l0268l2564j0659O4960m440k8117m1781P546l3208N4546R4188
308B08788p5768k5296N6194j4697j2228Q966L6600J9796m720Q757k235k3495p372
295A73290p411n2414M8778k2082J5060L2402j7547o639J5786L5117q7642M0192
283A66890J3786o7250J3341K8243j5632K7M3273R523j2174J0824L0846k0665j1742
270A89290M289r177n5999l4257K6431N6489l6248n373k3469j0566M0218M605r156
257A37077O9074J4578J0921J039N908o1962o4806k9988N5314Q9563n046M457r1673
244A34456O4500m0161j7021m2232L7586O7551j2612M6796o1904n747j0361L7636
232A98487M0594o3397N6099j4401o9265L8791k7210n975P707j875L9369j9779
$$ plain form
320 208608 168585 138317 105753 95094 160054 155614 127497 85716 93262 60054 114600 208788
308 208788 133020 107724 163918 149221 136993 145959 182559 202355 197635 206392 204157 180662 173290
295 173290 165879 113465 162243 140161 155221 187623 170076 163437 179223 214340 126698 166890
283 166890 180676 113426 126767 155010 139378 139405 182678 192201 180027 190851 221697 201032 189290
270 189290 193579 184402 128403 94146 120577 177066 140818 135445 111976 101410 141628 146233 137077
257 137077 206151 220729 231650 232689 238597 176635 111829 81841 137155 226718 221672 226129 134456
244 134456 198956 158795 141774 99542 137128 204679 192067 238863 176959 171212 160851 198487
232 198487 239081 175684 231783 217382 148117 186908 159698 153723 161430 159555 198924 179145
220A79145m1913k1030K9832r196k4230R5283j9033o5734M7573l0434j2811L7605
208A65057j7860O1272J8623l2419k5536m837Q3704l4359o3320K6954m0633P038
196A43684L8528j5835J0616l222k870k1163j9686l868N0786k3317R4637M709q0554
183A72445K4669J9670J4790K3205m3885K6744j1221j3809L6037n7058k4192l0810
171A36585J1607N3324L6393j5368n2019K2306k6171L0342k2191k1121l2158O707
159A28236M5162k7190L7265m72K3276j470n2078n0739M530J864L9462J6933K8820
146A93599K2344R878k9359j049J5940m242o7014J5727K3170m2038j0333J7992
134A44615L7394O2901O5274m3202q0003K5200k8024j4333K9286M936L6854n2040
$$ plain form
220 179145 137232 116202 146034 136838 112608 207891 188858 123124 170697 140263 127452 165057
208 165057 147197 208469 227092 194673 169137 164300 248004 213645 150325 177279 136646 143684
196 143684 182212 166377 176993 173771 170901 149738 130052 126184 176970 153653 248290 252999 172445
183 172445 197114 216784 231574 254779 210894 237638 226417 212608 248645 191587 167395 136585
171 136585 148192 201516 237909 222541 170522 192828 166657 196999 174808 153687 121529 128236
159 128236 173398 146208 183473 183001 206277 204807 152729 101990 106520 108384 147846 164779 193599
146 193599 215943 225821 196462 195413 211353 207111 140097 155824 178994 136956 126623 144615
134 144615 182009 244910 310184 266982 186979 212179 184155 169822 199108 204044 240898 188858
122A88858L304M7150j6336l5380j6805p87m3539r761P8938M5346K0396n8322K8203
109B31265R862l0688k8458l3593L1328O5388R302n8381m232j5746j4128M0770
97B02689M5135m6175j8554j3218j8313J6168O0290J5452j5516j1025o525k8368
85A82040j0439m5049j373O3256M551q53J0112K7172j1516O063j082m5523l0740
72A46619J2996M0374k1091j2877l3701j3559L6876j287M3859L6952l0006L796
60B08951m6846k5150l3466Q990M1842M4419k2660O135M004K6270j6777J4362L3649
47B43723j7772p451o23p872j3585L3113m2778J5695M387n1349j7232O9283M3931
34B51470Q70k8330l1471l6840J3647M3469O970K4773L2918m6609n3506K3022K7670
$$ plain form
122 188858 192162 239312 222976 187596 170791 170004 126465 116704 195642 240988 261384 203062 231265
109 231265 241127 210439 181981 148388 179716 245104 254406 196025 191793 176047 161919 202689
97 202689 247824 201649 183095 169877 151564 167732 228022 243474 227958 216933 210408 182040
85 182040 171601 126552 125179 188435 192986 192133 202245 229417 217901 223964 222882 177359 146619
72 146619 159615 199989 178898 166021 132320 118761 155637 154350 198209 235161 205155 208951
60 208951 162105 136955 103489 112479 154321 198740 176080 182215 186219 212489 195712 210074 243723
47 243723 225951 218500 217877 210005 196420 229533 186755 202450 206837 155488 138256 207539 251470
34 251470 252340 224010 192539 155699 169346 212815 219785 244558 277476 230867 177361 200383 228053
21B28053J5786j5414j5782j2135j9782J5732k9102J0421M2036k2842K3500L791
9B24262J8964J143q3693k521M672L4466m199R036j225
0B00905
$$ plain form
21 228053 243839 228425 212643 200508 180726 196458 167356 177777 219813 196971 220471 224262
9 224262 243226 244369 160676 158155 162827 197293 193094 202130 200905
0 200905
$$ Imaginary data points
##PAGE= N=2
##DATA TABLE= (X++(I..I)), XYDATA
16383e581390M3283J22548R1744M5563P7815P6993N7587Q0674Q6768R3915Q9349
16372d715151P4108O1866J27326O5735M1618Q9742L9716N6940J04256Q5707J20338
16361c847799N6699P1110R8923R3248P1552J12646R3899k539J00554Q2983O7669
16350c001055P6423M7143R3805J19053L9855P8153J4159J04161J43477J9614O8208
16339b197004O6690J01121P3406Q7304J6837Q0027J14744P4559M9727J10175Q3977
16328a338437J5802O7205M5808J31617M5597M1905N0963Q1253J11530N3112P3731
16317f19914Q3442R2408Q2794P1563N0864P5388O3851R7657N5305L3400J0336
16306I7094O8111Q4133N4402P4361M8262P1953R0847O5948M4347O0143O9223P0104
$$ plain form
16383 -5581390 -5538107 -5415559 -5323815 -5278252 -5200437 -5123444 -5065857 -4985183 -4898415 -4804500 -4715151
16372 -4715151 -4641043 -4579177 -4451851 -4386116 -4344498 -4254756 -4215040 -4158100 -4053844 -3968137 -3847799
16361 -3847799 -3791100 -3719990 -3621067 -3527819 -3456267 -3343621 -3249722 -3252261 -3151707 -3068724 -3001055
16350 -3001055 -2924632 -2877489 -2783684 -2664631 -2624776 -2546623 -2532464 -2428303 -2284826 -2265212 -2197004
16339 -2197004 -2130314 -2029193 -1955787 -1868483 -1851646 -1771619 -1656875 -1582316 -1532589 -1422414 -1338437
16328 -1338437 -1322635 -1255430 -1209622 -1078005 -1032408 -990503 -939540 -858287 -746757 -693645 -619914
16317 -619914 -536472 -444064 -361270 -289707 -238843 -163455 -99604 -1947 53358 86758 97094
16306 97094 165205 249338 303740 378101 426363 498316 589163 655111 699458 759601 828824 898928
16294H98928J2489R2504J28632O8738M2173N1424J01168N5950Q4783K4530J9507
16283A580826Q6117J6147M7256J13631N9019P9037j6085M8243P9248K0657N7989
16272B172085O6124N2843N6534N8927M8291P1222K7235O0928O4780L4732K1819
16261B735520J9024M5701K2484N4335N9269O8160P7718O0592R3715M347j8381
16250C222484J29123R3836J5254l1783M1224R2482O3734L6790L4703K9153J04036
16239C831036K4426N207M3284M9976K8337N1059m080l4861R5019N5858R5865N7870
16227D298996O9595j5596k0402J7806O1873P998L2788Q0879L3890O2997J17150
16216D747974M0803j3160O1548N2155K8543k5612j8028Q1132M0821J6578o88P5648
$$ plain form
16294 898928 911417 1003921 1132553 1201291 1243464 1294888 1396056 1452006 1536789 1561319 1580826
16283 1580826 1666943 1683090 1730346 1843977 1902996 1982033 1965948 2014191 2093439 2114096 2172085
16272 2172085 2238209 2291052 2347586 2406513 2454804 2526026 2553261 2614189 2678969 2713701 2735520
16261 2735520 2754544 2800245 2822729 2877064 2936333 3004493 3082211 3142803 3236518 3240865 3222484
16250 3222484 3351607 3445443 3460697 3428914 3470138 3562620 3626354 3663144 3697847 3727000 3831036
16239 3831036 3855462 3860669 3903953 3953929 3982266 4033325 4029245 3994384 4089403 4145261 4241126 4298996
16227 4298996 4368591 4352995 4332593 4350399 4412272 4420270 4453058 4533937 4567827 4630824 4747974
16216 4747974 4788777 4775617 4837165 4889320 4917863 4892251 4874223 4955355 4996176 5012754 5012066 5087714
16204E087714L2073L0968k880j4823J4982J11560K4413o6765N5715M2922Q8034
16193E403913R030l3741K2012O5685j7934J0612R7486Q009O4343k0081M739K1156
16181E635229N2656N056o5594L5622J7859L4238L2491K3254M4097K0473J4178
16170E849559Q4958l1155n274Q4627N0402O7762n7156k3678k3265J1884O2141
16159F070805P4246N8504m2420j5497O5495P318l354N2038L4515m8239L4535J4113
16147F302059Q413K9496q688J3662M443J3290l5740O6726n9783m6866O5612M7667
16135F400291J7881O2602M6509k7104n3000Q1426n6747O890P701L5281R86K0761
16123F543477N2212l0928m9064J2257O3518M0093N5688K6010j6202l6825K3501
$$ plain form
16204 5087714 5119787 5150755 5147875 5133052 5148034 5259594 5284007 5217242 5272957 5315879 5403913
16193 5403913 5412943 5379202 5401214 5466899 5448965 5459577 5557063 5565072 5629415 5609334 5614073 5635229
16181 5635229 5687885 5692941 5627347 5662969 5680828 5715066 5747557 5770811 5814908 5835381 5849559
16170 5849559 5934517 5903362 5898088 5982715 6033117 6100879 6043723 6020045 5996780 6008664 6070805
16159 6070805 6145051 6203555 6161135 6145638 6211133 6218451 6215097 6267135 6301650 6253411 6287946 6302059
16147 6302059 6310472 6339968 6331280 6344942 6349385 6362675 6326935 6393661 6333878 6287012 6352624 6400291
16135 6400291 6418172 6480774 6527283 6500179 6447179 6528605 6471858 6478748 6486449 6521730 6522716 6543477
16123 6543477 6595689 6564761 6515697 6527954 6591472 6631565 6687253 6713263 6697061 6660236 6683737
16112F683737K7653k6428l1120P9123J1086o4893K9588M1050j3133k5097M0506
$$ plain form
16112 6683737 6711390 6684962 6653842 6732965 6744051 6679158 6708746 6749796 6736663 6711566 6752072
$$ [...]
##END NTUPLES=NMR SPECTRUM
##END=
