##TITLE=1H_CA-9378-1
 200.13MHz, CDCl3,
 8 sc
 
 8.9.2025
##JCAMPDX= 6.0         $$ Bruker NMR JCAMP-DX V2.0
##DATA TYPE= NMR SPECTRUM
##DATA CLASS= NTUPLES
##ORIGIN= UXNMR, Bruker Analytische Messtechnik GmbH
##OWNER= pz
$$ XWIN-NMR		Version 3.5
$$ Mon Sep  8 13:59:15 2025 Russian Standard Time (UT+4h)  she@DPX200
##.OBSERVE FREQUENCY= 200.1313
##.OBSERVE NUCLEUS= ^1H
##.ACQUISITION MODE= SIMULTANEOUS
##.ACQUISITION SCHEME= undefined
##.AVERAGES= 8
##.DIGITISER RES= 18
##SPECTROMETER/DATA SYSTEM= spect
##.PULSE SEQUENCE= zg30
##.SOLVENT NAME= CDCl3
##.SHIFT REFERENCE= (INTERNAL, CDCl3, 0, 15.5144)
##AUDIT TRAIL= $$ (NUMBER, WHEN, WHO, WHERE, WHAT)
$$ ##TITLE= Audit trail, XWIN-NMR		Version 3.5
$$ ##JCAMPDX= 5.01
$$ ##ORIGIN= Bruker BioSpin GmbH
$$ ##OWNER= she
$$ F:/spectra/data/she/nmr/H-C/1/pdata/1/auditp.txt
$$ ##AUDIT TRAIL=  $$ (NUMBER, WHEN, WHO, WHERE, WHAT)
(   1,<2025-09-08 13:57:54.70 +0400>,<she>,<DPX200>,
      <created by zg, POWCHK disabled, PULCHK disabled
       configuration hash MD5:
       00 E9 B6 7A A2 85 ED C7 34 08 36 98 17 FE 4E 26
       data hash MD5: 16K
       45 25 EE B8 6F D2 E0 90 10 F5 C8 89 BD 47 F4 1E>)
(   2,<2025-09-08 13:57:57.89 +0400>,<she>,<DPX200>,
      <Start of raw data processing
       efp BC_mod = 2 LB = 0.25 FT_mod = 6 PKNL = 1 PHC0 = -1558.063 PHC1 = 11.39228 SI = 16K 
       data hash MD5: 16K
       1C CC CB 59 D6 5F 6A 02 65 2D 96 3D E1 05 DB 4C>)
(   3,<2025-09-08 13:58:20.95 +0400>,<she>,<DPX200>,
      <pk PHC0 = -158.2198 PHC1 = -4.2 
       data hash MD5: 16K
       E9 A2 A6 3D 1C 48 40 2F 95 7E 62 14 64 72 CC 98>)
(   4,<2025-09-08 13:58:24.85 +0400>,<she>,<DPX200>,
      <abs ABSG = 5 
       data hash MD5: 16K
       4A 55 D3 5F 8D 99 08 A5 51 9C C9 8E 6B B8 5F 63>)
$$ ##END=
$$ 
$$ hash MD5
$$ 2E 76 B2 33 5E BD 3C 87 9C AB 18 C5 86 43 1C 95
##$RELAX= 
##$RELAX= 
##$RELAX= 
##$RELAX= 
##$RELAX= 
##$RELAX= 
$$ Bruker specific parameters
$$ --------------------------
##$DU= <F:/spectra>
##$EXPNO= 1
##$NAME= <H-C>
##$PROCNO= 1
##$TYPE= <nmr>
##$USER= <she>
##$AMP= (0..31)
100 100 100 100 100 100 100 100 100 100 100 100 100 100 100 100 100 100 
100 100 100 100 100 100 100 100 100 100 100 100 100 100 
##$AQSEQ= 0
##$AQ_mod= 1
##$AUNM= <au_zg>
##$AUTOPOS= <>
##$BF1= 200.13
##$BF2= 200.13
##$BF3= 200.13
##$BF4= 200.13
##$BF5= 200.13
##$BF6= 200.13
##$BF7= 200.13
##$BF8= 200.13
##$BYTORDA= 1
##$CFDGTYP= 0
##$CFRGTYP= 5
##$CHEMSTR= <none>
##$CNST= (0..31)
1 1 145 1 1 1 1 1 1 1 1 1 1 1 1 1 1 1 1 1 1 1 1 1 1 1 1 1 1 1 1 1 
##$CPDPRG= <>
##$CPDPRG1= <>
##$CPDPRG2= <>
##$CPDPRG3= <>
##$CPDPRG4= <mlev>
##$CPDPRG5= <mlev>
##$CPDPRG6= <mlev>
##$CPDPRG7= <mlev>
##$CPDPRG8= <mlev>
##$CPDPRGB= <>
##$CPDPRGT= <>
##$D= (0..31)
0 0.7 0 0 0 0 0 0 0 0 0 0.03 0 0 0 0 0 0 0 0 0 0 0 0 0 0 0 0 0 0 0 0 
##$DATE= 1757325474
##$DBL= (0..7)
120 120 120 120 120 120 120 120 
##$DBP= (0..7)
150 150 150 150 150 150 150 150 
##$DBP07= 0
##$DBPNAM0= <>
##$DBPNAM1= <>
##$DBPNAM2= <>
##$DBPNAM3= <>
##$DBPNAM4= <>
$$ [...]
##$SUBNAM3= <"">
##$SUBNAM4= <"">
##$SUBNAM5= <"">
##$SUBNAM6= <"">
##$SUBNAM7= <"">
##$SUBNAM8= <"">
##$SUBNAM9= <"">
##$SW= 18.0517328524113
##$SWIBOX= (0..15)
0 0 2 0 0 0 0 0 0 0 0 0 0 0 0 0 
##$SW_h= 3612.71676300578
##$TD= 16384
##$TD0= 1
##$TE= 0
##$TE2= 300
##$TE3= 300
##$TEG= 300
##$TL= (0..7)
0 120 120 120 120 120 120 120 
##$TP= (0..7)
150 150 150 150 150 150 150 150 
##$TP07= 0
##$TPNAME0= <>
##$TPNAME1= <>
##$TPNAME2= <>
##$TPNAME3= <>
##$TPNAME4= <>
##$TPNAME5= <>
##$TPNAME6= <>
##$TPNAME7= <>
##$TPOAL= (0..7)
0.5 0.5 0.5 0.5 0.5 0.5 0.5 0.5 
##$TPOFFS= (0..7)
0 0 0 0 0 0 0 0 
##$TUNHIN= 0
##$TUNHOUT= 0
##$TUNXOUT= 0
##$USERA1= <user>
##$USERA2= <user>
##$USERA3= <user>
##$USERA4= <user>
##$USERA5= <user>
##$V9= 5
##$VALIST= <valist>
##$VCLIST= <CCCCCCCCCCCCCCC>
##$VD= 0
##$VDLIST= <DDDDDDDDDDDDDDD>
##$VPLIST= <PPPPPPPPPPPPPPP>
##$VTLIST= <TTTTTTTTTTTTTTT>
##$WBST= 1024
##$WBSW= 4
##$XGAIN= (0..3)
0 0 0 0 
##$XL= 0
##$YL= 0
##$YMAX_a= 613424
##$YMIN_a= -513315
##$ZGOPTNS= <>
##$ZL1= 120
##$ZL2= 120
##$ZL3= 120
##$ZL4= 120
##$ABSF1= 15.5089
##$ABSF2= -2.54295
##$ABSG= 5
##$ABSL= 3
##$ALPHA= 0
##$AQORDER= 0
##$ASSFAC= 0
##$ASSFACI= 0
##$ASSFACX= 0
##$ASSWID= 0
##$AUNMP= <proc_1d>
##$AZFE= 0.1
##$AZFW= 0.1
##$BCFW= 0
##$BC_mod= 2
##$BYTORDP= 0
##$COROFFS= 0
##$CY= -3
##$DATMOD= 1
##$DC= 0
##$DFILT= <>
##$DTYPP= 0
##$F1P= 0
##$F2P= 0
##$FCOR= 1
##$FTSIZE= 16384
##$FT_mod= 6
##$GAMMA= 0
##$GB= 0
##$INTBC= 1
##$INTSCL= 3.241238e-09
##$ISEN= 128
##$LB= 0.25
##$LEV0= 0
##$LPBIN= 0
##$MAXI= 10000
##$MC2= 0
##$MEAN= 0
##$ME_mod= 0
##$MI= 1.114404
##$NCOEF= 0
##$NC_proc= -6
##$NLEV= 6
##$NOISF1= 3.799351
##$NOISF2= 2.8
##$NSP= 0
##$NTH_PI= 0
##$NZP= 0
##$OFFSET= 15.51441
##$PC= 1
##$PHC0= -1716.283
##$PHC1= 7.19228
##$PH_mod= 1
##$PKNL= yes
##$PPARMOD= 0
##$PSCAL= 0
##$PSIGN= 0
##$REVERSE= no
##$SF= 200.130001458856
##$SI= 16384
##$SIGF1= 3
##$SIGF2= 2
##$SINO= 0.751879
##$SIOLD= 32768
##$SREGLST= <19F.Aceton>
##$SSB= 0
##$STSI= 16384
##$STSR= 0
##$SW_p= 3612.71676300578
##$SYMM= 0
##$S_DEV= 0
##$TDeff= 16384
##$TDoff= 0
##$TI= <>
##$TILT= no
##$TM1= 0
##$TM2= 0
##$TOPLEV= 0
##$USERP1= <user>
##$USERP2= <user>
##$USERP3= <user>
##$USERP4= <user>
##$USERP5= <user>
##$WDW= 1
##$XDIM= 16384
##$YMAX_p= 276803026
##$YMIN_p= -352147
$$ End of Bruker specific parameters
$$ ---------------------------------
##NTUPLES= NMR SPECTRUM
##VAR_NAME=  FREQUENCY,     SPECTRUM/REAL,   SPECTRUM/IMAG
##SYMBOL=    X,             R,               I
##VAR_TYPE=  INDEPENDENT,   DEPENDENT,       DEPENDENT
##VAR_FORM=  AFFN,          ASDF,            ASDF
##VAR_DIM=   16384,         16384,           16384
##UNITS=     HZ,            ARBITRARY UNITS, ARBITRARY UNITS
##FACTOR=    0.220516191357247, 1,           1
##FIRST=     3104.89889971993, 0,            0
##LAST=      -507.817863285851, 0,           0
##MIN=       -507.817863285851, -352147,     0
##MAX=       3104.89889971993, 276803026,    0
$$ Real data points
##PAGE= N=1
##DATA TABLE= (X++(R..R)), XYDATA
$$ [...]
8092D2337l9436n0384P578Q464k4120j608L1965k8866o1161r744P9637k1249k1750
8079h8337k6912L5563L0584K2792L1464k3146q254Q3053l5985n528j4879k510
8067b095l5921k698j7281K8604K6048K755n6974L9853J062K0930o5108k4248J0728
8054g4345j9067M3398l9498J6775M5316M2252k7748k3665O078M4462p3342R638
8042d9746J6318J7548p3844M5031q550o6669J9907J7015m1825J1869P5907O1767
8030B4728O5821n7702p4998n5980J03149M3034J4639j9389o7165p250P459n5384
8018g9038m488k9510L8944M330O714q1466N4568l9503l6279N6406N3367K7046
8006b8909J0875K6579k8908m8658l0375P7229j6991q053n968P4003o5481K273
$$ y = [42337, 2901, -47483, -39905, -31441, -55561, -57169, -25204, -54070, -115231, -124975, -45338, -66587, -88337, -115249, -79686, -49102, -26310, 5154, -17992, -26246, 56807, 20822, 15294, 415, -2095, -38016, -40714, -57995, -29391, -3343, -588, -57562, -17709, -16647, 4283, -60825, -85073, -74345, -93412, -50014, -89512, -72737, -27421, 14831, -12917, -36582, -30504, 13958, -59384, -49746, -33428, -15880, -89724, -44693, -53243, -119912, -100005, -82990, -124815, -112946, -37039, 24728, 90549, 32847, -42151, -98131, 5018, 48052, 62691, 43302, -23863, -31113, -23654, -79038, -83526, -113036, -74092, -69762, -63048, -144514, -89946, -129449, -165728, -109322, -55955, -28909, -18034, 8545, -20363, -69021, -99396, -22167, -39158, -47211, -53179, 20824, -44657, -42384]
7994d2384m660m6323J3554q261l9825J6463Q2446J6687k6280P7019l1716k6556
7982a9836J8605k623m9530L3763O2602J5128o641l5307J8061l2526j5061m1296
7970e4661P7636K1041r67n7422L578K1686K1609J508l8811q2415j0764Q748p2453
7957a61687J27608O7073j4900J192l7025L3904P757j7165J3812l0711j7818M1183
7945A3223k5417N1315N6743l6223q09o0011L2412p445K6465M4165N4959j512k5995
7932A21870k144J9097J10474P5970L8710m028N9663n4280M4717J8436o2336j0180
7920C55969J7012M4350k2410j7310l1077o5303J9460k9721m074l6365k6291M3795
7908B48035j6541j16774m7243N3240J2786K4773k1718J442j00169K9588J5293
$$ y = [-42384, -47044, -93367, -79813, -88074, -127899, -111436, -28990, -12303, -38583, 38436, 6720, -19836, -1231, -3854, -53384, -19621, 42981, 58109, 51468, 16161, 34222, 1696, -13365, -54661, 22975, 44016, 43049, -14373, -10795, 10891, 32500, 34008, -4803, -87218, -97982, -89234, -161687, -34079, 32994, 18094, 19286, -17739, 16165, 23922, 6757, 20569, -10142, -27960, 13223, -12194, 39121, 95864, 59641, 58832, -1179, 31233, 23788, 50253, 94418, 149377, 147865, 121870, 119726, 138823, 249297, 325267, 363977, 359949, 419612, 365332, 410049, 428485, 366149, 355969, 372981, 417331, 394921, 377611, 346534, 281231, 300691, 270970, 266896, 230531, 204240, 248035, 231494, 114720, 67477, 120717, 133503, 158276, 136558, 138000, 37831, 67419, 82712]
7897H2712K539R795l0783M0657K3672q8370l9143k9204J9198K729O4533m9231
7885I104L549J4614L3217n435m4694K7365L4915L1087l9904o0298N0805N3558
7873A07883m8775k7356o5367K2947N2686L6451l8715m7953j8831m015L1j9669
7861e0683O5544j5869o2667L7261J2555L9107n24o1422j8693m5235L7101K8933
7849c4592P507J4524j6472j7317L9167O6451K5270M0778k0525N039o5021j0880
7837C3929L2993l9642J4738K6873j2377n34N74J4631M9460J6797l1733m9412N3258
7824A09555K4822M3570N4259Q749Q9613m8805p5839M2987J08961M9598K8065J03342
7812E38877n903J25004M2363Q0091m0775k36500L0789l9573o4082m8686K2660
$$ y = [82712, 85251, 95046, 64263, 104920, 128592, 40222, 1079, -28125, -8927, -6198, 58335, 9104, 12653, 27267, 60484, 55049, 10355, 37720, 72635, 103722, 63818, 3520, 54325, 107883, 59108, 31752, -33615, -10668, 42018, 78469, 39754, -8199, -27030, -31045, -31014, -50683, 14861, -1008, -63675, -26414, -13859, 25248, 24724, -36698, -55391, -100626, -63525, -34592, -27085, -12561, -29033, -46350, -7183, 59268, 84538, 125316, 104791, 109830, 44809, 33929, 66922, 27280, 42018, 68891, 56514, 55980, 56554, 71185, 120645, 137442, 105709, 56297, 109555, 134377, 177947, 232206, 240955, 330568, 281763, 205924, 248911, 357872, 407470, 435535, 538877, 532974, 657978, 700341, 780432, 739657, 503157, 533946, 494373, 430291, 381605, 404265]
7801D04265j0616l1749n1352J3582j368k0927n0465j1972l1951k1816k7344K0189
7789A78476J2504j3943J5142k481n429n894l364j7746L5461K0164n5664j409M308
7776A60125o3332L0162J641l1369M5044K369j673K3704J6329m4537n9056j2274
7764F7133M0440j3336Q6907p5521l8880L8704r263k52O6038J4791m7515k0109
7752A09137j8872Q1731J463k0044K7888n6683K3143R2971l305M3698k2158J0096
7740B69065L4765m9087K747M2319P1786N769l0171q027m0026P1252j0167l0017
7728C30208j4272j0600P4541K3602O6801p0913k1387j2458J6674l7724m2864L7762
7716C39370q1726k4875K390R726n2988o3395K369J06861L7929J9230K4510q417
$$ y = [404265, 393649, 361900, 310548, 324130, 322762, 301835, 251370, 239398, 207447, 185631, 158287, 178476, 190980, 177037, 192179, 189698, 184269, 178375, 175011, 157265, 192726, 212890, 157226, 155817, 160125, 96793, 126955, 128596, 97227, 142271, 144640, 142967, 166671, 183000, 138463, 79407, 67133, 107573, 94237, 181144, 105623, 66743, 105447, 96184, 95932, 161970, 176761, 129246, 109137, 90265, 171996, 173459, 153415, 181303, 124620, 147763, 240734, 237429, 281127, 258969, 269065, 303830, 254743, 257490, 299809, 371595, 377364, 347193, 339166, 299140, 370392, 360225, 330208, 315936, 305336, 379877, 403479, 470280, 399367, 377980, 365522, 382196, 344472, 301608, 339370, 257644, 232769, 235159, 244885, 191897, 128502, 130871, 237732, 275661, 294891, 319401, 310984]
7704C10984j0098o992l5039K7466L7598M9762l9459r1119m3684M0186L599R2998
7692C36202p0408J9972L1533Q877m7129J12105o8930q7252O9155K183O802L3011
7680C46121L1048q699k0803n394J3689R0093L6239k1880k2178N6496P6028l3352
7668E37408P570K4848L7188L8183M8863L4640J7216P628K6472m7898J7867J03650
7656H53635K2955l5220L278j0421P4003M9453P6676m44K7416O1422N0214j179
7644A171788O6636Q7981l8799N4439J18821J6304Q4259M9484n6886j12K0260j442
7632A572733N3691Q0411N828J6969m5144o9867k6090j7215O214J8536O0895k2067
7620A634894Q5989J01824k0453o1775J652J0585l9980l4123N111k2097p4389j7069
$$ y = [310984, 300886, 293894, 258855, 286321, 323919, 373681, 334222, 243103, 199419, 239605, 243204, 336202, 265794, 285766, 317299, 326176, 279047, 391152, 322222, 234970, 304125, 306308, 313110, 346121, 377169, 368470, 347667, 342273, 355962, 446055, 482294, 460414, 438236, 494732, 570760, 537408, 544978, 569826, 607014, 645197, 694060, 728700, 745916, 753544, 780016, 732118, 749985, 853635, 876590, 841370, 844648, 834227, 908230, 957683, 1034359, 1033915, 1061331, 1122753, 1172967, 1171788, 1238424, 1326405, 1287606, 1342045, 1460866, 1477170, 1561429, 1610913, 1554027, 1553915, 1574175, 1572733, 1626424, 1706835, 1712663, 1729632, 1684488, 1614621, 1588531, 1571316, 1577530, 1596066, 1656961, 1634894, 1720883, 1822707, 1802254, 1740479, 1742131, 1752716, 1712736, 1678613, 1683724, 1661627, 1587238, 1570169]
7608A570169n7261j31364J5244r8776j27573m2141k5505k1131n0663k0364j7400
7597I93235k8858J7282l858q46o4982p2175r163K4110N2938j5792N4801M1632
7585I88324l370j1933m4987j3086k5386k976k9414M379J3342N5310J8157L056
7573I51416J01344k4030o3185K5042k4607l5032M8506J03742L5324P5038K4184
7562A217742N3885J16525k0244q238J5613R0400n29k5680M9705L3278J1471M3571
7550A577499o3112k3764l0905N2761M3778k2790q755l4389j2574L1189m1218L1755
7538A499475J41739r205m5457q7848j4788k0705j317K5510M26n9387o6643m0249
7526A321551p6493n0638n887j8694m7524m7806k7802L1364j2076m0700k284j1710
$$ y = [1570169, 1512908, 1381544, 1396788, 1298012, 1170439, 1128298, 1102793, 1081662, 1030999, 1010635, 993235, 964377, 981659, 977801, 976955, 911973, 839798, 830635, 854745, 907683, 891891, 946692, 988324, 984954, 973021, 928034, 914948, 889562, 886586, 857172, 861551, 874893, 930203, 948360, 951416, 1052760, 1028730, 965545, 990587, 965980, 930948, 979454, 1083196, 1118520, 1193558, 1217742, 1271627, 1388152, 1367908, 1359670, 1375283, 1465683, 1465154, 1439474, 1489179, 1522457, 1533928, 1577499, 1514387, 1490623, 1459718, 1512479, 1556257, 1533467, 1524712, 1490323, 1477749, 1508938, 1467720, 1499475, 1641214, 1632009, 1586552, 1498704, 1483916, 1463211, 1461894, 1487404, 1487830, 1428443, 1361800, 1321551, 1245058, 1194420, 1188533, 1169839, 1122315, 1074509, 1046707, 1078071, 1065995, 1025295, 1023011, 1011301]
7514A011301J734l5268O4930j217L2969Q6948L9957J48255M3965j979N0200m1920
7502A399875j129j13208j42116p7519j29390p913K6602l085p5909q480m9523j51970
7490F66235l5008K705j3425o4284Q686J4253l5009m9144J0048m8334j6548M2040
7478D82215J2134n9386l9514K0631J9372L2286o7821L6928j9684k8651o7351m0356
7466B80803O1674K1431M0444J3450l1999k3224q2466L3187l8487K5605J9056Q400
7454C27874m4710O3944J3065N0881k6267l8070m2685n4596k554N0087L7147m3206
7442B90910l2198P8481k5936j9255L9076K3712P0083m3489p5774K4643L8251m3764
7430C24740L3015r634M5116N1370P3523M484n1609J2996m3333j11782j361J0216
$$ y = [1011301, 1013035, 977767, 1042697, 1041480, 1074449, 1161397, 1201354, 1349609, 1393574, 1391595, 1441795, 1399875, 1398746, 1285538, 1143422, 1065903, 936513, 928600, 955202, 952117, 876208, 867728, 818205, 666235, 631227, 633932, 620507, 556223, 564909, 579162, 544153, 495009, 505057, 456723, 440175, 482215, 494349, 434963, 395449, 416080, 435452, 467738, 399917, 436845, 417161, 388510, 321159, 280803, 342477, 363908, 404352, 417802, 385803, 362579, 280113, 313300, 274813, 300418, 319474, 327874, 283164, 347108, 360173, 411054, 384787, 346717, 304032, 249436, 246882, 296969, 334116, 290910, 258712, 337193, 311257, 292002, 331078, 354790, 424873, 381384, 305610, 330253, 368504, 324740, 357755, 348121, 393237, 444607, 518130, 522614, 471005, 484001, 440668, 328886, 327525, 337741]
7418C37741Q1077l1390m8190M3350N5470O528L0316k6045l000L8718J3839J6480
7406E14894J9704K0902N6435L7850m993O5044j2878R192N0180P084M9543K9334
7394H42291L9721K8048R405m548P964L6234M6239r094J0042O1032J20764M8312
7382A236410P0150J45636R5796J52157J94831O7391J01558J88803J36023J93519
7372B582274J71716J32298J57952P0230Q2082Q405J5973j05500k9225j7717j9963
7361C048525m8292j70407j74482j03759m7560j17873j77796j34036p9918q1062
7351A913340p7451j38763k4370k1520p4227k5074M8752k6429K4328l6007q1784
7340A480795J8331L0329L4277M3155Q5559J8377J5942m121M0027J227M2983R7449
$$ y = [337741, 418818, 387428, 339238, 382588, 438058, 444586, 474902, 448857, 445857, 484575, 498414, 514894, 534598, 555500, 611935, 649785, 644792, 709836, 696958, 706150, 756330, 763414, 812957, 842291, 882012, 910060, 919465, 914917, 922881, 959115, 1005354, 996260, 1006302, 1067334, 1188098, 1236410, 1306560, 1452196, 1547992, 1700149, 1894980, 1962371, 2063929, 2252732, 2388755, 2582274, 2753990, 2886288, 3044240, 3114470, 3196552, 3204957, 3220930, 3115430, 3086205, 3068488, 3048525, 3000233, 2829826, 2655344, 2551585, 2504025, 2386152, 2208356, 2074320, 1994402, 1913340, 1835889, 1697126, 1672756, 1651236, 1577009, 1551935, 1600687, 1574258, 1598586, 1562579, 1480795, 1499126, 1529455, 1563732, 1606887, 1692446, 1710823, 1726765, 1722644, 1762671, 1763898, 1806881, 1904330]
7328A904330N6402J16257J06562M5624J91218K34861R9720J37218J24379J35212
7318C151783J45064O1746M1150R7246M8097p9338o0005k9917L6945k7997j56280
7307C228494m8145j04167k09874j96347q4680j62655q4883n4308l9896j24295
7297B119244o8369q8650q5720m1707n2435l9368j2164P180n0635n7142J199j900
7285A629533j1153r844n9436N4818n0668n9219n5n9102o4238m1082O6516L7468
7273A433538k2887l7838l1561j7814k3950k6122M7933R1095r2912p2440M4860
7262A291902o8891J9450M2057j7503j5098n1945J0713k1057P0198L7591j8532
7251A278885k482J5219q155l676j9127L9878N8192L7070O170q0612J0269k7153
$$ y = [1904330, 1960732, 2076989, 2183551, 2229175, 2420393, 2655254, 2754974, 2892192, 3016571, 3151783, 3296847, 3358593, 3399743, 3496989, 3545086, 3465748, 3405743, 3375826, 3412771, 3384774, 3228494, 3180349, 3076182, 2866308, 2669961, 2585281, 2422626, 2337743, 2283435, 2243539, 2119244, 2050875, 1962225, 1876505, 1834798, 1782363, 1742995, 1730831, 1738011, 1687376, 1630234, 1631433, 1629533, 1618380, 1608536, 1549100, 1603918, 1553250, 1494031, 1493976, 1434874, 1370636, 1329554, 1396070, 1433538, 1410651, 1372813, 1341252, 1323438, 1299488, 1273366, 1321299, 1412394, 1319482, 1247042, 1291902, 1223011, 1242461, 1284518, 1267015, 1251917, 1199972, 1210685, 1189628, 1259826, 1297417, 1278885, 1276403, 1291622, 1283467, 1279791, 1260664, 1300542, 1358734, 1395804, 1401974, 1321362, 1331631, 1304478]
7239A304478L979j5088q2084K2937M4604J0300J0053p7080m5284J7859M1758n8141
7227A178291j2600Q3954K9102j4158q0846o9813O78R1024M2132O646o4828k7209
7215A162373M7745L5929J1598l7355J6591J0161l7526k6241Q8155L0779q3190
7204A219019k7484n292P8282Q6716J1853N3216P5924J5828k9970m9112K7379K8914
7192A485273m7477P147N7159K4228J6169j1313Q1094M5064o239p3063j1877M8240
7180A614405n4425n6764L1197M9313l2510Q7807O5015O7255O6284j5359p028L7071
7168A852261K1236N5442R6615K8203O7528O5919P5380P0609J05647L9910J01861
7157B580611O9032P6835Q5592L9931J23323R6269O6390L1922J56393J89948J15619
$$ y = [1304478, 1308457, 1293369, 1211285, 1234222, 1278826, 1289126, 1299179, 1222099, 1176815, 1194674, 1236432, 1178291, 1165691, 1249645, 1278747, 1264589, 1183743, 1113930, 1114608, 1205632, 1247764, 1254410, 1189582, 1162373, 1210118, 1246047, 1257645, 1220290, 1236881, 1247042, 1209516, 1183275, 1271430, 1302209, 1219019, 1191535, 1186243, 1264525, 1351241, 1363094, 1416310, 1492234, 1508062, 1478092, 1428980, 1456359, 1485273, 1437796, 1444943, 1502102, 1526330, 1542499, 1531186, 1612280, 1657344, 1651105, 1578042, 1566165, 1614405, 1559980, 1503216, 1534413, 1583726, 1551216, 1639023, 1704038, 1771293, 1837577, 1822218, 1815190, 1852261, 1873497, 1928939, 2025554, 2053757, 2121285, 2187204, 2262584, 2333193, 2438840, 2478750, 2580611, 2649643, 2726478, 2812070, 2852001, 2975324, 3071593, 3137983, 3169905, 3326298, 3516246, 3631865]
7146C631865J49988K52825K22664K85206J71193J53160J73097K88130K56191L34320
7136E918639K71204K68586L60556M56411M50201N01715N91999N90054M96194N61578
7126A0467137O68318O81008Q21121R24961R56697J240804J358750J516486J908601
7117B0543883K254301K667498L029235L516503M266492N362143O960949R345953
7109E7946957J2278787J4357374J4879912J6922301J5008444O200864M93128p065601
7101A31022166j7245352j6267247j2192892j0141327q046271o208393m924409
7094E5996275m518301m089542l822844l841093l481795k903556k575560k312425
7086B8451159k137023k046194j900348j646779j437927j276357j196060r89570
$$ y = [3631865, 3781853, 4034678, 4257342, 4542548, 4713741, 4866901, 5039998, 5328128, 5584319, 5918639, 6189843, 6458429, 6818985, 7275396, 7725597, 8227312, 8819311, 9409365, 9905559, 10467137, 11135455, 11816463, 12637584, 13562545, 14519242, 15760046, 17118796, 18635282, 20543883, 22798184, 25465682, 28494917, 32011420, 36277912, 41640055, 48601004, 57946957, 70225744, 84583118, 99463030, 116385331, 131393775, 137594639, 138087767, 131022166, 113776814, 97509567, 85316675, 75175348, 67129077, 60920684, 55996275, 51477974, 47388432, 43565588, 39724495, 36242700, 33339144, 30763584, 28451159, 26314136, 24267942, 22367594, 20720815, 19282888, 18006531, 16810471, 15820901]
7078A5820901q33865q23426o90837o15293o08358o12632n07153m63825o07007
7069A0058505m13575l20456k89145m24635k87152l20576l00757l48687k86331
7060G067191l01346l02440l34887k51163j88775j39799k58133j83850j31044o4817
7050D910937r2518j72187r3158r9866p1574k796j83363j63569l8751p1404r2542
7039C829209o3411k7075m6327q6971j03065j32811L347n1524q8512l2992j51493
7028C048375j28892O390K0290o0255j20473k0622k2713j64050n9362J2509l2914
7017B478283r0194o1045n6159q9355o2034j6773j10763l1302n4819l4194J1677
7006A883322m065j2259l4662q1714m9248J1366n711o17l0680J5251o2217k4432
$$ y = [15820901, 14987036, 14163610, 13472773, 12857480, 12249122, 11636490, 11129337, 10665512, 10058505, 9644930, 9324474, 9035329, 8610694, 8323542, 8002966, 7702209, 7353522, 7067191, 6765845, 6463405, 6128518, 5877355, 5688580, 5548781, 5290648, 5106798, 4975754, 4910937, 4818419, 4646232, 4553074, 4453208, 4381634, 4378838, 4195475, 4031906, 3993155, 3921751, 3829209, 3765798, 3738723, 3692396, 3605425, 3502360, 3369549, 3372896, 3321372, 3232860, 3199868, 3048375, 2919483, 2925873, 2946163, 2885908, 2765435, 2744813, 2722100, 2558050, 2498688, 2511197, 2478283, 2388089, 2327044, 2270885, 2181530, 2119496, 2102723, 1991960, 1960658, 1905839, 1871645, 1883322, 1879257, 1866998, 1832336, 1750622, 1701374, 1712740, 1707029, 1706412, 1675732, 1690983, 1628766, 1604334]
6994A604334n997k6449n3314k7664J4189m9n8073L5548R217L3079J307o3190N5995
6981A518933o6003p0094K2840k1216j3597k1095j16381L0339q2803n8782o1208
6970A060933N757o438L7385L7936j1581q064q8758l7011k306Q461N2721o8303
6958I80732l7606P4509L3800n5308K7089k2004n4205l4852L311L2245r252l7283
6946I01176m8941J5361l6858p7343p153J8038M0044M4534p4869l2484n8174l1316
6934F52015L0489l552k9925p1457N0999R0751o5630j9407j8454p455k5112J6413
6922E99675Q13p8656n4661O4568J3848K5451m9446j3727p827J2226L8810N7650
6910F08724L9588n2898j5448m4100N6673q2992o6197K7221L1324l1390K4707J3361
$$ y = [1604334, 1598337, 1571888, 1518574, 1490910, 1505099, 1505050, 1446977, 1482525, 1491742, 1524821, 1526128, 1462938, 1518933, 1452930, 1382836, 1405676, 1384460, 1370863, 1349768, 1233387, 1263726, 1180923, 1122141, 1060933, 1066690, 1060252, 1097637, 1135573, 1123992, 1115928, 1027170, 990159, 987853, 996314, 1049035, 980732, 943126, 1017635, 1051435, 996127, 1023216, 1001212, 947007, 912155, 915466, 947711, 938459, 901176, 852235, 867596, 830738, 753395, 746242, 764280, 804324, 848858, 773989, 741505, 683331, 652015, 682504, 678952, 649027, 577570, 628569, 719320, 653690, 634283, 615829, 608374, 583262, 599675, 600488, 521832, 467171, 531739, 545587, 571038, 521592, 507865, 500038, 512264, 551074, 608724, 648312, 595414, 579966, 535866, 592539, 509547, 443350, 470571, 501895, 470505, 495212, 508573]
6898E08573p2808K6852j5238m1603L1540l8993M7329l440J8348J8007k7026m9629
6886D01912n561K4101m6392m0981N5111P3551m5091j6476N0691n78j4884k7407
6874D07996j9564k5499m7142j6781J7196R965m9794M8546J5209j5463l6267N3909
6862C42311l2901l1878N8038k393L184K0010m7672N323J2260K701p106j99J1078
6849C32756n045N1032p0436m0549O0916Q928j1129L6858J8085k1011m4507j2541
6837C03357P8560o43P660L4019l1849J5293J4340j9937k8599M3437K2416p3383
6825C64671J3659j7877M0886l0684Q369l4671L1755M9353j00172M2252j9307j5650
6813C32584M4989m5079k4167M8371k5610L8150r126m3496p4633J6765j1467m1319
$$ y = [508573, 435765, 462617, 447379, 405776, 437316, 398323, 445652, 442212, 460560, 478567, 451541, 401912, 396351, 420452, 374060, 333079, 388190, 461741, 416650, 400174, 450865, 450287, 435403, 407996, 388432, 362933, 315791, 299010, 316206, 326171, 276377, 324923, 340132, 324669, 288402, 342311, 309410, 277532, 335570, 333177, 336361, 356371, 308699, 314022, 326282, 328983, 321877, 321678, 332756, 327711, 378743, 308307, 267758, 328674, 337602, 326473, 363331, 381416, 360405, 315898, 303357, 381917, 381274, 388934, 422953, 391104, 406397, 420737, 400800, 372201, 415638, 438054, 364671, 378330, 360453, 401339, 370655, 379024, 344353, 376108, 425461, 325289, 367541, 348234, 332584, 377573, 332494, 308327, 356698, 331088, 369238, 360112, 316616, 241983, 258748, 247281, 205962]
6801B05962J04222J3667O1222K8116m0245J8338l3612M930p9260N9428M9101o6836
6789C25033K8275M8724k488k3046p2032K305P0431J7942l6602m0407K9526k650
6777C45011L4545K0812K4382O070n9030m86R379K2896k8100j088P9584n6767N4887
6764D52095J9526o1651q3521J7579L0831M7766N5748M1239m1965r1615L4490q196
6752D12326J5222J4107L9152L0033m2178o8035K6842j1143R525N3293p2395n26
6740D06223N645k9323r96r406j4694Q1780Q090o3592l5241P714P5946M621R643
6727D46410l0373m972K1795J4365p3503m5346j8541L3342K9252J4544J4656p3369
6715C28260O273L5811M3314R830L4615L96j3658l047O4316L3006R0015O5867N6373
$$ y = [205962, 310184, 323851, 385073, 413189, 372944, 391282, 357670, 362600, 283340, 342768, 391869, 325033, 353308, 402032, 399544, 376498, 304466, 306771, 377202, 395144, 358542, 318135, 347661, 345011, 379556, 400368, 424750, 430820, 371790, 371304, 380683, 403579, 375479, 374391, 453975, 397208, 452095, 471621, 409970, 326449, 344028, 374859, 422625, 478373, 519612, 477647, 386032, 420522, 412326, 427548, 441655, 480807, 510840, 468662, 400627, 427469, 416326, 425851, 479144, 406749, 406223, 411868, 382545, 381549, 372143, 357449, 439229, 447319, 383727, 348486, 356200, 432146, 436767, 446410, 416037, 411065, 432860, 447225, 373722, 328376, 309835, 343177, 372429, 386973, 401629, 328260, 334533, 370344, 413658, 423488, 458103, 458499, 444841, 441794, 506110, 539116, 629131, 694998, 751371]
6702G51371Q6866Q122R2044Q8489L7216j8053m8859j37122l2880j00284j12393
6691F14517n311j7122l7958K8338l4473K6273L6978m6548k3395l8896o9232J333
6679D34504k3510j3064R3289l2188K0825m4290K5137P694j817R2432J5123j08530
6667D65605m411k5035J9119M7770k9449Q076J04078L110K2468K954L9274Q4779
6655G38338M006r735j3649N944r630N3011J6161k4700k5887O2866L65M076K8790
6642H29956R512q3185n1147j4452j8710o655K4236K6824J544o0939k5979l4137
6630E96868k5422n501K7568J5097Q090j7596J9771n4350O1980M0300K4852P9536
6618G71193j1259q8248O9718L9735K283P7708L2605j4844L4727o132J252k5901
$$ y = [751371, 838237, 846359, 938403, 1026892, 1064108, 1046055, 997196, 860074, 827194, 726910, 614517, 609206, 592084, 554126, 582464, 547991, 574264, 611242, 564694, 541299, 502403, 433171, 434504, 410994, 397930, 491219, 459031, 479856, 435566, 460703, 468397, 466580, 559012, 574135, 465605, 461194, 436159, 455278, 503048, 473599, 481675, 585753, 588863, 611331, 614285, 653559, 738338, 742344, 732609, 718960, 724904, 715274, 768285, 784446, 759746, 733859, 796725, 797090, 801166, 829956, 839468, 756283, 705136, 690684, 671974, 665319, 689555, 716379, 717923, 656984, 631005, 596868, 571446, 565945, 593513, 608610, 616700, 599104, 618875, 564525, 626505, 666805, 691657, 771193, 759934, 671686, 741404, 781139, 783422, 861130, 893735, 878891, 913618, 907486, 908738, 882837]
6606H82837n0935M8168o536O2342P836j03022j01364Q3884p6322J0072n516k4813
6594G26631M063n1955O7757K3479p0689K8536l1495J3238q4719m6419M0578j5335
6582F03670j4876k982O643j8108P524J1031j9086N11K2899J3198J01765l5685
6570F76504J0109m632j6694o18j05891K3329M3270o199n203K5544J9822m331J5886
6557F70896O2224P689j01069r594M3600k8039O9768Q056n0223J8903M3477p619
6545G28069J9011m677n4900l910N0907M3825L3344j342J3838o256P6969J04443
6533I99321k324Q3346P5300L5656P625O3004L3222M457K6825m7269q809N6533
6521A326887N0049N6635j4934J2131J2991N9552N9525R619L882K9623J5664O8317
$$ y = [882837, 831902, 880070, 873534, 935876, 943712, 840690, 739326, 823210, 746888, 756960, 751444, 726631, 730694, 678739, 746496, 769975, 699286, 727822, 696327, 709565, 624846, 578427, 619005, 603670, 588794, 585812, 592455, 574347, 581871, 592902, 573816, 574327, 597226, 610424, 712189, 676504, 686613, 681981, 665287, 664669, 558778, 582107, 625377, 619178, 613975, 639519, 659341, 655010, 670896, 733120, 740809, 639740, 630146, 673746, 645707, 715475, 723531, 673308, 692211, 735688, 728069, 747080, 742403, 687503, 683593, 734500, 778325, 811669, 810327, 824165, 817909, 894878, 999321, 996997, 1080343, 1155643, 1191299, 1198924, 1261928, 1295150, 1299607, 1326432, 1279163, 1270354, 1326887, 1376936, 1433571, 1418637, 1430768, 1443759, 1503311, 1562836, 1572455, 1576337, 1605960, 1621624, 1689941]
6509A689941J08945j9782p6105l0456Q2904L4514l7524P0545O7259O6127r788
6498A946580M1059R2755R4756M85P7632R0958L0517J17033O2193J04364J00450
6487B758782J55651J90802K80380K47851J94811J49843J36926J0979q7019j41112
6477C897894j84863k06013j93106j37616q2991p8794j55722j95160j42959o6675
6467B453995j01746j22352o8673j15912j09979m4031J8007r743o7639o1350m4572
6456A726005q34j3706J9521k8098j13844j2564J8861Q933o251l6021K8561k2418
6444A568145o6816j7567q99n165L7125o3574o3845m5173J0721m9264J4446J0061
6432A328195q0440j7762L9983j5980m9754M9199m8128J5393j4982l3094m5600
$$ y = [1689941, 1798886, 1779104, 1702999, 1672543, 1755447, 1789961, 1752437, 1822982, 1890241, 1956368, 1946580, 1987639, 2080394, 2175150, 2175635, 2253267, 2344225, 2374742, 2491775, 2553968, 2658332, 2758782, 2914433, 3105235, 3385615, 3633466, 3828277, 3978120, 4115046, 4126025, 4039006, 3897894, 3713031, 3507018, 3313912, 3176296, 3093305, 3014511, 2858789, 2663629, 2520670, 2453995, 2352249, 2229897, 2161224, 2045312, 1935333, 1891302, 1909309, 1899566, 1831927, 1770577, 1726005, 1725171, 1711465, 1730986, 1702888, 1589044, 1576480, 1595341, 1604274, 1598023, 1562002, 1590563, 1568145, 1501329, 1483762, 1482863, 1477698, 1514823, 1451249, 1387404, 1342231, 1352952, 1303688, 1318134, 1328195, 1247755, 1229993, 1269976, 1253996, 1204242, 1253441, 1205313, 1220706, 1205724, 1172630, 1127030]
6421A127030K1850M0022m4929q344L5170O4768q954J1840k536J8129J0141K3589
6409A287776j4914K8831O5097n7732P987Q2343K3886j4789j1936Q9122L4417j5466
6397A504622p424N3151J0119j4331L5740Q1373J05878N6195J35018J23944M8171
6386B132456J39114O5982O2427J50325J57219O6439J41832J14265M8565J8670
6376C097294j8026j18950q2950m9421m9647K4452Q2096J4944j50307n4850j5858
6365B678777j1096L1887Q1611R761l4629K7406L6937R9083K8444j5792P4595N7817
6353C064801J01546N6446O6508J6690Q6885O1219N8380j8553J14175J54466J27857
6342C890420J34005K09707K48260K33501K22843K57587K17220P0168O359r5599
$$ y = [1127030, 1148880, 1188902, 1143973, 1135629, 1170799, 1235567, 1226613, 1238453, 1235917, 1254046, 1264187, 1287776, 1272862, 1301693, 1366790, 1309058, 1317045, 1399388, 1423274, 1408485, 1396549, 1485671, 1520088, 1504622, 1497198, 1550349, 1560468, 1546137, 1581877, 1663250, 1769128, 1825323, 1960341, 2084285, 2132456, 2271570, 2337552, 2399979, 2550304, 2707523, 2773962, 2915794, 3030059, 3078624, 3097294, 3079268, 2960318, 2877368, 2827947, 2778300, 2802752, 2884848, 2899792, 2749485, 2694635, 2678777, 2667681, 2699568, 2781179, 2790940, 2756311, 2783717, 2820654, 2919737, 2948181, 2932389, 3006984, 3064801, 3166347, 3222793, 3289301, 3305991, 3392876, 3454095, 3512475, 3493922, 3608097, 3762563, 3890420, 4024425, 4234132, 4482392, 4715893, 4938736, 5196323, 5413543, 5483711, 5490070, 5394471]
6332E394471j95448k45680k77588k07237j90356k07572j48761j72098j49592j48461
6322C451678j06982j18686n3642r0169j66050J4362l3417j08247m6576l4708j59871
6311B547692o6096p5235m047l0993q7766q5780j0164J069p6599k7667j40337J2167
6299A956244l1632m2878p111O058o3147n5143N6398M5501k7450L6870K7528o4095
6287A837143p3615n8219n5778l4895N6389o5020k9991J8652l2248r326J9956J045
6275A574093K998n120j5950P2581K7741r4804M4691Q2139o1385p1033J5339j4501
6263A556789k5246O5184n9794n6768M7663n704K8008j1373j4000Q667J6922P0717
6251A621065j686K716l4128k9643J4119J8273k7298p3475j3399J31627k2936l3407
$$ y = [5394471, 5199023, 4953343, 4675755, 4468518, 4278162, 4070590, 3921829, 3749731, 3600139, 3451678, 3344696, 3226010, 3172368, 3082199, 2916149, 2930511, 2897094, 2788847, 2742271, 2707563, 2547692, 2481596, 2406361, 2402314, 2371321, 2283555, 2197775, 2187611, 2188680, 2112081, 2084414, 1944077, 1956244, 1924612, 1881734, 1874623, 1880681, 1817534, 1762391, 1818789, 1864290, 1836840, 1873710, 1901238, 1837143, 1763528, 1705309, 1649531, 1614636, 1671025, 1606005, 1576014, 1594666, 1562418, 1553092, 1573048, 1574093, 1577091, 1571971, 1556021, 1628602, 1656343, 1561539, 1606230, 1688369, 1626984, 1555951, 1571290, 1556789, 1531543, 1596727, 1536933, 1480165, 1527828, 1522124, 1550132, 1538759, 1524759, 1533426, 1550348, 1621065, 1619379, 1622095, 1587967, 1558324, 1572443, 1590716, 1563418, 1489943, 1476544, 1608171, 1585235, 1551828]
6239A551828k9878K9223L6769j9270n8242M2448j5419M5753K1980M7623J5667
6228A668482j1085M0300m5940K3162M5650P496K4901p786N907J2589k3888M636
6216A744424L9910M8433k2875N549J8038k1006J2104L3803L0789N7914K3785j5349
6204A955519J2618R0449K8440K4364j0038N1122M3388M2507L2727M6529N562L2806
6192B355993l0501l725L251j8129L7903M4288l9927J9011o96P6150R6276l9379
6180B500515q745K4981R3290J1480N363R8614P2137p02K9240P8026Q227L5109
6168B947535O3589K5613J0826j667Q7929N1275O4072M6369O4628R4487P1715P0974
6156C597345J20062Q9973N9560J32486J20448J61581J01458L8004J85658J87769
$$ y = [1551828, 1521950, 1551173, 1587942, 1568672, 1510430, 1552878, 1537459, 1583212, 1605192, 1652815, 1668482, 1657397, 1697697, 1651757, 1674919, 1720569, 1728065, 1752966, 1745180, 1751087, 1763676, 1739788, 1744424, 1784334, 1832767, 1809892, 1815441, 1833479, 1812473, 1824577, 1858380, 1889169, 1947083, 1970868, 1955519, 1968137, 2058586, 2087026, 2111390, 2101352, 2152474, 2195862, 2238369, 2271096, 2317625, 2323187, 2355993, 2325492, 2321767, 2325018, 2306889, 2344792, 2389080, 2349153, 2368164, 2367468, 2443618, 2539894, 2500515, 2491770, 2516751, 2610041, 2621521, 2626884, 2725498, 2797635, 2796933, 2826173, 2904199, 2912426, 2947535, 3011124, 3036737, 3047563, 3045896, 3133825, 3185100, 3249172, 3295541, 3360169, 3454656, 3526371, 3597345, 3717407, 3807380, 3866940, 3999426, 4119874, 4281455, 4382913, 4420917, 4606575, 4794344]
6146D794344M0913M805l0k0359p6534o1910q1391j04694j3818l0203n8175m4095
6134D348853r5818r1401k3519l6584r722L8087O1279o9190k2233P6494N1472K8120
6122D255838R3566R6540J3442m493J7559j7230j3491n3779j0734o264M557m0963
6110D334548n7131o748o4504j07031j08629K8492k0355N5599k5182l4218m1297
6099C953544l2984k2272J6967L0909P686n160k7332L934J556K5222k7403L6613
6087C961280K4521L6547M4740o2332K9222l3203J6978k2205m2414M2504L5162
6076D030800r7947K4760R9438m6977K6574J0555J31714J0975n102P2996N9506
6065D317292L1331N2179J40422O2447L3047O0986R5052J16325N4447J09347M8560
$$ y = [4794344, 4835257, 4840062, 4840032, 4819673, 4743139, 4681229, 4599838, 4495144, 4481326, 4451123, 4392948, 4348853, 4253035, 4161634, 4138115, 4101531, 4091809, 4129896, 4191175, 4121985, 4099752, 4176246, 4227718, 4255838, 4349404, 4445944, 4459386, 4454893, 4472452, 4455222, 4441731, 4387952, 4377218, 4370954, 4375511, 4334548, 4277417, 4270669, 4206165, 4099134, 3990505, 4018997, 3998642, 4054241, 4029059, 3994841, 3953544, 3920560, 3898288, 3915255, 3946164, 3953850, 3948690, 3921358, 3925292, 3926848, 3952070, 3924667, 3961280, 3985801, 4022348, 4067088, 4004756, 4033978, 4000775, 4017753, 3995548, 3953134, 3995638, 4030800, 3932853, 3957613, 4057051, 4010074, 4036648, 4047203, 4178917, 4189892, 4184790, 4257786, 4317292, 4348623, 4400802, 4541224, 4603671, 4636718, 4697704, 4792756, 4909081, 4963528, 5072875, 5121435]
6054E121435Q9541J22115K0914J18782J3234P9253O6157m0060k214J0457M5900
6043E645514Q0022J2658L0925L5344L7394J20306J16313J02025J36213J40333
6033F457047R9952J88883K67981J31415J51427J99783J42454K15121K20467K04954
6023H279484J17655J84142J08297K0039J2492j6993m7145j76490q6804j21450
6013H273227j42075j50977j07944p1144j03795q0995j42224j31499m2407q0401
6003G219766q0468o9391p0948p6191j0052j1789j95967n3547p2388q8562q8165
5992F402298o365j04947j29726j09116n1196q9915j36826o7942m1078m4857n4661
5981E565669K76r8769j06436P1141L1463j13893p2885K6646m7128q7574o9575
$$ y = [5121435, 5210976, 5333091, 5354005, 5472787, 5486021, 5565274, 5631431, 5591371, 5589157, 5599614, 5645514, 5725536, 5738194, 5769119, 5804463, 5841857, 5962163, 6078476, 6180501, 6316714, 6457047, 6556999, 6745882, 7013863, 7145278, 7296705, 7496488, 7638942, 7854063, 8074530, 8279484, 8397139, 8581281, 8689578, 8709617, 8722109, 8705116, 8657971, 8481481, 8394677, 8273227, 8131152, 7980175, 7872231, 7801087, 7697292, 7616297, 7474073, 7342574, 7300167, 7219766, 7139298, 7069907, 6998959, 6922768, 6912716, 6900927, 6704960, 6651413, 6579025, 6490463, 6402298, 6395933, 6290986, 6161260, 6052144, 6000948, 5911033, 5774207, 5706265, 5665187, 5620330, 5565669, 5565945, 5467176, 5360740, 5431881, 5463344, 5349451, 5276566, 5303212, 5256084, 5168510, 5098935]
5970E098935N485p756j4167L3511Q4006j7831l2699K1648Q7933k7020j7413O4385
5958E279017K7098R9069N7788K1699L9699J348P9959J52882O8146L6031P7645
5947E940381P0262J09264N8478L7374N3649q8007n9066l2556j3453m2719L2145
5936F065752J1338l9268j10824j6632q2427N7060Q0766j7516l6493N5517L0046
5925E997319M2133R8443J22439M9370J76312J71602K02680J81545J88695K51009
5915G481547J89458K64809J85030K50875K13811J82744K01300K49978J79459K56329
5905I655340K06804J52579J83665J43467N1617n5747P2489m9174L0368M4913L7099
5894A0473420P0831J37167J61637O6730J77409J44192K02435K43946J69761K60532
$$ y = [5098935, 5104420, 5096664, 5082497, 5116008, 5200014, 5182183, 5149484, 5171132, 5259065, 5232045, 5214632, 5279017, 5306115, 5405184, 5462972, 5484671, 5524370, 5525718, 5605677, 5758559, 5826705, 5862736, 5940381, 6010643, 6119907, 6178385, 6215759, 6269408, 6181401, 6122335, 6089779, 6076326, 6033607, 6065752, 6077090, 6037822, 5926998, 5910366, 5827939, 5884999, 5965765, 5948249, 5911756, 5967273, 5997319, 6039452, 6137895, 6260334, 6309704, 6486016, 6657618, 6860298, 7041843, 7230538, 7481547, 7671005, 7935814, 8120844, 8371719, 8585530, 8768274, 8969574, 9219552, 9399011, 9655340, 9862144, 10014723, 10198388, 10341855, 10393472, 10337725, 10410214, 10361040, 10391408, 10436321, 10473420, 10544251, 10681418, 10843055, 10909785, 11087194, 11231386, 11433821, 11677767, 11847528, 12108060]
5884A2108060K87269K53812L01622J81966K10522J81585J55879K34788K00388
5875A4115891K11500K55152J68089J69760K36288J81565L5086O6567P0929p9672
5865A5431155o6469l6840j0245N9767J30444J48910K09944J16781J54912J96724
5855A6335083K22839K00717J85594J54179M1969j2016j45479j98050k20962l51824
5845A6212050m30362m37662l72716m01164l65128l00238k84608k20352k49839
5836A3149981j88228n3732p3301j12269J138j55423p9313j6713j23776j66935
5826A2181429o5017K4338l4732m0387j3965M654K9812M8920O6815N5917L4134
5815A2291918L6323J16094J14515J06048P5126J89011K12203J99248K02956J35607
$$ y = [12108060, 12395329, 12649141, 12950763, 13132729, 13343251, 13524836, 13680715, 13915503, 14115891, 14327391, 14582543, 14750632, 14920392, 15156680, 15338245, 15373331, 15439898, 15510827, 15431155, 15364686, 15327846, 15317601, 15377368, 15507812, 15656722, 15866666, 15983447, 16138359, 16335083, 16557922, 16758639, 16944233, 17098412, 17140381, 17128365, 16982886, 16784836, 16563874, 16212050, 15781688, 15344026, 14971310, 14570146, 14205018, 13904780, 13620172, 13399820, 13149981, 12961753, 12908021, 12834720, 12722451, 12723589, 12568166, 12488853, 12472140, 12348364, 12181429, 12116412, 12140750, 12106018, 12065631, 12051666, 12056320, 12086132, 12135052, 12201867, 12257784, 12291918, 12328241, 12444335, 12558850, 12664898, 12740024, 12929035, 13141238, 13340486, 13543442, 13679049]
5805A3679049J46551J89916J59939J79891R1829Q4374J2593n8806J748l4742j46796
5794A4305546n9474k4695j03303p2153L4936O836J0578j0802L392J66865k8957
5783A4228769m5566p8095j26495j99007k62553k87474l60841l22999k98956l87681
5773A1859102l13641l03090l31382k95046k62606l29530k13604j76618j71701
5764I461884k00595j47287j46995j83725k24258j49421j6432o4477q8683o1561
5754H178450r863l8959q7746n6073N1796q7310p4144m3690N4917j03321n7322
5743G726735n67r004J7181j2552k3820l2231Q0514J33570L3086M5777K20902J99220
5731H378811K31779K66479K80158K73192K59199K19185J18600R7699o748n4803
$$ y = [13679049, 13825600, 14015516, 14175455, 14355346, 14447175, 14531549, 14544142, 14485336, 14487084, 14452342, 14305546, 14246072, 14221377, 14118074, 14045921, 14080857, 14087693, 14098271, 14087469, 14090861, 14257726, 14228769, 14183203, 14105108, 13978613, 13779606, 13517053, 13229579, 12868738, 12545739, 12246783, 11859102, 11545461, 11242371, 10910989, 10615943, 10353337, 10023807, 9810203, 9633585, 9461884, 9261289, 9114002, 8967007, 8783282, 8559024, 8409603, 8393171, 8328694, 8240011, 8178450, 8168587, 8129628, 8041882, 7985809, 8037605, 7950295, 7876151, 7832461, 7887378, 7784057, 7726735, 7726168, 7717164, 7734345, 7721793, 7697973, 7665742, 7746256, 7879826, 7912912, 7958689, 8179591, 8378811, 8610590, 8877069, 9157227, 9430419, 9689618, 9908803, 10027403, 10125102, 10118354, 10063551]
5721A0063551j9803r6239o0964n9720k1330P4026J35098J08339K22234K76855
5711A0622047K97124L51472L34625L19231L12603K95124K49508K31846R1119O6284
5701A3170983J33667K8878l374J01920n1902q0861l2972J3097J23517J85946J67202
5690A3756101Q7991J67657J78455K2178l7044j06006j39986j96531k38766k03140
5680A3290909j03803j11101j59672l0628K460P9633N1749J72191J25069N1768
5670A3368575Q8341J04903Q8748P5343J3368J01912R7067L3199k3551R2943J44211
5659A4185059J14068N5010k2710p4984j74241k16960j79547k39584j54621j05101
5649A3186389j05159j63446p8700o3258j9195p61J4935P3851M2324L2959M1218
$$ y = [10063551, 10043748, 9947509, 9886545, 9826825, 9805495, 9879521, 10014619, 10122958, 10345192, 10622047, 10919171, 11270643, 11605268, 11924499, 12237102, 12532226, 12781734, 13013580, 13104699, 13170983, 13304650, 13333528, 13330154, 13432074, 13380172, 13299311, 13266339, 13279436, 13402953, 13588899, 13756101, 13844092, 14011749, 14190204, 14212382, 14175338, 14069332, 13929346, 13732815, 13494049, 13290909, 13187106, 13076005, 12916333, 12885705, 12888165, 12967798, 13019547, 13191738, 13316807, 13368575, 13456916, 13561819, 13650567, 13725910, 13739278, 13841190, 13938257, 13971456, 13947905, 14040848, 14185059, 14299127, 14354137, 14331427, 14256443, 14082202, 13865242, 13685695, 13446111, 13291490, 13186389, 13081230, 12917784, 12839084, 12775826, 12756631, 12755870, 12770805, 12844656, 12886980, 12919939, 12961157]
5638A2961157J26467k2243M5258Q9411J33548J27745J57323L58286N16576M82004
5628A4975532N62515N27382M42497K66943J25618n9266j31251l6453K0878M9515
5618A6743910L7760j9070M1173J05650K9148j8259m7288J2928m8857l1666J7228
5607A6822657l005P1668J07436Q8566J14959J77720K14288K48458K29749L18235
5597A8390731K95429K27266K46180J26652j53522k73503n76833p13604n52448
5588A7016348n54062m32288l75050l02196k75464k79063j66572j60720j53198
5579A4317735k02104j71613R284J00610L350J26980J69253K78350K74403K78395
5569A5184643K44330L54729M41396M57699M35811N37370N61929N31608M14609
$$ y = [12961157, 13087624, 13065381, 13110639, 13200050, 13333598, 13461343, 13618666, 13976952, 14493528, 14975532, 15538047, 16065429, 16507926, 16774869, 16900487, 16841221, 16709970, 16673517, 16694395, 16743910, 16781670, 16762600, 16803773, 16909423, 16938571, 16920312, 16873024, 16885952, 16837095, 16805429, 16822657, 16819652, 16891320, 16998756, 17087322, 17202281, 17380001, 17594289, 17842747, 18072496, 18390731, 18686160, 18913426, 19159606, 19286258, 19132736, 18859233, 18282400, 17568796, 17016348, 16462286, 16029998, 15654948, 15352752, 15077288, 14798225, 14631653, 14470933, 14317735, 14115631, 13944018, 13953302, 14053912, 14057262, 14184242, 14353495, 14631845, 14906248, 15184643, 15428973, 15783702, 16225098, 16682797, 17118608, 17655978, 18217907, 18749515, 19164124]
5560A9164124M84438M31382K98413L01015K75438K45307K13011J45366N160j35185
5550B1428469j99841k84685l20726l92769l74091m50483m91646l78513m44710
5541A8091005l58237l66771j99376j66241p9606N1366K7451k3021J31754Q7447
5531A7195771J80770J72340J74722J69791J93079M4102J5033p6302k40132k29743
5521A7599431k48222m03052m24150m64353m85111m74775n13678n50787m64989
5512A3570314m43814l98889m29306m31957m62492l56776k74404k70173k56693
5503A0245810l06141k71772k02404j91318j11643j47158j55155j40706j32919
5494H586594n7909m387q4438r4509K2694K9351p510K393J13997N5089M8276O6655
$$ y = [19164124, 19648562, 20079944, 20378357, 20679372, 20954810, 21200117, 21413128, 21558494, 21563654, 21428469, 21228628, 20943943, 20623217, 20230448, 19856357, 19405874, 18914228, 18535715, 18091005, 17732768, 17365997, 17166621, 17000380, 16920774, 16972140, 16999591, 16976570, 17108324, 17195771, 17376541, 17548881, 17723603, 17893394, 18086473, 18130575, 18145608, 18069306, 17829174, 17599431, 17351209, 16948157, 16524007, 16059654, 15574543, 15099768, 14586090, 14035303, 13570314, 13126500, 12727611, 12298305, 11866348, 11403856, 11047080, 10772676, 10502503, 10245810, 9939669, 9667897, 9465493, 9274175, 9162532, 9015374, 8860219, 8719513, 8586594, 8528685, 8524298, 8439860, 8345351, 8368045, 8397396, 8389886, 8392279, 8506276, 8561365, 8609641, 8676296]
5482H676296K7155n499P6471J24245O389Q6437R5703R1935J08253Q9202J9884
5471I396471j571J16069N3474O3396l206N37k1089l6746q4674q2175n8513r9796
5459I242177j91622q4682j00046q7819j35934p2078k08002j25565j17233j55797
5449G963399j43850k25457j25364j41320j87551j32636j33659j18795j06673q3173
5439F564921m6278j30945j07253q1944p0178p4622r2409r2680j5789l6053j01825
5428E714945o6395r3001j5422L8793j49974o4425J2014J4989j6889j4017k7363
5417E333255k4992k9650q4630r8811k6272M1816q1842p2859M0468o7998L5351
5406D963836l4277p282l3766j09620j7992m2192j4136n1583k6697q0387m4326
$$ y = [8676296, 8703451, 8697952, 8774423, 8898668, 8905057, 8991494, 9087197, 9179132, 9287385, 9376587, 9396471, 9394900, 9510969, 9564443, 9627839, 9624633, 9625170, 9604081, 9567335, 9482661, 9400486, 9341973, 9242177, 9050555, 8965873, 8865827, 8778008, 8642074, 8569996, 8361994, 8236429, 8119196, 7963399, 7819549, 7594092, 7468728, 7327408, 7139857, 7007221, 6873562, 6754767, 6648094, 6564921, 6518643, 6387698, 6280445, 6198501, 6128323, 6053701, 5961292, 5868612, 5852823, 5816770, 5714945, 5648550, 5555549, 5540127, 5578920, 5428946, 5364521, 5376535, 5391524, 5374635, 5360618, 5333255, 5308263, 5278613, 5193983, 5095172, 5068900, 5110716, 5028874, 4956015, 4996483, 4928485, 4963836, 4929559, 4922277, 4888511, 4778891, 4760899, 4718707, 4704571, 4652988, 4626291, 4545904, 4501578]
5395D501578m7559M998l3471k3490k7952P0797Q464K739O1346N692l1791K7013
5383D518364P1980L7357L1369n278q9602k5282l1712p2284K8510m1106j03833
5372D318483n0056M9844j4653m7193l660K0173K8501j10655j2329l5755L9719
5361D182419M2108q7898O6489k5164R0003J1815o6704R1971L9838K5722n3206
5350D317393l6188j6256M1051j3369l3451N6923K8800N4272N3887R5070m8822
5339D499310J0846j4540J1017O4802P479o6039n2504q2969K0575q1684o6984K5973
5327D275282k4665L9257K147m6944l2937m1751p2472j3687N1146J8699o747J4097
5315D161425q3793p2950P4912R5534M9998k8114l3813L8372N357K7984O1115J2005
$$ y = [4501578, 4454019, 4459017, 4425546, 4402056, 4374104, 4444901, 4453365, 4456104, 4517450, 4523142, 4491351, 4518364, 4590344, 4627701, 4659070, 4653792, 4564190, 4538908, 4507196, 4434912, 4463422, 4422316, 4318483, 4268427, 4318271, 4303618, 4256425, 4252765, 4272938, 4301439, 4190784, 4178455, 4142700, 4182419, 4224527, 4136629, 4203118, 4177954, 4267957, 4279772, 4213068, 4305039, 4344877, 4370599, 4317393, 4281205, 4264949, 4306000, 4292631, 4259180, 4316103, 4344903, 4399175, 4453062, 4548132, 4499310, 4510156, 4495616, 4506633, 4571435, 4578914, 4512875, 4460371, 4377402, 4397977, 4316293, 4249309, 4275282, 4250617, 4289874, 4292021, 4245077, 4212140, 4170389, 4097917, 4084230, 4135376, 4154075, 4147328, 4161425, 4077632, 4004682, 4079594, 4175128, 4225126, 4197012, 4163199, 4201571, 4206928, 4234912, 4296027, 4308032]
5303D308032o6581k9883N9123k6262m6191K5540O923n3014k9909R4331M863m859
5291D242113J7834O976K1131j1278Q364L2978N436M8473J03637N9959J02200J01996
5279D739819J33407J40267M2588K3848j03501n2287j15744j68553j29242j16553
5269D394049p4534r0012r0353n8757J1295j7216p5592N3133p8969o8375k9734
5258C874935K1912O065J4127o085q5145j8658j8192P0598K7608J3247q8021j8331
5246C794060m9869M0583L7428l0715O6141J1226L1279j0562n2651k8632J4308
5235C822596K533R028K8693L6149R7597k0598L6087M8100P6500M9960M463P7980
5223D269088M3105R1070J47045Q0356J59902J32175P3863P4665k0363J1380m9344
$$ y = [4308032, 4241451, 4211568, 4270691, 4244429, 4198238, 4223778, 4230701, 4177687, 4147778, 4242109, 4246972, 4242113, 4259947, 4266923, 4288054, 4276776, 4285140, 4318118, 4323554, 4372027, 4475664, 4535623, 4637823, 4739819, 4873226, 5013493, 5056081, 5079929, 4976428, 4924141, 4808397, 4639844, 4510602, 4394049, 4319515, 4229503, 4139150, 4080393, 4091688, 4074472, 3998880, 4052013, 3973044, 3904669, 3874935, 3896847, 3902912, 3917039, 3910954, 3825809, 3807151, 3788959, 3859557, 3887165, 3900412, 3812391, 3794060, 3744191, 3784774, 3822202, 3791487, 3857628, 3868854, 3900133, 3889571, 3836920, 3808288, 3822596, 3825129, 3834157, 3862850, 3898999, 3996596, 3975998, 4012085, 4060185, 4136685, 4186645, 4191108, 4269088, 4312193, 4403263, 4550308, 4630664, 4790566, 4922741, 4996604, 5071269, 5050906, 5062286, 5012942]
5212E012942j40232j46169q0379O972j00017l3205R196K411k118m3861j16445
5201D369095P4937M4910p834m0568j2964L4522P9022m1016j1366O958l9892N5758
5189D511562n2746k8755n2770O1387J4489j9250N416R089l5933Q0527j2238K8878
5177D509656L3588M9537j654J8232O8317K7508P6759L2472J8238O7972L0840O2390
5165D993855n4680L5599k9526L3721k6086k7628K9198L231n349L4260O2113P228
5153E055936O8762K5506j7138L9598L3075K2951L0631L1842J1202L9559Q4230
5142E426154r000J0585K3029O5557N3556k7713l7970K1889l3227m0024L6274K3621
5130E512731q5144m6928Q6262N758j0758n726o3408J8243J2841l9308K3384L9966
$$ y = [5012942, 4872710, 4726541, 4646162, 4653134, 4553117, 4519912, 4529108, 4531519, 4529401, 4485540, 4369095, 4444032, 4488942, 4481108, 4440540, 4427576, 4462098, 4541120, 4500104, 4488738, 4495696, 4455804, 4511562, 4458816, 4430061, 4377291, 4438678, 4453167, 4433917, 4439333, 4448422, 4412489, 4493016, 4480778, 4509656, 4543244, 4592781, 4591127, 4609359, 4677676, 4705184, 4781943, 4814415, 4832653, 4900625, 4931465, 4993855, 4939175, 4974774, 4945248, 4978969, 4952883, 4925255, 4954453, 4957684, 4952335, 4986595, 5048708, 5055936, 5124698, 5150204, 5133066, 5172664, 5205739, 5228690, 5259321, 5291163, 5302365, 5341924, 5426154, 5417154, 5427739, 5450768, 5516325, 5569881, 5542168, 5504198, 5526087, 5492860, 5452836, 5489110, 5512731, 5427587, 5380659, 5466921, 5472679, 5461921, 5456195, 5392787, 5411030, 5423871, 5384563, 5407947, 5447913]
5118E447913l5787J912L41J29616M1139k5637J00912J16139K4372J6142O0210
5107E877272O7432L0497R3434K4446k5272l3179J3582O1482j7329j1478K2635
5096F103522l5847L981O2957Q8273J8697J5713K7558L5980M0629k7769M6316J68301
5084F548311M1402j3952J2978P0882O2421O6108J00477L8979J2619j2903R7617
5073G024939N7356N1347R7299R3960N0243K7576M5342K3806P5439K7989M6056
5062G621352Q0591J23966Q7296J39001J06854M8308K7276M6412J09698J06251
5052H497005P7635Q9567R8924J25377Q3014L7462M9176J17437L7277J4041j4765
5041I212150P8290J3645J14665K06909O5572P0461J04109J53996J29972R8488
$$ y = [5447913, 5412126, 5414038, 5414379, 5543995, 5585134, 5559497, 5660409, 5776548, 5800920, 5817062, 5877272, 5944704, 5975201, 6068635, 6093081, 6067809, 6034630, 6048212, 6109694, 6092365, 6080887, 6103522, 6067675, 6071656, 6134613, 6222886, 6241583, 6257296, 6284854, 6320834, 6361463, 6333694, 6380010, 6548311, 6589713, 6575761, 6588739, 6659621, 6722042, 6788150, 6888627, 6927606, 6940225, 6927322, 7024939, 7082295, 7133642, 7230941, 7324901, 7375144, 7402720, 7448062, 7471868, 7547307, 7575296, 7621352, 7701943, 7825909, 7913205, 8052206, 8159060, 8207368, 8234644, 8281056, 8390754, 8497005, 8574640, 8664207, 8763131, 8888508, 8971522, 9008984, 9058160, 9175597, 9212874, 9226915, 9212150, 9290440, 9304085, 9418750, 9625659, 9691231, 9761692, 9865801, 10019797, 10149769, 10248257]
5031A0248257R1638J79105J41141J46230R5428J73386J97938K75348J99075J79877
5021A1927423J58072J15780J56482K35680K75580J77834J71067K29976L14334
5012A3762228M16198K64082L04505L81579L71267L99390M44791L76643L96854
5003A7117537N03130N36992O29571O13747O56173O67609P79005J044696J011199
4994B3559659J124964J195842J197852J363133J409281J428461J552465J722179
4986C4553836K030798K264173K674698K999702L425182M157348N002137N644307
4978F2752181O522777P666752R138850J1268048J4281038J8251911K2467994K6043691
4970A78393242K9107923K8440528K3063448J5510366K287519j2253818k0606620
$$ y = [10248257, 10339895, 10519000, 10660141, 10806371, 10901799, 11075185, 11273123, 11548471, 11747546, 11927423, 12085495, 12201275, 12357757, 12593437, 12869017, 13046851, 13217918, 13447894, 13762228, 14178426, 14442508, 14747013, 15128592, 15499859, 15899249, 16344040, 16720683, 17117537, 17620667, 18157659, 18787230, 19400977, 20057150, 20724759, 21503764, 22548460, 23559659, 24684623, 25880465, 27078317, 28441450, 29850731, 31279192, 32831657, 34553836, 36584634, 38848807, 41523505, 44523207, 47948389, 52105737, 57107874, 62752181, 69274958, 76941710, 86080560, 97348608, 111629646, 129881557, 152349551, 178393242, 207501165, 235941693, 259005141, 274515507, 276803026, 264549208, 243942588]
4963B43942588k5913010k6368479k1747567j7307778j3908489j1418722r665275
4956A17613268q757289q124650p483140o876011o142411n122229m561160m150996
4948F6395382l650905l273052k915372k449006k029080j697952j488528j206436
4940D7685051r02140p04966n53998m12179k78490j93059J4349J21003K37130M67483
4930D5480184N67432O43753P29689Q57907R17191J042735J223741J532952J889211
4921E4884795K304726K752133L357510L962655M798576N723620O854445Q256097
4913I2894557J0236127J2907937J6414084J9929988K3087505K6619635K7334880
4906B29424713K2242756J6703735Q368968o100742j4778788j8890387k4304235
$$ y = [243942588, 218029578, 191661099, 169913532, 152605754, 138697265, 127278543, 117613268, 108855979, 100731329, 93248189, 86372178, 80229767, 75107538, 70546378, 66395382, 62744477, 59471425, 56556053, 54107047, 52077967, 50380015, 48891487, 47685051, 46782911, 46077945, 45523947, 45111768, 44833278, 44640219, 44654568, 44775571, 45012701, 45480184, 46047616, 46691369, 47421058, 48278965, 49196156, 50238891, 51462632, 52995584, 54884795, 57189521, 59941654, 63299164, 67261819, 72060395, 77784015, 84638460, 92894557, 103130684, 116038621, 132452705, 152382693, 175470198, 202089833, 229424713, 251667469, 268371204, 276740172, 270639430, 255860642, 236970255, 212666020]
4899B12666020k4043454j9275877j5579790j2972574j0741996r165273q469355
4892A12417701p745116o856136o323755n745881n065337m624212m161048l689337
4884F8206879l235091l035552k623173k250806j978658j817457j463969j299517
4876E0502656j200609j054852r99616r51294j088793j066286j070236j054146
4868D2016824j069575j063957j087143j055647j009600q77707q82589r21270q82096
4859C3167240q05934p80837p10179n61588o54222n44028m42982m79363m09529
4850B7778578l52895k46299j91264j94573k52677k55461k04560j94144j21685
4841B5765020j93847j43034k06375k66570j83494k80286k11004k43526k96367
$$ y = [212666020, 188622566, 169346689, 153766899, 140794325, 130052329, 120887056, 112417701, 104672585, 97816449, 91492694, 85746813, 80681476, 76057264, 71896216, 68206879, 64971788, 61936236, 59313063, 57062257, 55083599, 53266142, 51802173, 50502656, 49302047, 48247195, 47247579, 46296285, 45207492, 44141206, 43070970, 42016824, 40947249, 39883292, 38796149, 37740502, 36730902, 35853195, 34970606, 34049336, 33167240, 32361306, 31580469, 30870290, 30308702, 29654480, 29110452, 28667470, 28188107, 27778578, 27425683, 27179384, 26988120, 26793547, 26540870, 26285409, 26080849, 25886705, 25765020, 25571173, 25428139, 25221764, 24955194, 24771700, 24491414, 24280410, 24036884, 23740517]
4832B3740517k84586j81815k58177k32259j50636p3218k0528j25857n6640o1388
4822B2295413n5198o5903r9910j33575j73705j15716p5019j43988j45186k3226
4812B1263987K3099M1538R4529J08033J52711J29886K59779K59523K68545M22213
4802B3023843L42695L88498M96688M24283M76231N21679M77823N08261N58038
4793B7218039L84974K96658K36967J10369j24079k12746k97210l78046l77077
4784B6857849m90782n34941m84309m33754l61909m48316l27470l06940l66704
4775B3102724k20251j64900k20931k15550j93574j47421k11301k98783k59342
4766B1170671k61399k41306k31463k83748k73648j96077k41808k54675j51192
$$ y = [23740517, 23455931, 23274116, 23015939, 22783680, 22633044, 22559826, 22539298, 22413441, 22356801, 22295413, 22240215, 22174312, 22074402, 21940827, 21767122, 21651406, 21576387, 21432399, 21287213, 21263987, 21287086, 21328624, 21423153, 21531186, 21683897, 21813783, 22073562, 22333085, 22601630, 23023843, 23366538, 23755036, 24251724, 24676007, 25152238, 25673917, 26151740, 26660001, 27218039, 27603013, 27899671, 28136638, 28247007, 28122928, 27910182, 27612972, 27234926, 26857849, 26367067, 25832126, 25347817, 24914063, 24552154, 24103838, 23776368, 23469428, 23102724, 22882473, 22717573, 22496642, 22281092, 22087518, 21940097, 21728796, 21430013, 21170671, 20909272, 20667966, 20436503, 20152755, 19879107, 19683030, 19441222, 19186547, 19035355]
4757A9035355j55908k17932j31941j59880j77831q6573n6824l4190l1147k8794
4747A7954335n5501M2348Q7637M2203R1865O8815J59370J18024J46954J93540
4737A8849590J34620K01390K30037J30038K72359K40417J99826J81766J23923
4728B0563966O0525J49664J03877K7822M7937J6825O9779N3204J9963m2102K2003
4717B1093463Q776o0722n2526r3429m5948m3086K0592O7814R4372Q0224J23982
4706B1193512J6555J67787K47804J72391J92964K90838L08860K79809K37275K00973
4696B3308768K49636J95427K51173K13272J92827J64248J82879K30803L46014
4687B5335047L73731M31458N38430N20840N16305O03931O37623O11567M94476
$$ y = [19035355, 18879447, 18661515, 18529574, 18369694, 18191863, 18105290, 18048466, 18014276, 17983129, 17954335, 17898834, 17941182, 18028819, 18071022, 18162887, 18231702, 18391072, 18509096, 18656050, 18849590, 18984210, 19185600, 19415637, 19545675, 19818034, 20058451, 20258277, 20440043, 20563966, 20624491, 20774155, 20878032, 20905854, 20953791, 20970616, 21040395, 21093599, 21113562, 21071460, 21093463, 21102239, 21041517, 20988991, 20895562, 20849614, 20806528, 20827120, 20894934, 20989306, 21069530, 21193512, 21210067, 21377854, 21625658, 21798049, 21991013, 22281851, 22590711, 22870520, 23107795, 23308768, 23558404, 23753831, 24005004, 24218276, 24411103, 24575351, 24758230, 24989033, 25335047, 25708778, 26140236, 26678666, 27199506, 27715811, 28319742, 28957365, 29568932, 30063408]
4678C0063408M35681L76296K91838J67892J10442K1044m0886j92009j92959j31036
4668C0909711k13030k04138k25013k70200k77143l24239k61326k66893j51073
4659B8716656q2547M9029j2237Q5784J50165Q7813O9572J8491n4417r3739j24035
4648B8810535k92017k26523k52914k68538l39432l03621l18104k32931j17023
4639B6459432n4452K4354O1208P6725R0238J18472J81417J20885J27892K02240
4629B7408411J42305J45990Q9537J66484J58284M9765O970n3372p8262r6897j42732
4618B7796483r7890l7649j4224P0645J00671K02473K59871L30972M11648M44853
4608B9467853N50663P21190P62739P96877P31444P38176O80504M15680R8931q5306
$$ y = [30063408, 30499089, 30875385, 31167223, 31335115, 31445557, 31466601, 31425715, 31233706, 31040747, 30909711, 30696681, 30492543, 30267530, 29997330, 29720187, 29395948, 29134622, 28867729, 28716656, 28634109, 28683138, 28670901, 28756685, 28906850, 28994663, 29064235, 29082726, 29028309, 28934570, 28810535, 28518518, 28291995, 28039081, 27770543, 27431111, 27127490, 26809386, 26576455, 26459432, 26404980, 26429334, 26490542, 26567267, 26657505, 26775977, 26957394, 27078279, 27206171, 27408411, 27550716, 27696706, 27786243, 27952727, 28111011, 28160776, 28167746, 28114374, 28036112, 27939215, 27796483, 27698593, 27660944, 27646720, 27717365, 27818036, 28020509, 28280380, 28611352, 29023000, 29467853, 30018516, 30739706, 31502445, 32299322, 33030766, 33768942, 34449446, 34865126, 34964057, 34878751]
4598C4878751j75942j97138k66484k63135j23387q6204p6157q1063j69512j32866
4588C3306863k51236l23319l33382k20890j09315q745R0690K59932L74243N25345
4578C3310186O08528M68994L85826K03729P0863k09012l83622n29130o05510n76509
4568C2744343m32977m09790l28621l17828k84192k19302k19714j90745p811n2558
4558C0280805O27J76414R5915J54362K07621L04663L24476K98625M23314M46294
4548C2713116M88682O05659N93617O02418O38963N53309N37156M88762M97358
4539C7719040O11498P27320Q97591R92781J105528J396702J649382J792529J935751
4530D8828122K052821J993924J985166J774041J498667J126050P49040M85993
$$ y = [34878751, 34702809, 34505671, 34239187, 33976052, 33852665, 33766461, 33690304, 33609241, 33439729, 33306863, 33055627, 32732308, 32398926, 32178036, 32068721, 32059976, 32150666, 32410598, 32784841, 33310186, 33918714, 34387708, 34773534, 34977263, 35048126, 34839114, 34455492, 33926362, 33320852, 32744343, 32311366, 31901576, 31572955, 31255127, 30970935, 30751633, 30531919, 30341174, 30333363, 30280805, 30281432, 30457846, 30553761, 30708123, 30915744, 31220407, 31544883, 31843508, 32266822, 32713116, 33201798, 33807457, 34401074, 35003492, 35642455, 36195764, 36732920, 37221682, 37719040, 38330538, 39057858, 39955449, 40948230, 42053758, 43450460, 45099842, 46892371, 48828122, 50880943, 52874867, 54860033, 56634074, 58132741, 59258791, 60007831, 60493824]
4522F0493824R7666M7009l5472J00119L65490N29417P46370J065887J214016J345588
4512F5969914J620574J792495K031833K163190K420243K670435K890423L173527
4504H4732634L318559L415316L382996K904040K248024J321608R9825j078584
4496A00344418k101519l043208l648537l962821l908471l615519l323640l007144
4488G3733559k806332k360255k067676j845737j468847j180972p53301m86856
4480F0763583k24248J55170L78910P25718J037755J343024J504635J741403J986731
4471F9412681K095283K042293J814922J323207N52513l94943j358742k271035
4463G3216179k940906l142577l136311l147232k913195k658092k415825k155809
$$ y = [60493824, 60591490, 60638499, 60603027, 60703146, 61068636, 61598053, 62344423, 63410310, 64624326, 65969914, 67590488, 69382983, 71414816, 73578006, 75998249, 78668684, 81559107, 84732634, 88051193, 91466509, 94849505, 97753545, 100001569, 101323177, 101423002, 100344418, 98242899, 95199691, 91551154, 87588333, 83679862, 80064343, 76740703, 73733559, 70927227, 68566972, 66499296, 64653559, 63184712, 62003740, 61250439, 60763583, 60539335, 60694505, 61073415, 61799133, 62836888, 64179912, 65684547, 67425950, 69412681, 71507964, 73550257, 75365179, 76688386, 77240899, 76845956, 75487214, 73216179, 70275273, 67132696, 63996385, 60849153, 57935958, 55277866, 52862041, 50706232]
4455E0706232j959940j867312j654450j447309j330916j222577j031255r93446
4447C9199027r49414q89785q49329p54756p92268p05234o75937p00320n96035
4438C2285949n70885n72824n01590m70854m35515m88363l60434l33176k96076
4429B8256232k54521j53941j78417j01866l6980J17944K10219R5238J87256L10537
4419B8451701M04801M67628M85234M95681N03864M23074L97803K73322K61900
4410C2165008K29038K70918M52159O54833P65138R70252J235602J502595J741340
4401C9986883K147737K607349L077871L712416M149427M428377M449205M146246
4393F8705511K801473J101629q08394k894512l918408l937015l452968k952497
$$ y = [50706232, 48746292, 46878980, 45224530, 43777221, 42446305, 41223728, 40192473, 39199027, 38249613, 37359828, 36510499, 35755743, 34963475, 34258241, 33582304, 32881984, 32285949, 31715064, 31142240, 30640650, 30169796, 29734281, 29245918, 28885484, 28552308, 28256232, 28001711, 27847770, 27669353, 27567487, 27530507, 27648451, 27858670, 27953908, 28141164, 28451701, 28856502, 29324130, 29809364, 30305045, 30808909, 31231983, 31629786, 31903108, 32165008, 32394046, 32664964, 33117123, 33771956, 34537094, 35507346, 36742948, 38245543, 39986883, 42134620, 44741969, 47819840, 51532256, 55681683, 60110060, 64559265, 68705511, 71506984, 72608613, 71800219, 68905707, 64987299, 61050284, 57597316, 54644819]
4385E4644819k518403k269054j957173j844612j812576j661017j536629j448710
4377C9596645j167315r57806r35714o08829l55707j74104K5170K12049K18394
4368C5852783K48397k9793l73077o77844j140752j324791j209715j066236r45875
4359B9333097p14126n49334m96055l69379k46456k19591j97706p9089n6578J9842
4349B6424625l5400q5739j52295j66746k46506l93282l31589l31214k95095k20407
4339B4166352j57069k91034l16830k57829k79495j41952j48574j74660k58958
4330B2139951k51226l37902n16181o44934p06617n91629n64293m59033m58365
4321A7609771m48586l51916l83967m10329l02607k85532k06334k46533k37113
$$ y = [54644819, 52126416, 49857362, 47900189, 46055577, 44243001, 42581984, 41045355, 39596645, 38429330, 37471524, 36535810, 35926981, 35571274, 35397170, 35422340, 35634389, 35852783, 36101180, 36071387, 35698310, 35020466, 33879714, 32554923, 31345208, 30278972, 29333097, 28618971, 28069637, 27573582, 27204203, 26957747, 26738156, 26540450, 26461361, 26404783, 26424625, 26389225, 26303486, 26151191, 25984445, 25737939, 25344657, 25013068, 24681854, 24386759, 24166352, 24009283, 23718249, 23401419, 23143590, 22864095, 22722143, 22573569, 22398909, 22139951, 21888725, 21550823, 21034642, 20389708, 19683091, 19091462, 18527169, 18068136, 17609771, 17161185, 16809269, 16425302, 16014973, 15712366, 15426834, 15220500, 14973967, 14736854]
4312A4736854k56560j63903j16347k27772j77231p5884j40606m6699j26087m4395
4302A3361370K1870k2423l7106p0430j8769n7817j05535j54155j30299j11110
4292A2675596p0150q6897m7534R818m9646p2749j3929R8262K9073k3515m1L8292
4280A2486580J7570k0722M4509n938M1075o550O5978r393O2767N3101J34109J24753
4268A2987839L2457M2678P4759J77396N3661J31540J12095K7256J10110K16664
4258A3966455J83842J36005J90442K43693K92629K20640K65017L07726L04857
4249A6111306L10989K75354L01827L61445L20232K78896L09415K95861J92490
4240A8757815K72325J70454J97882L33987K03902K76297K56107J82057K29221
$$ y = [14736854, 14480294, 14316391, 14200044, 13972272, 13795041, 13719157, 13578551, 13531852, 13405765, 13361370, 13383240, 13360817, 13323711, 13253281, 13234512, 13176695, 13071160, 12917005, 12786706, 12675596, 12605446, 12518549, 12471015, 12480833, 12431187, 12358438, 12344509, 12442771, 12471844, 12448329, 12448288, 12486580, 12504150, 12483428, 12527937, 12521999, 12563074, 12556524, 12622502, 12613109, 12675876, 12728977, 12863086, 12987839, 13020296, 13062974, 13137733, 13315129, 13368790, 13500330, 13612425, 13639681, 13749791, 13966455, 14150297, 14286302, 14476744, 14720437, 15013066, 15233706, 15498723, 15806449, 16111306, 16422295, 16697649, 16999476, 17360921, 17681153, 17960049, 18269464, 18565325, 18757815, 19030140, 19200594, 19398476, 19732463, 19936365, 20212662, 20468769, 20650826, 20880047]
4231B0880047J21237J83095K30842J79020J67232K37709K46116J87844K40778
4222B2673920K64823K57685J99975K07558K32802O7373R9313J85382J2783K784
4212B4204398M575m7200L4063N4542N6650O9315J47667J72226Q4941J91290O5064
4201B5037531J00423N8737r3803j32864m7018r6381j20895r6511n4620J8714L6350
4190B4609663N8828J4352L1167n4719j01548j79111k69721k82165m00004l52989
4180B3073753l91591k96352l34767l35323l03610j97701k28738k91731l76025
4171B0317915m15392l80540l94740m35044m71200l88125m57037l93421l73953
4162A6608463l43017l83366l33688k87913l42055l50320l61493l58998l76511
$$ y = [20880047, 21001284, 21184379, 21415221, 21594241, 21761473, 21999182, 22245298, 22433142, 22673920, 22938743, 23196428, 23396403, 23603961, 23836763, 23904136, 24003449, 24188831, 24201614, 24204398, 24208973, 24161773, 24195836, 24250378, 24307028, 24376343, 24524010, 24696236, 24781177, 24972467, 25037531, 25137954, 25196691, 25102888, 24970024, 24923006, 24826625, 24705730, 24609219, 24554599, 24573313, 24609663, 24668491, 24682843, 24714010, 24659291, 24557743, 24378632, 24108911, 23826746, 23426742, 23073753, 22682162, 22385810, 22051043, 21715720, 21412110, 21214409, 20985671, 20693940, 20317915, 19902523, 19521983, 19127243, 18692199, 18220999, 17832874, 17375837, 16982416, 16608463, 16265446, 15882080, 15548392, 15260479, 14918424, 14568104, 14206611, 13847613, 13471102]
4153A3471102l09904l07689l53787l76669m47207k79455k41524k66577k83855
4144A0604435k79319l00251k16590k16592k11610j54614j83272j91226k43654
4135H607307k30884j36337j94993k23200j25292j77832j71723j26976j51760j30748
4125F937562j69604j67739j21321j01250k01425j12181n4043n2515p6505j40653
4115E740326j01520q6267q2075j09932j17931j05693j17440q3252L2760q6896
4105D882080j06474l4099q2173o6261m283r115m4234m5799j4195m3953l4693j9372
4093D377429o7876n5889k7303k1971k5650r9853q433R199j16687n1643m6469j9764
4081C845090j00859j860k5996j8152o7639o3582l4084n6513k2555k2259M399j9767
$$ y = [13471102, 13161198, 12853509, 12499722, 12123053, 11675846, 11396391, 11154867, 10888290, 10604435, 10325116, 10024865, 9808275, 9591683, 9380073, 9225459, 9042187, 8850961, 8607307, 8376423, 8240086, 8045093, 7821893, 7696601, 7518769, 7347046, 7220070, 7068310, 6937562, 6767958, 6600219, 6478898, 6377648, 6176223, 6064042, 6009999, 5957484, 5880979, 5740326, 5638806, 5552539, 5470464, 5360532, 5242601, 5136908, 5019468, 4936216, 4968976, 4882080, 4775606, 4741507, 4659334, 4593073, 4588790, 4579675, 4535441, 4489642, 4475447, 4431494, 4396801, 4377429, 4309553, 4253664, 4226361, 4204390, 4178740, 4078887, 4070454, 4079653, 3962966, 3911323, 3864854, 3845090, 3744231, 3742371, 3716375, 3698223, 3630584, 3567002, 3532918, 3476405, 3453850, 3431591, 3435990, 3416223]
4069C416223l9141r976m4573q5579M3348k9144n572J565J8301k7859k0975L5386
4057C252004j03512m2235m2394m1301M0618m0243o9807L5929j2157j884L4459
4046C009477o2103m8982q0541K8070P6391K5762k2474l7606k2787k6979J8032
4035B856260M774L6060M401l9656m2161K7287L445L7489K3827J7492M8821O1153
4023C039192R336j05309l2896j5349Q9715l5676j4016l9424j4739P867k4499n5138
4011B809064m2118J9459P3598n3515j65n506N152K5733n1523p3393k1456J6452
3999B701782N361K9944J1294j9351N9545Q772O5935K772j0425L992p5622K3542
3987B807541m9331n2635l5077j7117m0031j5257K621J5770q3587L6225K0408n6246
$$ y = [3416223, 3377082, 3367106, 3322533, 3236954, 3280302, 3251158, 3245586, 3247151, 3265452, 3237593, 3216618, 3252004, 3148492, 3106257, 3063863, 3022562, 3063180, 3022937, 2953130, 2989059, 2976902, 2975018, 3009477, 2947374, 2898392, 2817851, 2845921, 2922312, 2948074, 2925600, 2887994, 2865207, 2838228, 2856260, 2861034, 2897094, 2901495, 2861839, 2819678, 2846965, 2850410, 2887899, 2911726, 2929218, 2978039, 3039192, 3048528, 2943219, 2910323, 2894974, 2984689, 2949013, 2934997, 2895573, 2880834, 2888701, 2864202, 2809064, 2766946, 2786405, 2860003, 2806488, 2806323, 2800817, 2805969, 2831702, 2780179, 2706786, 2685330, 2701782, 2707143, 2737087, 2748381, 2729030, 2788575, 2797347, 2863282, 2866054, 2855629, 2859621, 2783999, 2807541, 2758210, 2705575, 2670498, 2653381, 2613350, 2598093, 2600714, 2616484, 2532897, 2569122, 2589530, 2533284]
3975B533284k0320J9722J436M1330p6756l4469l8801l5463R8368j6975n6251N4550
3963B469655R573m0311r0402n5720M1156K736J7391p893P277n032n2999L2224
3951B327655k1715K6607N2098l2444l6339M4061m108j6722K9189j8736l2446M2779
3939B359879J4709N806M6623J1579o7282L7567L7594j3603P403l2019k6578q571
3927B373107O0356j3806j0398l7192K2671J9702O5043J8058o3624J0910L3450
3916B478277P6170r02K6035K7201l8374M714L9332J4238k3921K0433p2880K2372
3904B572695l3406J402N2814k4353P3321O7415N365o6072j8426o801P894j5736
3892B616112Q895J3655Q050O6835l2348J0402Q916N366L3749N9488m626n0287
$$ y = [2533284, 2512964, 2532686, 2534122, 2575452, 2498696, 2464227, 2425426, 2389963, 2488331, 2471356, 2415105, 2469655, 2479228, 2438917, 2348515, 2292795, 2333951, 2336687, 2354078, 2346185, 2353462, 2348430, 2295431, 2327655, 2305940, 2332547, 2384645, 2352201, 2315862, 2359923, 2355815, 2339093, 2368282, 2349546, 2317100, 2359879, 2374588, 2380394, 2427017, 2438596, 2371314, 2408881, 2446475, 2432872, 2440275, 2408256, 2381678, 2373107, 2433463, 2419657, 2409259, 2372067, 2394738, 2414440, 2479483, 2497541, 2433917, 2444827, 2478277, 2554447, 2553545, 2579580, 2606781, 2568407, 2573121, 2612453, 2626691, 2602770, 2623203, 2550323, 2572695, 2539289, 2540691, 2593505, 2569152, 2642473, 2709888, 2715253, 2649181, 2630755, 2623954, 2631848, 2616112, 2625007, 2638662, 2646712, 2713547, 2681199, 2691601, 2700517, 2705883, 2739632, 2799120, 2794494, 2744207]
3880B744207K9396N4909J9276m5992J7551P0856q465p687l8357l3500K3837O8309
3868B894340P1460n4283L1365Q2586m0161j8465j0996R0290M9594j3869m878l1217
3856C045766M9897N0029N2955j4262J1843J05044Q9918K5701j59P1080J03033
3845C590845M6363N2274Q1302J84102K8986J6152J8149l4977n2620k2198l8207
3834C870171o6958L4887R718K0377k9283L9056q729m719M6828j0960j1448P1252
3822C960192Q5297j9332J2725P3570J19906Q3396J01213N5381J31236J18260J51110
3811D872954J44625M3780M8405Q5523R9626Q5255J05428J00852O5121J18785Q8115
3800E858469N5396R5501J24660J50882J17037M4918O8781K8216M2383M7793N5768
$$ y = [2744207, 2773603, 2828512, 2847788, 2801796, 2819347, 2890203, 2881738, 2874051, 2835694, 2802194, 2826031, 2894340, 2965800, 2911517, 2942882, 3025468, 2985307, 2966842, 2955846, 3046136, 3095730, 3081861, 3076983, 3045766, 3095663, 3145692, 3198647, 3184385, 3196228, 3301272, 3391190, 3416891, 3416732, 3487812, 3590845, 3637208, 3689482, 3770784, 3954886, 3983872, 4000024, 4018173, 3983196, 3930576, 3908378, 3870171, 3803213, 3838100, 3847818, 3868195, 3838912, 3877968, 3869239, 3864520, 3911348, 3900388, 3888940, 3960192, 4045489, 4026157, 4038882, 4112452, 4232358, 4315754, 4416967, 4472348, 4603584, 4721844, 4872954, 5017579, 5061359, 5109764, 5195287, 5294913, 5380168, 5485596, 5586448, 5651569, 5770354, 5858469, 5913865, 6009366, 6134026, 6284908, 6401945, 6446863, 6515644, 6543860, 6586243, 6634036, 6689804]
3789F689804L5628j8017J6194j5210P245m0461l5289n6963m4586j38644m8711
3778F350990j00457j24541j37511o9842j27970j55984j10544j37982j09629o8027
3768E208503p4494l2801n9919q877l1950p1584q0969j9936k3170j0469o2498l2889
3756D698947J1517P5387O2933J1928L8118L7242O2237J11072O1902R2396N1248
3745E314927O9383N9568j8962M0769K6206J14180R2145R9644K1327Q1255o649
3734E893793O3248M5891P3079R1284K1676k3987M6891J7134K5052J15314L1979
3723F401354l4864L7611M1506P7176j0269N3246M1974J1770o159k658N6256O1269
3711F728212L5169P0919Q1997Q5031L7723J22052J03885Q6251N584N1311J16948
$$ y = [6689804, 6725432, 6707415, 6723609, 6708399, 6715644, 6675183, 6639894, 6582931, 6538345, 6399701, 6350990, 6250533, 6125992, 5988481, 5918639, 5790669, 5634685, 5524141, 5386159, 5276530, 5208503, 5134009, 5101208, 5041289, 5032412, 5000462, 4928878, 4847909, 4827973, 4804803, 4794334, 4731836, 4698947, 4710464, 4785851, 4848784, 4860712, 4898830, 4936072, 4998309, 5109381, 5171283, 5263679, 5314927, 5384310, 5443878, 5424916, 5465685, 5491891, 5606071, 5698216, 5797860, 5819187, 5900442, 5893793, 5957041, 6002932, 6076011, 6167295, 6188971, 6164984, 6211875, 6229009, 6254061, 6369375, 6401354, 6366490, 6404101, 6445607, 6522783, 6512514, 6565760, 6607734, 6619504, 6613345, 6610687, 6666943, 6728212, 6763381, 6834300, 6916297, 7001328, 7039051, 7161103, 7264988, 7351239, 7356823, 7408134, 7525082]
3700G525082L6559Q4923J50008J73956R8951J31936N6905J17984J76830R9897
3690H653031J15803J71289J21888Q2608N8179J14914J53963Q9774K1118J04696
3680I687263n622O5905R3671Q7788J91418J2891K5946J31315J43009O1832R7684
3669A0593100P2732P5402J3496M9434J58006J37753R1027M7408R8986J17990K01298
3658A1656632J50232J41505J25992J86550J56856K35625J63327J67198J48322
3649A3132239K13087J66116K44633K66499L09754L19084L38197L63911M20358
3640A5773878M40584N23259M58332M91963N59801M99319N92662N36219M44085
3631B0320102L31444L10376L59486L54798K44157K06664J60894J97939J37448
$$ y = [7525082, 7561641, 7646564, 7796572, 7970528, 8069479, 8201415, 8258320, 8376304, 8553134, 8653031, 8768834, 8940123, 9062011, 9144619, 9202798, 9317712, 9471675, 9561449, 9582567, 9687263, 9681641, 9747546, 9841217, 9929005, 10120423, 10133314, 10159260, 10290575, 10433584, 10495416, 10593100, 10665832, 10741234, 10754730, 10804164, 10962170, 11099923, 11190950, 11238358, 11337344, 11455334, 11656632, 11806864, 11948369, 12074361, 12260911, 12417767, 12653392, 12816719, 12983917, 13132239, 13345326, 13511442, 13756075, 14022574, 14332328, 14651412, 14989609, 15353520, 15773878, 16214462, 16737721, 17196053, 17688016, 18247817, 18747136, 19339798, 19876017, 20320102, 20651546, 20961922, 21321408, 21676206, 21920363, 22127027, 22287921, 22485860, 22623308]
3622B2623308J58080J72583K45655J75853R5640L6827R4239P9576M4849L8570
3612B3765180m1754q485O968o8785P1845O0860P3205J23152J20033J93866J68152
3601B4464237J70432J63933J85278J68891J35095K94420K14607J35358J31632
3592B6063883J7220O4048J18138Q728n5738m7186n8334m7096j93618k15945j83031
3581B5471069k03524k24238k35042j82330k52153k94904k70667j65458k13630
3572B3429123k60317k69649k38956j73627j51874j15804j33742p7755n4878Q5085
3562B2037606R1063O0954J84772K40912L29866K70946L22222M27376M65715M98718
3552B4930150M81388M73409N27664M26694M29979K86342M02496N20497L81070
$$ y = [22623308, 22781388, 22953971, 23199626, 23375479, 23471119, 23507946, 23602185, 23681761, 23726610, 23765180, 23723426, 23714941, 23721909, 23653124, 23724969, 23785829, 23859034, 23982186, 24102219, 24296085, 24464237, 24634669, 24798602, 24983880, 25152771, 25287866, 25582286, 25796893, 25932251, 26063883, 26081103, 26145151, 26263289, 26272017, 26216279, 26169093, 26110759, 26063663, 25870045, 25654100, 25471069, 25267545, 25043307, 24808265, 24625935, 24373782, 24078878, 23808211, 23642753, 23429123, 23168806, 22899157, 22660201, 22486574, 22334700, 22218896, 22085154, 22007399, 21952521, 22037606, 22128669, 22189623, 22374395, 22615307, 22945173, 23216119, 23538341, 23965717, 24431432, 24930150, 25411538, 25884947, 26412611, 26839305, 27269284, 27555626, 27958122, 28478619, 28859689]
3543B8859689M23635M82754N62901O09960O70851O91393O50472P24415Q23352
3534C4499422P60922P28228O86190P09873N86873N37187L84000M11700L94001
3525C9698396K98661L36202M09880L75877M49037M85263M94476N79768N37914
3516D3665474N75862P56502O92524O38579P20944P15337O76218P43992P28659
3507D9914091P11504P31371P35250P40992O57029N91293M50095M14376M24405
3498E5370406M57902L38747L43363M72485M50115L98294M86858O25612O36727
3489E9580509P37292P81443Q11553R44351J049399J210828J257915J322392J497096
3480F9192778J593474J713625J805014J845219J760355J781151J750418J701479
$$ y = [28859689, 29283324, 29766078, 30328979, 30938939, 31609790, 32301183, 32951655, 33676070, 34499422, 35260344, 35988572, 36674762, 37384635, 37971508, 38508695, 38892695, 39304395, 39698396, 39997057, 40333259, 40743139, 41119016, 41568053, 42053316, 42547792, 43127560, 43665474, 44241336, 44997838, 45690362, 46328941, 47049885, 47765222, 48441440, 49185432, 49914091, 50625595, 51356966, 52092216, 52833208, 53490237, 54081530, 54531625, 54946001, 55370406, 55828308, 56167055, 56510418, 56982903, 57433018, 57831312, 58318170, 58943782, 59580509, 60317801, 61099244, 61910797, 62855148, 63904547, 65115375, 66373290, 67695682, 69192778, 70786252, 72499877, 74304891, 76150110, 77910465, 79691616, 81442034, 83143513]
3472H3143513J600500J568992J579563J644031J618792J889207K122122K134315
3464I7301035K290766K284371K384930K356090K224552K116032J948982J716024
3456A14622782J694829J696612J644204J648297J696554J775622K023706K232665
3448A29035271K283918K328736K476961K361904K377939K259181K154396J922375
3440A47200681J592570J369419R93229N94030K24154k296l98411p45946r17213
3431A49910217j088899j277375j356580j458108j666715j730057j943889k047308
3423A37341286k264651k389573k485374k665774k797876l023033l199319l374693
3415A15140993l656416l673183l527124l271319l042543k861168k661053k459089
$$ y = [83143513, 84744013, 86313005, 87892568, 89536599, 91155391, 93044598, 95166720, 97301035, 99591801, 101876172, 104261102, 106617192, 108841744, 110957776, 112906758, 114622782, 116317611, 118014223, 119658427, 121306724, 123003278, 124778900, 126802606, 129035271, 131319189, 133647925, 136124886, 138486790, 140864729, 143123910, 145278306, 147200681, 148793251, 150162670, 151155899, 151749929, 151974083, 151971787, 151573376, 150827430, 149910217, 148821318, 147543943, 146187363, 144729255, 143062540, 141332483, 139388594, 137341286, 135076635, 132687062, 130201688, 127535914, 124738038, 121715005, 118515686, 115140993, 111484577, 107811394, 104284270, 101012951, 97970408, 95109240, 92448187, 89989098]
3407H9989098k344770k220906k103748k024825j854107j797793j654213j678775
3399G4309961j584664j477215j354287j287409j222683j039327q24812p47602
3391F4771962m76907l50434k10977j6433l121l14153o07497r32397j511833j769463
3381E8578747j645234j552385j467737j191791r80335q59082p68019o73489n56400
3372D8884275l13992j41068j53052O24O2820J62440L24420L58365M11977N41429
3362E0138238N87340P04394P23333P53327Q26814Q96095P93488O77094M44020
3353E6544143L06748k0350l12869l68231k50987j34242m1532Q1252M1099K20720
3343E6065751K73802K26745J82994K79166K66256K99408K53015K73199K00955
$$ y = [89989098, 87644328, 85423422, 83319674, 81294849, 79440742, 77642949, 75988736, 74309961, 72725297, 71248082, 69893795, 68606386, 67383703, 66344376, 65519564, 64771962, 64295055, 63944621, 63733644, 63717211, 63714090, 63399937, 62792440, 61860043, 60348210, 58578747, 56933513, 55381128, 53913391, 52721600, 51741265, 50882183, 50114164, 49440675, 48884275, 48570283, 48429215, 48276163, 48276787, 48339607, 48502047, 48826467, 49184832, 49596809, 50138238, 50725578, 51429972, 52153305, 52906632, 53733446, 54629541, 55423029, 56100123, 56544143, 56850891, 56830541, 56517672, 56149441, 55898454, 55764212, 55722680, 55803932, 55845031, 56065751, 56339553, 56566298, 56749292, 57028458, 57294714, 57594122, 57847137, 58120336, 58321291]
3334E8321291J86148O4209p69j02632k84348m19574n04917m79458m99943n13877
3324E5766130m24531l82138k67901j82753n3205J81933L20060M40894N63923O86749
3314E6649161Q63733R68249J159938J319924J339561J360079J547528J647247
3306F6855420J663646J753586J672125J639677J608731J608532J364817J231146
3298G9397680J030825P00265N30641K85411J13358j43874k00975k62475l29094
3289H1121762m08542l15891k02662j42333r8624r7508J3651O5831l0439j31615
3279G9773630j59793j69811k75394l94735m63381o84200p25176q78498r63829
3270G5058813r88436j104782j085826j128715j151563j153659j136508j151641
$$ y = [58321291, 58507439, 58571648, 58570879, 58468247, 58183899, 57764325, 57259408, 56779950, 56280007, 55766130, 55341599, 54959461, 54691560, 54508807, 54455602, 54637535, 54957595, 55398489, 55962412, 56649161, 57512894, 58481143, 59641081, 60961005, 62300566, 63660645, 65208173, 66855420, 68519066, 70272652, 71944777, 73584454, 75193185, 76801717, 78166534, 79397680, 80428505, 81128770, 81659411, 81944822, 82058180, 81914306, 81713331, 81450856, 81121762, 80713220, 80397329, 80194667, 80052334, 79953710, 79856202, 79869853, 79935684, 79905245, 79773630, 79613837, 79444026, 79168632, 78773897, 78310516, 77626316, 76901140, 76022642, 75058813, 74070377, 72965595, 71879769, 70751054, 69599491, 68445832, 67309324, 66157683]
3262F6157683j225744j188702j249259j275815j307414j372326j445089j380714
3254E5712620j468793j490248j511592j459649j393646j407058j321895j141804
3246D4517935j108404j150476j022543r57527r21188q52076p58500p60346q29954
3237C6156921o86774o62797p18497o53485o12320o63737o70394o03419o59314
3228C0226184o43414n49430o45543p10313o12474o52613o50639o04559n73977
3219B4583222o26806n13481m36923m93653m85287m81948l68593m51476l15942
3210B0409113k97252l15276k52063l79706k65588k26396k21294k56666l35849
3201A7859023k36032l15744l26432k85449l42553k74419k71723k98446k91804
$$ y = [66157683, 64931939, 63743237, 62493978, 61218163, 59910749, 58538423, 57093334, 55712620, 54243827, 52753579, 51241987, 49782338, 48388692, 46981634, 45659739, 44517935, 43409531, 42259055, 41236512, 40278985, 39357797, 38505721, 37747221, 36986875, 36156921, 35470147, 34807350, 34088853, 33435368, 32823048, 32159311, 31488917, 30885498, 30226184, 29582770, 29033340, 28387797, 27677484, 27065010, 26412397, 25761758, 25157199, 24583222, 23956416, 23442935, 23006012, 22512359, 22027072, 21545124, 21176531, 20725055, 20409113, 20111861, 19796585, 19544522, 19164816, 18899228, 18672832, 18451538, 18194872, 17859023, 17622991, 17307247, 16980815, 16695366, 16352813, 16078394, 15806671, 15508225, 15216421]
3192A5216421j54303k91171k37656j94865k19113j13989j12138j79792j47661
3183A3565733r6442j48095j17695p0718J1905o8623n3721L1708K309j1672J9393
3172A3064082M0624J1512l0084j00120q8589k3763q654j46137j58517o1968n2979
3161A2445407p5617M0036j33557n1627j0367M8509K9728l8346M5415R059Q9578
3150A2398218N6180N4916J70011J69062J30663J92918J92601J79154J86719K07591
3140A3938033L48076L04042K36661K39270J71977J24944J93321J73488J16061
3131A5845873J98830J77428K69776K56625K94098L53000M29036L98114M26884
3122A8649664N96557N90942N77075P83308Q38273Q81986Q81715R39837R59091
$$ y = [15216421, 15062118, 14770947, 14533291, 14338426, 14119313, 14005324, 13893186, 13713394, 13565733, 13469291, 13321196, 13203501, 13132783, 13144688, 13076065, 13022344, 13054052, 13056361, 13044689, 13064082, 13104706, 13116218, 13086134, 12986014, 12897425, 12873662, 12865008, 12718871, 12560354, 12498386, 12445407, 12369790, 12409826, 12276269, 12224642, 12214275, 12262784, 12292512, 12254166, 12299581, 12308640, 12398218, 12454398, 12509314, 12679325, 12848387, 12979050, 13171968, 13364569, 13543723, 13730442, 13938033, 14286109, 14590151, 14826812, 15066082, 15238059, 15363003, 15556324, 15729812, 15845873, 16044703, 16222131, 16491907, 16748532, 17042630, 17395630, 17824666, 18222780, 18649664, 19246221, 19837163, 20414238, 21197546, 22035819, 22917805, 23799520, 24739357, 25698448]
3113B5698448J024941J223926J299078J316047J402031J439218J242827J024222
3105C5670738P25884L24439K307l45178m18813n55997m31227m36158l59130p7854
3095C4099011o0558P2456K03434K48180L74581N11178O61455P73326Q88469J064577
3085C8836109J238929J435863J704849J995881K234276K482590K869645L239349
3077E6037491L579786M001000M309369M653901M750282M900528M994405N244987
3069I2471749N699614O196179O847206P427995P556478P070595O025747M672534
3061A43968097L283283K187130J670834J766706K318440K760309L075442L437605
3053A64467846L631877L741409L830621L859675L853158L659359L066950K297944
$$ y = [25698448, 26723389, 27947315, 29246393, 30562440, 31964471, 33403689, 34646516, 35670738, 36396622, 36721061, 36723368, 36378190, 35959377, 35403380, 34972153, 34535995, 34176865, 34099011, 34038453, 34110909, 34314343, 34562523, 34937104, 35448282, 36109737, 36883063, 37771532, 38836109, 40075038, 41510901, 43215750, 45211631, 47445907, 49928497, 52798142, 56037491, 59617277, 63618277, 67927646, 72581547, 77331829, 82232357, 87226762, 92471749, 98171363, 104367542, 111214748, 118642743, 126199221, 133269816, 139295563, 143968097, 147251380, 149438510, 151109344, 152876050, 155194490, 157954799, 161030241, 164467846, 168099723, 171841132, 175671753, 179531428, 183384586, 187043945, 190110895, 192408839]
3045A92408839J492714Q15233O72546J116162J853712K205520J907164R89534
3037B03461424o38321k597793m694124o619272p711316q172627q310241q037723
3029A56680007p642300p092847o790833o368170n963350n610875n243505n026557
3021A06941570m869882m651099m584904m509590m385863m209012m025339l751484
3013G1954397l409916l158426k985335k721483k536892k487607k306671k235234
3005E0112833k075148j904665j772755j686337j588602j511098j396432j239131
2997C6938665j173946j151384j238840j229470j081429j144879j135750j061713
2989B7721254j054859r44505p97412q93592q65860p69857p00256o86173o22526
$$ y = [192408839, 193901553, 194716786, 195389332, 196505494, 198359206, 200564726, 202471890, 203461424, 202823103, 200225310, 195531186, 188911914, 181200598, 173027971, 164717730, 156680007, 149037707, 141944860, 135154027, 128785857, 122822507, 117211632, 111968127, 106941570, 102071688, 97420589, 92835685, 88326095, 83940232, 79731220, 75705881, 71954397, 68544481, 65386055, 62400720, 59679237, 57142345, 54654738, 52348067, 50112833, 48037685, 46133020, 44360265, 42673928, 41085326, 39574228, 38177796, 36938665, 35764719, 34613335, 33374495, 32145025, 31063596, 29918717, 28782967, 27721254, 26666395, 25721890, 24924478, 24030886, 23165026, 22395169, 21694913, 21008740, 20386214]
2980B0386214n86309n42653n84306n58130n29548m76081l93517n23245m86213
2971A5706212m20053m20187l11370l45534l76573l10428l64207k78770k88529
2962A2590561l92180k94867k93536k33791k68420k68054j52874k17414k13116
2953A0256309k34292k19839j85750j28179j33939r8591j96796k76732j41677j41501
2943H499013q5287j08899j60494o2393j07589j23218q9465j20775r4858k8930
2933G517105j07111k4380p6812j09451q7478j27441r6147j36589j51193j29331
2923F471172j61738j50212l8753j60640n7677n2930r0894j14085j07634r5433
2913E441176k5078n7600q0088K4360q0303l4172L5961o6551l4950o937n2266r9543
$$ y = [20386214, 19799905, 19257252, 18672946, 18114816, 17585268, 17109187, 16715670, 16192425, 15706212, 15286159, 14865972, 14554602, 14209068, 13832495, 13522067, 13157860, 12879090, 12590561, 12198381, 11903514, 11609978, 11376187, 11107767, 10839713, 10686839, 10469425, 10256309, 10022017, 9802178, 9616428, 9488249, 9354310, 9255719, 9058923, 8782191, 8640514, 8499013, 8413726, 8304827, 8144333, 8081940, 7974351, 7851133, 7761668, 7640893, 7546035, 7517105, 7409994, 7385614, 7308802, 7199351, 7111873, 6984432, 6888285, 6751696, 6600503, 6471172, 6309434, 6159222, 6120469, 5959829, 5902152, 5849222, 5758328, 5644243, 5536609, 5441176, 5416098, 5358498, 5278410, 5302770, 5222467, 5188295, 5224256, 5157705, 5122755, 5115818, 5063552, 4964009]
2901D964009p5100j06099n7672j13559r1493j37135j37957k2652l9585m0929j53605
2890C988223j05652m3463n3996m2595k6736n6874k9304l4369p7219o1315j20346
2879C336354o4105m0591k7688n9551j22610j6691q4416k9740P012K2102o1036
2868B859040l7228j03898n4723P961l4883p4125m2984Q573m4516L9408N593p6924
2856B451294j08129l3920K6234j4814m6032K943m7835r410j02707Q715k6344j5465
2844B084530n3077n2638J7117m8065k6116j1536l692m3431j2085p4183J799m5208
2832A733415J65M4231j9256k5064O8129k4782l4385l4182N4826k3127J0214l5528
2820A714656o7544J1512j2010j6922o5949q4288J2595K4170j1226n5083J0645
$$ y = [4964009, 4888909, 4782810, 4725138, 4611579, 4520086, 4382951, 4244994, 4222342, 4182757, 4141828, 3988223, 3882571, 3839108, 3785112, 3742517, 3715781, 3658907, 3629603, 3595234, 3518015, 3456700, 3336354, 3272249, 3231658, 3203970, 3144419, 3021809, 3005118, 2920702, 2890962, 2897974, 2920076, 2859040, 2821812, 2717914, 2663191, 2671152, 2636269, 2562144, 2519160, 2527733, 2483217, 2522625, 2528218, 2451294, 2343165, 2309245, 2335479, 2320665, 2274633, 2277576, 2229741, 2220331, 2117624, 2126339, 2099995, 2084530, 2031453, 1978815, 1995932, 1947867, 1921751, 1910215, 1906523, 1863092, 1851007, 1776824, 1778623, 1733415, 1733580, 1777811, 1758555, 1733491, 1801620, 1776838, 1742453, 1708271, 1763097, 1739970, 1750184, 1714656, 1647112, 1658624, 1646614, 1629692, 1563743, 1479455, 1492050, 1516220, 1504994, 1449911, 1460556]
2809A460556j2714J4800j9314j4281P8623J4643k1758n9545k9609L0547q863J7187
2797A450272M3631K3611M7231j5062l7914N4023Q6183K0942M1625n09O8481J6243
2785A798757q932K3899N9502j547r0011J5300R896L3494N5716m4826M9847O638
2773A907733M0050k7291K9425j3218l0533K2916K7888o045R6517M9877n4189j1672
2761B031458j3971K1546J9125m2644J169p028m6696m377j9603n7864l6979j3988
2749A830148o6463j17400k7955k3445q8465l891j2013m5868q3941m7841j10442
2738A202424k2807J9036P708L1188q7136n2656o8248k1184p319m5459K2199j334
2726I76412L1477m7299n2358j7412m551mj5495Q600p2716m3695l0543K2562J1848
$$ y = [1460556, 1447842, 1462642, 1443328, 1429047, 1507670, 1522313, 1500555, 1441010, 1411401, 1441948, 1433085, 1450272, 1493903, 1517514, 1564745, 1549683, 1511769, 1565792, 1651975, 1672917, 1714542, 1714033, 1782514, 1798757, 1789825, 1813724, 1873226, 1871679, 1781668, 1796968, 1806864, 1840358, 1896074, 1851248, 1901095, 1907733, 1947783, 1920492, 1949917, 1936699, 1906166, 1929082, 1956970, 1950925, 2047442, 2097319, 2043130, 2031458, 2017487, 2039033, 2058158, 2015514, 2016683, 2009655, 1962959, 1958582, 1938979, 1881115, 1844136, 1830148, 1763685, 1646285, 1618330, 1594885, 1506420, 1502529, 1490516, 1444648, 1360707, 1312866, 1202424, 1179617, 1198653, 1206361, 1237549, 1150413, 1097757, 1029509, 1008325, 1001006, 955547, 977746, 976412, 1007889, 960590, 908232, 890820, 886269, 886265, 870770, 879370, 806654, 762959, 732416, 754978, 766826]
2713G66826o290l8843m6363O5701m7884k5716M8413M0838l2704o0551J275K7728
2701F92430l3842m4528l4161L2901J4881J1632K662l9073j5301p1620j140o079
2689E08762l0226L6511o2946o492J00879q2522j6164l6997J7304P9751l0464l2066
2677D45330k0131K657L5927k8179J1686k1795l3322j5304m0005N6864K8103p6986
2665C44845j1218R329j0881O0267n2455J7721o372k3001P5067m8133j8659m200
2653C32310j9893K9831n9214n825J3963j4898O3859Q3679q1111n4365k5760l1561
2641B31015P097n017k5889j0457Q573M7542m0580j8053Q7187M327j0598J9o5224
2628B09942j0473k2669l324K5340j5073N5867l004j0943k5682Q23K8017n4546
$$ y = [766826, 760536, 721693, 675330, 741031, 693147, 667431, 715844, 756682, 723978, 663427, 664702, 692430, 658588, 614060, 579899, 612800, 627681, 639313, 641975, 602902, 587601, 515981, 514841, 508762, 478536, 515047, 452101, 445609, 546488, 463966, 447802, 410805, 428109, 507860, 477396, 445330, 425199, 427856, 463783, 435604, 447290, 425495, 392173, 376869, 336864, 393728, 421831, 344845, 333627, 342956, 332075, 392342, 339887, 357608, 351236, 328235, 403302, 355169, 336510, 332310, 312417, 342248, 283034, 277209, 291172, 276274, 340133, 423812, 342701, 288336, 262576, 231015, 238112, 233095, 207206, 196749, 205322, 252864, 212284, 194231, 281418, 285745, 275147, 275166, 209942, 199469, 176800, 173476, 198816, 183743, 239610, 236606, 225663, 199981, 200804, 228821, 174275]
2616A74275p8329M0115Q0977j1334j2211Q644K8608j03093j520N2614m0777n6729
2604H1240j6854P2866N7775j5242n4799K0657l9195j1976n112M5135P3248l86
2592B07357n5259j8289J5074o1302K5453J4322l3309n473M7695m9114M5658o119
2580A26694l5976K0906M6932N2647o0253K7665p419l7450n496k0955J618K4593
2568A33506L2021k2156K4388l0513J0581Q2403m3138k8867m8954P0451j0780p2081
2556I6861K6345J5476k2846Q506N2584j5777m8945J421J2623n3555j8087j6289
2544C8317K1170O1371p3530M3536k083N6254M1309j13271m2380k1858N8358M6211
2532A13404j11252O6445J34519k3753l0472k9858R615K6556o5551P6797O7904
$$ y = [174275, 95946, 136061, 217038, 205704, 193493, 202137, 230745, 127652, 126132, 178746, 137969, 81240, 64386, 137252, 195027, 179785, 124986, 145643, 106448, 94472, 89360, 134495, 207743, 207357, 152098, 133809, 148883, 87581, 113034, 127356, 94047, 88574, 136269, 87155, 132813, 126694, 90718, 111624, 158556, 211203, 150950, 178615, 171196, 133746, 128250, 107295, 108913, 133506, 165527, 143371, 167759, 137246, 147827, 230230, 187092, 158225, 109271, 179722, 168942, 96861, 123206, 138682, 115836, 124342, 176926, 161149, 112204, 113625, 126248, 72693, 54606, 38317, 59487, 120858, 47328, 90864, 88781, 145035, 186344, 73073, 30693, 8835, 67193, 113404, 2152, 68597, 203116, 179363, 148891, 119033, 128648, 155204, 89653, 166450, 234354]
2521B34354r5003j9865o448o4251m3939N5177P3660n4673k1585K3233o6688k8107
2509a4135N9291K3392j3166K592M0984K9041j2425l0992n5122p358K2542L1584
2497G6228k2837j2632j3654p046M5233p457o0695r4514R9383J4513K9163R723
2485E5408K8547k8202k9091L0916o4183K765J2446o641m7638k5628L071J2062
2473e6168L2694O345k5383N015M090O3640m670O3174k1336q1338M2792O3117p5505
2460A6467j3712m943J4259N091j2091K4285o403j3286k0665l4409M7375k9686
2448b7718K295R8469k1301j227O581K0301l1451p0137j9616J7892k3983J7271
2436c2624O8546j04507j5826L2345M510l6663N6533M9590k488K8117l5297k4557
$$ y = [234354, 139351, 119486, 113038, 48787, 4848, 60025, 133685, 79012, 57427, 80660, 13972, -14135, 45156, 68548, 55382, 57974, 98958, 127999, 115574, 84582, 29460, 22102, 44644, 76228, 53391, 40759, 27105, 20059, 65292, 57835, -2860, -97374, 2009, 16522, 45685, 55408, 83955, 55753, 26662, 57578, -6605, -3840, 8606, 1965, -45673, -71301, -68230, -56168, -23474, -17129, -42512, -37497, -33407, 30233, 25563, 88737, 67401, -13937, 28855, 91972, 16467, 2755, -2188, 12071, 17162, 5071, 29356, 22953, 9667, -10998, -45407, 1968, -27718, -25423, 73046, 51745, 50518, 57099, 77400, 45949, -24188, -43804, -25912, -49895, -32624, 35922, -68585, -84411, -52066, -47556, -84219, -27686, 21904, 19416, 47533, 12236, -12321]
2424a2321m0957K5165N1426j5503q079M1200m9614n9719K4336N3596N0859k6441
2412C3948k8913j3051P5J0651L7491J291L3768l0232l1758P763l8953j7829R081
2399b6668N9988j1917l1094K2576K8373n016K8853k8343k1327O6739q608j7691
2387E5865j4873K5285M1098q098j8360m7011k6116k4639K4636M0464l080n7391
2375a2220K2660k5481n3950N9039O1413j8448M2813j6943n1543l2458R601J9812
2363D295M9J1618L3093N5906l7189l6921Q012P086n605p044k0096L9762R856k6865
2349C5957j1511l8406M6110J8877K8351P3254n7440L570Q8268j6051P2800N054
2337B48833p0356j452K0177M8400l8762K1555J658J6220K8338J449K8673P5774
$$ y = [-12321, -53278, -28113, 23313, 7810, -269, 40931, -8683, -68402, -44066, 9530, 60389, 33948, 5035, -8016, -7941, 2710, 40201, 41492, 75260, 45028, 13270, 21033, -17920, -35749, -26668, 33320, 21403, -9691, 12885, 41258, 36242, 65095, 36752, 15425, 82164, 73556, 55865, 40992, 66277, 107375, 99277, 80917, 33906, 7790, -16849, 7787, 48251, 45171, -12220, 10440, -15041, -68991, -9952, 51461, 33013, 75826, 58883, 7340, -25118, -15517, 4295, 4344, 15962, 49055, 104961, 67772, 30851, 38863, 45949, 40344, 33300, 13204, 52966, 62822, 35957, 24446, -13960, 32150, 51027, 79378, 152632, 95192, 98762, 187030, 170979, 243779, 248833, 178477, 177025, 197202, 245602, 206840, 228395, 230053, 246273, 274611, 276060, 304733, 380507]
2325C80507Q5522N3035J7946j8480R3335L7398J6484J17749Q6373J7573Q9240
2314I76682R5282J42660J86939J97604K37315L81473M60184N24937M75486N55463
2304D234025N21327J72207p163l64721o46229n80410m14679l63484k72860j92467
2294B085546k17961j81826p9387j52910r2793j18088p7347q2926m9403r2624j22235
2283H18046m5340j22255j5080r00j23550p8782O0123n5105l800K4250q3670r8736
2271B75201n9565n950N2418L2188k5307j8745j6098k3570L5060j3040l6989K7889
2259B23492j00411l3323K4064M177K4797j3195K6674o1723M2025J3457m0440M2055
2247A51649K8302m3774j2265k529m972K0191q803q6679l7522j5536N4387P640
$$ y = [380507, 466029, 519064, 537010, 518530, 611865, 649263, 665747, 783496, 869869, 887442, 976682, 1071964, 1214624, 1401563, 1599167, 1836482, 2217955, 2678139, 3203076, 3678562, 4234025, 4755352, 4927559, 4920396, 4555675, 3909446, 3329036, 2914357, 2550873, 2278013, 2085546, 1867585, 1685759, 1606372, 1453462, 1360669, 1242581, 1165234, 1082308, 1032905, 940281, 818046, 772706, 650451, 635371, 634471, 510921, 432139, 492262, 437157, 433357, 457607, 373937, 275201, 215636, 209686, 262104, 294292, 268985, 250240, 234142, 210572, 245632, 232592, 195603, 223492, 123081, 89758, 113822, 117999, 142796, 129601, 156275, 94552, 136577, 150034, 109594, 151649, 179951, 136177, 123912, 121383, 116411, 136602, 127799, 41120, 3598, -11938, 42449, 50089]
2235E0089m5914n903K456L7716n0736M5136P88l8618P256j3342N330l2514Q462
2222b9794l6932J5296J01097n2747m1871n3719n881J8939J07865o0223o9505O8687
2210c8788L8676L8775l8631k0264l9918P7877o776n3610l4127o264P1460n3804
2198f5394R078j2323L7740k939R20L7547l9885l1749P3522L2924j818n9260J0709
2185a0928l4567j8465j3280M9292K0177N840M5509n5622j1602L1168l0223O3201
2173D0500k1429l6595J8160j08320P631L4514L2973J03691K0799p1314O6572k2581
2161F4601j02883j5749J7114P2566k4887J580l984o6776J0228L9615l6041m0812
2149h5428N1473L5471J471o0748j857N9274j2068k699M4453P421J8019R432q7037
$$ y = [50089, 4175, -1728, 728, 38444, -12292, 32844, 33632, -4986, 2270, -11072, -5742, -38256, -29794, -66726, -51430, 49667, -3080, -44951, -98670, -104551, -85612, 22253, -37970, -107475, -38788, -112, 38663, 32, -20232, -60150, 17727, 10951, -42659, -76786, -83050, -11590, -65394, -56316, -68639, -30899, -33838, -32918, 4629, -35256, -67005, 6517, 39441, 37623, -21637, -10928, -45495, -63960, -77240, -27948, -7771, -1931, 43578, -12044, -23646, 7522, -22701, 40500, 19071, -17524, 636, -107684, -100053, -65539, -32566, 71125, 91924, 20610, 87182, 64601, -38282, -54031, -36917, 35649, 10762, 12342, 8358, -58418, -48190, -8575, -44616, -85428, -33955, 1516, 2987, -57761, -59618, -344, -12412, -15111, 29342, 36763, 54782, 64214, -22823]
2136b2823m1382J3096K6401J8055j4944j3099n3653l084O7301L300m9183n007
$$ y = [-22823, -64205, -51109, -24708, -6653, -21597, -34696, -88349, -91433, -24132, -20832, -70015, -75022]
$$ [...]
##END NTUPLES=NMR SPECTRUM
##END=
