##TITLE=1H_CA-9377
 200.13MHz, CDCl3,
 8 sc
 
 4.9.2025
##JCAMPDX= 6.0         $$ Bruker NMR JCAMP-DX V2.0
##DATA TYPE= NMR SPECTRUM
##DATA CLASS= NTUPLES
##ORIGIN= UXNMR, Bruker Analytische Messtechnik GmbH
##OWNER= pz
$$ XWIN-NMR		Version 3.5
$$ Thu Sep  4 14:00:17 2025 Russian Standard Time (UT+4h)  she@DPX200
##.OBSERVE FREQUENCY= 200.1313
##.OBSERVE NUCLEUS= ^1H
##.ACQUISITION MODE= SIMULTANEOUS
##.ACQUISITION SCHEME= undefined
##.AVERAGES= 8
##.DIGITISER RES= 18
##SPECTROMETER/DATA SYSTEM= spect
##.PULSE SEQUENCE= zg30
##.SOLVENT NAME= CDCl3
##.SHIFT REFERENCE= (INTERNAL, CDCl3, 0, 15.4703)
##AUDIT TRAIL= $$ (NUMBER, WHEN, WHO, WHERE, WHAT)
$$ ##TITLE= Audit trail, XWIN-NMR		Version 3.5
$$ ##JCAMPDX= 5.01
$$ ##ORIGIN= Bruker BioSpin GmbH
$$ ##OWNER= she
$$ F:/spectra/data/she/nmr/H-C/1/pdata/1/auditp.txt
$$ ##AUDIT TRAIL=  $$ (NUMBER, WHEN, WHO, WHERE, WHAT)
(   1,<2025-09-04 13:58:56.79 +0400>,<she>,<DPX200>,
      <created by zg, POWCHK disabled, PULCHK disabled
       configuration hash MD5:
       00 E9 B6 7A A2 85 ED C7 34 08 36 98 17 FE 4E 26
       data hash MD5: 16K
       1D 6B 42 61 0A EA 4B 1D BC B6 3B C5 CE 76 B9 E4>)
(   2,<2025-09-04 13:59:01.62 +0400>,<she>,<DPX200>,
      <Start of raw data processing
       efp BC_mod = 2 LB = 0.25 FT_mod = 6 PKNL = 1 PHC0 = -1557.981 PHC1 = 7.792279 SI = 16K 
       data hash MD5: 16K
       42 E7 58 D1 4C 2E 62 60 6A C6 25 D4 55 D8 2F 6E>)
(   3,<2025-09-04 13:59:18.89 +0400>,<she>,<DPX200>,
      <pk PHC0 = -1.832081 PHC1 = 2.4 
       data hash MD5: 16K
       BD C0 52 DB 76 A2 AA B3 6D 62 C0 30 1E FE DB 3D>)
(   4,<2025-09-04 13:59:22.73 +0400>,<she>,<DPX200>,
      <abs ABSG = 5 
       data hash MD5: 16K
       7D 90 D0 6E B8 70 A7 42 67 0E F0 1A 9C 47 98 5D>)
$$ ##END=
$$ 
$$ hash MD5
$$ E4 6A 74 42 47 82 F7 25 DC C2 54 84 A7 F3 AD 26
##$RELAX= 
##$RELAX= 
##$RELAX= 
##$RELAX= 
##$RELAX= 
##$RELAX= 
$$ Bruker specific parameters
$$ --------------------------
##$DU= <F:/spectra>
##$EXPNO= 1
##$NAME= <H-C>
##$PROCNO= 1
##$TYPE= <nmr>
##$USER= <she>
##$AMP= (0..31)
100 100 100 100 100 100 100 100 100 100 100 100 100 100 100 100 100 100 
100 100 100 100 100 100 100 100 100 100 100 100 100 100 
##$AQSEQ= 0
##$AQ_mod= 1
##$AUNM= <au_zg>
##$AUTOPOS= <>
##$BF1= 200.13
##$BF2= 200.13
##$BF3= 200.13
##$BF4= 200.13
##$BF5= 200.13
##$BF6= 200.13
##$BF7= 200.13
##$BF8= 200.13
##$BYTORDA= 1
##$CFDGTYP= 0
##$CFRGTYP= 5
##$CHEMSTR= <none>
##$CNST= (0..31)
1 1 145 1 1 1 1 1 1 1 1 1 1 1 1 1 1 1 1 1 1 1 1 1 1 1 1 1 1 1 1 1 
##$CPDPRG= <>
##$CPDPRG1= <>
##$CPDPRG2= <>
##$CPDPRG3= <>
##$CPDPRG4= <mlev>
##$CPDPRG5= <mlev>
##$CPDPRG6= <mlev>
##$CPDPRG7= <mlev>
##$CPDPRG8= <mlev>
##$CPDPRGB= <>
##$CPDPRGT= <>
##$D= (0..31)
0 0.7 0 0 0 0 0 0 0 0 0 0.03 0 0 0 0 0 0 0 0 0 0 0 0 0 0 0 0 0 0 0 0 
##$DATE= 1756979936
##$DBL= (0..7)
120 120 120 120 120 120 120 120 
##$DBP= (0..7)
150 150 150 150 150 150 150 150 
##$DBP07= 0
##$DBPNAM0= <>
##$DBPNAM1= <>
##$DBPNAM2= <>
##$DBPNAM3= <>
##$DBPNAM4= <>
##$DBPNAM5= <>
$$ [...]
##$SUBNAM3= <"">
##$SUBNAM4= <"">
##$SUBNAM5= <"">
##$SUBNAM6= <"">
##$SUBNAM7= <"">
##$SUBNAM8= <"">
##$SUBNAM9= <"">
##$SW= 18.0517328524113
##$SWIBOX= (0..15)
0 0 2 0 0 0 0 0 0 0 0 0 0 0 0 0 
##$SW_h= 3612.71676300578
##$TD= 16384
##$TD0= 1
##$TE= 0
##$TE2= 300
##$TE3= 300
##$TEG= 300
##$TL= (0..7)
0 120 120 120 120 120 120 120 
##$TP= (0..7)
150 150 150 150 150 150 150 150 
##$TP07= 0
##$TPNAME0= <>
##$TPNAME1= <>
##$TPNAME2= <>
##$TPNAME3= <>
##$TPNAME4= <>
##$TPNAME5= <>
##$TPNAME6= <>
##$TPNAME7= <>
##$TPOAL= (0..7)
0.5 0.5 0.5 0.5 0.5 0.5 0.5 0.5 
##$TPOFFS= (0..7)
0 0 0 0 0 0 0 0 
##$TUNHIN= 0
##$TUNHOUT= 0
##$TUNXOUT= 0
##$USERA1= <user>
##$USERA2= <user>
##$USERA3= <user>
##$USERA4= <user>
##$USERA5= <user>
##$V9= 5
##$VALIST= <valist>
##$VCLIST= <CCCCCCCCCCCCCCC>
##$VD= 0
##$VDLIST= <DDDDDDDDDDDDDDD>
##$VPLIST= <PPPPPPPPPPPPPPP>
##$VTLIST= <TTTTTTTTTTTTTTT>
##$WBST= 1024
##$WBSW= 4
##$XGAIN= (0..3)
0 0 0 0 
##$XL= 0
##$YL= 0
##$YMAX_a= 757592
##$YMIN_a= -1091824
##$ZGOPTNS= <>
##$ZL1= 120
##$ZL2= 120
##$ZL3= 120
##$ZL4= 120
##$ABSF1= 15.46593
##$ABSF2= -2.585919
##$ABSG= 5
##$ABSL= 3
##$ALPHA= 0
##$AQORDER= 0
##$ASSFAC= 0
##$ASSFACI= 0
##$ASSFACX= 0
##$ASSWID= 0
##$AUNMP= <proc_1d>
##$AZFE= 0.1
##$AZFW= 0.1
##$BCFW= 0
##$BC_mod= 2
##$BYTORDP= 0
##$COROFFS= 0
##$CY= -3
##$DATMOD= 1
##$DC= 0
##$DFILT= <>
##$DTYPP= 0
##$F1P= 0
##$F2P= 0
##$FCOR= 1
##$FTSIZE= 16384
##$FT_mod= 6
##$GAMMA= 0
##$GB= 0
##$INTBC= 1
##$INTSCL= 3.241238e-09
##$ISEN= 128
##$LB= 0.25
##$LEV0= 0
##$LPBIN= 0
##$MAXI= 10000
##$MC2= 0
##$MEAN= 0
##$ME_mod= 0
##$MI= 1.114404
##$NCOEF= 0
##$NC_proc= -6
##$NLEV= 6
##$NOISF1= 3.799351
##$NOISF2= 2.8
##$NSP= 0
##$NTH_PI= 0
##$NZP= 0
##$OFFSET= 15.47034
##$PC= 1
##$PHC0= -1559.813
##$PHC1= 10.19228
##$PH_mod= 1
##$PKNL= yes
##$PPARMOD= 0
##$PSCAL= 0
##$PSIGN= 0
##$REVERSE= no
##$SF= 200.130010278998
##$SI= 16384
##$SIGF1= 3
##$SIGF2= 2
##$SINO= 0.751879
##$SIOLD= 32768
##$SREGLST= <19F.Aceton>
##$SSB= 0
##$STSI= 16384
##$STSR= 0
##$SW_p= 3612.71676300578
##$SYMM= 0
##$S_DEV= 0
##$TDeff= 16384
##$TDoff= 0
##$TI= <>
##$TILT= no
##$TM1= 0
##$TM2= 0
##$TOPLEV= 0
##$USERP1= <user>
##$USERP2= <user>
##$USERP3= <user>
##$USERP4= <user>
##$USERP5= <user>
##$WDW= 1
##$XDIM= 16384
##$YMAX_p= 390277525
##$YMIN_p= -1074732
$$ End of Bruker specific parameters
$$ ---------------------------------
##NTUPLES= NMR SPECTRUM
##VAR_NAME=  FREQUENCY,     SPECTRUM/REAL,   SPECTRUM/IMAG
##SYMBOL=    X,             R,               I
##VAR_TYPE=  INDEPENDENT,   DEPENDENT,       DEPENDENT
##VAR_FORM=  AFFN,          ASDF,            ASDF
##VAR_DIM=   16384,         16384,           16384
##UNITS=     HZ,            ARBITRARY UNITS, ARBITRARY UNITS
##FACTOR=    0.220516191357247, 1,           1
##FIRST=     3096.07925820744, 0,            0
##LAST=      -516.637504798338, 0,           0
##MIN=       -516.637504798338, -1074732,    0
##MAX=       3096.07925820744, 390277525,    0
$$ Real data points
##PAGE= N=1
##DATA TABLE= (X++(R..R)), XYDATA
$$ [...]
7239A712852K0478K538n454J04802n1701J1129J60111M8338M8282L1241J88673
$$ 1712852 1733330 1735868 1730414 1835216 1783515 1794644 1954755 2003093 2051375 2082616 2271289
7228B271289L5478M474J29256k793j656L3897N422R7769j0887k4679K06741q745
$$ 2271289 2306767 2311241 2440497 2437704 2436048 2469945 2475367 2573136 2562249 2537570 2744311 2735566
7216B735566j4554m7487o112O8734p5947M4984K5977k1653n0110K0406k1997j2332
$$ 2735566 2721012 2673525 2667413 2736147 2660200 2705184 2731161 2709508 2659398 2679804 2657807 2645475
7204B645475m4513l4572R9711J47305O2488J20973M3126K7479Q5389J8767j5570
$$ 2645475 2600962 2566390 2666101 2813406 2875894 2996867 3039993 3067472 3152861 3171628 3156058
7193C156058J12370p092j39709j419l5276j158J7831p2775R0305M8941J63968
$$ 3156058 3268428 3261336 3121627 3120208 3084932 3083774 3101605 3028830 3119135 3168076 3332044
7182C332044P2720N4565m4136K2119J65621O8943J00241L12248J90835K51457
$$ 3332044 3404764 3459329 3415193 3437312 3602933 3671876 3772117 4084365 4275200 4526657
7172D526657K02438K57846K39282K24283K86354K39383K77909J92648R7344J73560
$$ 4526657 4729095 4986941 5226223 5450506 5736860 5976243 6254152 6446800 6544144 6717704
7162F717704K20800J80610K08798L50684J07801K57572L07066M09220L45975L59639
$$ 6717704 6938504 7119114 7327912 7678596 7786397 8043969 8351035 8760255 9106230 9465869
7152I465869M13222M69722O02219O05902N10152P12733P23516P32427P75951Q52074
$$ 9465869 9879091 10348813 10951032 11556934 12067086 12779819 13503335 14235762 15011713 15863787
7142A5863787R93225J209698J058716J190345J129380J248950J318045J676155
$$ 15863787 16857012 18066710 19125426 20315771 21445151 22694101 24012146 25688301
7134B5688301J701962J929481K293638K783129K808877L288347L834804M756106
$$ 25688301 27390263 29319744 31613382 34396511 37205388 40493735 44328539 49084645
7126D9084645M999501N752602O208120P035887P438413Q736837J0048868J2424170
$$ 49084645 54084146 59836748 66044868 73080755 80519168 89256005 99304873 111729043
7118A11729043J5499148K0151478K5220562L1213773L3696641L4292966L7459015
$$ 111729043 127228191 147379669 172600231 203814004 237510645 271803611 309262626
7111C09262626L9404257K6845202J4765440j2137839n1294225m9806601l7956737
$$ 309262626 348666883 375512085 390277525 378139686 326845461 277038860 239082123
7104B39082123k9536675k3929717k0357243j7072013j4119194j3209228j2161125
$$ 239082123 209545448 185615731 165258488 148186475 134067281 120858053 108696928
7097A08696928j0171990q403305p006149n802937m913008m709708m672715m250594
$$ 108696928 98524938 90121633 83115484 77312547 72399539 67689831 63017116 58766522
7089E8766522l990382l720139l393907k871075k638603k308944k240578k014486
$$ 58766522 54776140 51056001 47662094 44791019 42152416 39843472 37602894 35588408
7081C5588408j890083j740707j583469j547450j211442r67415r93977j074283
$$ 35588408 33698325 31957618 30374149 28826699 27615257 26647842 25653865 24579582
7073B4579582r73316j109211r87449q03220p51458n42129p44218r26522o42881
$$ 24579582 23606266 22497055 21509606 20706386 19954928 19412799 18668581 17742059 17099178
7064A7099178p07267o93644o51348m75516m32209m99001n02070k33501l21430
$$ 17099178 16391911 15698267 15046919 14571403 14139194 13640193 13138123 12904622 12583192
7055A2583192l42889l85194j27316j43261j18873j26772L8762k74761j45899j73686
$$ 12583192 12240303 11855109 11727793 11584532 11465659 11338887 11377649 11102888 10956989 10783303
7045A0783303k01096k18609k48313k55289k75322k16659k61783l01426k35354
$$ 10783303 10582207 10363598 10115285 9859996 9584674 9368015 9106232 8804806 8569452
7036H569452l30172k32896k84738j64995k59583k79756j69481j84699k39005j71266
$$ 8569452 8239280 8006384 7721646 7556651 7297068 7017312 6847831 6663132 6424127 6252861
7026F252861j92887k60577k03712p9279n0417j01297J6509p3742K5429J10714
$$ 6252861 6059974 5799397 5595685 5516406 5465989 5364692 5381201 5307459 5332888 5443602
7016E443602j75843r2759j38227k7209j06616j00620l0853k4733o7705j00996
$$ 5443602 5267759 5175000 5036773 5009564 4902948 4802328 4771475 4746742 4679037 4578041
7006D578041j40375j4853J09577M8091Q4129P5312J48306M2571J3644l3593j39016
$$ 4578041 4437666 4422813 4532390 4580481 4664610 4739922 4888228 4930799 4944443 4910850 4771834
6995D771834j14755j31234j65152j60540K0j45868k25633j8234J0591l2717J5548
$$ 4771834 4657079 4525845 4360693 4200153 4200173 4054305 3828672 3810438 3821029 3788312 3803860
6984C803860m5492l3806q3319j00712j19602o1217o0970j21386k1899k0273j21427
$$ 3803860 3758368 3724562 3641243 3540531 3420929 3359712 3298742 3177356 3155457 3135184 3013757
6973C013757k2034j41020n3241p4490N646o673n5494j91286q9830p314Q3316l8991
$$ 3013757 2991723 2850703 2797462 2722972 2728618 2721945 2666451 2475165 2385335 2378021 2461337 2422346
6961B422346m7886Q6797n0317j28672R628l4796q5907n5682l6906j27875n5738
$$ 2422346 2374460 2461257 2410940 2282268 2291896 2257100 2171193 2115511 2078605 1950730 1894992
6950A894992k3731j04384O8062j18721j03119n5891P7326p9428n836Q7526J00159
$$ 1894992 1871261 1766877 1834939 1716218 1613099 1557208 1634534 1555106 1549270 1636796 1736955
6939A736955o841q0145q7391j21426O6707J1923O197k7146Q7277j2329j8548k0169
$$ 1736955 1730114 1649969 1562578 1441152 1507859 1519782 1525979 1498833 1586110 1573781 1555233 1535064
6927A535064J04731p810o0153J48386o9624L1848J375K8887o5688j4400Q5115
$$ 1535064 1639795 1631985 1571832 1720218 1650594 1682442 1683817 1712704 1647016 1632616 1717731
6916A717731L6906j1493q0190K3532P8235j18935j04679M2160L0958j15769m7738
$$ 1717731 1754637 1743144 1662954 1686486 1764721 1645786 1541107 1583267 1614225 1498456 1450718
6905A450718l0193n4463k1760m2486J3079O5336l8443q678k602Q1877M3390m1209
$$ 1450718 1420525 1366062 1344302 1301816 1314895 1380231 1341788 1333110 1330508 1412385 1455775 1414566
6893A414566r7255n3939n9604j6916K10852O693n5040k541n6594L1213J06678
$$ 1414566 1317311 1263372 1203768 1186852 1397704 1404397 1349357 1346816 1290222 1321435 1428113
6882A428113N0485q985Q3606l1655N2146j6308K08398M6577k4761M7941P9614
$$ 1428113 1478598 1469613 1553219 1521564 1573710 1557402 1765800 1812377 1787616 1835557 1915171
6871A915171Q2683L1432O0199j6147P4321N7740j59569O190o0578P156r6690r233
$$ 1915171 1997854 2029286 2089485 2073338 2147659 2205399 2045830 2052020 1991442 1998598 1901908 1892675
6859A892675j4469j60327r8651M066j4566K226r1445j04261p1096k2590J0515
$$ 1892675 1878206 1717879 1619228 1623294 1608728 1610954 1519509 1415248 1344152 1321562 1332077
6848A332077j08760l8324l8969K0811K1600k930q9230k3950m4516Q8796l232K8036
$$ 1332077 1223317 1184993 1146024 1166835 1188435 1185505 1096275 1072325 1027809 1116605 1113373 1141409
6836A141409J3129k9563j02571m2204Q3751K357q8251l9034M1667n9188Q7239
$$ 1141409 1154538 1124975 1022404 980200 1063951 1066308 978057 939023 980690 921502 1008741
6825A008741L7656N2135n0844O6453m9122j29550J16513J5599j08374j6053J8871
$$ 1008741 1046397 1098532 1047688 1114141 1065019 935469 1051982 1067581 959207 943154 962025
6814I62025O0193j9309K0077k0163n9476M1426m6177J11242N058P011J059K7892
$$ 962025 1022218 1002909 1022986 1002823 943347 984773 938596 1049838 1054896 1061907 1062966 1090858
6802A090858O47j03476n6313L4946O626N170J0556Q2554M3133P5448k4049L2703
$$ 1090858 1091505 988029 931716 966662 973288 978458 989014 1071568 1114701 1190149 1166100 1198803
6790A198803k0189j7323k8954R2502m5706m3735N9593R874j35747K7141P5572
$$ 1198803 1178614 1161291 1132337 1224839 1179133 1135398 1194991 1204865 1069118 1096259 1171831
6779A171831m9568m2869M3868l7964J110M9405k4772Q9558J16304L9471Q6207
$$ 1171831 1122263 1079394 1123262 1085298 1086408 1135813 1111041 1200599 1316903 1356374 1442581
6768A442581P7635r1762o3154j6843N9597J07975J8204o3017O9488J10719m0027
$$ 1442581 1520216 1428454 1365300 1348457 1408054 1516029 1534233 1471216 1540704 1651423 1611396
6757A611396k7103j7757P4079N6838q4728L724J59635J12680J7970J7486M7235
$$ 1611396 1584293 1566536 1640615 1697453 1612725 1616449 1776084 1888764 1906734 1924220 1971455
6746A971455Q0814P0142J42225J48089M0413J87357R0052J30202J99086N6627
$$ 1971455 2052269 2122411 2264636 2412725 2453138 2640495 2730547 2860749 3059835 3116462
6736C116462O0576Q5685n0639n2225p8850n405R8646j5286k3912m7120P8478J14379
$$ 3116462 3177038 3262723 3212084 3159859 3081009 3075604 3174250 3158964 3135052 3087932 3166410 3280789
6724C280789k2129P7621K6755J33984J80339k95N1764R0101J61498Q1046O3961
$$ 3280789 3258660 3336281 3363036 3497020 3677359 3677064 3728828 3818929 3980427 4061473 4125434
6713D125434J09119R7807P8319J22635K19072J67764n38K03536M8734n080j06113
$$ 4125434 4234553 4332360 4410679 4533314 4752386 4920150 4919612 5123148 5171882 5166802 5060689
6702E060689k11692l82839k20840j80795l9998j33207k46673k4831j53966p1489
$$ 5060689 4848997 4466158 4245318 4064523 4024525 3891318 3644645 3619814 3465848 3394359
6692C394359p1126M0015q9858j0226O4033J6742j06441L1043K7899R881l1330
$$ 3394359 3323233 3363248 3273390 3263164 3327197 3343939 3237498 3268541 3296440 3306321 3274991
6681C274991Q127N3231J5755M671l1471p5708p9562m3810j29303k5691m0231p4302
$$ 3274991 3283118 3336349 3352104 3356775 3325304 3249596 3170034 3126224 2996921 2971230 2930999 2856697
6669B856697q2217Q6113M353q428j2122k507L2540K5172r1821M1991K4676J337
$$ 2856697 2774480 2860593 2864946 2856518 2844396 2841889 2874429 2899601 2807780 2849771 2874447 2875784
6657B875784k3792o6911J42600J42264J05707R9585J3573R7410j12056N6232K3537
$$ 2875784 2851992 2785081 2927681 3069945 3175652 3275237 3288810 3386220 3274164 3330396 3353933
6646C353933L7612K038K1465P1747Q6765K6262N0273Q1507N7950M068j60306m6921
$$ 3353933 3391545 3393583 3415048 3486795 3573560 3599822 3650095 3731602 3789552 3793620 3633314 3586393
6634C586393J08232k050o21q2568q366L3343N7782L6293o006J81290K8417n6368
$$ 3586393 3694625 3692575 3691954 3609386 3601020 3634363 3692145 3728438 3722432 3903722 3932139 3875771
6622C875771L0686J60341L0884O5850J7335O1591P8281k0588J17181J72751n912
$$ 3875771 3906457 4066798 4097682 4163532 4180867 4242458 4320739 4300151 4417332 4590083 4584171
6611D584171J07435P4630N3410P5839l2804O0434J72793R1909J82033K98252P9283
$$ 4584171 4691606 4766236 4819646 4895485 4862681 4923115 5095908 5187817 5369850 5668102 5747385
6600E747385J78125K69306L16923K22032K98884K58128J73060M15719N41475M75634
$$ 5747385 5925510 6194816 6511739 6733771 7032655 7290783 7463843 7879562 8421037 8896671
6590H896671L34922L68182M4089J05728J66329J26702P6095J24594J24341N646
$$ 8896671 9231593 9599775 9643864 9749592 9915921 10042623 10118718 10243312 10367653 10373299
6580A0373299J24810K33475K47631K73262K30816L06060L79943M51960N02968
$$ 10373299 10498109 10731584 10979215 11252477 11483293 11789353 12169296 12621256 13124224
6571A3124224N73322N39816O21259P92580P69823O18411Q37403P86256R91702
$$ 13124224 13697546 14237362 14858621 15651201 16421024 17039435 17876838 18663094 19654796
6562A9654796J003425J094969J089533J130027J442692J499602J580634J800439
$$ 19654796 20658221 21753190 22842723 23972750 25415442 26915044 28495678 30296117
6554C0296117K004818K371706K682038K902649L333668L633529M168974M572900
$$ 30296117 32300935 34672641 37354679 40257328 43590996 47224525 51393499 55966399
6546E5966399N134799N812577O510692P345645Q414767R533340J0973613J2638732
$$ 55966399 61101198 66913775 73424467 80770112 89184879 98718219 109691832 122330564
6538A22330564J4002465J5070615J5430460J5366098J4011796J1152203O903967
$$ 122330564 136333029 151403644 166834104 182200202 196211998 207364201 214268168
6531B14268168J538908m145588q693575j1353249j2324211j2023982j1202419
$$ 214268168 215807076 211661488 202967913 191614664 179290453 167266471 156064052
6524A56064052j0649188j0071892r351871q877332q095456p425984o830739o268613
$$ 156064052 145414864 135342972 125991101 117113769 109018313 101592329 94761590 88492977
6516H8492977n669083n216318m817468m374452l998465l638389l280500l041502
$$ 88492977 82823894 77607576 72790108 68415656 64417191 60778802 57498302 54456800
6508E4456800k662029k355383k067634j808986j447282j265389j017257q32130
$$ 54456800 51794771 49439388 47371754 45562768 44115486 42850097 41832840 41000710
6500D1000710p63027o73031q16239q50326r70851j129953j102219j111904j002254
$$ 41000710 40237683 39564652 38748413 37898087 36927236 35797283 34695064 33583160 32580906
6491C2580906p38522n93414p06467n14030l32820k33306q4894r006M2338Q7073
$$ 32580906 31842384 31248970 30542503 30028473 29695653 29462347 29377453 29368447 29410785 29497858
6481B9497858k05242n42033p45791j032647j006588q85676j195010j129271r47998
$$ 29497858 29292616 28750583 28004792 26972145 25965557 25079881 23884871 22755600 21807602
6472B1807602r29345r53009q76838q53621o71307p08971o14640n77669m88505
$$ 21807602 20878257 19925248 19048410 18194789 17523482 16814511 16199871 15622202 15133697
6463A5133697m46250m14251n62393m30213l69182l78515k15271l13777k64586
$$ 15133697 14687447 14273196 13710803 13280590 12911408 12532893 12317622 12003845 11739259
6454A1739259l29815j63087k45971k28351l31901k21325k98400k09149k17405
$$ 11739259 11409444 11246357 11000386 10772035 10440134 10218809 9920409 9711260 9493855
6445I493855r5633k33088r5798j46763j36779k8009j13787J098j38727n9275q3943
$$ 9493855 9398222 9165134 9069336 8922573 8785794 8757785 8643998 8645096 8506369 8447094 8363151
6434H363151j4618n4899m4841N3775M8657n5701j19847P1723O8938R7939J54379
$$ 8363151 8348533 8293634 8248793 8302568 8351225 8295524 8175677 8247400 8316338 8414277 8568656
6423H568656J87959K9171J36755L47537K96119L10332K92577L57525L70023K01419
$$ 8568656 8756615 8785786 8922541 9270078 9566197 9876529 10169106 10526631 10896654 11098073
6413A1098073J29462j11045p713j76546k07539r2935j33848l4808p225J47293
$$ 11098073 11227535 11116490 11108777 10932231 10724692 10631757 10497909 10463101 10455876 10603169
6403A0603169M0315R5236J61196J62339J52555J92024J31015N9898j42640j98714
$$ 10603169 10643484 10738720 10899916 11062255 11214810 11406834 11537849 11597747 11455107 11256393
6393A1256393j03356p447j6819L0346J42008J51505M9755J08488K33752J42627
$$ 11256393 11153037 11145590 11128771 11159117 11301125 11452630 11502385 11610873 11844625 11987252
6383A1987252K52345L72294K95092K88307L96298M96412N34662O70120P01230
$$ 11987252 12239597 12611891 12906983 13195290 13591588 14088000 14622662 15292782 15994012
6374A5994012Q34398Q54200O50109L17852j83995o73131p14140p59411n88968
$$ 15994012 16828410 17682610 18332719 18650571 18466576 17793445 17079305 16319894 15730926
6365A5730926l51209k28561j00374L4198J2666L1229K12034L82473L32101L45872
$$ 15730926 15379717 15151156 15050782 15084980 15097646 15128875 15340909 15723382 16055483 16401355
6355A6401355L11563J29213k83057p36654q17153r24067o89438n66888o27383
$$ 16401355 16712918 16842131 16559074 15822420 15005267 14081200 13391762 12824874 12197491
6346A2197491o19903n24051m44001m25101l78452l48525k36890j53167j71480
$$ 12197491 11577588 11053537 10609536 10184435 9805983 9457458 9220568 9067401 8895921
6337H895921k64275k32904j29785j41894k13240j01846k26173j94277j49040j86192
$$ 8895921 8631646 8398742 8268957 8127063 7913823 7811977 7585804 7391527 7242487 7056295
6327G056295j24256j86930k16414k61426l598k6360j19399p7152r9j70539j30691
$$ 7056295 6932039 6745109 6528695 6267269 6263671 6237311 6117912 6040760 6040661 5870122 5739431
6316E739431M31l0736M6498N4852l9103N3406p0262o3736p6481P3067P1681k8935
$$ 5739431 5739862 5709126 5755624 5810476 5771373 5824779 5754517 5690781 5614300 5687367 5759048 5730113
6304E730113P1808O6256r061L9973r300Q78Q9600j7926j0087K9516J5567O8125
$$ 5730113 5801921 5868177 5859116 5899089 5889789 5890667 5980267 5962341 5952254 5981770 5997337 6065462
6292F065462q8842p6069P5431n1618O9658J2056j07708o5629j4791m1859N0965
$$ 6065462 5976620 5900551 5975982 5924364 5994022 6006078 5898370 5832741 5817950 5776091 5827056
6281E827056k6780q7140L3311M3628o0228N1000m7812J4332J3134M2204r1262
$$ 5827056 5800276 5713136 5746447 5790075 5729847 5780847 5733035 5747367 5760501 5802705 5711443
6270E711443j10722P8275o7444L6817l0417j887J9382j1484k4808j9169o9012
$$ 5711443 5600721 5678996 5611552 5648369 5617952 5616065 5635447 5623963 5599155 5579986 5510974
6259E510974P471Q6605N9362l765j5873q6208K7692j7891R5621J1893n6163M8268
$$ 5510974 5518445 5605050 5664412 5660647 5644774 5558566 5586258 5568367 5663988 5675881 5619718 5667986
6247E667986r0668j8200M5697J15570r2781J40768K480k62N8155O9679J17751
$$ 5667986 5577318 5559118 5604815 5720385 5627604 5768372 5770852 5770590 5828745 5898424 6016175
6236F016175p0192q2995p838j1654R0731J85980O0376k8537o7109J9329j6366
$$ 6016175 5945983 5862988 5855150 5843496 5934227 6120207 6180583 6152046 6084937 6104266 6087900
6225F087900J71533J19998Q3583p0181J6347j01263j9752k2603j6804R4553j6977
$$ 6087900 6259433 6379431 6463014 6392833 6409180 6307917 6288165 6265562 6248758 6343311 6326334
6214F326334j55615m7875J47200K4184o6662M2176O4155J3487k3316r695J20801
$$ 6326334 6170719 6122844 6270044 6294228 6227566 6269742 6333897 6347384 6324068 6314373 6435174
6203F435174m2477P8830M9658J75729Q3568J18695M3682O3518L9520l8181K1266
$$ 6435174 6392697 6471527 6521185 6696914 6780482 6899177 6942859 7006377 7045897 7007716 7028982
6192G028982j8437J02071J15k3835J1436Q6710J00761q378k7006O4363J18125
$$ 7028982 7010545 7112616 7112731 7088896 7100332 7187042 7287803 7279425 7252419 7316782 7434907
6181G434907L9572K8934O8645R9275m4875j4380M5749o3984R3528K01226N6511
$$ 7434907 7474479 7503413 7572058 7671333 7626458 7612078 7657827 7593843 7687371 7888597 7945108
6170G945108L629J28119K05356Q7078J39528J20646J26213K02404K54650K13112
$$ 7945108 7948737 8076856 8282212 8369290 8508818 8629464 8755677 8958081 9212731 9425843
6160I425843M8515K3148N1371J01123J00713J44653Q9962J44253J70885J05770
$$ 9425843 9474358 9497506 9548877 9650000 9750713 9895366 9985328 10129581 10300466 10406236
6150A0406236J02333J68323K292Q9766K00652J84420J08141J44890K91825K00254
$$ 10406236 10508569 10676892 10679184 10768950 10969602 11154022 11262163 11407053 11698878 11899132
6140A1899132L05703K65410L52362L68128K81654L47519L00588J71667K25056
$$ 11899132 12204835 12470245 12822607 13190735 13472389 13819908 14120496 14292163 14517219
6131A4517219J85184M0035p6084j71073p2244k7721o2170m8437M4078O5280M3377
$$ 14517219 14702403 14742438 14666354 14495281 14423037 14395316 14333146 14284709 14328787 14394067 14437444
6120A4437444J25837J08284J74571P3766J44584J83246L03156L32029K93934M31582
$$ 14437444 14563281 14671565 14846136 14919902 15064486 15247732 15550888 15882917 16176851 16608433
6110A6608433N69028M98543N14190N95871N09692L79174L16111K68009K24348
$$ 16608433 17177461 17676004 18190194 18786065 19295757 19674931 19991042 20259051 20483399
6101B0483399K19853K95825J41475q4467K4866K06379K71551L47431K83933K57029
$$ 20483399 20703252 20999077 21140552 21056085 21080951 21287330 21558881 21906312 22190245 22447274
6091B2447274K64803K62695N3948l8636k22840l72075k97462l23943k08174k41506
$$ 22447274 22712077 22974772 23028720 22990084 22767244 22395169 22097707 21773764 21565590 21324084
6081B1324084j27504q6013K7862l2148j28817k13514j52372k20900l35496k77247
$$ 21324084 21196580 21110567 21138429 21106281 20977464 20763950 20611578 20390678 20055182 19777935
6071A9777935k01226k45264k14321l05938k75260n4404J1769q7432M1893J22787
$$ 19777935 19576709 19331445 19117124 18811186 18535926 18481522 18493291 18405859 18447752 18570539
6061A8570539O3149M5889J95688J68490K60125L05850M07455L87496L27891N08076
$$ 18570539 18633688 18679577 18875265 19043755 19303880 19609730 20017185 20404681 20732572 21240648
6051B1240648M89246N71195O33644P38847P08727O57989O86897P44673Q90440
$$ 21240648 21729894 22301089 22934733 23673580 24382307 25040296 25727193 26471866 27362306
6042B7362306Q32282R69013J109907J227356J362626J527738J728392J956336
$$ 27362306 28194588 29163601 30273508 31500864 32863490 34391228 36119620 38075956
6034C8075956K049757K412885K675870K860975L033682L319083L390298L606465
$$ 38075956 40125713 42538598 45214468 48075443 51109125 54428208 57818506 61424971
6026F1424971L751764L756693L902281L883911M053368M192492M493518M816366
$$ 61424971 65176735 68933428 72835709 76719620 80772988 84965480 89458998 94275364
6018I4275364M875757M932231M744115L997742K773165J404354l64689k252382
$$ 94275364 99151121 104083352 108827467 112825209 115598374 117002728 116638039 114385657
6010A14385657l903384n298523n952127o261780o079243n795588n360540m956140
$$ 114385657 110482273 105183750 99231623 92969843 86890600 81095012 75734472 70778332
6002G0778332m558146m036109l732002l284973k996459k788963k298976k226923
$$ 70778332 66220186 62184077 58452075 55167102 52170643 49381680 47082704 44855781
5994D4855781k001136j854915j713597j511366j449935j280500j249781j067114
$$ 44855781 42854645 40999730 39286133 37774767 36324832 35044332 33794551 32727437
5986C2727437j008638q97298r74416j007921q27789q02123p81559o61014n87825
$$ 32727437 31718799 30821501 29847085 28839164 28011375 27209252 26427693 25766679 25178854
5977B5178854n89350n82696o09671l89901m83208m20867m33819l54421l80014
$$ 25178854 24589504 24006808 23397137 23007236 22524028 22103161 21669342 21314921 20934907
5968B0934907l72362k84650l62701k89427k96698k62209j93063k67642j63188
$$ 20934907 20562545 20277895 19915194 19625767 19329069 19066860 18873797 18606155 18442967
5959A8442967j64822k95927j41264j40797k12603j72404o1750r4658j96381l0540
$$ 18442967 18278145 17982218 17840954 17700157 17487554 17315150 17253400 17158742 16962361 16931821
5949A6931821q4118q5254p7641j98147j81868K8612o4237q5816j29345j15536
$$ 16931821 16847703 16762449 16684808 16486661 16304793 16333405 16269168 16183352 16054007 15938471
5939A5938471j17966j05854j20925k3303l7798J24577j9683j58911j13709p8557
$$ 15938471 15820505 15714651 15593726 15570423 15532625 15657202 15637519 15478608 15364899 15286342
5929A5286342j38528o583J8138q0060j19020j1414m8034j28108o4887r9040m0389
$$ 15286342 15147814 15141231 15159369 15079309 14960289 14948875 14900841 14772733 14707846 14608806 14568417
5918A4568417p7403m0721m8463o3670q2776J3719r428o6556r5202j14893m8966
$$ 14568417 14491014 14450293 14401830 14338160 14255384 14269103 14259675 14193119 14097917 13983024 13934058
5907A3934058j6734J0199J57784L323K5777m0506n4042j16241L6687J8416j11800
$$ 13934058 13917324 13927523 14085307 14088630 14114407 14073901 14019859 13903618 13940305 13958721 13846921
5896A3846921j21194m2865J2466O2426k1225p419m0203j389K9930J5139K8906
$$ 13846921 13725727 13682862 13695328 13757754 13736529 13729110 13688907 13687518 13717448 13732587 13761493
5885A3761493m7926Q248n2030p867k8058j36426l1106Q8001l4690k912M4194j558
$$ 13761493 13713567 13721815 13669785 13661918 13633860 13497434 13466328 13554329 13519639 13516727 13560921 13559363
5873A3559363Q2330j27588j10227O7501j7396O1879J13774j3559L6909O0431L9506
$$ 13559363 13641693 13514105 13403878 13471379 13453983 13515862 13629636 13616077 13652986 13713417 13752923
5862A3752923O3124p9022O3887J45661J12187J29528o3332K03248O5710J84339
$$ 13752923 13816047 13737025 13800912 13946573 14058760 14188288 14124956 14328204 14393914 14578253
5852A4578253O0813L8111M1435o3865j20895m0190M5790p3935J15979P1476P4409
$$ 14578253 14639066 14677177 14718612 14654747 14533852 14493662 14539452 14465517 14581496 14652972 14727381
5841A4727381R8056P1317O2307J11807J07496J10187Q8063N4497P763M2022M1867
$$ 14727381 14825437 14896754 14959061 15070868 15178364 15288551 15376614 15431111 15438874 15480896 15522763
5830A5522763P8796J7728q1477j56746k72325j19293L4012Q2271o3114j04844
$$ 15522763 15601559 15619287 15537810 15381064 15108739 14989446 15023458 15105729 15042615 14937771
5820A4937771m5696n965N6936K763l2771R1854R5202k9103N4778K25405N5174
$$ 14937771 14892075 14886110 14943046 14945809 14913038 15004892 15100094 15070991 15125769 15351174 15406348
5809A5406348M5414j18646J16874Q7262L7060J39119j45838O4809J55760l436
$$ 15406348 15451762 15333116 15449990 15537252 15574312 15713431 15567593 15632402 15788162 15784726
5799A5784726L3460K43189P3110J50658K8865P8146P7281J07910P4578L7150L5762
$$ 15784726 15818186 16061375 16134485 16285143 16314008 16392154 16469435 16577345 16651923 16689073 16724835
5788A6724835K368J00535J7111Q424K7700m7709R995K53998m5124l8360J02908
$$ 16724835 16727203 16827738 16844849 16853273 16880973 16833264 16843259 17097257 17052133 17013773 17116681
5777A7116681Q2852J37444J58534K9224K17742J88114l0328K13872l864o5157
$$ 17116681 17199533 17336977 17495511 17524735 17742477 17930591 17900263 18114135 18110271 18045114
5767A8045114J2883K4519j79876r7901m6480j72442j67809L1035n5455j70979
$$ 18045114 18057997 18082516 17902640 17804739 17758259 17585817 17418008 17449043 17393588 17222609
5757A7222609n8970l4954l3812n0777K2926J8286n5728Q8091K2251l7709L9235
$$ 17222609 17163639 17128685 17094873 17044096 17067022 17085308 17029580 17117671 17139922 17102213 17141448
5746A7141448N919K4420m5931r5907K4649o5169O124j39043j01411j24186k54820
$$ 17141448 17147367 17171787 17125856 17029949 17054598 16989429 16995553 16856510 16755099 16630913 16376093
5735A6376093q8173r2293j69301m1327l2623m1912j22752j78329k6581l2520k59220
$$ 16376093 16287920 16195627 16026326 15984999 15952376 15910464 15787712 15609383 15582802 15550282 15291062
5724A5291062l3009j28272k04091j14798k14883k71502j51233p3439j49459j45760
$$ 15291062 15258053 15129781 14925690 14810892 14596009 14324507 14173274 14099835 13950376 13804616
5714A3804616j84693k8413q453k5500P5786N9737l5792P8206J65110K22553J79008
$$ 13804616 13619923 13591510 13583057 13557557 13633343 13693080 13657288 13735494 13900604 14123157 14302165
5703A4302165O2006q6018j69724l15525l86099l92682k29226k37209j28047j66933
$$ 14302165 14364171 14278153 14108429 13792904 13406805 13014123 12784897 12547688 12419641 12252708
5693A2252708k46418j66520k0482l880J935N8522o0290Q6844J81487P7408J54694
$$ 12252708 12006290 11839770 11819288 11815408 11817343 11875865 11815575 11902419 12083906 12161314 12316008
5682A2316008J64186K74661K30257M47028M95076O03666P16815P90216P84693
$$ 12316008 12480194 12754855 12985112 13432140 13927216 14530882 15247697 16037913 16822606
5673A6822606O93021P54883L62401N8753l68222p29841q46284p63532p27953m95235
$$ 16822606 17515627 18270510 18632911 18691664 18323442 17593601 16747317 15983785 15255832 14760597
5663A4760597l87375l92131l02688l96726k02330j71636j0713j02882o8144J75955
$$ 14760597 14373222 13981091 13678403 13281677 13079347 12907711 12896998 12794116 12725972 12901927
5653A2901927K07436J37763R5482K14073K40666K68115M35745N40640O23526P38772
$$ 12901927 13109363 13247126 13342608 13556681 13797347 14065462 14501207 15041847 15665373 16404145
5643A6404145P81873P62565P53685P07361L26700o013l89357p84403q33448p15390
$$ 16404145 17186018 17948583 18702268 19409629 19736329 19730316 19340959 18556556 17723108 17007718
5633A7007718m38101l57189l07188k37908K8038r1022k50696l06794k58583k59910
$$ 17007718 16569617 16212428 15905240 15667332 15695370 15604348 15353652 15046858 14788275 14528365
5623A4528365j41419j33678l5405L7584n2074K3415n6408N2168k3357J34742J75080
$$ 14528365 14386946 14253268 14217863 14255447 14203373 14226788 14170380 14222548 14199191 14333933 14509013
5612A4509013L57768M83665K62990M44727N36863K61704L15252K78483R0024q42
$$ 14509013 14866781 15350446 15613436 16058163 16595026 16856730 17171982 17450465 17540489 17539647
5602A7539647j33124k59576j66503j23769j3825O8018J1629K8482J5022J18725
$$ 17539647 17406523 17146947 16980444 16856675 16842850 16910868 16922497 16950979 16966001 17084726
5592A7084726q3625J85657J99176J40034L87994L45973L39302N07290O12406N41401
$$ 17084726 17001101 17186758 17385934 17525968 17913962 18259935 18599237 19106527 19718933 20260334
5582B0260334N40431N85443N55135M59326K62537k06082n98132p93735p30237
$$ 20260334 20800765 21386208 21941343 22400669 22663206 22457124 21858992 21065257 20335020
5573B0335020m52075m18816n31069l94562k77999j70511j71803j09372q9897Q2074
$$ 20335020 19882945 19464129 18933060 18538498 18260499 18089988 17918185 17808813 17718916 17800990
5563A7800990R0572K19934K28566M64043L34456M61719O00568P72751N16924M42903
$$ 17800990 17891562 18111496 18340062 18804105 19138561 19600280 20200848 20973599 21490523 21933426
5553B1933426K30077j81421l24297k38274m5596J10890J71608N0357L70897M70213
$$ 21933426 22163503 21982082 21657785 21419511 21373915 21484805 21656413 21706770 22077667 22547880
5543B2547880N13313N32185O37263N32393N03076M37679P03974M68759J22169
$$ 22547880 23061193 23593378 24230641 24763034 25266110 25703789 26407763 26876522 26998691
5534B6998691j59693m01304l99780l64158k92547j46473r9633R7866K23967J45462
$$ 26998691 26838998 26437694 26037914 25673756 25381209 25234736 25135103 25232969 25456936 25602398
5524B5602398K69623M22650J97274J38061O1105j75916m14733n33143o95296n75581
$$ 25602398 25872021 26294671 26491945 26630006 26691111 26515195 26100462 25567319 24872023 24296442
5514B4296442l53524l48002r0985n3405J23297K71243L29556L45990K68137P1882
$$ 24296442 23942918 23594916 23503931 23450526 23573823 23845066 24174622 24520612 24788749 24860631
5504B4860631j84910m29269p10388o41623o42787n55452m51998n21622m62735
$$ 24860631 24675721 24246452 23536064 22894441 22251654 21696202 21244204 20722582 20259847
5495B0259847n21452l89465n43592n14082m37430m90274l72878l12292l73074
$$ 20259847 19738395 19348930 18805338 18291256 17853826 17363552 16990674 16678382 16305308
5486A6305308m77082n39474n73310n55567n42669m29590l41223l66434l01800
$$ 16305308 15828226 15288752 14715442 14159875 13617206 13187616 12846393 12479959 12178159
5477A2178159k59814l10282k48479j61174j82478o8480p2787j07444j38563J0397
$$ 12178159 11918345 11608063 11359584 11198410 11015932 10947452 10874665 10767221 10628658 10639055
5467A0639055k5361j9075J7244J22354J32648J66182J84255J93276K90439K47410
$$ 10639055 10613694 10594619 10611863 10734217 10866865 11033047 11217302 11410578 11701017 11948427
5457A1948427K13229K94943J74279K3374K7849L9793n6136k0809J61137J25400
$$ 11948427 12161656 12456599 12630878 12654252 12682101 12721894 12665758 12644949 12806086 12931486
5447A2931486J47213K74196L52605K58427N48940M62297N06975O30374Q75601
$$ 12931486 13078699 13352895 13705500 13963927 14512867 14975164 15482139 16112513 16988114
5438A6988114R07058J054011J165635J207877J442061J477971J782653K145499
$$ 16988114 17895172 18949183 20114818 21322695 22764756 24242727 26025380 28170879
5430B8170879K549257L180349L878686M321034N158891N669054N681606N896908
$$ 28170879 30720136 33900485 37779171 42100205 47259096 52928150 58609756 64506664
5422F4506664N279025L661259J226787j957854n316643o494748o198737n279619
$$ 64506664 69785689 73446948 74673735 72715881 67399238 60904490 54705753 49426134
5414D9426134m597612l841294l339447k879229k653152k329549j853679j739994
$$ 49426134 44828522 40987228 37647781 34768552 32115400 29785851 27932172 26192178
5406B6192178j532505j331371j113384j043124r22556q53656p26326p59529p08775
$$ 26192178 24659673 23328302 22214918 21171794 20249238 19395582 18669256 17909727 17200952
5397A7200952p16078p10233p16871n95958n42126n61715n05360l52139m38459
$$ 17200952 16484874 15774641 15057770 14461812 13919686 13357971 12852611 12500472 12062013
5388A2062013k04530l21355j76639l11635l36798k37836k38989k12353j95958
$$ 12062013 11857483 11536128 11359489 11047854 10711056 10473220 10234231 10021878 9825920
5379I825920j71643k04566j70325j77493j73538j42732j96461k31524o2254j65945
$$ 9825920 9654277 9449711 9279386 9101893 8928355 8785623 8589162 8357638 8295384 8129439
5369H129439q2192j02055p4529m3416o4014k1976N6865p2098k2780R7753J14900
$$ 8129439 8047247 7945192 7870663 7827247 7763233 7741257 7798122 7726024 7703244 7800997 7915897
5358G915897p2812n9557N310R137j2667k3107j610K9005P6946k4873j01358q590
$$ 7915897 7843085 7783528 7788838 7797975 7785308 7762201 7760591 7789596 7866542 7841669 7740311 7731721
5346G731721j21975j46450K335j56212j54239j46576q8315j16676n9652p4355
$$ 7731721 7609746 7463296 7465631 7309419 7155180 7008604 6920289 6803613 6743961 6669606
5336F669606p9876j80490j8390q4954j08014N104P1285n2506l6194l067k423N6292
$$ 6669606 6589730 6409240 6390850 6305896 6197882 6202986 6274271 6221765 6185571 6182504 6180081 6236373
5324F236373N4697j9882j7886K05502K9998j6263J41777J06882N3618J05409J62183
$$ 6236373 6291070 6271188 6253302 6458804 6488802 6472539 6614316 6721198 6774816 6880225 7042408
5313G042408K00392K68452L17305K29005K61439L16103J53653m384j607j64795
$$ 7042408 7242800 7511252 7828557 8057562 8319001 8635104 8788757 8784373 8782766 8617971
5303H617971k31053k64838l80791k81117j14759r2418j22348j14228r2344M0529
$$ 8617971 8386918 8122080 7741289 7460172 7345413 7252995 7130647 7016419 6924075 6964604
5293F964604j206Q1978J93433J15906P2030K21448J30725Q4980R8913j01942J09214
$$ 6964604 6963398 7045376 7238809 7354715 7426745 7648193 7778918 7863898 7962811 7860869 7970083
5282G970083K27072J43134J76991L11571J79846R5111Q9017O3565j64034j62525
$$ 7970083 8197155 8340289 8517280 8828851 9008697 9103808 9192825 9256390 9092356 8929831
5272H929831j43629k04798j85879q2853O842Q4722J54121K22372J92717K72373
$$ 8929831 8786202 8581404 8395525 8312672 8319514 8404236 8558357 8780729 8973446 9245819
5262I245819L85194K68160J94501m319j52852k45619l11124l13016k07702k34172
$$ 9245819 9631013 9899173 10093674 10089355 9936503 9690884 9379760 9066744 8859042 8624870
5252H624870k28555n6396k2574k7184R5455j7464R3294J14640P5372O2363N3547
$$ 8624870 8396315 8339919 8317345 8290161 8385616 8368152 8461446 8576086 8651458 8713821 8767368
5241H767368K8067l6382J18707P5202J07558P2397J13874K60289K00792J85807
$$ 8767368 8795435 8759053 8877760 8952962 9060520 9132917 9246791 9507080 9707872 9893679
5231I893679K02950K12395J3028j14451l29829l43318k69991l12620j52391k17766
$$ 9893679 10096629 10309024 10322052 10207601 9877772 9534454 9264463 8951843 8799452 8581686
5221H581686m08056j47407j04403n7935j25705j16618j0991r1155j2482j7245
$$ 8581686 8173630 8026223 7921820 7863885 7738180 7621562 7610571 7519416 7506934 7489689
5211G489689m8470m4960Q2977K2139K4177N9831J20566m682P5877J34508K5098
$$ 7489689 7441219 7396259 7479236 7501375 7525552 7585383 7705949 7701267 7777144 7911652 7936750
5200G936750J56987J41180P9186J26602L6047Q574O8718K8242l1243M0893r0503
$$ 7936750 8093737 8234917 8314103 8440705 8476752 8485326 8554044 8582286 8551043 8591936 8501433
5189H501433o9609l435r4313Q864M4561P948L2771n1657N564R6780J8390P5826
$$ 8501433 8431824 8428389 8334076 8342940 8387501 8395449 8428220 8376563 8382127 8478907 8497297 8573123
5177H573123J8548J02022K22152J00887O9994R9575J78731J80449J47724J20124
$$ 8573123 8591671 8693693 8915845 9016732 9086726 9186301 9365032 9545481 9693205 9813329
5167I813329K73839Q1683J23413R4684J45714J03537J12779J19664J29162n824
$$ 9813329 10087168 10168851 10292264 10386948 10532662 10636199 10748978 10868642 10997804 10991980
5157A0991980P9686K03063J95934K28285J06411J64452R7180Q8207N1168l3536
$$ 10991980 11071666 11274729 11470663 11698948 11805359 11969811 12066991 12155198 12206366 12172830
5147A2172830J6928R5966k487o7321n7174j4109m1544k824k7499r584J7481l3089
$$ 12172830 12189758 12285724 12283237 12215916 12158742 12144633 12103089 12100265 12072766 12063182 12080663 12047574
5135A2047574J14367R9307p4924M136N8360Q2736J21465r6378p9716m9016N0780
$$ 12047574 12161941 12261248 12186324 12190460 12248820 12331556 12453021 12356643 12276927 12227911 12278691
5124A2278691J91776R533J1796j03714j35169o796j01145p9075N5881J1938M2581
$$ 12278691 12470467 12480000 12491796 12388082 12252913 12246117 12144972 12065897 12121778 12133716 12176297
5113A2176297q6449M5570O5600J33105J50867J93329J15114J85469K24733J28163
$$ 12176297 12089848 12135418 12201018 12334123 12484990 12678319 12793433 12978902 13203635 13331798
5103A3331798Q1347R8619M9016K29687J44005M3922L8972l0009O2114M9097N0659
$$ 13331798 13413145 13511764 13560780 13790467 13934472 13978394 14017366 13987357 14049471 14098568 14149227
5092A4149227O5757q7614Q454R5444K7097P1074O8720Q781p2564J49480J15446
$$ 14149227 14214984 14127370 14135824 14231268 14258365 14329439 14398159 14406940 14334376 14483856 14599302
5081A4599302r8097P4689P0175N6247O7833L3204K650q198J05974P6537N7648
$$ 14599302 14501205 14575894 14646069 14702316 14770149 14803353 14806003 14797805 14903779 14980316 15037964
5070A5037964J39813K7020Q2506L4865J99659J85533Q1472J35224O5477M190K6756
$$ 15037964 15177777 15204797 15287303 15322168 15521827 15707360 15788832 15924056 15989533 15993723 16020479
5059A6020479J20906J30124k2411j9237R2339J13989M2885J7874J90978O2647
$$ 16020479 16141385 16271509 16249098 16229861 16322200 16436189 16479074 16496948 16687926 16750573
5049A6750573J03333q685K7478K02376J31707J21511R8056K6951K06413J55981
$$ 16750573 16853906 16845221 16872699 17075075 17206782 17328293 17426349 17453300 17659713 17815694
5039A7815694J27626J24289j1171R1942M8015R5994P3925J8802O6034P4007J39247
$$ 17815694 17943320 18067609 18056438 18148380 18196395 18292389 18366314 18385116 18451150 18525157 18664404
5028A8664404J02218J54763R6388J71342K04901K61838K71637L71152L60420M35143
$$ 18664404 18766622 18921385 19017773 19189115 19394016 19655854 19927491 20298643 20659063 21094206
5018B1094206M16108N44160O24276O30669O27410O81365P52979P20052P71549
$$ 21094206 21510314 22054474 22678750 23309419 23936829 24618194 25371173 26091225 26862774
5009B6862774R37266J037053J095438J059269J059509J107283J260713J311684
$$ 26862774 27800040 28837093 29932531 30991800 32051309 33158592 34419305 35730989
5001C5730989J599554J611608J893596K255106K509875K977796L406839L970386
$$ 35730989 37330543 38942151 40835747 43090853 45600728 48578524 51985363 55955749
4993E5955749M414820M774489N307382N989275O650668P745481R166763J1019928
$$ 55955749 60370569 65145058 70452440 76441715 83092383 90837864 100004627 111024555
4985A11024555J3555432J6701612J9894396K2372618K4505211K5971440K5068689
$$ 111024555 124579987 141281599 161175995 183548613 208053824 234025264 259093953
4978B59093953K1253733J3545534j255782j4664908k3857540k8610985k5283111
$$ 259093953 280347686 293893220 292637438 277972530 254114990 225504005 200220894
4971B00220894k0377795j6461651j3529664j1324883r884974q566349p482108
$$ 200220894 179843099 163381448 149851784 138526901 128641927 120075578 112593470
4964A12593470o426522n088896m010614l037181k572659k084963j630429j433193
$$ 112593470 106166948 101078052 97067438 94030257 91457598 89372635 87742206 86309013
4956H6309013q79984n32009J8460N34900R72697J305848J711199K150255K567970
$$ 86309013 85429029 84897020 84915480 85450380 86423077 87728925 89440124 91590379 94158349
4947I4158349K961942L607562M268116M886115N812173O813287Q088362R824154
$$ 94158349 97120291 100727853 104995969 109882084 115694257 122507544 130595906 140420060
4939A40420060J1872259J4530445J7776186K0318834K2410473K5148265K6088748
$$ 140420060 152292319 166822764 184598950 204917784 227328257 252476522 278565270
4932B78565270K3226835J9038936J0220413m579366j2599280j9074526k6147957
$$ 278565270 301792105 320831041 331051454 326472088 313872808 294798282 268650325
4925B68650325k4790908j9718630j5285653j1998320r814985p847036n820459
$$ 268650325 243859417 224140787 208855134 196856814 187041829 179194793 173374334
4918A73374334m121844k707710j278032j13297N50194N56465P4222o96901j967692
$$ 173374334 169252490 166544780 165266748 165153451 165703645 166260110 166334332 165637431 163669739
4909A63669739l125460m137118m159626l805314l296088k414157j608342p12124
$$ 163669739 160544279 156407161 152247535 148442221 145146133 142731976 141123634 140411510
4901A40411510K17313J061491J731687K482661L122009L461890L626835L439439
$$ 140411510 140628823 141690314 143422001 145904662 149026671 152488561 156115396 159554835
4893A59554835K782500J973610R70432j26183j282501k234973k764390l218405
$$ 159554835 162337335 164310945 165281377 165155194 163872693 161637720 158873330 155654925
4885A55654925l146485k768862k305845j946195j131526m47178K98260J162615
$$ 155654925 152508440 149739578 147433733 145487538 144356012 143908834 144207094 145369709
4877A45369709J773670K328733K822371L118602L194218K961258K524678J896731
$$ 145369709 147143379 149472112 152294483 155413085 158607303 161568561 164093239 165989970
4869A65989970R64304j11868j172751k245621l113409l474934l758801l671912
$$ 165989970 166954274 166842406 165669655 163424034 160310625 156835691 153076890 149404978
4861A49404978l346195k980281k379134j767145j111934l95647J6559M85648P59319
$$ 149404978 146058783 143078502 140699368 138932223 137820289 137424642 137441201 137926849 138686168
4852A38686168Q07539P16604K39635m63372j234152j974829k684387l210255l422855
$$ 138686168 139493707 140210311 140449946 139986574 138752422 136777593 134093206 130882951 127460096
4843A27460096l622760l535203l202926k965363k623617k414553k329424k241399
$$ 127460096 123837336 120302133 117099207 114133844 111510227 109095674 106766250 104524851
4835A04524851k001617j868475j585903j365201j359009j408174j233896j300316
$$ 104524851 102523234 100654759 99068856 97703655 96344646 94936472 93702576 92402260
4827I2402260j247080j359093j408593j327323j418792j608226j554503j687919
$$ 92402260 91155180 89796087 88387494 87060171 85641379 84033153 82478650 80790731
4819H0790731j824188j637791j589848j359816j309316j074454j076488j120591
$$ 80790731 78966543 77328752 75738904 74379088 73069772 71995318 70918830 69798239
4811F9798239j079021j179318j298379j417736j516972j625133j547746j529277
$$ 69798239 68719218 67539900 66241521 64823785 63306813 61681680 60133934 58604657
4803E8604657j533100j468473j255551j144827r61101r76496p43040n77294n06332
$$ 58604657 57071557 55603084 54347533 53202706 52241605 51265109 50522069 49944775 49438443
4794D9438443n11093n20751n24105p07674q76162r56417r48100r81736r45218
$$ 49438443 48927350 48406599 47882494 47174820 46298658 45342241 44394141 43412405 42467187
4785D2467187j001728q74455q16968q09502o51844o22556n66942n37298n06508
$$ 42467187 41465459 40591004 39774036 38964534 38312690 37690134 37123192 36585894 36079386
4776C6079386m14511n81205m21567m23741m38890n04466m83959l76273m14794
$$ 36079386 35664875 35083670 34662103 34238362 33799472 33295006 32811047 32434774 32019980
4767C2019980l99826m64991l77784l01655m44624m41792l60215j49513k40446
$$ 32019980 31620154 31155163 30777379 30475724 30031100 29589308 29229093 29079580 28839134
4758B8839134m05330k68396j63471k04855k89557k43297k35320k85855o4767k44893
$$ 28839134 28433804 28165408 28001937 27797082 27507525 27264228 27028908 26743053 26678286 26433393
4748B6433393p5934j95654j41847J915j07273l9683n7723M3832J891o5035j96353
$$ 26433393 26357459 26161805 26019958 26021873 25914600 25874917 25817194 25861026 25862917 25797882 25601529
4737B5601529o2033n1594j43469j56482P54J7804L7164P9189j50765K003j0271
$$ 25601529 25539496 25487902 25344433 25187951 25188705 25206509 25243673 25322862 25172097 25174100 25163829
4726B5163829j32151n6572n3597j25016q7550o1860j28220j52391j23955L3361
$$ 25163829 25031678 24975106 24921509 24796493 24708943 24647083 24518863 24366472 24242517 24275878
4716B4275878N3396L7149L4465q936Q5920L6177K0450k7851r8726q3465K5947
$$ 24275878 24329274 24366423 24400888 24391952 24477872 24514049 24534499 24506648 24407922 24324457 24350404
4705B4350404m0812q2363j09739q9433j07217m806j3657k3870K2463n4713R4790
$$ 24350404 24309592 24227229 24117490 24028057 23920840 23916034 23902377 23878507 23900970 23846257 23941047
4694B3941047P3614K00767O4943K15830P0468O3564J41698P1887j2606M7645P8830
$$ 23941047 24014661 24215428 24280371 24496201 24566669 24630233 24771931 24843818 24831212 24878857 24957687
4683B4957687P6975L9343Q022N5041R0930J17760M6923J14317K27840K74445L30084
$$ 24957687 25034662 25074005 25082027 25137068 25227998 25345758 25392681 25506998 25734838 26009283 26339367
4672B6339367L12101L25863L76535M98677L67721L71979M29735M58960L11361
$$ 26339367 26651468 26977331 27353866 27852543 28220264 28592243 29021978 29480938 29792299
4663B9792299K98299M36250L00044L36097L75872M04602M29064M71449O44919
$$ 29792299 30090598 30526848 30826892 31162989 31538861 31943463 32372527 32843976 33488895
4654C3488895Q37586P23591Q61793J051395J069806J135896J217133J193647J233011
$$ 33488895 34326481 35050072 35911865 36963260 38033066 39168962 40386095 41579742 42812753
4645D2812753J326380J252650J176800J256946J240510J198931J199089J304881
$$ 42812753 44139133 45391783 46568583 47825529 49066039 50264970 51464059 52768940
4637E2768940J673210J697711J834877K352301K459966K862378L232746L682029
$$ 52768940 54442150 56139861 57974738 60327039 62787005 65649383 68882129 72564158
4629G2564158M303415M812522N469943O090246O733421P476435Q225396R374879
$$ 72564158 76867573 81680095 87150038 93240284 99973705 107450140 115675536 125050415
4621A25050415J0385521J1827394J3499022J5829318J8432354K0796583K2971746
$$ 125050415 135435936 147263330 160762352 176591670 195024024 215820607 238792353
4614B38792353K4118173K4286805K3252514J9664389J2649258K794454q796506
$$ 238792353 262910526 287197331 310449845 330114234 342763492 345557946 336761440
4607C36761440j7853548k1300052k0596977j8438087j6108909j3997808j2372423
$$ 336761440 318907892 297607840 277010863 258572776 242463867 228466059 216093636
4600B16093636j1332741j0562709j0049838r194175q223930p337794o733511o140406
$$ 216093636 204760895 194198186 184148348 174954173 166730243 159392449 152658938 146518532
4592A46518532o063090o195669o174302o367196o380394n870984n401919m762722
$$ 146518532 140455442 134259773 128085471 121718275 115337881 109466897 104064978 99302256
4584I9302256m412450l930361l572066l452851l114574k823546k629529k451725
$$ 99302256 94889806 90959445 87387379 83934528 80819954 77996408 75366879 72915154
4576G2915154k252112k080389j776240j689526j432870j267737j079333r64150
$$ 72915154 70663042 68582653 66806413 65116887 63684017 62416280 61336947 60372797
4568F0372797p45371o16696n59487m66543l52244l38125k38093k38811k77990
$$ 60372797 59627426 59010730 58451243 57984700 57632456 57294331 57056238 56817427 56539437
4559E6539437l07670j53669k24798k44510j99582l35151l03991j48547j49844
$$ 56539437 56231767 56078098 55853300 55608790 55409208 55074057 54770066 54621519 54471675
4550E4471675k07491j33788L0568L17071M46351M68546M79855O76847Q52910Q94712
$$ 54471675 54264184 54130396 54160964 54478035 54924386 55392932 55872787 56549634 57402544 58297256
4540E8297256J036289J177281J341780J345229J486792J703431J716486J927251
$$ 58297256 59333545 60510826 61852606 63197835 64684627 66388058 68104544 70031795
4532G0031795K144973K309238K720198L105836L665051M194113M932191N622545
$$ 70031795 72176768 74486006 77206204 80312040 83977091 88171204 93103395 98725940
4524I8725940O385157P129132Q208099R166253J0174659J1265253J2327334J3627041
$$ 98725940 105111097 112240229 120448328 129614581 139789240 151054493 163381827 177008868
4516A77008868J5027376J6996257J8666137K0475096K2228403K3429899K3668132
$$ 177008868 192036244 209032501 227698638 248173734 270402137 293832036 317500168
4509C17500168K2491361J9375493J3840262O194194j644786r465876j6345371
$$ 317500168 339991529 359367022 373207284 379401478 377756692 368290816 351945445
4502C51945445k1230388k3681062k4143803k2653105j9820040j7171529j4739565
$$ 351945445 330715057 307033995 282890192 260237087 240417047 223245518 208505953
4495B08505953j2732157j1031087r626613q196261o966796n936386n075380m572364
$$ 208505953 195773796 184742709 175116096 166919835 159953039 154016653 148941273 144368909
4487A44368909m080363l898102l885061m053146m348138m377436m431742m414685
$$ 144368909 140288546 136390444 132505383 128452237 124104099 119726663 115294921 110880236
4479A10880236m351613m286645l988420l833572l752342l659165l516846l287395
$$ 110880236 106528623 102241978 98253558 94419986 90667644 87008479 83491633 80204238
4471H0204238l102060l014796k789890k628653k308421k223239k062121j784756
$$ 80204238 77102178 74087382 71297492 68668839 66360418 64137179 62075058 60290302
4463F0290302j656454j513660j387731j229456j120078j024112q62865p76133
$$ 60290302 58633848 57120188 55732457 54503001 53382923 52358811 51495946 50719813
4455E0719813o49285m02708n31862k84223p5193L8269L55690N66888P68997R61958
$$ 50719813 50070528 49667820 49135958 48851735 48776542 48814811 49170501 49737389 50506386 51468344
4445E1468344J137179J265360J358389J355735J236918R52077O39652N93223K99065
$$ 51468344 52605523 53870883 55229272 56585007 57821925 58774002 59413654 60006877 60305942
4436F0305942M9067j52093n75053r02448j307999j759190j965086k173399j959822
$$ 60305942 60355009 60202916 59627863 58725415 57417416 55658226 53693140 51519741 49559919
4427D9559919j953944j927846j693727j635433j602889j264466j138032j275395
$$ 49559919 47605975 45678129 43984402 42348969 40746080 39481614 38343582 37068187
4419C7068187j051783r17118p78080o79534p89503n55078n32724n04761n04949
$$ 37068187 36016404 35099286 34321206 33641672 32852169 32297091 31764367 31259606 30754657
4410C0754657o40903n23165n95152n15808m18091m65786l87143m12268l97504
$$ 30754657 30113754 29590589 28995437 28479629 28061538 27595752 27208609 26796341 26398837
4401B6398837m56617l58969m34523m50422l25815m38118l44499k87635j68618
$$ 26398837 25942220 25583251 25148728 24698306 24372491 23934373 23589874 23302239 23133621
4392B3133621k86757j56247l4935l1802p3431K0141J21879J19044R9536j44454
$$ 23133621 22846864 22690617 22655682 22623880 22550449 22570590 22692469 22811513 22911049 22766595
4382B2766595p1028o6438k39553j97753j98938j09147l4156Q0907O7986R0405
$$ 22766595 22695567 22629129 22389576 22191823 21992885 21883738 21849582 21930489 21998475 22088880
4372B2088880O4021J24502O3542j63257r4443o7793k49361k87385k69572k91232
$$ 22088880 22152901 22277403 22340945 22177688 22083245 22015452 21766091 21478706 21209134 20917902
4362B0917902l15384l22473p7818j1727r0414J471j6285j06486j7461J02992K41680
$$ 20917902 20602518 20280045 20202227 20190500 20100086 20101557 20085272 19978786 19961325 20064317 20305997
4351B0305997J55621J02719K38260J36138J67178J04196P5884J0356j13495j54220
$$ 20305997 20461618 20564337 20802597 20938735 21105913 21210109 21285993 21296349 21182854 21028634
4341B1028634o4545q3462k0235J12963K2256J34024N3362J43786M40695J42992
$$ 21028634 20964089 20880627 20860392 20973355 20995611 21129635 21182997 21326783 21767478 21910470
4331B1910470J09350K06325K74060L41776J78898K51750M08263L58103M16287
$$ 21910470 22019820 22226145 22500205 22841981 23020879 23272629 23680892 24038995 24455282
4322B4455282M08131M61677M49437L54701L59351L12066M17591L83264L51237
$$ 24455282 24863413 25325090 25774527 26129228 26488579 26800645 27218236 27601500 27952737
4313B7952737M50938M38280M25219M23882L92360N06811M16602N33910M88079
$$ 27952737 28403675 28841955 29267174 29691056 30083416 30590227 31006829 31540739 32028818
4304C2028818L75381J47690K33308L18471J39315J89312R5598J86947Q3433K12787
$$ 32028818 32404199 32551889 32785197 33103668 33242983 33432295 33527893 33714840 33798273 34011060
4294C4011060K12607M9263J65644J96066J35157J64571P9001O3593P5796o845
$$ 34011060 34223667 34272930 34438574 34634640 34769797 34934368 35013369 35076962 35152758 35145913
4284C5145913n3897j76959j95466k79597j85211l57590j68754k09593j47534j70619
$$ 35145913 35092016 34915057 34719591 34439994 34254783 33897193 33728439 33518846 33371312 33200693
4274C3200693l04534k48307j77453l57188m56626m21404m18826m33177n42038
$$ 33200693 32896159 32647852 32470399 32113211 31656585 31235181 30816355 30383178 29841140
4265B9841140n56460m93319m28534o24121o65177n57350n26633n82406m96807
$$ 29841140 29284680 28791361 28362827 27738706 27073529 26516179 25989546 25407140 24910333
4256B4910333n35836o80305o65739n94817o47061p53829n65210n97921n77090
$$ 24910333 24374497 23694192 23028453 22433636 21786575 21032746 20467536 19869615 19292525
4247A9292525o22534n96856n00646n20942m39606m32951m43530l22941l59020
$$ 19292525 18669991 18073135 17572489 17051547 16611941 16178990 15735460 15412519 15053499
4238A5053499m45492j97267k13970k51059l18148k81446j34095j95107o7399O8830
$$ 15053499 14608007 14410740 14196770 13945711 13627563 13346117 13212022 13016915 12949516 13018346
4228A3018346p7356j16304n8133K12348J29220j9657O3834K81961K64320J80428
$$ 13018346 12940990 12824686 12766553 12978901 13108121 13088464 13152298 13434259 13698579 13879007
4218A3879007K16040J54846J54133J18124K15300K64582J94143K55235L02859
$$ 13879007 14095047 14249893 14404026 14522150 14737450 15002032 15196175 15451410 15754269
4209A5754269L02944J12808j0229j30805k62778l73826m66669n91714o09509o93306
$$ 15754269 16057213 16170021 16159792 16028987 15766209 15392383 14925714 14334000 13724491 13031185
4199A3031185n69527n27732m46851n97831m46205m01307l19111l85864l45469
$$ 13031185 12461658 11933926 11487075 10889244 10443039 10041732 9722621 9336757 8991288
4190H991288k39530l49843k70711k29755k53238k20072k51803k31218k67677k05058
$$ 8991288 8751758 8401915 8131204 7901449 7648211 7428139 7176336 6945118 6677441 6472383
4180F472383p9856j68212j45097j60075q9053k03061j62730j66510n6739j40821
$$ 6472383 6392527 6224315 6079218 5919143 5830090 5627029 5464299 5297789 5241050 5100229
4170E100229q2554j0997p6858n9614m1869l6125l8535m4879k9781j31357K8389
$$ 5100229 5017675 5006678 4929820 4870206 4828337 4792212 4753677 4708798 4679017 4547660 4576049
4159D576049n5803l2735o43l2618p3801q5412k9214j0811j80803K061R4323n6722
$$ 4576049 4520246 4487511 4486868 4454250 4380449 4295037 4265823 4255012 4074209 4076270 4170593 4113871
4147D113871M2565q3969J7170r8448j80632L7055k2004n2867n2831o4031l966
$$ 4113871 4156436 4072467 4089637 3991189 3810557 3847612 3825608 3772741 3719910 3655879 3651913
4136C651913m2542m0910N1388n6897L8377j350j55670J6271o600j00612q5821
$$ 3651913 3609371 3568461 3619849 3562952 3601329 3599979 3444309 3460580 3453980 3353368 3267547
4125C267547L4379k2717N2555j71058j24941J03302j7678o6901J03046j26393
$$ 3267547 3301926 3279209 3331764 3160706 3035765 3139067 3121389 3054488 3157534 3031141
4115C031141r6054L4257p5081m788l6174Q825K5505n5424o3466K0195m9648M9911
$$ 3031141 2935087 2969344 2894263 2889475 2853301 2862126 2887631 2832207 2768741 2788936 2739288 2789199
4103B789199j1404n8815m9352L0161J5380q2215l833k8135o888O1215O9963l2843
$$ 2789199 2777795 2718980 2669628 2699789 2715169 2632954 2629121 2600986 2594098 2655313 2725276 2692433
4091B692433j55177m4164N6886M4632m4657o0596k1158l0986n9484Q6609L6450
$$ 2692433 2537256 2493092 2549978 2594610 2549953 2489357 2468199 2437213 2377729 2464338 2500788
4080B500788J7809l4026o3147J00208J5145q0696l615Q5115K2889n1322P131P4737
$$ 2500788 2518597 2484571 2421424 2521632 2536777 2456081 2452466 2537581 2560470 2509148 2516279 2591016
4068B591016l7590k6607k7218p5847Q2831J8723Q1859N9794o5351j70956J16509
$$ 2591016 2553426 2526819 2499601 2423754 2506585 2525308 2607167 2666961 2601610 2430654 2547163
4057B547163L3884N5764N7626j59657M6554M4230J46113K02k9252R3193J0721
$$ 2547163 2581047 2636811 2694437 2534780 2581334 2625564 2771677 2771879 2742627 2835820 2846541
4046B846541q261P7114J18654J4181k237Q1569L1835P1187R6628o2033P4263P3328
$$ 2846541 2838280 2915394 3034048 3048229 3045992 3127561 3159396 3230583 3327211 3265178 3339441 3412769
4034C412769K991J05916L0969L1859M6632M5949O9250L1466J822N506k386L6043
$$ 3412769 3415760 3521676 3552645 3584504 3631136 3677085 3746335 3777801 3779623 3785129 3782743 3818786
4022C818786K3395J3990l049k3429j615N7425L7201J8378L6606l69j00933P4645
$$ 3818786 3842181 3856171 3853122 3829693 3828078 3885503 3922704 3941082 3977688 3977319 3876386 3951031
4010C951031j2332J0349j00015R813j5100r0655J32980M4378N5289J00417n0540
$$ 3951031 3938699 3949048 3849033 3858846 3843746 3753091 3886071 3930449 3985738 4086155 4035615
3999D035615n3620j9640j7724Q4231J83052P427r5382l3120O9804L6447l6461
$$ 4035615 3981995 3962355 3944631 4028862 4211914 4219341 4123959 4090839 4160643 4197090 4160629
3988D160629p882O9133n0780j6791Q3853P1530J58975J8277n4577K0417O3658
$$ 4160629 4152747 4221880 4171100 4154309 4238162 4309692 4468667 4486944 4432367 4452784 4516442
3977D516442j4181J7026Q9943N8411J50659P8004P9737j54452m6305J04767J3091
$$ 4516442 4502261 4519287 4609230 4667641 4818300 4896304 4976041 4821589 4775284 4880051 4893142
3966D893142J05013J36137J89405Q8120j2935O2384J15968P4958O9865P8776Q7370
$$ 4893142 4998155 5134292 5323697 5411817 5398882 5461266 5577234 5652192 5722057 5800833 5888203
3955E888203L1667J01963J27612J23580N2045P0584J43715p145m259P7854o73
$$ 5888203 5919870 6021833 6149445 6273025 6325070 6395654 6539369 6532224 6527965 6605819 6605146
3944F605146R4297K8843J22922R8816K9704N5180O1222J528R571j9795J65573
$$ 6605146 6699443 6728286 6851208 6950024 6979728 7034908 7096130 7097658 7107229 7087434 7253007
3933G253007K2857M659m8413K3374R0849N1568R739Q189n3129J32707J32684P9107
$$ 7253007 7275864 7280523 7232110 7255484 7346333 7397901 7407640 7415829 7362700 7495407 7628091 7707198
3921G707198P1676K8020N1816J3740Q291R5272J78358K2782O8990J14495Q8804
$$ 7707198 7778874 7806894 7858710 7872450 7880741 7976013 8154371 8177153 8246143 8360638 8449442
3910H449442J0124K3655j7811R3178m5251L1826O9862J18239j4490l5115P377
$$ 8449442 8459566 8483221 8465410 8558588 8513337 8545163 8615025 8733264 8718774 8683659 8691036
3899H691036O494P3692M1948l5303p9473J110n6961J5475K3357n4072k4699K2222
$$ 8691036 8697530 8771222 8813170 8777867 8698394 8699504 8642543 8658018 8681375 8627303 8602604 8624826
3887H624826K302K6649o723O5173Q9939R0753o6861M5236J78283J48828J87019
$$ 8624826 8627128 8653777 8647054 8712227 8802166 8892919 8826058 8871294 9049577 9198405 9385424
3876I385424R2076J14050P9511J65912K32497K49149J07877J91770J48235Q4532
$$ 9385424 9477500 9591550 9671061 9836973 10069470 10318619 10426496 10618266 10766501 10851033
3866A0851033J62712K36625J65601J50353J75081J06160K25039K27700R9788J26000
$$ 10851033 11013745 11250370 11415971 11566324 11741405 11847565 12072604 12300304 12400092 12526092
3856A2526092L7615J05332J98599L9119P5612R6606l5492j06897R5463P6746J5286
$$ 12526092 12563707 12669039 12867638 12906757 12982369 13078975 13043483 12936586 13032049 13108795 13124081
3845A3124081m4788j7150q3512l1193K6228k4946r7265n0395L4241j2351K322
$$ 13124081 13079293 13062143 12978631 12947438 12973666 12948720 12851455 12801060 12835301 12822950 12825272
3834A2825272R7753n1020J345N855l4910O6902q8875R8426J57526N4057q5895
$$ 12825272 12923025 12872005 12873350 12879205 12844295 12911197 12822322 12920748 13078274 13132331 13046436
3823A3046436M0822P1030K8844O3290J7063J34890Q0554R4591J18300P2259J28083
$$ 13046436 13087258 13158288 13187132 13250422 13267485 13402375 13482929 13577520 13695820 13768079 13896162
3812A3896162J85438J72707J33738J62118K40010J81577J28041J02864J58540
$$ 13896162 14081600 14254307 14388045 14550163 14790173 14971750 15099791 15202655 15361195
3803A5361195J96385K09039J57333O0350J15559J33022J04712J09102J97533L8508
$$ 15361195 15557580 15766619 15923952 15984302 16099861 16232883 16337595 16446697 16644230 16682738
3793A6682738J60664J23901R8956J17273J20309J31597Q295J20717P3633j346
$$ 16682738 16843402 16967303 17066259 17183532 17303841 17435438 17443733 17564450 17638083 17636737
3783A7636737K39694J27642Q5860L6593K40673K12714J38208K07920J12526K26499
$$ 17636737 17876431 18004073 18089933 18126526 18367199 18579913 18718121 18926041 19038567 19265066
3773A9265066K60630K74996K88780K59565L44406L88387K41716L54603K75428
$$ 19265066 19525696 19800692 20089472 20349037 20693443 21081830 21323546 21678149 21953577
3764B1953577K44370L54914L28877K97663L20153K58125L39008L44311L32632
$$ 21953577 22197947 22552861 22881738 23179401 23499554 23757679 24096687 24440998 24773630
3755B4773630M47666L14608K80740K60946K89843N05506M44742L74900N00231
$$ 24773630 25221296 25535904 25816644 26077590 26367433 26872939 27317681 27692581 28192812
3746B8192812N15087N24531O85636O79870O05002P17848Q56264Q14778Q49155
$$ 28192812 28707899 29232430 29918066 30597936 31202938 31920786 32777050 33591828 34440983
3737C4440983R35153J000114J147769J252293J228499J169805J185910J085927
$$ 34440983 35376136 36376250 37524019 38776312 40004811 41174616 42360526 43446453
3729D3446453J085507J034896R15274Q56174R43667P67197N18370N35221M77861
$$ 43446453 44531960 45566856 46482130 47338304 48281971 49049168 49567538 50102759 50580620
3720E0580620N50883L89994M44369M39282M81478L66787K90592K35699K03895
$$ 50580620 51131503 51521497 51965866 52405148 52886626 53253413 53544005 53779704 53983599
3711E3983599O8202j66510j35499l60894n37856o44296p24519p50898q10253p00460
$$ 53983599 54051801 53885291 53749792 53388898 52851042 52206746 51482227 50731329 49921076 49220616
3701D9220616p15751q05550o94157o67291p20933p97852o21424p29994n78063
$$ 49220616 48504865 47699315 47005158 46337867 45616934 44819082 44197658 43467664 42889601
3692D2889601n50192n87752n20999n78474m64862n87241n78631n33300l85411
$$ 42889601 42339409 41751657 41230658 40652184 40187322 39600081 39021450 38488150 38102739
3683C8102739n17350m86389l36838m40246m68080l88688l29889l38785m07549
$$ 38102739 37585389 37099000 36762162 36321916 35853836 35465148 35135259 34796474 34388925
3674C4388925k14330k56853k00051k25552k55949n3357j74511k06694j14684j3478
$$ 34388925 34174595 33917742 33717691 33492139 33236190 33182833 33008322 32801628 32686944 32673466
3664C2673466q7959j69193r4453k2198k21522j92238j90367k40289j40693k50564
$$ 32673466 32585507 32416314 32321861 32299663 32078141 31885903 31695536 31455247 31314554 31063990
3654C1063990l08127l18192k60474l41775l50282k35191l30898k41563q0455k16923
$$ 31063990 30755863 30437671 30177197 29835422 29485140 29249949 28919051 28677488 28597033 28380110
3644B8380110j35068p7833J0021r6194O315J32665N8312l4300r659N7198K0864
$$ 28380110 28245042 28167209 28177230 28081036 28087351 28220016 28278328 28244028 28234369 28291567 28312431
3633B8312431R6243Q8109k8175j26452j2792j04768j22646p2024m1412j9544J9731
$$ 28312431 28408674 28496783 28468608 28342156 28329364 28224596 28101950 28029926 27988514 27968970 27988701
3622B7988701l7961k3622N5M7743j033N2811J78924P0778l6301K79828K22293
$$ 27988701 27950740 27927118 27927173 27974916 27973883 28026694 28205618 28276396 28240095 28519923 28742216
3611B8742216J86485K08344K41881K82608L11352M11276K70879L50413L89884
$$ 28742216 28928701 29137045 29378926 29661534 29972886 30384162 30655041 31005454 31395338
3602C1395338L10068K85712K56227M37922L62686L81107M00728K01645K32001
$$ 31395338 31705406 31991118 32247345 32685267 33047953 33429060 33829788 34031433 34263434
3593C4263434L03202L86968K85605K74949K38935J79567J86413R2274K61333K27026
$$ 34263434 34566636 34953604 35239209 35514158 35753093 35932660 36119073 36211347 36472680 36699706
3583C6699706J80792L04034J86680L50031M01918L71267M79000K67399L89344
$$ 36699706 36880498 37184532 37371212 37721243 38123161 38494428 38973428 39240827 39630171
3574C9630171N08166N36647O04609N19153O61861Q82583R01711P87030Q32191
$$ 39630171 40138337 40674984 41279593 41798746 42460607 43343190 44244901 45031931 45864122
3565D5864122R70348J046431J187808J257011J215003J494904J492055J509182
$$ 45864122 46834470 47880901 49068709 50325720 51540723 53035627 54527682 56036864
3557E6036864J630855J655078J853888K073988J933317K036386K150510K085911
$$ 56036864 57667719 59322797 61176685 63250673 65183990 67220376 69370886 71456797
3549G1456797K212505K219215K282146K336277K380121K383437K536519K577809
$$ 71456797 73669302 75888517 78170663 80506940 82887061 85270498 87807017 90384826
3541I0384826K799870K828317K917343K929885L164915L267745L434367L627926
$$ 90384826 93184696 96013013 98930356 101860241 105025156 108292901 111727268 115355194
3533A15355194L760783M120317M256130M431807M734849M938822N177034N418452
$$ 115355194 119115977 123236294 127492424 131924231 136659080 141597902 146774936 152193388
3525A52193388N422570N440774N273834N076181M557110L989770L408075K819562
$$ 152193388 157615958 163056732 168330566 173406747 177963857 181953627 185361702 188181264
3517A88181264K301923J661316J245326Q90375O16907N73028M04768M12823J37451
$$ 188181264 190483187 192144503 193389829 194280204 194897111 195470139 195874907 196287730 196425181
3508A96425181J4354k73107q94835j251564j545124k059892k459868k879862l138537
$$ 196425181 196439535 196166428 195271593 194020029 192474905 190415013 187955145 185075283 181936746
3499A81936746l332209l348612l593853l520569l311687l508177l573650l461502
$$ 181936746 178604537 175255925 171662072 168141503 164829816 161321639 157747989 154286487
3491A54286487l329860l135385l166117l107598k919958l032670k951576k861401
$$ 154286487 150956627 147821242 144655125 141547527 138627569 135594899 132643323 129781922
3483A29781922k958350k812101k890915l015420l049428l036534l063112l075312
$$ 129781922 126823572 124011471 121120556 118105136 115055708 112019174 108956062 105880750
3475A05880750k898075l059305l017366k972114k758831k652994k499180k299944
$$ 105880750 102982675 99923370 96906004 93933890 91175059 88522065 86022885 83722941
3467H3722941k292193j992763j804036j666250j216328j180741j009852q28100
$$ 83722941 81430748 79437985 77633949 75967699 74751371 73570630 72560778 71732678
3459G1732678p54215o16963q11965j059625j595452k112240k187019j975960j876726
$$ 71732678 70978463 70361500 69549535 68489910 66894458 64782218 62595199 60619239 58742513
3450E8742513j729501j529420j481854j351363j338973j076286r49171r87995
$$ 58742513 57013012 55483592 54001738 52650375 51311402 50235116 49285945 48297950
3442D8297950p99157o89590o76441o33509m13925m42488l57393j83025J2914L01354
$$ 48297950 47498793 46809203 46132762 45499253 45085328 44642840 44285447 44102422 44115336 44416690
3432D4416690N84266Q32191J080151J158776J208155J294624J090076O94164j05491
$$ 44416690 45000956 45833147 46913298 48072074 49280229 50574853 51664929 52359093 52253602
3423E2253602j497509k179285j909735j846432j464763j025984j193372r22085
$$ 52253602 50756093 48576808 46667073 44820641 43355878 42329894 41136522 40214437
3415D0214437p81012p77812n35094l97438k24058p5440M635j65908K8816N9295
$$ 40214437 39433425 38655613 38120519 37723081 37499023 37423583 37428218 37262310 37291126 37350421
3405C7350421l4945K15047K69678L08467M88664N64747Q50144P88427P63870R07144
$$ 37350421 37315476 37530523 37800201 38108668 38597332 39162079 40012223 40800650 41564520 42471664
3395D2471664R11629P43531L47370k2477n02788p77874p30743q37897n46552m70453
$$ 42471664 43383293 44126824 44474194 44451717 43948929 43171055 42440312 41602415 41055863 40585410
3385D0585410l25308j76607o7876k4387N7151M8110K34981K99511K87823M82804
$$ 40585410 40260102 40083495 40015619 39991232 40048383 40096493 40331474 40630985 40918808 41401612
3375D1401612M36488N20252M90356N32599O91477Q74192Q78326J045340J107269
$$ 41401612 41838100 42358352 42848708 43381307 44072784 44946976 45825302 46870642 47977911
3366D7977911J031965J343749J341806J357787J455842J331486J408733J259638
$$ 47977911 49009876 50353625 51695431 53053218 54509060 55840546 57249279 58508917
3358E8508917J193253J151800J178812R11770Q56191O85627N43900M73020M87375
$$ 58508917 59702170 60853970 62032782 62944552 63800743 64486370 65030270 65503290 65990665
3349F5990665L55153L76979M32244K70663K86358K28417J50335j08684j08435
$$ 65990665 66345818 66722797 67155041 67425704 67712062 67940479 68090814 67982130 67873695
3340F7873695j27337m26334p00387n83906q00455r57299j086201j305150j217437
$$ 67873695 67746358 67320024 66619637 66035731 65235276 64277977 63191776 61886626 60669189
3331F0669189j384092j421069j414421j385986j443525j398867j310546j431946
$$ 60669189 59285097 57864028 56449607 55063621 53620096 52221229 50910683 49478737
3323D9478737j316905j227377j258058j169016j142040j211156j005959r69027
$$ 49478737 48161832 46934455 45676397 44507381 43365341 42154185 41148226 40179199
3315D0179199j142276j104759r72956r28656j037915r75014j007816r63209r14454
$$ 40179199 39036923 37932164 36959208 36030552 34992637 34017623 33009807 32046598 31132144
3306C1132144q44017q15281r02864q46970q83706p61589p85313o53389o41596
$$ 31132144 30288127 29472846 28569982 27723012 26839306 26077717 25292404 24639015 23997419
3297B3997419o42081n68219l91830m01993n99658m50129l07725l30294l17696
$$ 23997419 23355338 22787119 22395289 21993296 21393638 20943509 20635784 20305490 19987794
3288A9987794l29829l30337l10348k70658k15969k94554l20581j41648k33740
$$ 19987794 19657965 19327628 19017280 18746622 18530653 18236099 17915518 17773870 17540130
3279A7540130k36978l18160k95961k35058l10166k88864l17725j70059j40199
$$ 17540130 17303152 16984992 16689031 16453973 16143807 15854943 15537218 15367159 15226960
3270A5226960j86537l72431k80493r5609n5294j08331j02950q6301m4509j58361
$$ 15226960 15040423 14667992 14387499 14291890 14236596 14128265 14025315 13939014 13894505 13736144
3260A3736144j53172n4258q7482j5436m0183o4865l1754j11978j1290r7866j5820
$$ 13736144 13582972 13528714 13441232 13425796 13385613 13320748 13288994 13177016 13165726 13067860 13052040
3249A3052040K1467n9335l2986Q8013m3779l6724l2424p7626r3551K979n5933
$$ 13052040 13073507 13014172 12981186 13069199 13025420 12988696 12956272 12878646 12785095 12788074 12732141
3238A2732141j6461l8525q9512n4634R1952o6702j08583L2895J3127Q0167n0561
$$ 12732141 12715680 12677155 12587643 12533009 12624961 12558259 12449676 12482571 12495698 12575865 12525304
3227A2525304p4990l3189O2679Q5126K62087O2626j02071J20718J17469J9652
$$ 12525304 12450314 12417125 12479804 12564930 12827017 12889643 12787572 12908290 13025759 13045411
3217A3045411k8934K40241J56272J34805J65852J82753K09617k2670M7050q91
$$ 13045411 13016477 13256718 13412990 13547795 13713647 13896400 14106017 14083347 14130397 14129506
3207A4129506J30145n2118j38325j27447K4995M1556J54579o167k3926n8338o7476
$$ 14129506 14259651 14207533 14069208 13941761 13966756 14008312 14162891 14156724 14132798 14074460 14006984
3196A4006984L1021k3050m253l2090R5438J85890K4369J10891J80650J72340J50829
$$ 14006984 14038005 14014955 14010702 13978612 14074050 14259940 14284309 14395200 14575850 14748190 14899019
3185A4899019Q4373K11420L09166L03966L48840L55827M40054N24211L78959N56281
$$ 14899019 14983392 15194812 15503978 15807944 16156784 16512611 16952665 17476876 17855835 18412116
3175A8412116O06307N50276O66190O40007Q11048P99086O49688R09818Q95073
$$ 18412116 19018423 19568699 20234889 20874896 21685944 22485030 23134718 24044536 24939609
3166B4939609Q67026J015399J202000J174543J338437J384355J355361J386829
$$ 24939609 25806635 26822034 28024034 29198577 30537014 31921369 33276730 34663559
3158C4663559J494406J571872J373510J410613J297268J187683J327137J375057
$$ 34663559 36157965 37729837 39103347 40513960 41811228 42998911 44326048 45701105
3150D5701105J339068J442670J696279J872030J941302K301583K473899K754616
$$ 45701105 47040173 48482843 50179122 52051152 53992454 56294037 58767936 61522552
3142F1522552K984870L197403L200961L210502L229966L121282L103934L144320
$$ 61522552 64507422 67704825 70905786 74116288 77346254 80467536 83571470 86715790
3134H6715790L396282L904509M398800N210002N920143O369305O993142P472575
$$ 86715790 90112072 94016581 98415381 103625383 109545526 115914831 122907973 130380548
3126A30380548P758448P925114P858360P693410P496070P481714P641117Q182602
$$ 130380548 138138996 146064110 153922470 161615880 169111950 176593664 184234781 192417383
3118A92417383R131009J0294550J1401437J2343971J3016443J3502175J3396843
$$ 192417383 201548392 211842942 223244379 235588350 248604793 262106968 275503811
3111B75503811J1818199Q961700M563881m12887m246819o313233p462722q080153
$$ 275503811 287322010 296283710 300847591 300434704 296187885 289874652 282411930 274331777
3103B74331777q751526r523591j0199531j0976476j1680352j2187349j2138788
$$ 274331777 265580251 256056660 245857129 234880653 223200301 211012952 198874164
3096A98874164j1728777j1140902j0445549r790264q782590q074006p466897o884807
$$ 198874164 187145387 176004485 165558936 155768672 146986082 138912076 131445179 124560372
3088A24560372o231597n733311n280942m790178m366533m102941l680507l345357
$$ 124560372 118328775 112595464 107314522 102524344 98157811 94054870 90374363 87029006
3080H7029006l057789k731103k431926k121163j908101j785963j630415j656659
$$ 87029006 83971217 81240114 78808188 76687025 74778924 72992961 71362546 69705887
3072F9705887j728501j833167j903044j987986k153670k263784k353170k345043
$$ 69705887 67977386 66144219 64241175 62253189 60099519 57835735 55482565 53137522
3064E3137522k353174k099933k078720k031799j753661j717992j690582j611177
$$ 53137522 50784348 48684415 46605695 44573896 42820235 41102243 39411661 37800484
3056C7800484j460585j376402j343663j163862j074354j159223j055217q42175
$$ 37800484 36339899 34963497 33619834 32455972 31381618 30222395 29167178 28325003
3048B8325003q41182r09251p59291p36074p27668o55501n16498o17385n48838
$$ 28325003 27483821 26574570 25815279 25079205 24351537 23696036 23179538 22562153 22013315
3039B2013315m51372n85853m68173n10523n02472l88649m20216m44373m11555
$$ 22013315 21561943 20976090 20507917 19997394 19494922 19106273 18686057 18241684 17830129
3030A7830129k99151l98975m34139m49851l75844k45935l96331k60969k34081
$$ 17830129 17530978 17132003 16697864 16248013 15872169 15626234 15229903 14968934 14734853
3021A4734853j89483k12091k89007l03449j00243k57005k12960j37581j40035
$$ 14734853 14545370 14333279 14044272 13740823 13640580 13383575 13170615 13033034 12892999
3012A2892999j09482j86291j86243k38492j82736k55522k17880j92344j92976
$$ 12892999 12783517 12597226 12410983 12172491 11989755 11734233 11516353 11324009 11131033
3003A1131033q1595k60994k80411j77336j95750k42487l31349k50973j18094j44901
$$ 11131033 11049438 10788444 10508033 10330697 10134947 9892460 9561111 9310138 9192044 9047143
2993I047143j92761j65087j34772k46166k16269j4598j05210j96334j34140j54418
$$ 9047143 8854382 8689295 8554523 8308357 8092088 8077490 7972280 7775946 7641806 7487388
2983G487388m3368k0655q8749j40317j77631q5981n3811j08765p3754j40716j90958
$$ 7487388 7444020 7423365 7334616 7194299 7016668 6930687 6876876 6768111 6694357 6553641 6362683
2972F362683p56j39392j78327j00592o6648p941n9711r2180o7834j12993j09923
$$ 6362683 6361927 6222535 6044208 5943616 5876968 5869027 5809316 5717136 5649302 5536309 5426386
2961E426386r0004j41293j10054j39228n3622j17876J8842q6391k0406l3860j49281
$$ 5426386 5336382 5195089 5085035 4945807 4892185 4774309 4793151 4706760 4686354 4652494 4503213
2950D503213M5825o8260j89177o8780q6742l9978r2476j27617m0975K3639J7681
$$ 4503213 4549038 4480778 4291601 4222821 4136079 4096101 4003625 3876008 3835033 3858672 3876353
2939C876353j08638j07091l9829K5058q0796m7700n0094J4954j8459j07103L1210
$$ 3876353 3767715 3660624 3620795 3645853 3565057 3517357 3467263 3482217 3463758 3356655 3387865
2928C387865j24073o1809O5645j03773P2811m9504r0813m0849J6284K4253o2484
$$ 3387865 3263792 3201983 3267628 3163855 3236666 3187162 3096349 3055500 3071784 3096037 3033553
2917C033553L1875r439o2190m9831m8319J1803m3561K6845J3939l2780p7183L7809
$$ 3033553 3065428 3055989 2993799 2943968 2895649 2907452 2863891 2890736 2904675 2871895 2794712 2832521
2905B832521O4060j07649j6077l9295m2661o6224R7416m0074j80468R290q3058
$$ 2832521 2896581 2788932 2772855 2733560 2690899 2624675 2722091 2682017 2501549 2510839 2427781
2894B427781N5883j2164m7421l5986n9493L5078M5768k6175l0719L6491k5846
$$ 2427781 2483664 2471500 2424079 2388093 2328600 2363678 2409446 2383271 2352552 2389043 2363197
2883B363197P9220n2293q3303j38691p9376P2051K6994Q1721n8656K7881R3451
$$ 2363197 2442417 2390124 2306821 2168130 2088754 2160805 2187799 2269520 2210864 2238745 2332196
2872B332196k0826N3101j1854p4759Q1700L7889m5784p9688J01138L0697m3714
$$ 2332196 2311370 2364471 2352617 2277858 2359558 2397447 2351663 2271975 2373113 2403810 2360096
2861B360096N7395K8887P4704N2346M4277j38174j13487Q2180O9412N2767l849
$$ 2360096 2417491 2446378 2521082 2573428 2617705 2479531 2366044 2448224 2517636 2570403 2566554
2850B566554o752L7949N7854O4326j4810J2367O1924J9117m532O1185O2582J29755
$$ 2566554 2559802 2597751 2655605 2719931 2705121 2717488 2779412 2798529 2793997 2855182 2917764 3047519
2838C047519J4962r3546J70767J75141o1748m1676J94180R9798j8725N4087N1260
$$ 3047519 3062481 2968935 3139702 3314843 3253095 3211419 3405599 3505397 3486672 3540759 3592019
2827C592019K5563j3618j30273J2122m4390q6220N853P81j23327l4860K7766j46311
$$ 3592019 3617582 3603964 3473691 3485813 3441423 3355203 3361056 3361837 3238510 3203650 3231416 3085105
2815C085105l3887j22607q905n4975j51400q2642p2156k0801n0741r3041j04782
$$ 3085105 3051218 2928611 2919706 2864731 2713331 2630689 2558533 2537732 2486991 2393950 2289168
2804B289168k4684M297o902k8636N3315K6873n1025n9629j28958n4578J15032
$$ 2289168 2264484 2268781 2261879 2233243 2286558 2313431 2262406 2202777 2073819 2019241 2134273
2793B134273k2746j41938j2870K2543q0676o2555o404j69779j8097r163j12645
$$ 2134273 2111527 1969589 1956719 1979262 1898586 1836031 1829627 1659848 1641751 1632588 1519943
2782A519943k3290m6620l8732k3620j04752R0360J8998J6603p6971j82760L4859
$$ 1519943 1496653 1450033 1411301 1387681 1282929 1373289 1392287 1408890 1331919 1149159 1184018
2771A184018m2983l949m080n5827M0279K1880r8810m5571n841K1627k2796l3245
$$ 1184018 1141035 1137086 1133006 1077179 1117458 1139338 1040528 994957 989116 1010743 987947 954702
2759I54702q0632L1472j529j2894m0473n8544q45p8962P3725M6416n3829r7515
$$ 954702 874070 905542 904013 891119 850646 792102 791257 712295 786020 832436 778607 681092
2747F81092m8226k6470j5077R8064J3313j73747p9922N9218k1270n067q0053O8527
$$ 681092 632866 606396 591319 689383 702696 528949 449027 508245 486975 481908 401855 470382
2735D70382O5286o029M490p2877j4808j2788k2049j9930O220r5381q327N58M5236
$$ 470382 535668 529639 534129 461252 446444 433656 411607 391677 397897 302516 294189 294747 339983
2722C39983n5653N3530j39520J681M4344n0040O5797o3899j18651N2124J02649
$$ 339983 284330 337860 198340 200021 244365 194325 260122 196223 77572 129696 232345
2711B32345L3415l4371J8546M9232j16880r640k2643Q0512O1965m2076L7786l4048
$$ 232345 265760 231389 249935 299167 182287 172647 150004 230516 292481 250405 288191 254143
2699B54143p4253J7353p6526N3148M1483j6043k1497l5140Q6227N5264r2742n0451
$$ 254143 179890 197243 120717 173865 215348 199305 177808 142668 228895 284159 191417 140966
2687A40966l8101J9667L6178J15389M6350m2599r6317J4112K5110q564j39794
$$ 140966 102865 122532 158710 274099 320449 277850 181533 195645 220755 212191 72397
2676G2397j4871R8643L5179L2183Q1729J594j15986j8843j45168k6987J00186
$$ 72397 57526 156169 191348 223531 305260 306854 190868 172025 26857 -130 100056
2665A00056p2029j4430J30533L6706l3121n373O2268n2091m9385p2728J9016j0518
$$ 100056 28027 13597 144130 180836 147715 142342 204610 152519 103134 30406 49422 38904
2653C8904n5370m2433Q1213J5346K0574j6164l9512j4679K3992m986P3317J01825
$$ 38904 -16466 -58899 22314 37660 58234 42070 2558 -12121 11871 6885 80202 182027
2641A82027q2818K8242N9798K2521j349j03962n4337O010j2928j06288q615J39977
$$ 182027 99209 127451 187249 209770 208421 104459 50122 56132 43204 -63084 -71699 68278
2629F8278m3339k0463O6765M8351m6105j29635N9491k1127k310J43747J26K835
$$ 68278 24939 4476 71241 119592 73487 -56148 3343 -17784 -20094 123653 123779 126614
2617A26614j21649o5996Q0700j0514j6138Q8414l887m2916K515M7296r477m0063
$$ 126614 4965 -61031 19669 9155 -6983 81431 77544 34628 37143 84439 74962 34899
2605C4899m9390N6639M9111r3491m6611J19612p0840m3688Q478K1705Q386k2952
$$ 34899 -14491 42148 91259 -2232 -48843 70769 -71 -43759 -35281 -13576 -5190 -28142
2593b8142M1929k2033m798j86m8762Q7493N3210L9393k6551q1932j5424K9749
$$ -28142 13787 -8246 -13044 -13230 -61992 25501 78711 118104 91553 9621 -5803 23946
2581B3946J7818l4432k1856N8096l1037q4476K1136J2736q2122N1972P8736j10636
$$ 23946 41764 7332 -14524 43572 12535 -71941 -50805 -38069 -120191 -68219 10517 -100119
2569a00119L3703P3769R9127q8858o8632K7383k2332l4420J28218K958l9085k0108
$$ -100119 -66416 7353 106480 17622 -51010 -23627 -45959 -80379 47839 50797 11712 -8396
2557h396j7068K7838m2804m9492r22K4439O6823o3011r5508R604K9143K1230J8261
$$ -8396 -25464 2374 -40430 -89922 -90844 -66405 418 -62593 -158101 -148497 -119354 -98124 -79863
2544g9863J03878M1549j42257m1353N2666m8430l37L3432L3409J405R4809j1569
$$ -79863 24015 65564 -76693 -118046 -65380 -113810 -114147 -80715 -47306 -45901 48908 37339
2532C7339Q375r9194J5695n9622L7410p718l8454P2946n3554Q360o7319J18354
$$ 37339 45714 -53480 -37785 -97407 -59997 -67715 -106169 -33223 -86777 -78417 -145736 -27382
2520b7382O8714q1000p4517R4345N8736p0836l1536j1473O10n3890j162N9317
$$ -27382 41332 -39668 -114185 -19840 38896 -31940 -63476 -74949 -74339 -128229 -129391 -70074
2508g0074k7784Q2780k718K7299K7892j30913P824K4817m4854L1011l2260r463
$$ -70074 -97858 -15078 -17796 9503 37395 -93518 -85694 -60877 -105731 -74720 -106980 -116443
2496a16443N2328L960p0787J1068M4457o729Q201K6557M1596q4788L859J09941
$$ -116443 -64115 -60155 -130942 -119874 -75417 -82146 -73945 -47388 -5792 -90580 -86721 23220
2484B3220r1982m045O608k6880j342N0538J8982L5697j8769m7361M291Q7388N7028
$$ 23220 -68762 -72807 -66199 -93079 -94421 -43883 -24901 10796 -7973 -55334 -51043 36345 93373
2471I3373o5398q2640j7919m8981M2339k8647j096R3661P2934m3626m7040L0837
$$ 93373 27975 -54665 -72584 -121565 -79226 -107873 -108969 -15308 57626 14000 -33040 -2203
2459b203j11789j5090J19144J4110j1133O6688j07520o4143J2298j06567R7894
$$ -2203 -113992 -129082 -9938 4172 -6961 59727 -47793 -111936 -99638 -206205 -108311
2448a08311L9564J248N9078j46557M8665J1383M1260n0114q8821L0988J58092
$$ -108311 -68747 -67499 -8421 -154978 -106313 -94930 -53670 -103784 -192605 -161617 -3525
2437c525L1159j12273R187l0093O455R6185Q1910l1505p4925l7360m1208K0457
$$ -3525 27634 -84639 -75452 -105545 -99090 -2905 79005 47500 -27425 -64785 -105993 -85536
2425h5536q574j8954J1559k0261k3010O0020N5104p3309o0839P9410J8770j7375
$$ -85536 -94110 -113064 -101505 -121766 -144776 -84756 -29652 -102961 -163800 -84390 -65620 -82995
2413h2995j35417K585J11654L5945m5055N3543J398k3015L3955Q3483j0001m1162
$$ -82995 -218412 -215827 -104173 -68228 -113283 -59740 -58342 -81357 -47402 36081 26080 -15082
2401a5082l9407p5378O1377L3020o6111k7782P3635K1203k5745o2604N6698J7458
$$ -15082 -54489 -129867 -68490 -35470 -101581 -129363 -55728 -34525 -60270 -122874 -66176 -48718
2389d8718q2904J02622J6837k435j7976P4699j8034O6656J07476j27037l2802
$$ -48718 -131622 -29000 -12163 -14598 -32574 42125 24091 90747 198223 71186 38384
2378C8384J23837P8468R7768R8855j36271P770O2700k5821N6187M3042J7143j6030
$$ 38384 162221 240689 338457 437312 301041 308811 371511 345690 401877 444919 462062 446032
2366D46032J08298J03063n6660N7017O6968O9718J56726J31526J38156K22953
$$ 446032 554330 657393 600733 657750 724718 794436 951162 1082688 1220844 1443797
2356A443797J42917J06639P8786L37799L27023L97183L98816O88780P84137O80421
$$ 1443797 1586714 1693353 1772139 2109938 2436961 2834144 3232960 3921740 4705877 5386298
2346E386298O96082P43136N67569M53735j57833j144546r95815p44984n76381
$$ 5386298 6082380 6825516 7393085 7846820 7688987 6544441 5548626 4803642 4227261
2337D227261n05732l55833k79848k61531k76812k85921j40926p5916j45707k17282
$$ 4227261 3721529 3365696 3085848 2824317 2547505 2261584 2120658 2044742 1899035 1681753
2327A681753m1607j90113j29534n4706j34388j05789j61146k1214j08828l2894
$$ 1681753 1640146 1450033 1320499 1265793 1131405 1025616 864470 843256 734428 701534
2317G01534Q36q0164m8310p5957K6997l9130o1473m2043o9437n1616M4984n461
$$ 701534 702370 622206 573896 497939 524936 485806 424333 382290 312853 261237 306221 300760
2305C00760n0558P7354J2892j58043j00035R6535l074j5502m6884J3902M4563
$$ 300760 250202 327556 340448 182405 82370 178905 175831 160329 113445 127347 171910
2294A71910m338j733L535N1057J5111m3433l3695j094k8989q8139J2195J9801
$$ 171910 167572 165839 169374 220431 235542 192109 158414 157320 128331 40192 52387 72188
2282G2188K8154M2525j4073n3201q4345M5057O947M2008q7612K8790l0576p3467
$$ 72188 100342 142867 128794 75593 -8752 36305 43252 85260 -2352 26438 -4138 -77605
2270g7605J1427J16555k0542m5609L1599m816p0170n0635P4260L2903K440o3261
$$ -77605 -66178 50377 29835 -15774 15825 11009 -59161 -109796 -35536 -2633 -193 -63454
2258f3454k8005n0180p9707Q8494O8224m3096Q6391k067p2091L5416j3478m4548
$$ -63454 -91459 -141639 -221346 -132852 -64628 -107724 -21333 -23400 -95491 -60075 -73553 -118101
2246a18101P6517o561j07941J15069j8604j6722r0516n8020J70008p686P35M8047
$$ -118101 -41584 -48145 -156086 -41017 -59621 -76343 -166859 -224879 -54871 -62557 -61822 -13775
2234a3775K690j14405K7983j4379L0224R997M1063m1740n456K1776l4208M8465
$$ -13775 -11085 -125490 -97507 -111886 -81662 -71665 -30602 -72342 -77798 -56022 -90230 -41765
2222d1765J4397j22634O4836n763k3214J11939m4675k696j2972r3022K5443N4520
$$ -41765 -27368 -150002 -85166 -90929 -114143 -2204 -46879 -49575 -62547 -155569 -130126 -75606
2210g5606N2081q6153K3114m8585k9142J4317N9303m8695p2116L8292Q5397R6461
$$ -75606 -23525 -109678 -86564 -135149 -164291 -149974 -90671 -139366 -211482 -173190 -87793 8668
2198H668j12887j4678l338O8585o5850q0735k641M8229k878n511Q1623k5368Q354
$$ 8668 -104219 -118897 -122235 -53650 -119500 -200235 -202876 -154647 -157525 -163036 -81413 -106781 -98427
2185i8427J24984r7522Q9823l9348J6994m0920n3632J29294p7602n5398L2735
$$ -98427 26557 -70965 18858 -20490 -3496 -44416 -98048 31246 -46356 -101754 -69019
2174f9019K0981l195R090j61651O9109q481l4394M5271M3865O8271n4309J4612
$$ -69019 -48038 -51233 -42143 -203794 -134685 -143166 -177560 -132289 -88424 -20153 -74462 -59850
2162e9850n5473l1018k4418j2931J1709n9759M1787P8164p4593o0744J35340k9181
$$ -59850 -115323 -146341 -170759 -183690 -171981 -231740 -189953 -111789 -186382 -247126 -111786 -140967
2150a40967l9021P3559K5848O4389j9459o9360M1408q6803q998P6942m4357k2767
$$ -140967 -179988 -106429 -80581 -16192 -35651 -105011 -63603 -150406 -159404 -82462 -126819 -149586
2138a49586O420K4773j2596J33336k3623p7209m3477K0116J7011o3077j7919L2992
$$ -149586 -143166 -118393 -130989 2347 -21276 -98485 -141962 -121846 -104835 -167912 -185831 -152839
2126a52839q2149K4693Q9345L0687R1275r4265l0566j873J9332Q652o8978K8920
$$ -152839 -234988 -210295 -120950 -90263 1012 -93253 -123819 -125692 -106360 -97708 -166686 -137766
2114a37766J17098l8269k1247K5624O0444j00486K0651J01557q5509j7379J8343
$$ -137766 -20668 -58937 -80184 -54560 5884 -94602 -73951 27606 -57903 -75282 -56939
2103e6939N7714q8240p7898o242P3454P7681o1607j0515L7555j2907l3324m7596
$$ -56939 775 -87465 -165363 -171605 -98151 -20470 -82077 -92592 -55037 -67944 -101268 -148864
2091a48864J5905J6528R9434o1903l8766L3109K3459o3144j523k843K05299K5569
$$ -148864 -132959 -116431 -16997 -78900 -117666 -84557 -61098 -124242 -125765 -128608 76691 102260
2079A02260j84841k5480l1985N7126N311K8586n2062j319m0107J17899Q1765q1120
$$ 102260 -82581 -108061 -140046 -82920 -77609 -49023 -101085 -102404 -142511 -24612 57153 -23967
2067b3967o656q8885K3188O7283q7235j2765L0813p4028J15220j0997k7408L4538
$$ -23967 -30623 -119508 -96320 -29037 -116272 -129037 -98224 -172252 -57032 -68029 -95437 -60899
2055f0899m1346J08308q7476O3567j1965n9158Q1337M9118k8325l9523n6862q2911
$$ -60899 -102245 6063 -81413 -17846 -29811 -88969 -7632 41486 13161 -26362 -83224 -166135
2043a66135m2210R0503n4326n5201J54598k1113r94M6189m2200k4756n3086M1927
$$ -166135 -208345 -117842 -172168 -227369 -72771 -93884 -94878 -48689 -90889 -115645 -168731 -126804
2031a26804j4295m2093j8603J03021J11066M830J6849L7483j14339o5387K8754
$$ -126804 -141099 -183192 -201795 -98774 12292 17122 33971 71454 -42885 -108272 -79518
2020g9518K6653o091o9607M0331N1587N0959N1444j2740o7881n5565L5129j8478
$$ -79518 -52865 -58956 -128563 -88232 -36645 14314 65758 53018 -14863 -70428 -35299 -53777
2008e3777q8730K1559j5878K486n4981J10016j4430j6274o7381Q1888p2586N1893
$$ -53777 -142507 -120948 -136826 -134340 -189321 -79305 -93735 -110009 -177390 -95502 -168088 -116195
1996a16195J10282m6209l9418m9888k1820k0913J04136N0260k659K4456J8916
$$ -116195 -5913 -52122 -91540 -141428 -163248 -184161 -80025 -29765 -32424 -7968 10948
1985A0948r6490N5376k9763k9971m7328j1680L7880O2166M5263j5294L8468p305
$$ 10948 -85542 -30166 -59929 -89900 -137228 -148908 -111028 -48862 -3599 -18893 19575 12270
1973A2270P3818j85263P0068J25284m2640p3517o3316K3904m3536n065P2147L4068
$$ 12270 86088 -99175 -29107 96177 53537 -19980 -83296 -59392 -102928 -107993 -35846 -1778
1961a778J2820j244r380J10970r0556q282p0983l5699J0402J221o5527q8862L6330
$$ -1778 11042 9798 418 111388 20832 12550 -58433 -94132 -83730 -82509 -148036 -236898 -200568
1948b00568L472k8586j0860O9409J06713j1432J2811n2230N9643o825R3160l4158
$$ -200568 -197096 -225682 -236542 -167133 -60420 -71852 -59041 -111271 -51628 -58453 34707 549
1936E49q1167N7660o466o8679p2339O6370L6396k8892n6423L2431K43305p690
$$ 549 -80618 -22958 -29424 -98103 -170442 -104072 -67676 -96568 -152991 -120560 122745 115055
1924A15055m1206r0576j30169l410Q7458n5088j400l6668L2947J49384j23975
$$ 115055 73849 -16727 -146896 -150306 -62848 -117936 -119336 -156004 -123057 26327 -97648
1913i7648q7083O2948R1546M0886M5434k1766l5498l7272k2603r5108N0817m110
$$ -97648 -184731 -121783 -30237 10649 56083 34317 -1181 -38453 -61056 -156164 -105347 -109457
1901a09457O9108Q9354M1665r6285q3310j58266J45688P4203o6957J4416l1941
$$ -109457 -40349 49005 90670 -5615 -88925 -247191 -101503 -27300 -94257 -79841 -111782
1890a11782L9127l326K3783L5178k7631j3956Q6653o0930l4419r8215O8932O6950
$$ -111782 -72655 -75981 -52198 -17020 -44651 -58607 28046 -32884 -67303 -165518 -96586 -29636
1878b9636j0093m3748k3938P3101l7446O209M6745n7172j1699K7251m6625L1225
$$ -29636 -39729 -83477 -107415 -34314 -71760 -65551 -18806 -75978 -87677 -60426 -107051 -75826
1866g5826l2696K30L2886N1142M4692Q1782j47351L1007O657o2511k0262M060
$$ -75826 -108522 -108292 -75406 -24264 20428 102210 -45141 -14134 -7477 -69988 -90250 -86190
1854h6190K5857N9467n8281k3553R2228n2274J1103J918N765K8947k33256j4879
$$ -86190 -60333 -866 -59147 -82700 9528 -42746 -31643 -29725 -23960 4987 -228269 -243148
1842b43148J14907O4537n4056j05730K4704J17217J34919j39053j9299K3571K0307
$$ -243148 -128241 -63704 -117760 -223490 -198786 -81569 53350 -85703 -105002 -81431 -61124
1831f1124q5702L7585l025K8832l3576k7064J7640J4275J6301p3501k2025j8823
$$ -61124 -146826 -109241 -112266 -83434 -117010 -144074 -126434 -112159 -95858 -169359 -191384 -210207
1819b10207m4237O0085L4670M6814l355r9193m857k9686J18050J13583n6173l488
$$ -210207 -254444 -194359 -159689 -112875 -116230 -215423 -220280 -249966 -131916 -18333 -74506 -77994
1807g7994l9392k1195M5658L5149j9462o5o90l8919P5561j807q0065J1076Q7916
$$ -77994 -117386 -138581 -92923 -57774 -77236 -77301 -77991 -116910 -41349 -43156 -123221 -112145 -24229
1794b4229Q2801p254l5724k5040O6330o1699O240l480k4342o1410L3945j3884
$$ -24229 58572 51318 15594 -9446 56884 -4815 1425 -2055 -26397 -87807 -53862 -67746
1782f7746j06910O023J02507O8040r4100j661k0054P8706m6174l6329M9718p1969
$$ -67746 -174656 -168633 -66126 1914 -92186 -93847 -113901 -35195 -81369 -117698 -67980 -139949
1770a39949J3096L6469k0859P7347L5351p9176J0055R0867P780l3165k638k2622
$$ -139949 -126853 -90384 -111243 -33896 1455 -77721 -67666 23201 30981 -2184 -4822 -27444
1758b7444j3592j28274m8875M8209N980R0568Q227L637Q5283j3200m9078N1228
$$ -27444 -41036 -169310 -218185 -169976 -163996 -73428 -65201 -61564 23719 10519 -38559 12669
1746A2669O3871m2487m9747l9485M5418R9072o7229j08373K2035P2213k5135o4329
$$ 12669 76540 34053 -15694 -55179 -9761 89311 22082 -86291 -64256 7957 -17178 -81507
1734h1507K0360K234L3754o382l0077k3371n5743l3625M3251J7099M5705J3578
$$ -81507 -61147 -58913 -25159 -31541 -61618 -84989 -140732 -174357 -131106 -114007 -68302 -54724
1722e4724j31075M7403Q1613m6893K6585Q894r4010J18383N8509L408J700K1929
$$ -54724 -185799 -138396 -56783 -103676 -77091 -68197 -162207 -43824 14685 18093 19793 41722
1710D1722l0775o1514J18734q5521q8766P8499k9818O4195j17264k5686Q1885
$$ 41722 10947 -50567 68167 -17354 -106120 -27621 -57439 6756 -110508 -136194 -54309
1699e4309J02785P178k3100n1065j12156K3507q869q1205M4720J82834p7932L7616
$$ -54309 48476 55654 32554 -18511 -130667 -107160 -116029 -197234 -152514 30320 -47612 -9996
1687i996m874j11202n1403J31237K1535o4807Q1494m0013l4997n5142L2369m7876
$$ -9996 -14870 -126072 -177475 -46238 -24703 -89510 -8016 -48029 -83026 -138168 -105799 -153675
1675a53675o6847n968J46666j230j0698R2654l4817J9908J0999o7432o021P7742
$$ -153675 -220522 -226490 -79824 -81054 -91752 902 -33915 -14007 -3008 -70440 -76461 1281
1663A281m3831n593n748l752k6305j01912P9434J08861j8891l4134n5764m0779
$$ 1281 -42550 -48143 -53891 -57643 -83948 -185860 -106426 2435 -16456 -50590 -106354 -147133
1651a47133R6055M9693N098N4443j92653L6463L6028j9097L8592l5294J539o356
$$ -147133 -51078 -1385 3713 58156 -134497 -98034 -62006 -81103 -42511 -77805 -76266 -82622
1639h2622L2305k5786m834M0761m7146m8248J19342M6991M17m1444l2849L3370
$$ -82622 -50317 -76103 -80937 -40176 -87322 -135570 -16228 30763 31180 -10264 -43113 -9743
1627i743m3027n7599q8239J25839M4826M4990l5126J476k5188N691r319j7222
$$ -9743 -52770 -110369 -198608 -72769 -27943 17047 -18079 -16603 -41791 -36100 -45419 -62641
1615f2641J05635O3257r8235j46904J28134k1502o1644L2561o5657J7217O2007
$$ -62641 42994 106251 8016 -138888 -10754 -32256 -93900 -61339 -126996 -109779 -47772
1604d7772l0301k2492M9076n2082k5534R0396l9530M1955L7572j8628j15587o5994
$$ -47772 -78073 -100565 -51489 -103571 -129105 -38709 -78239 -36284 1288 -17340 -132927 -198921
1592a98921P1164J2223J26041M1279p6096l6664O6607K3542k6134J7154n7831
$$ -198921 -127757 -115534 10507 51786 -24310 -60974 5633 29175 3041 20195 -37636
1581c7636N7010n7611r5588K0858L6669r736L9907l2066l5297Q0857P2558O6313
$$ -37636 19374 -38237 -133825 -112967 -76298 -86034 -46127 -78193 -113490 -32633 39925 106238
1569A06238K2548p4455k4348j07570J1368M0056m4794l1880j06544J38794K7869
$$ 106238 128786 54331 29983 -77587 -66219 -26163 -70957 -102837 -209381 -70587 -42718
$$ [...]
##END NTUPLES=NMR SPECTRUM
##END=
