##TITLE=1H_CA-9376-3
 200.13MHz, CDCl3,
 8 sc
 
 30.9.2025
##JCAMPDX= 6.0         $$ Bruker NMR JCAMP-DX V2.0
##DATA TYPE= NMR SPECTRUM
##DATA CLASS= NTUPLES
##ORIGIN= UXNMR, Bruker Analytische Messtechnik GmbH
##OWNER= pz
$$ XWIN-NMR		Version 3.5
$$ Tue Sep 30 15:47:13 2025 Russian Standard Time (UT+4h)  she@DPX200
##.OBSERVE FREQUENCY= 200.1313
##.OBSERVE NUCLEUS= ^1H
##.ACQUISITION MODE= SIMULTANEOUS
##.ACQUISITION SCHEME= undefined
##.AVERAGES= 8
##.DIGITISER RES= 18
##SPECTROMETER/DATA SYSTEM= spect
##.PULSE SEQUENCE= zg30
##.SOLVENT NAME= CDCl3
##.SHIFT REFERENCE= (INTERNAL, CDCl3, 0, 15.4516)
##AUDIT TRAIL= $$ (NUMBER, WHEN, WHO, WHERE, WHAT)
$$ ##TITLE= Audit trail, XWIN-NMR		Version 3.5
$$ ##JCAMPDX= 5.01
$$ ##ORIGIN= Bruker BioSpin GmbH
$$ ##OWNER= she
$$ F:/spectra/data/she/nmr/H-C/1/pdata/1/auditp.txt
$$ ##AUDIT TRAIL=  $$ (NUMBER, WHEN, WHO, WHERE, WHAT)
(   1,<2025-09-30 15:45:41.90 +0400>,<she>,<DPX200>,
      <created by zg, POWCHK disabled, PULCHK disabled
       configuration hash MD5:
       00 E9 B6 7A A2 85 ED C7 34 08 36 98 17 FE 4E 26
       data hash MD5: 16K
       60 3E 14 C4 02 F4 CE 8D FD 6E 2B B9 33 2A A1 18>)
(   2,<2025-09-30 15:45:49.40 +0400>,<she>,<DPX200>,
      <Start of raw data processing
       efp BC_mod = 2 LB = 0.25 FT_mod = 6 PKNL = 1 PHC0 = -1565.823 PHC1 = 22.79226 SI = 16K 
       data hash MD5: 16K
       C4 D8 64 8D C9 95 81 87 34 15 50 E1 12 EB B1 A9>)
(   3,<2025-09-30 15:46:15.37 +0400>,<she>,<DPX200>,
      <pk PHC0 = -155.0456 PHC1 = -1.6 
       data hash MD5: 16K
       37 C0 A2 46 A1 1D D4 CE 08 11 52 C7 9F FC 04 26>)
(   4,<2025-09-30 15:46:19.09 +0400>,<she>,<DPX200>,
      <abs ABSG = 5 
       data hash MD5: 16K
       5E 07 CD 46 79 A1 C8 77 EB E0 04 B7 3B 94 A8 47>)
$$ ##END=
$$ 
$$ hash MD5
$$ EE 45 F6 3E B0 B6 A9 35 CB 18 46 9D 95 1D 78 F8
##$RELAX= 
##$RELAX= 
##$RELAX= 
##$RELAX= 
##$RELAX= 
##$RELAX= 
$$ Bruker specific parameters
$$ --------------------------
##$DU= <F:/spectra>
##$EXPNO= 1
##$NAME= <H-C>
##$PROCNO= 1
##$TYPE= <nmr>
##$USER= <she>
##$AMP= (0..31)
100 100 100 100 100 100 100 100 100 100 100 100 100 100 100 100 100 100 
100 100 100 100 100 100 100 100 100 100 100 100 100 100 
##$AQSEQ= 0
##$AQ_mod= 1
##$AUNM= <au_zg>
##$AUTOPOS= <>
##$BF1= 200.13
##$BF2= 200.13
##$BF3= 200.13
##$BF4= 200.13
##$BF5= 200.13
##$BF6= 200.13
##$BF7= 200.13
##$BF8= 200.13
##$BYTORDA= 1
##$CFDGTYP= 0
##$CFRGTYP= 5
##$CHEMSTR= <none>
##$CNST= (0..31)
1 1 145 1 1 1 1 1 1 1 1 1 1 1 1 1 1 1 1 1 1 1 1 1 1 1 1 1 1 1 1 1 
##$CPDPRG= <>
##$CPDPRG1= <>
##$CPDPRG2= <>
##$CPDPRG3= <>
##$CPDPRG4= <mlev>
##$CPDPRG5= <mlev>
##$CPDPRG6= <mlev>
##$CPDPRG7= <mlev>
##$CPDPRG8= <mlev>
##$CPDPRGB= <>
##$CPDPRGT= <>
##$D= (0..31)
0 0.7 0 0 0 0 0 0 0 0 0 0.03 0 0 0 0 0 0 0 0 0 0 0 0 0 0 0 0 0 0 0 0 
##$DATE= 1759232741
##$DBL= (0..7)
120 120 120 120 120 120 120 120 
##$DBP= (0..7)
150 150 150 150 150 150 150 150 
##$DBP07= 0
##$DBPNAM0= <>
##$DBPNAM1= <>
##$DBPNAM2= <>
##$DBPNAM3= <>
##$DBPNAM4= <>
$$ [...]
##$SUBNAM3= <"">
##$SUBNAM4= <"">
##$SUBNAM5= <"">
##$SUBNAM6= <"">
##$SUBNAM7= <"">
##$SUBNAM8= <"">
##$SUBNAM9= <"">
##$SW= 18.0517328524113
##$SWIBOX= (0..15)
0 0 2 0 0 0 0 0 0 0 0 0 0 0 0 0 
##$SW_h= 3612.71676300578
##$TD= 16384
##$TD0= 1
##$TE= 0
##$TE2= 300
##$TE3= 300
##$TEG= 300
##$TL= (0..7)
0 120 120 120 120 120 120 120 
##$TP= (0..7)
150 150 150 150 150 150 150 150 
##$TP07= 0
##$TPNAME0= <>
##$TPNAME1= <>
##$TPNAME2= <>
##$TPNAME3= <>
##$TPNAME4= <>
##$TPNAME5= <>
##$TPNAME6= <>
##$TPNAME7= <>
##$TPOAL= (0..7)
0.5 0.5 0.5 0.5 0.5 0.5 0.5 0.5 
##$TPOFFS= (0..7)
0 0 0 0 0 0 0 0 
##$TUNHIN= 0
##$TUNHOUT= 0
##$TUNXOUT= 0
##$USERA1= <user>
##$USERA2= <user>
##$USERA3= <user>
##$USERA4= <user>
##$USERA5= <user>
##$V9= 5
##$VALIST= <valist>
##$VCLIST= <CCCCCCCCCCCCCCC>
##$VD= 0
##$VDLIST= <DDDDDDDDDDDDDDD>
##$VPLIST= <PPPPPPPPPPPPPPP>
##$VTLIST= <TTTTTTTTTTTTTTT>
##$WBST= 1024
##$WBSW= 4
##$XGAIN= (0..3)
0 0 0 0 
##$XL= 0
##$YL= 0
##$YMAX_a= 990322
##$YMIN_a= -800429
##$ZGOPTNS= <>
##$ZL1= 120
##$ZL2= 120
##$ZL3= 120
##$ZL4= 120
##$ABSF1= 15.49678
##$ABSF2= -2.555069
##$ABSG= 5
##$ABSL= 3
##$ALPHA= 0
##$AQORDER= 0
##$ASSFAC= 0
##$ASSFACI= 0
##$ASSFACX= 0
##$ASSWID= 0
##$AUNMP= <proc_1d>
##$AZFE= 0.1
##$AZFW= 0.1
##$BCFW= 0
##$BC_mod= 2
##$BYTORDP= 0
##$COROFFS= 0
##$CY= -3
##$DATMOD= 1
##$DC= 0
##$DFILT= <>
##$DTYPP= 0
##$F1P= 0
##$F2P= 0
##$FCOR= 1
##$FTSIZE= 16384
##$FT_mod= 6
##$GAMMA= 0
##$GB= 0
##$INTBC= 1
##$INTSCL= 3.241238e-09
##$ISEN= 128
##$LB= 0.25
##$LEV0= 0
##$LPBIN= 0
##$MAXI= 10000
##$MC2= 0
##$MEAN= 0
##$ME_mod= 0
##$MI= 1.114404
##$NCOEF= 0
##$NC_proc= -7
##$NLEV= 6
##$NOISF1= 3.799351
##$NOISF2= 2.8
##$NSP= 0
##$NTH_PI= 0
##$NZP= 0
##$OFFSET= 15.45161
##$PC= 1
##$PHC0= -1720.869
##$PHC1= 21.19226
##$PH_mod= 1
##$PKNL= yes
##$PPARMOD= 0
##$PSCAL= 0
##$PSIGN= 0
##$REVERSE= no
##$SF= 200.130014027249
##$SI= 16384
##$SIGF1= 3
##$SIGF2= 2
##$SINO= 0.751879
##$SIOLD= 32768
##$SREGLST= <19F.Aceton>
##$SSB= 0
##$STSI= 16384
##$STSR= 0
##$SW_p= 3612.71676300578
##$SYMM= 0
##$S_DEV= 0
##$TDeff= 16384
##$TDoff= 0
##$TI= <>
##$TILT= no
##$TM1= 0
##$TM2= 0
##$TOPLEV= 0
##$USERP1= <user>
##$USERP2= <user>
##$USERP3= <user>
##$USERP4= <user>
##$USERP5= <user>
##$WDW= 1
##$XDIM= 16384
##$YMAX_p= 589355473
##$YMIN_p= -2549602
$$ End of Bruker specific parameters
$$ ---------------------------------
##NTUPLES= NMR SPECTRUM
##VAR_NAME=  FREQUENCY,     SPECTRUM/REAL,   SPECTRUM/IMAG
##SYMBOL=    X,             R,               I
##VAR_TYPE=  INDEPENDENT,   DEPENDENT,       DEPENDENT
##VAR_FORM=  AFFN,          ASDF,            ASDF
##VAR_DIM=   16384,         16384,           16384
##UNITS=     HZ,            ARBITRARY UNITS, ARBITRARY UNITS
##FACTOR=    0.220516191357247, 1,           1
##FIRST=     3092.33084829532, 0,            0
##LAST=      -520.385914710462, 0,           0
##MIN=       -520.385914710462, -2549602,    0
##MAX=       3092.33084829532, 589355473,    0
$$ Real data points
##PAGE= N=1
##DATA TABLE= (X++(R..R)), XYDATA
$$ [...]
5692B4827232L68018L32296K39281M08275K54775L92827L74162L08755L50607
5683B7856228N24398N11336M25907M98586M50408P09912N70693O94118Q09100
5674C3050686Q26393R64549R80390R21332R94573R68990Q26234Q77975R02171
5665D1313293Q74954R71656J027085J141367J080726J171851J145369J165268
5657D9891569J283036J203105J292143J295989J248077R54760Q42030Q46769P16424
5648E9573902O63518M11099L34020K66699L5001J41269M49668J82307K89591m0356
5638F2306718l57216n96779p59008q66200q94700r51861j025716r09847q35197
5629E5110194n87269l03911q8308K91177K78295L72637Q17225R72628J191507
$$ plain form
5692 24827232 25195250 25527546 25766827 26175102 26429877 26822704 27196866 27505621 27856228
5683 27856228 28380626 28891962 29317869 29816455 30266863 30976775 31547468 32241586 33050686
5674 33050686 33877079 34841628 35822018 36743350 37737923 38706913 39533147 40411122 41313293
5665 41313293 42188247 43159903 44186988 45328355 46409081 47580932 48726301 49891569
5657 49891569 51174605 52377710 53669853 54965842 56213919 57168679 58010709 58857478 59573902
5648 59573902 60237420 60648519 60982539 61249238 61284239 61425508 61875176 62057483 62347074 62306718
5638 62306718 61949502 61352723 60593715 59727515 58832815 57880954 56855238 55945391 55110194
5629 55110194 54522925 54219014 54130706 54421883 54700178 55072815 55890040 56862668 58054175
5620E8054175J505080J660007J954775K252414K546879K765704K733645L296394
5612G6769073L469418L468504L677491L758907L491415L055705K488825J805284
5604A01984622J194206P18221K8272n60461j102583j453846j555943k008498j986086
5595I5257904j994108k065762k207732k242401k136381j979493j906045j809770
5587G8916212j593119j596911j401080j093778r96868q44242o68775n28118k41993
5578F9951328j34803k32898k67537k87159m28412o73716j147277j125686j327691
5569F4326149j381365j667686j758140j809667j810046j837849k016629j909506
5561E0135261j566228j679063j685856j564176j693746j373422j305477j264763
$$ plain form
5620 58054175 59559255 61219262 63174037 65426451 67973330 70739034 73472679 76769073
5612 76769073 80238491 83706995 87384486 91143393 94634808 97690513 100179338 101984622
5604 101984622 103178828 103897049 103925321 103364860 102262277 100808431 99252488 97243990 95257904
5595 95257904 93263796 91198034 88990302 86747901 84611520 82632027 80725982 78916212
5587 78916212 77323093 75726182 74325102 73231324 72234456 71390214 70721439 70193321 69951328
5578 69951328 69816525 69583627 69316090 69028931 68600519 67926803 66779526 65653840 64326149
5569 64326149 62944784 61277098 59518958 57709291 55899245 54061396 52044767 50135261
5561 50135261 48569033 46889970 45204114 43639938 41946192 40572770 39267293 38002530
5553C8002530j278828r96097j018492j151034p66845q89660q43528n80113o13644
5544B9864289o64964o74628o39386n57389n05825n79571n70642l98823m03635
5535B4869426k63996l86660l83018k43646l12078j78985k76844j05015j42509
5526B2576675L4799K6638l2982R7018J94901J14636O3599Q2345Q4962J41818J89942
5515B3574351O6897J888o0549p704q231j17658j33282k67023k70213k85901k74155
5504B2218420k74435l02788k73953k65487k48233k00648l27163l10426j2741j0425
5494A9992121p4154j56322J8518j33366k6567q4146j77038j52778j83924j82758
5484A8839586j87807k14530l82559k16370k84824l41172k33072j91544l09912
$$ plain form
5553 38002530 36723702 35727605 34709113 33558079 32791234 31901574 31058046 30477933 29864289
5544 29864289 29199325 28524697 27885311 27327922 26822097 26242526 25671884 25273061 24869426
5535 24869426 24605430 24218770 23835752 23592106 23280028 23101043 22824199 22719184 22576675
5526 22576675 22611474 22638112 22605130 22702148 22897049 23011685 23075284 23157629 23242591 23384409 23574351
5515 23574351 23641248 23643136 23582587 23574883 23566652 23448994 23315712 23048689 22778476 22492575 22218420
5504 22218420 21943985 21641197 21367244 21101757 20853524 20652876 20325713 20015287 20002546 19992121
5494 19992121 19917967 19761645 19780163 19646797 19620230 19536084 19359046 19206268 19022344 18839586
5484 18839586 18651779 18437249 18054690 17838320 17553496 17212324 16979252 16787708 16477796
5475A6477796k90489j09901k31579j32149j78083j06902j02909k86201o1961k9818
5465A4947804j61898j16483j6054r7274j31930M6728m1507q9974N5873j29874
5455A4265411j89350j07904k6622P3908m9937j61095K19093J33532l4824j02325
5445A4019887k4944j04737n3874M8669l4242q1541J02519j2155k1745l8666Q6659
5434A3885830o6364k7270J14234P4796l8038Q363o5329K14000o282K2541J75268
5423A4291749k8654K2642n9596J02872Q6453K08004J38873J35698n1995j03162
5413A4742884O8309K10879J86428Q1759j5951J35559J47101M2504J8755J36119
5403A5754346J67879J50878N5140K37356J43424N3371J93479L58561K73374K62863
$$ plain form
5475 16477796 16187307 16077406 15845827 15713678 15535595 15428693 15325784 15039583 14977622 14947804
5465 14947804 14785906 14669423 14653369 14556095 14424165 14470893 14429386 14339412 14395285 14265411
5455 14265411 14076061 13968157 13941535 14015443 13965506 13804411 14023504 14157036 14122212 14019887
5445 14019887 13994943 13890206 13836332 13885001 13850759 13769218 13871737 13859582 13837837 13799171 13885830
5434 13885830 13819466 13792196 13906430 13981226 13943188 13951551 13886222 14100222 14093940 14116481 14291749
5423 14291749 14263095 14285737 14226141 14329013 14415466 14623470 14762343 14898041 14846046 14742884
5413 14742884 14811193 15022072 15208500 15290259 15274308 15409867 15556968 15599472 15618227 15754346
5403 15754346 15922225 16073103 16128243 16365599 16509023 16562394 16755873 17114434 17387808 17650671
5393A7650671M93128O22714O02556N41086P05942P22323Q95643J089988J030924
5384B4354975J140736J343459J719220K073612K545107L125237L754768M316874
5376D4373988L998723K693074J096270m81295j218385j753677k382159l064717
5368D3261822l373289l085837k760166k286954k093692j930147j710730j495533
5360B4525474j291566j051726q49689p15639p21399o90011o22137m41776m72297
5351A7669234m30378n31849m55635j90108l39287m00763l76148k56722l24788
5342A4363556l10325j94596n8407k55684k48234k33121j79374j8222k14666j67097
5332A2483830j76614o8624L9782j55218k35209N351n8355j09715r9404j13751
$$ plain form
5393 17650671 18143799 18766513 19369069 19910155 20616097 21338420 22234063 23324051 24354975
5384 24354975 25495711 26839170 28558390 30632002 33177109 36302346 40057114 44373988
5376 44373988 48372711 51065785 52162055 51680760 50462375 48708698 46326539 43261822
5368 43261822 39888533 36802696 34042530 31755576 29661884 27731737 26021007 24525474
5360 24525474 23233908 22182182 21332493 20616854 19895455 19205444 18583307 18141531 17669234
5351 17669234 17238856 16707007 16251372 16061264 15721977 15321214 14945066 14688344 14363556
5342 14363556 14053231 13858635 13800228 13544544 13296310 13063189 12883815 12865593 12650927 12483830
5332 12483830 12307216 12238592 12278374 12123156 11887947 11893298 11834943 11725228 11625824 11512073
5322A1512073l4448o9492j0692k8429p2891n9319J6783p3163q0992n7520r4042
5311A0947868m0270M557N0223n8973j11773j14893j08336k1375K26r8448r6660
5300A0352146n5742l4553p3121q3796J3122K6127k6683r056k9186j5498r201Q041
5288A0062600k08529O4826Q6318O6596P2055m4031j70064j50987J35332J17385
5278A0031501o0611o1298o7768J25504n5935J65362J21193j06593R9496J33934
5268A0324785Q6080J38976Q7306M1510J9261j08171J08071J18656J32521m0635
5258A0908360p2315j48506Q5402O9659J64n7887K175o6228L1667K560m4838l470
5246A0706743J00314P3217J25587R1967L8984J61740J12702R225J3555J06893
$$ plain form
5322 11512073 11477625 11408133 11397441 11369012 11296121 11236802 11253585 11180422 11099430 11041910 10947868
5311 10947868 10907598 10912155 10962378 10903405 10791632 10676739 10568403 10547028 10547254 10448806 10352146
5300 10352146 10296404 10261851 10188730 10104934 10118056 10144183 10117500 10108444 10079258 10063760 10054559 10062600
5288 10062600 9854071 9918897 10005215 10071811 10143866 10099835 9929771 9778784 9914116 10031501
5278 10031501 9970890 9909592 9841824 9967328 9911393 10076755 10197948 10091355 10190851 10324785
5268 10324785 10410865 10549841 10637147 10678657 10697918 10589747 10697818 10816474 10948995 10908360
5258 10908360 10836045 10687539 10772941 10842600 10842764 10784877 10787052 10720824 10752491 10755051 10710213 10706743
5246 10706743 10807057 10880274 11005861 11097828 11136812 11298552 11411254 11420479 11434034 11540927
5236A1540927J53647J47070J34118Q8346J73753K3868l0692J90277J14909j00049
5226A2436174J37754J6117M5297O3209j9777J18775J74246P1623J3531M658R9755
5215A3161362J28699K22335M0878l8984R9671J10877O7607J54475R0694J25024
5205A4162638J68366K21783K16845j58023J40950O5313J310q5899J47478O1570
5195A4942331L8572j41906M4339k2973q184k7779l7596L4518L8257J94031M7477
5184A5101087m2832m6828J11586J2325p8998L0249k5663j35866K38154K28763
5174A5391977K4697J04476J02081P6421O2792N8791J07028N3028M2097Q8850N3730
5163A6165968l3541O3895Q7256Q5983K40700Q3292J82452k282K2765R8511P0084
$$ plain form
5236 11540927 11694574 11841644 11975762 12064108 12237861 12261729 12231037 12421314 12536223 12436174
5226 12436174 12573928 12590045 12635342 12698551 12678774 12797549 12971795 13043418 13056949 13061607 13161362
5215 13161362 13290061 13512396 13553274 13514290 13613961 13724838 13792445 13946920 14037614 14162638
5205 14162638 14331004 14552787 14769632 14611609 14752559 14817872 14819182 14733283 14880761 14942331
5195 14942331 14980903 14838997 14883336 14860363 14852179 14824400 14786804 14821322 14859579 15053610 15101087
5184 15101087 15058255 15011427 15123013 15135338 15056340 15086589 15060926 14925060 15163214 15391977
5174 15391977 15416674 15521150 15623231 15699652 15762444 15821235 15928263 15981291 16023388 16112238 16165968
5163 16165968 16132427 16196322 16283578 16369561 16610261 16693553 16876005 16873723 16896488 16994999 17065083
5152A7065083k47503P9907Q627j35771J05068J93725J1872k4317J80042j8418
5142A7218315P1455J00021k8849J73166J77615J06315J55846J71160J51147K66885
5132A8563076J39970Q2736J92119O0294J49883J06016R9640J10131J15304j022
5122A9618147J51751M9791J68845K84804J77690K42840K95075K90267M02679M82967
5112B2164856M12978J38265K11976l5605j14340o0640k51443k32047k63516k92672
5102B1677812j98061j29402k21210k49799k39985p7466L2600p779j36184M7791
5092B0498317J91223J01417K29277J77736J18863L85623K90489J83873K93235
5083B2470053L21773K64740R4157J65070J70303R3087N2951o7834j85001o8455
$$ plain form
5152 17065083 16817580 16897487 16906114 16770343 16875411 17069136 17081008 17056691 17236733 17218315
5142 17218315 17289770 17389791 17360942 17534108 17711723 17818038 17973884 18145044 18296191 18563076
5132 18563076 18703046 18785782 18977901 19038195 19188078 19294094 19393734 19503865 19619169 19618147
5122 19618147 19769898 19819689 19988534 20273338 20451028 20693868 20988943 21279210 21681889 22164856
5112 22164856 22577834 22716099 22928075 22892470 22778130 22717490 22466047 22234000 21970484 21677812
5102 21677812 21479751 21350349 21129139 20879340 20639355 20561889 20594489 20586710 20450526 20498317
5092 20498317 20689540 20790957 21020234 21197970 21316833 21702456 21992945 22176818 22470053
5083 22470053 22791826 23056566 23150723 23315793 23486096 23579183 23632134 23564300 23379299 23310844
5073B3310844k42150j35110j43784q8232k01152j24286r2668j06609j17748J6109
5063B2075214R8913J9623J32535J55203K74696L61939L31872K55939J70106K02865
5053B4078905P1748J38059P4357L2192K07757R9818p0578J47646K47395K36483
5043B5263782J35127J62737K43467K95598M35376K17695K82483K95372J74429
5034B7506066L7033P6973J3002J7195p3417J38799K00688L6291J66179J36645
5024B8255454J34356K73819L01687K95385L04139L85583K51418L54255M25726
5015C0981822M41750O70413N81389O59579N45507M10397N79402N80620M82885
5006C5933764J92984K35986K10303J27525L64355M7009P5490M45244J05667J98334
$$ plain form
5073 23310844 23068694 22933584 22789800 22701568 22500416 22376130 22283462 22176853 22059105 22075214
5063 22075214 22174127 22193750 22326285 22481488 22756184 23118123 23449995 23705934 23876040 24078905
5053 24078905 24150653 24288712 24363069 24395261 24603018 24702836 24632258 24779904 25027299 25263782
5043 25263782 25398909 25561646 25805113 26100711 26536087 26753782 27036265 27331637 27506066
5034 27506066 27543099 27620072 27633074 27650269 27576852 27715651 27916339 27952630 28118809 28255454
5024 28255454 28389810 28663629 28965316 29260701 29564840 29950423 30201841 30556096 30981822
5015 30981822 31423572 32093985 32675374 33334953 33880460 34290857 34870259 35450879 35933764
5006 35933764 36126748 36362734 36573037 36700562 37064917 37111926 37187416 37632660 37738327 37936661
4996C7936661M11556M36891N06954N55689N25184N71039M77339O30518O54512
4987D2706343P66336P45264P20862P60091Q49131P81628Q59985J034007R26992
4978E0150639R71587R14785R60648J067587J236648J212229J384794J573421J605118
4969F1077456J770391J883741K219203K106930K253283K680099L095166L449119
4961H0535388L929011M921281O001758O861974P779301P866454O920240N188400
4953A30003807K824684O70426r88872k291133l437768m034658m232265m137031
4945A14377190l534809k756284k311394j747113j263155r42867k44436J24905
4937A01702037L91373Q49869J059601J418624J540383J840592K293287K746591
$$ plain form
4996 37936661 38348217 38785108 39292062 39847751 40372935 40943974 41421313 42051831 42706343
4987 42706343 43472679 44217943 44938805 45698896 46548027 47329655 48189640 49223647 50150639
4978 50150639 51122226 52037011 52997659 54065246 55301894 56514123 57898917 59472338 61077456
4969 61077456 62847847 64731588 66950791 69057721 71311004 73991103 77086269 80535388
4961 80535388 84464399 89385680 95387438 102249412 110028713 117895167 124815407 130003807
4953 130003807 132828491 133498917 132510045 130218912 126781144 122746486 118514221 114377190
4945 114377190 110842381 108086097 105774703 104027590 102764435 101821568 101577132 101702037
4937 101702037 102093410 102943279 104002880 105421504 106961887 108802479 111095766 113842357
4929A13842357L221325M123228N204754O362472P214694O943747N897214M216121
4921A57025912K437429L70406j960608l166006m045633m535687m743407m632804
4913A36749602m317828l607281l101785k636206k162014j668189j451678j105369
4905A16699252p50308o30775n00800n20401n09804p42494o89773q05905q88003
4896A10660989p40052p81140q20408m93976m83376k69636j51755r4521P2209J70316
4886A07068650J64580L45234L90216M07568L98542K89387N08271M67271O08552
4877A10648271N86880M14834N59403O28685N62457P95481O11620O42473M36384
4868A15886488N45458O29760L71183K99529K30577L51582J84217J79191J24353
$$ plain form
4929 113842357 117063682 121186910 126391664 132754136 139968830 146912577 152809791 157025912
4921 157025912 159463341 159833747 157873139 154707133 150661500 146125813 141382406 136749602
4913 136749602 132431774 128824493 125722708 123086502 120924488 119256299 117804621 116699252
4905 116699252 115948944 115318169 114817369 114296968 113787164 113044670 112354897 111548992 110660989
4896 110660989 109920937 109139797 108319389 107825413 107342037 107072401 106920646 106826125 106898334 107068650
4886 107068650 107233230 107578464 107968680 108376248 108774790 109064177 109572448 110039719 110648271
4877 110648271 111235151 111649985 112209388 112838073 113400530 114196011 114807631 115450104 115886488
4868 115886488 116431946 117061706 117432889 117732418 117962995 118314577 118498794 118677985 118802338
4859A18802338J97613J72183L75069Q7946K10383L04783J41478M49164N23508
4850A21264465K76775K44728L97202K34852L29220L80196K75143L42104L47938
4841A24092623K46453L82068L04228M62682O88409P21363Q27763Q06757P92460
4832A29324806Q97994J108910J070281J107773J227585J105339J228719J224380
4824A38295787J155267J359733J212764J173090J202917J360398J143732R38515
4816A47842203J170403J075109J086023J046420J083532J085366J147402J422142
4808A56958600J457691J693608J774097J618465J728827J914625J844473J618284
4800A70608670J677496J488992J476707J486170J479860J473386J267720J291393
$$ plain form
4859 118802338 118999951 119172134 119547203 119635149 119845532 120150315 120291793 120740957 121264465
4850 121264465 121541240 121785968 122183170 122418022 122747242 123127438 123402581 123744685 124092623
4841 124092623 124339076 124721144 125025372 125488054 126176463 126897826 127725589 128532346 129324806
4832 129324806 130222800 131331710 132401991 133509764 134737349 135842688 137071407 138295787
4824 138295787 139451054 140810787 142023551 143196641 144399558 145759956 146903688 147842203
4816 147842203 149012606 150087715 151173738 152220158 153303690 154389056 155536458 156958600
4808 156958600 158416291 160109899 161883996 163502461 165231288 167145913 168990386 170608670
4800 170608670 172286166 173775158 175251865 176738035 178217895 179691281 180959001 182250394
4792A82250394J337512J151530R55592Q58586N49865K33860p5946o63415q37589
4783A85760389r55841j531107j728154j864049k234301k195206k216962k433367
4775A70601402k289916k371999k381446k419446k396721k499956k437844k401355
4767A51402719k259036k265589k376435k315805k440210k355474k183887k034126
4759A33172157k046927j984610j645255j600077j453344j220127r69564q04801
4751A21447452p25756m85421k67731l48938l23359L0832K19908J99869K42671
4742A19989527K98607L47981N99977P19187P70060P44210Q06996Q19321Q64421
4733A25960287Q85459P38847O57601Q45090O85645P40293M60863N43949M83571
$$ plain form
4792 182250394 183587906 184739436 185695028 186553614 187103479 187337339 187261393 186597978 185760389
4783 185760389 184804548 183273441 181545287 179681238 177446937 175251731 173034769 170601402
4775 170601402 168311486 165939487 163558041 161138595 158741874 156241918 153804074 151402719
4767 151402719 149143683 146878094 144501659 142185854 139745644 137390170 135206283 133172157
4759 133172157 131125230 129140620 127495365 125895288 124441944 123221817 122252253 121447452
4751 121447452 120721696 120236275 119968544 119619606 119296247 119327079 119546987 119746856 119989527
4742 119989527 120288134 120636115 121236092 121955279 122725339 123469549 124276545 125095866 125960287
4733 125960287 126845746 127584593 128242194 129087284 129772929 130513222 130974085 131518034 132001605
4724A32001605M34571L43158J33606N0286N8442n2821l33152k86442o86498p33616
4714A30929139p46219q27327q10452r69211j096385q46149q21962j082783r70642
4705A22758009q53426q56149n91984p21312n17632n36389n79770l95115k36260
4696A17469972j02943J11767O4041K09127K63132J48414K13962R6796J54803k939
4686A18626132j19365j04068k6509m20549m90790m09720o37704n14481l63546
4677A15539400n50168l40986k74062l46686j72430j08229o4375K30778K44685
4668A14157927K85489L37855L52391O41789P68243P37820O51560Q76303R49242
4659A19758619J119207J252674J205131J272108J335355J482439J596717J831229
$$ plain form
4724 132001605 132436176 132779334 132912940 132963226 133021668 132968847 132635695 132349253 131662755 130929139
4714 130929139 130182920 129355593 128545141 127575930 126479545 125633396 124811434 123728651 122758009
4705 122758009 121904583 121048434 120456450 119735138 119217506 118681117 118101347 117706232 117469972
4696 117469972 117367029 117478796 117542837 117751964 118015096 118163510 118377472 118474268 118629071 118626132
4686 118626132 118506767 118402699 118376190 117955641 117464851 117055131 116417427 115902946 115539400
4677 115539400 114989232 114648246 114374184 114027498 113855068 113746839 113682464 113913242 114157927
4668 114157927 114443416 114781271 115133662 115775451 116543694 117281514 117933074 118809377 119758619
4659 119758619 120877826 122130500 123335631 124607739 125943094 127425533 129022250 130853479
4651A30853479J911610K143610K364591K716498L037866L168480L204495L189411
4643A52590040K856888J987467J188061M16930r2498m77600q95305j100242j236113
4634A55237628j072720j111384j099930q10621p33904m59382k73409J47821K92809
4625A50116908N15941O56851R65209J197449J532855J769896K132107K447987
4617A61335203K781870L360397L689169M143791M760271N424931O050538O830957
4609A98377127P570785Q012792Q094189P322358O035386M192916K438172R99828
4601B43043553j63524q33246j225373j693287j513971j173193p11817k73630L90450
4592B35845962R64413J042463R07736K52291j22060q84413j506493j931182k150342
$$ plain form
4651 130853479 132765089 134908699 137273290 139989788 143027654 146196134 149400629 152590040
4643 152590040 155446928 157434395 158622456 159039386 158946888 158469288 157573983 156473741 155237628
4634 155237628 154164908 153053524 151953594 151142973 150409069 149949687 149676278 149824099 150116908
4625 150116908 150632849 151289700 152254909 153452358 154985213 156755109 158887216 161335203
4617 161335203 164117073 167477470 171166639 175310430 180070701 185495632 191546170 198377127
4609 198377127 205947912 213960704 222054893 229377251 235412637 239605553 242043725 243043553
4601 243043553 242880029 242046783 240821410 239128123 237614152 236440959 235729142 235455512 235845962
4592 235845962 236810375 237852838 238760574 239012865 238890805 238006392 236499899 234568717 232418375
4583B32418375k538024k413180k041176j656032j373209q01096l59605J57789
4575B21393842P21078J294085J569752K308908L079164L505181M018148M730377
4567B42620535N512807O226025O954505P539513Q319158Q996847R473267R504123
4559C05146780R521328R636019R288098R133116R051642Q989289Q497782P669471
4551C76933525O365822M893854K947916J073675m15890k055973k739627k843106
4543C84160196k649605j915901j401528o23644k45717l44050n33989j238319j725051
4534C73482392k279959k630022k597264k271766j373759l87233O72031J728839
4526C64343259K849267L738281M083571M330654M210223L833789L347737K513552
$$ plain form
4583 232418375 229880351 227467171 225425995 223769963 222396754 221595658 221236053 221393842
4575 221393842 222114920 223409005 224978757 227287665 230366829 233872010 237890158 242620535
4567 242620535 248133342 254359367 261313872 268853385 277172543 286169390 295642657 305146780
4559 305146780 314668108 324304127 333592225 342725341 351776983 360766272 369264054 376933525
4551 376933525 383299347 388193201 391141117 392214792 391798902 389742929 387003302 384160196
4543 384160196 381510591 379594690 378193162 377569518 377323801 376979751 376445762 375207443 373482392
4534 373482392 371202433 368572411 365975147 363703381 362329622 361942389 362614420 364343259
4526 364343259 367192526 370930807 375014378 379345032 383555255 387389044 390736781 393250333
4518C93250333J934737J134723K5986r80840k370570l683709n208978o175054
4510C77926628o730823p208285p412969p000279o808258o358372n849488n545110
4502C25013044n452850n609377n918750o419763o974219p524630q177612q368409
4494B70567434q530798q574005q331837q023791p620547p308762o835048o578041
4486B08764605n912618n584091n259922m768430m741448m253468m230750m143810
4478A69870068l942857l620192l311673l180175l079707k788899k663715k476112
4470A44806738k234125k050036j767031j615675j389855j006617p02875o76882
4462A33363642o83929q11797j045049j012553j379306j454794j530888j432232
$$ plain form
4518 393250333 395185070 396319793 396345779 395364939 392994369 389310660 384101682 377926628
4510 377926628 371195805 363987520 356574551 349574272 342766014 336407642 330558154 325013044
4502 325013044 319560194 313950817 308032067 301612304 294638085 287113455 278935843 270567434
4494 270567434 262036636 253462631 245130794 237107003 229486456 222177694 215342646 208764605
4486 208764605 202851987 197267896 192007974 187239544 182498096 178244628 174013878 169870068
4478 169870068 165927211 162307019 158995346 155815171 152735464 149946565 147282850 144806738
4470 144806738 142572613 140522577 138755546 137139871 135750016 134743399 134040524 133363642
4462 133363642 132679713 131867916 130822867 129810314 128431008 126976214 125445326 124013094
4454A24013094j499315j616257j362103j172653j094617q52713q50208n77808
4446A14987420m82941m71160k88536n31070m73704q47467p90279p39956p75685
4437A09586622q70439j096634r49783r08642r41857n83963n28074q84030o21050
4428A02202150m51850m89573m01853n49234k63879k23010l41495l21473l20586
4419I8839197n16969m08566o32974n41455n08355n98500n23319n83966n25034
4410I4000059l03318l42768j61971J6598n8753K04429L45174N31673P55878P20589
4400I5707590N90783M74969M09066p2973m84126p80467r42648j367055j516767
4391I2018372j629945j581208j510381j422865j392853j289350j175980r79625
$$ plain form
4454 124013094 122513779 120897522 119535419 118362766 117268149 116415436 115565228 114987420
4446 114987420 114504479 114033319 113744783 113213713 112740009 111892542 111102263 110362307 109586622
4437 109586622 108716183 107619549 106669766 105761124 104819267 104235304 103707230 102823200 102202150
4428 102202150 101750300 101260727 100858874 100309640 100045761 99822751 99481256 99159783 98839197
4419 98839197 98322228 97913662 97280688 96739233 96230878 95632378 95109059 94525093 94000059
4410 94000059 93696741 93353973 93192002 93208600 93149847 93354276 93699450 94231123 94987001 95707590
4400 95707590 96298373 96773342 97182408 97109435 96625309 95844842 94902194 93535139 92018372
4391 92018372 90388427 88807219 87296838 85873973 84481120 83191770 82015790 81036165
4383H1036165p62955r13001p53922p04447q35540n69027m98707n53500m58718
4374G4986348k99696l84009j66949m8168l614N1090J62675L46329L81993M60568
4364G5486567M61772K93109K25499j65165m39587m87663q39153q10764q90873
4355G2833742q67832r81387q09456p38014m31544k14668l27249l06334j16535
4346F8040723L2407J52047L20989M70851L40825M32506K77197L58985K56347J41441
4336G0824318K13584m1708k10258j34648q7354k33036j94942j16810r0429O6736
4326F9995453J94342L06242L65834N01659N14187Q61992Q56801O82055P57119
4317G5035684O06712N70623N31228K24812p4928M8008p3768R8656P2589K04304
$$ plain form
4383 81036165 80273210 79360209 78606287 77901840 77066300 76497273 75998566 75445066 74986348
4374 74986348 74686652 74302643 74135694 74087526 74083912 74135002 74297677 74644006 75025999 75486567
4364 75486567 75948339 76241448 76466947 76301782 75862195 75374532 74535379 73724615 72833742
4355 72833742 71965910 70984523 70175067 69437053 69005509 68790841 68463592 68157258 68040723
4346 68040723 68073130 68225177 68546166 69017017 69357842 69790348 70067545 70426530 70682877 70824318
4336 70824318 71037902 70996194 70785936 70651288 70563934 70330898 70135956 70019146 69928717 69995453
4326 69995453 70189795 70496037 70861871 71363530 71877717 72739709 73596510 74278565 75035684
4317 75035684 75642396 76213019 76744247 76969059 76894131 76942139 76868371 76967027 77039616 77243920
4307G7243920M99618M40041N34595M31160M12930O12267N75547L61916M98647
4298H1610641K24852R2861J5990r7854r985l9115N1414R1371O8362J72392k3802
4287H2157127K17090L37603L30594M02462L15209N98116M32033N59315O39503
4278H5989052P29238P48495P82254R90342R02131R92464J186260J119607J288322
4269I4728165J454419J346571J452535J420315J295104J176102R34238P97590
4261A04605039O83168O00182M02727L72124L38560J37926M87684M54721N40172
4252A08622303O72195Q39564J065369J105857J190151J374147J397536J471862
4244A17738984J786238J895722J861378K116382K107990K211278K435220K221629
$$ plain form
4307 77243920 77743538 78183579 78718174 79149334 79562264 80174531 80750078 81111994 81610641
4298 81610641 81835493 81928354 81944344 81846490 81836505 81797390 81848804 81940175 82008537 82180929 82157127
4287 82157127 82374217 82711820 83042414 83444876 83760085 84358201 84790234 85349549 85989052
4278 85989052 86718290 87466785 88249039 89239381 90141512 91133976 92320236 93439843 94728165
4269 94728165 96182584 97529155 98981690 100402005 101697109 102873211 103807449 104605039
4261 104605039 105288207 105888389 106291116 106663240 107001800 107139726 107627410 108082131 108622303
4252 108622303 109294498 110134062 111199431 112305288 113495439 114869586 116267122 117738984
4244 117738984 119525222 121420944 123282322 125398704 127506694 129717972 132153192 134374821
4236A34374821K040841J675730J180192M60228j05600r18167j504800k014203
4228A35189042k477564k872169l095213l362603l241065l033666k993495k922890
4220A11190377k919229k515707k682662k484575k240262k300002k338929k235376
4212I1473635k131089k290869k212690k104038k130265k318047k150838k136705
4204G3999094k069951j930024j901673j759657j904489j918880j793174j689069
4196E9032177j658836j664908j484626j618197j527645j291509j358355j307278
4188D7120823j296111j123973j251884j259233r56792r57284r95097r02915p93653
4179C7583881r66026q29042q04622o69504o40458p27301o51241n37339o76851
$$ plain form
4236 134374821 136415662 138091392 139271584 139731812 139626212 138708045 137203245 135189042
4228 135189042 132711478 129839309 126744096 123381493 120140428 117106762 114113267 111190377
4220 111190377 108271148 105755441 103072779 100588204 98347942 96047940 93709011 91473635
4212 91473635 89342546 87051677 84838987 82734949 80604684 78286637 76135799 73999094
4204 73999094 71929143 69999119 68097446 66337789 64433300 62514420 60721246 59032177
4196 59032177 57373341 55708433 54223807 52605610 51077965 49786456 48428101 47120823
4188 47120823 45824712 44700739 43448855 42189622 41232830 40275546 39280449 38377534 37583881
4179 37583881 36617855 35788813 34984191 34314687 33674229 32946928 32295687 31758348 31081497
4170C1081497o47566m00281n60992m34707l73962m96887m53739m96566l42279
4161B6874518l80944m31991k62442m12520k65821l06768m57508l74293m58205
4152B3524026j03329k61783l32459j34715l82913k95246l04010l46839k04283
4143B1158449k19372q7495k11318j79233k145j24790l92369j95982r9196J5904
4133A9662453J04181R2584M7382p3234o914K9458O2947K800m7858L5030o0503
4122A9848326j39566j37825j38837j03229j97079k48452j38858j22336k54945
4113A8367199k68516k81815r2558k2705j54052k45056k03744j66089q4851j34861
4103A6712952j26400j79954j86510k2800p3542k02203O5406J79790l6958o8154
$$ plain form
4170 31081497 30433931 30033650 29472658 29037951 28663989 28167102 27713363 27216797 26874518
4161 26874518 26493574 26061583 25799141 25386621 25120800 24814032 24356524 23982231 23524026
4152 23524026 23420697 23158914 22826455 22691740 22308827 22013581 21709571 21362732 21158449
4143 21158449 20939077 20851582 20640264 20461031 20458886 20334096 19941727 19745745 19646549 19662453
4133 19662453 19766634 19859218 19906600 19833366 19826452 19855910 19918857 19921657 19873799 19908829 19848326
4122 19848326 19708760 19570935 19432098 19328869 19131790 18883338 18744480 18622144 18367199
4113 18367199 18098683 17816868 17724310 17701605 17547553 17302497 17098753 16932664 16847813 16712952
4103 16712952 16586552 16406598 16220088 16197288 16123746 15921543 15986949 16166739 16129781 16061627
4093A6061627J0856j45459K12523N200j40162p4686j9845J14666o0482q7854J2504
4082A5888888j15603L820L0425j55690j43970K0173j454j28282J2469j33410J8279
4071A5295645J6826j19663l7849k04080j31164m8309j15329j6449o4603r1824
4061A4483201r7407j47864q0298j22408j02185j79248j15552k31393j09012m1263
4051A3256571k26946j93144M6446p1946k06962N1336o0038j07306m7864j02698
4041A2337449j06525k5644k09851m7879K802o4295k0781j54979k80869j28445
4031A1300983m5576k2594M89j57172J185j40659j50365o5594j61178m1621p967
4020A0509931k7051m5976k68098m4840L8119j835K5985j43069M853j4553p615
$$ plain form
4093 16061627 16072483 15927024 16139547 16144747 16004585 15929899 15910054 16024720 15964238 15876384 15888888
4082 15888888 15773285 15777105 15807530 15651840 15507870 15528043 15526589 15398307 15410776 15277366 15295645
4071 15295645 15312471 15192808 15154959 14950879 14819715 14771406 14656077 14639628 14575025 14483201
4061 14483201 14385794 14237930 14157632 14035224 13933039 13753791 13638239 13406846 13297834 13256571
4051 13256571 13029625 12836481 12882927 12810981 12604019 12655355 12595317 12488011 12440147 12337449
4041 12337449 12230924 12205280 11995429 11947550 11950352 11886057 11865276 11710297 11429428 11300983
4031 11300983 11255407 11232813 11233302 11076130 11077315 10936656 10786291 10720697 10559519 10517898 10509931
4020 10509931 10482880 10436904 10168806 10123966 10162085 10160250 10186235 10043166 10048019 10033466 10025851
4009A0025851j09964m1557j52479j665k8478n2691O1544j40810j01632r3057N310
3998I370372M8232K9783j05324l9494l2554j13871j07804k0166p6732j0612j948
3987H939882q0568q3151j29768j4792q6229m9710l7489j4311L233k5088O8849
3976H490858J2754j9920K3665j4899K5581R2550L6687r2714K7212L1069Q4499
3965H697342q0505J13042Q9966k5980K7507L9706R7383R9144Q7882j9227K33043
3954I359303O149R6879J41780m3475n8994j7771J23290k1265N2808P84J4367j44374
3942I509481L5364O7333M0602K6956n4836r4201J3755K1891Q9904L2644j08983
3931I579910n9351n9607P9924J9420k1074J13606n0113m8904R7991M0222l9931
$$ plain form
4009 10025851 9915887 9874330 9721851 9720186 9691708 9639017 9700561 9559751 9458119 9365062 9370372
3998 9370372 9418604 9448387 9343063 9303569 9271015 9157144 9049340 9029174 8952442 8941830 8939882
3987 8939882 8859314 8776163 8646395 8631603 8545374 8495664 8458175 8443864 8447097 8422009 8490858
3976 8490858 8503612 8483692 8507357 8492458 8518039 8610589 8647276 8554562 8581774 8612843 8697342
3965 8697342 8616837 8729879 8819845 8793865 8821372 8861078 8958461 9057605 9145487 9126260 9359303
3954 9359303 9365452 9462331 9604111 9560636 9501642 9483871 9607161 9585896 9638704 9639488 9653855 9509481
3942 9509481 9544845 9612178 9652780 9679736 9624900 9530699 9544454 9566345 9656249 9688893 9579910
3931 9579910 9520559 9460952 9540876 9560296 9539222 9652828 9602715 9553811 9651802 9692024 9652093
3920I652093m7408J03430N4106L398J0683J05734J8673m67q771J50053J51662
3909A0193186L1829r7047m8780J75091J18146j7583K8544J02325N6269R1759Q2365
3898A0716104R5587L1119r7305R7315J10542N7004R696P9402q0055O5433K28446
3887A1313288m3467n0875J55869M1124j0580k7996L0878l482J01842Q592q8376
3876A1426817k3761J1436N6941K443M7189j4186R4064Q5674K01162J44722M7574
3865A2080075m7950N4603R5139J16801L0621O0209J15300K05502Q3278O8094J51916
3854A3013588J48339J6458J12610Q5166M3726J4324N2048K89149j611M4146R4326
3843A3912269J07951p593P9248P1354K603k2022M0162L0762J10659j01916j48597
$$ plain form
3920 9652093 9604685 9708115 9762221 9765619 9776302 9882036 9900709 9900242 9891471 10041524 10193186
3909 10193186 10225015 10127968 10079188 10254279 10372425 10354842 10383386 10485711 10541980 10633739 10716104
3898 10716104 10811691 10842810 10745505 10842820 10953362 11010366 11020062 11099464 11019409 11084842 11313288
3887 11313288 11269821 11218946 11374815 11415939 11405359 11377363 11408241 11404759 11506601 11515193 11426817
3876 11426817 11403056 11414492 11471433 11473876 11521065 11506879 11600943 11686617 11887779 12032501 12080075
3865 12080075 12032125 12086728 12181867 12298668 12329289 12389498 12504798 12710300 12793578 12861672 13013588
3854 13013588 13161927 13178385 13290995 13376161 13419887 13434211 13486259 13775408 13773797 13817943 13912269
3843 13912269 14020220 14012627 14091875 14163229 14165832 14143810 14183972 14214734 14325393 14223477 14074880
3832A4074880J37986Q9119r8841N0779n6068K6297O9151L6210Q4915P0149J29042
3821A4613619j20207L7813M1320m2593K08976P3488K2584Q5694P8474K09312K35797
3810A5444277J67306L1485R876J66579K20413K04422J49204K65660J60255K33568
3800A7053045L13014J54406J49247K72372M45686N7475J49813J89042J32695K24112
3790A9140907J75078K36416L12308L16157R1124J69746K92948L19265K21132K37538
3780B1512619K99260K77474J80558L09553L81695K48982K54754K44810K89014
3771B3998719K75021K87621K92276L17436L19349M68522K53003J58591K11933
3762B6582471K32864K48808K89996K87358K40816K88694M10660L78440J94190
$$ plain form
3832 14074880 14212866 14301985 14203144 14253923 14197855 14224152 14293303 14329513 14414428 14484577 14613619
3821 14613619 14493412 14531225 14572545 14529952 14738928 14812416 14835000 14920694 14999168 15208480 15444277
3810 15444277 15611583 15643068 15652944 15819523 16039936 16244358 16393562 16659222 16819477 17053045
3800 17053045 17366059 17520465 17669712 17942084 18387770 18445245 18595058 18784100 18916795 19140907
3790 19140907 19315985 19552401 19864709 20180866 20271990 20441736 20734684 21053949 21275081 21512619
3780 21512619 21811879 22089353 22269911 22579464 22961159 23210141 23464895 23709705 23998719
3771 23998719 24273740 24561361 24853637 25171073 25490422 25958944 26211947 26370538 26582471
3762 26582471 26815335 27064143 27354139 27641497 27882313 28171007 28581667 28960107 29154297
3753B9154297J94689L40172K95980L68041L61102L90380L15528M14179L03357
3744C2137725M06818L58515K93855M96092O05617L60981M95499O89102O40145
3735C6484349P14610O93135P72993P18491Q72741P30224Q82179R31687J113122
3726D3913531R83192J038492J121291J046287J145831J239055J203429J154958
3718E2846066J395813J175926J300068J258702J149056J284015J381397J374136
3710F3165179J399492J288629J226167J184118J339498J246742J022488J045855
3702G2918168J058978R89839Q86615R87670P67574P06218N35559O43483M99941
3693G9994045M97599M85786L35189L25708J61933J44479J14438L3596M2584j38846
$$ plain form
3753 29154297 29348986 29689158 29985138 30353179 30714281 31104661 31420189 31834368 32137725
3744 32137725 32544543 32903058 33196913 33693005 34298622 34659603 35155102 35844204 36484349
3735 36484349 37198959 37892094 38665087 39383578 40256319 40986543 41868722 42800409 43913531
3726 43913531 44896723 45935215 47056506 48102793 49248624 50487679 51691108 52846066
3718 52846066 54241879 55417805 56717873 57976575 59125631 60409646 61791043 63165179
3710 63165179 64564671 65853300 67079467 68263585 69603083 70849825 71872313 72918168
3702 72918168 73977146 74966985 75853600 76841270 77608844 78315062 78850621 79494104 79994045
3693 79994045 80491644 80977430 81312619 81638327 81800260 81944739 82059177 82092773 82135357 81996511
3683H1996511j14200q6609M0134N7294j4390j56113N1968j09712j42760L3292
3673H1555415M0902K8300p2368r52k5372q5306j94776k24314j23548j47893l15931
3662H0434157j64497m22869l55439l81906l46738l16626n04119m00718l85232
3653G7156013n46663m57246m64039m56624n75402m60981o09864p41274n32735
3644G2311185o59090o65086m80202o21671n06870n12574l74955k51791j80028
3635F8058918j81778m7037j63886J24126K09806J97234L54223M34862O13793L36848
3625F9937109L78440L45391M52827N89752M64058M44954L41554M23275L64880
3616G3742240L15052K88769K59458M22933L82566N19268M71726L44578N19730
$$ plain form
3683 81996511 81882311 81795702 81835836 81893130 81878740 81722627 81774595 81664883 81522123 81555415
3673 81555415 81596317 81624617 81552249 81551297 81525925 81440619 81245843 81021529 80897981 80750088 80434157
3662 80434157 80269660 79846791 79491352 79109446 78762708 78446082 77941963 77541245 77156013
3653 77156013 76609350 76152104 75688065 75231441 74656039 74195058 73585194 72843920 72311185
3644 72311185 71652095 70987009 70506807 69885136 69378266 68865692 68490737 68238946 68058918
3635 68058918 67877140 67830103 67666217 67790343 68000149 68197383 68551606 68986468 69600261 69937109
3625 69937109 70315549 70660940 71113767 71703519 72167577 72612531 72954085 73377360 73742240
3616 73742240 74057292 74346061 74605519 75028452 75411018 75930286 76402012 76746590 77266320
3607G7266320L87440K53026M86994M05932L20037L09976M78301K62422N02858
3598H0673306M29485M22196N12653O57780N59427O89872Q60019P51226R28509
3589H6484473Q48109J055167J248492J170030J400979J155807J378887J570319
3581I6312263J697778J797312J902758J949256J893678J964132K535098K406681
3573A12458956K352522K469973K557937K544259K522309K633928K625024K373599
3565A32538507K388728K487088K211182K083305K054131K151889J836269J652515
3557A49403614J790993J763035J541992J603204J610299J412505J382943J458677
3549A61967262J468542J517308J452579J419838J479989J403362J419718J696635
$$ plain form
3607 77266320 77653760 77906786 78393780 78799712 79119749 79429725 79908026 80170448 80673306
3598 80673306 81102791 81524987 82037640 82695420 83254847 83944719 84804738 85555964 86484473
3589 86484473 87332582 88387749 89636241 90806271 92207250 93363057 94741944 96312263
3581 96312263 98010041 99807353 101710111 103659367 105553045 107517177 110052275 112458956
3573 112458956 114811478 117281451 119839388 122383647 124905956 127539884 130164908 132538507
3565 132538507 134927235 137414323 139625505 141708810 143762941 145914830 147751099 149403614
3557 149403614 151194607 152957642 154499634 156102838 157713137 159125642 160508585 161967262
3549 161967262 163435804 164953112 166405691 167825529 169305518 170708880 172128598 173825233
3541A73825233J829527J789570J898539K205932K272816K580614K659657L126604
3533A92188492L317551L481557L625093L900202M125585M249892M420514M543831
3525B23852717M738066M963653N190153N150001N193473N344615N380143N368299
3517B65181120N319806N385829N319772N288564N021958N016658M807134M812767
3509C06153608M669768M802074M589910M757221M806578M725411M801180M796882
3501C44102632M736958M740908M475409M415776M495776M299421M317730M200652
3493C79785262M187353M238657M476666M545898M758862M732240M816944M899453
3485D16441335M594649M498721M002415L585193L155766K260376J621525R44005
$$ plain form
3541 173825233 175654760 177444330 179342869 181548801 183821617 186402231 189061888 192188492
3533 192188492 195506043 198987600 202612693 206512895 210638480 214888372 219308886 223852717
3525 223852717 228590783 233554436 238744589 243894590 249088063 254432678 259812821 265181120
3517 265181120 270500926 275886755 281206527 286495091 291517049 296533707 301340841 306153608
3509 306153608 310823376 315625450 320215360 324972581 329779159 334504570 339305750 344102632
3501 344102632 348839590 353580498 358055907 362471683 366967459 371266880 375584610 379785262
3493 379785262 383972615 388211272 392687938 397233836 401992698 406724938 411541882 416441335
3485 416441335 421035984 425534705 429537120 433122313 436278079 438538455 440159980 441103985
3477D41103985M26780k11704p94531j483174j667024k146818k688549k997510
3469D29541455l543797l992044m376155m924759n558476o036481o436377o962078
3461C87711288p228771p273294p628708p680614p606545p436775p377269p292632
3453C28186680o825659o742516o671819o230084o214613n933056n743731n595922
3445B78229280n232989n112759m746273m521392m663881m931313n115285n093963
3437B38811425m994919n063080n096060m963262m787512m830213m600983m249803
3429B00225593m012170l906203l596217l157930k871670k672807k384278k292003
3421A75332315j917552j828004j465270j315373j009059r04928n35260l70406
$$ plain form
3477 441103985 441530765 441319061 440524530 439041356 437374332 435227514 432538965 429541455
3469 429541455 425997658 422005614 417629459 412704700 407146224 401109743 394673366 387711288
3461 387711288 380482517 373209223 365580515 357899901 350293356 342856581 335479312 328186680
3453 328186680 321361021 314618505 307946686 301716602 295501989 289568933 283825202 278229280
3445 278229280 272996291 267883532 263137259 258615867 253951986 249020673 243905388 238811425
3437 238811425 233816506 228753426 223657366 218694104 213906592 209076379 204475396 200225593
3429 200225593 196213423 192307220 188711003 185553073 182681403 180008596 177624318 175332315
3421 175332315 173414763 171586759 170121489 168806116 167797057 166892129 166356869 165986463
3413A65986463J52484O54491R20246J222323Q26878K1871m78468n58730q25141
3404A67922417p40662p73325q76540p08730l62258j33271k46675q8760j9564j56679
3394A63815953J49467K9722j52452j92663l85829m29193m23152k88686j09986
3385A62013181j86059J11947K62262N51323Q42015J207587J474027J757916J650641
3376A69684840J391438J412761J476783J522130J510858J456704J715692J761989
3368A81933195J573009J694863J649452J656747J328255J156441R74642O59755
3360A92626359M14445J82872K6809k09075n06178l43495m64189n67566l16986
3351A90842996k93061k84385k92895l50118j47470K5499l1270j01517j88715l4000
$$ plain form
3413 165986463 166138947 166793438 167713684 168936007 169762885 169784756 169306288 168747558 167922417
3404 167922417 167181755 166408430 165531890 164823160 164460902 164327631 164080956 163992196 163972632 163815953
3394 163815953 163965420 163995142 163842690 163650027 163264198 162835005 162411853 162123167 162013181
3385 162013181 161827122 161939069 162201331 162752654 163594669 164802256 166276283 168034199 169684840
3376 169684840 171076278 172489039 173965822 175487952 176998810 178455514 180171206 181933195
3368 181933195 183506204 185201067 186850519 188507266 189835521 190991962 191966604 192626359
3360 192626359 193040804 193223676 193250485 193041410 192535232 192191737 191727548 191159982 190842996
3351 190842996 190549935 190265550 189972655 189622537 189475067 189500566 189469296 189367779 189179064 189145064
3341A89145064r6539k51283m57730l57816n80197o02128m76720m71701n54228
3332A85296722m64093m42789j90033j18414p5130K30238J45285M48214N22751
3323A85352751N79458L54435J69162L83869K52788J655k27805l05380n96855q53744
3313A85110334j150283j245575j250791j422658j460899j722492j810665j692023
3305A73354948j843303k041829k107432k148580k160584k210762k556413k719359
3297A55566686k614641k709702k865633k950047l035720l064677k956381l002376
3289A32367509l017267l041245l087830k773830k841224k622684k596035k577914
3281A09809480k554685k438086k549468k360794k066427k218322k029051k001530
$$ plain form
3341 189145064 189048525 188797242 188339512 187981696 187401499 186799371 186322651 185850950 185296722
3332 185296722 184832629 184389840 184199807 184081393 184006263 184236501 184381786 184830000 185352751
3323 185352751 185932209 186286644 186455806 186839675 187092463 187094118 186866313 186560933 185964078 185110334
3313 185110334 183960051 182714476 181463685 180041027 178580128 176857636 175046971 173354948
3305 173354948 171511645 169469816 167362384 165213804 163053220 160842458 158286045 155566686
3297 155566686 152952045 150242343 147376710 144426663 141390943 138326266 135369885 132367509
3289 132367509 129350242 126308997 123221167 120447337 117606113 114983429 112387394 109809480
3281 109809480 107254795 104816709 102267241 99906447 97840020 95621698 93592647 91591117
3273I1591117j873829j854982j726458j736897j568214j453494j469738j219567
3265G8687938j141278j092485j049061q57907p35216n91578n27701o16373n91859
3256G1484480n98043n36916o50136n49793o95872o66627p61422p16258n79400
3247F5730013o57505r20597r20308q90452r70808p59554q46652j103699r36242
3238E7724196r94940j020898p99418p63641p02617o10373q06786p67445o34140
3229E0623938o04277n71323n78659o04056n42484n02147m19894n20790n81192
3220D5699116n88712n34827l19035l99579k98314m37889k76280l27528l33269
3211D2183683l02503j98305r8743j47013j35374K915k5908O0021l9474J16024
$$ plain form
3273 91591117 89717288 87862306 86135848 84398951 82830737 81377243 79907505 78687938
3265 78687938 77546660 76454175 75405114 74547207 73811991 73220413 72692712 72076339 71484480
3256 71484480 70886437 70349521 69699385 69149592 68453720 67787093 67025671 66309413 65730013
3247 65730013 65072508 64151911 63231603 62341151 61370343 60610789 59764137 58660438 57724196
3238 57724196 56729256 55708358 54908940 54145299 53442682 52832309 52025523 51258078 50623938
3229 50623938 50019661 49448338 48869679 48265623 47723139 47220992 46801098 46280308 45699116
3220 45699116 45110404 44575577 44256542 43856963 43558649 43120760 42844480 42516952 42183683
3211 42183683 41881180 41682875 41584132 41437119 41301745 41304660 41278752 41338773 41299299 41415323
3201D1415323K08338K34354K08183K87068M68938K64271L48823M38776L14150
3192D4188224M36301L78261K69420L67808L44844M18304L96785M84813M65169
3183D7749929O64382O18468M99781O40685N02024N37646N52574M22156N31011
3174E2718656M07864N20582O63135P71924Q09119O58905P98003Q78098P22042
3165E8948328Q77158J057519J035224J168239J088116J163390J269868J148943
3157F7756785J345937J382422J280379J186298J525532J442551J638582J871346
3149G9429832J957254J948938K189736K275841K364954K468207K594997K722146
3141I7951905K911832L070848L371464L576104L908721M072842M355699M905178
$$ plain form
3201 41415323 41623661 41858015 42066198 42353266 42822204 43086475 43435298 43874074 44188224
3192 44188224 44624525 45002786 45272206 45640014 45984858 46403162 46799947 47284760 47749929
3183 47749929 48414311 49032779 49532560 50173245 50675269 51212915 51765489 52187645 52718656
3174 52718656 53126520 53647102 54310237 55082161 55891280 56550185 57348188 58226286 58948328
3165 58948328 59825486 60883005 61918229 63086468 64174584 65337974 66607842 67756785
3157 67756785 69102722 70485144 71765523 72951821 74477353 75919904 77558486 79429832
3149 79429832 81387086 83336024 85525760 87801601 90166555 92634762 95229759 97951905
3141 97951905 100863737 103934585 107306049 110882153 114790874 118863716 123219415 128124593
3133A28124593N082370N465171N637195O053558O359042O591717P005762P506587
3125A77825995P721736Q035940Q741974R268995R673216J0298733J0724092J1408480
3117B53699161J2047869J2713977J3058340J3293663J3477744J3326424J2679289
3110C44296467J2223485J1795193J0936650J0231522R611078R071331Q652718
3103D16818444Q370750Q389367Q443292Q938296R451567J0113490J0862949J1713532
3095D93101687J2091823J2021998J1746936J1625409J1393197J1073023J0319175
3088E73373248Q327291N517624K137310j855180n658985q923058j1563027j3571034
3080E47784189j4638584j5246533j5241252j4613362j3676872j2319870j1498093
$$ plain form
3133 128124593 133206963 138672134 144309329 150362887 156721929 163313646 170319408 177825995
3125 177825995 185547731 193583671 202325645 211594640 221267856 231566589 242290681 253699161
3117 253699161 265747030 278461007 291519347 304813010 318290754 331617178 344296467
3110 344296467 356519952 368315145 379251795 389483317 399094395 408165726 416818444
3103 416818444 425189194 433578561 442021853 450960149 460411716 470525206 481388155 493101687
3095 493101687 505193510 517215508 528962444 540587853 551981050 563054073 573373248
3088 573373248 581700539 587218163 589355473 587500293 581841308 572918250 561355223 547784189
3080 547784189 533145605 517899072 502657820 488044458 474367586 462047716 450549623
3073D50549623j0747789r915525r669495r830882j0075377j0608123j1170086
3066C78532346j1453888j1786706j1975149j1661355j1183671j0779143r841729
3059B99850705q594464p637479o852068o323924o000165o567889p494697q422851
3051B41957168q976535r431992r556381r669766r694655r438839q925332q388512
3043A67875156p785725p446728o772908o383645o124438n569312n078611m897864
3035A17815925m662884m378995m038584l833942l594604l365203l362668l229792
3027H7349253k878993k649572k787983k429513k267064k151659k216433k047360
3019F7920676j901534j825412j740162j762874j659743j371209j520589j517316
$$ plain form
3073 450549623 439801834 429886309 420216814 410385932 400310555 389702432 378532346
3066 378532346 367078458 355291752 343316603 331655248 320471577 309692434 299850705
3059 299850705 291256241 283618762 276766694 270442770 264442605 257874716 250380019 241957168
3051 241957168 232980633 223548641 213992260 204322494 194627839 185189000 176263668 167875156
3043 167875156 160089431 152642703 145869795 139486150 133361712 127792400 122713789 117815925
3035 117815925 113153041 108774046 104735462 100901520 97306916 93941713 90579045 87349253
3027 87349253 84470260 81820688 79032705 76603192 74336128 72184469 69968036 67920676
3019 67920676 66019142 64193730 62453568 60690694 59030951 57659742 56139153 54621837
3011E4621837j313183j266440j244336j164941j140465j126088j024106r62389
3003D5379889j139072j127081r62735r11265q70146r11399p31265q85545q42128
2994C6999253p19060q87069o02404n29017m36011n79573o88680m46937n11805
2985C1598697n03177l93659n32759m84030n63328n59823m33139n53314n03566
2976B7071902n01390m71660m34310k74370n38410m57794m04230m53352k76115
2967B3260271m04787l76733j71217j96674l94321k96908j62240k84036m07692
2958B0565663l08716m12234k17165m16327m73674l63924l06596k59904n03897
2949A7303226m49396l41847k23713l25613l25224l79027l37622l16303j53441
$$ plain form
3011 54621837 53308654 52042214 50797878 49632937 48492472 47366384 46342278 45379889
3003 45379889 44240817 43113736 42151001 41239736 40369590 39458191 38726926 37841381 36999253
2994 36999253 36280193 35393124 34790720 34261703 33825692 33246119 32557439 32110502 31598697
2985 31598697 31095520 30701861 30169102 29685072 29121744 28561921 28128782 27575468 27071902
2976 27071902 26570512 26098852 25664542 25390172 24851762 24393968 23989738 23536386 23260271
2967 23260271 22855484 22478751 22307534 22110860 21716539 21419631 21257391 20973355 20565663
2958 20565663 20256947 19844713 19627548 19211221 18737547 18373623 18067027 17807123 17303226
2949 17303226 16853830 16511983 16288270 15962657 15637433 15258406 14920784 14604481 14451040
2940A4451040P675j57803l61755j85655k38600l90341l54201j07457k62500k56867
2930A2143536j30617j34585r6296k73929k6850j90113k15559k05343k01660j52768
2920A0515816j66242j33252j62711p8304j88743k08847j9670r5316q3226q4723
2910I294782p0489l9171j41188J9183r6365j39371k04478m0943j82104p8234p8572
2899H243050n8748j95092j9562m5180p6532k3284R1962j54180j18340K6260j42924
2888G527430n4311k0923L9379j36757n4116j2653q2848j95941j8713l882k949
2877F983716O8700m8390j20431L9378M1101J559q6824q4429O4164m4335l7940
2866F776269j9662j86964J62162j4382j9013J9584q6818j26642k166M1782R1674
$$ plain form
2940 14451040 14458715 14300912 13939157 13753502 13514902 13124561 12770360 12662903 12400403 12143536
2930 12143536 12012919 11878334 11782038 11508109 11481259 11291146 11075587 10870244 10668584 10515816
2920 10515816 10349574 10216322 10053611 9975307 9786564 9577717 9558047 9462731 9379505 9294782
2910 9294782 9224293 9185122 9043934 9063117 8966752 8827381 8622903 8581960 8399856 8321622 8243050
2899 8243050 8184302 7989210 7969648 7924468 7847936 7824652 7916614 7762434 7644094 7670354 7527430
2888 7527430 7473119 7452196 7491575 7354818 7300702 7288049 7205201 7009260 6990547 6986665 6983716
2877 6983716 7052416 7004026 6883595 6922973 6964074 6965633 6878809 6794380 6858544 6814209 6776269
2866 6776269 6756607 6569643 6731805 6717423 6698410 6717994 6631176 6504534 6502368 6544150 6635824
2855F635824K2183L0957J8468J38156L4473j01731n8193O6541q6279J2425p3810
2844F639014l7221J4172l5070n4370o3087j3173Q342j60593N7378K07059J8365
2833F580816l0540Q3233R4670J5595O6988k4744o6156m4752J26837o3344k9761
2822F708842l2957m7268M2671Q6317Q1755J884J8334L131J1738l0436j40191O7316
2810F771136q9860k1492J4058K9278m0294j49643k3187k3927r3932q523j64492
2799F199122o2190o2075j94143j35756j80260m5903j30842j88205O7336p5306
2789E191778o9726j89191L0600k06289j05407J7321l19911q4898J01924K9005
2779D395206k13390j63775j68852j3295j69405J90649m8829k0364j11354k01786
$$ plain form
2855 6635824 6658007 6688964 6707432 6845588 6880061 6778330 6720137 6786678 6700399 6712824 6639014
2844 6639014 6601793 6615965 6580895 6526525 6463438 6450265 6458607 6298014 6355392 6562451 6580816
2833 6580816 6550276 6633509 6728179 6743774 6810762 6786018 6719862 6675110 6801947 6738603 6708842
2822 6708842 6675885 6628617 6671288 6757605 6839360 6841244 6859578 6862709 6874447 6844011 6703820 6771136
2810 6771136 6681276 6659784 6673842 6703120 6662826 6513183 6489996 6466069 6372137 6363614 6199122
2799 6199122 6136932 6074857 5880714 5744958 5564698 5518795 5387953 5199748 5267084 5191778
2789 5191778 5122052 4932861 4963461 4757172 4651765 4669086 4349175 4264277 4366201 4395206
2779 4395206 4181816 4018041 3849189 3835894 3666489 3857138 3808309 3787945 3676591 3474805
2769C474805j7388j07202P3277j99284j52547p8019r044n1834j38328q6085j37001
2758B571350O7163q9304j35966p5552k0290p41j28411R988l1434q6582j5449N4402
2746B119174M6879m1749m8746r6363j28284O4233Q5053j3334n9425j91976p0077
2735A665385K04923k05544j18674O0928L0973K0118l6457m8181l1383R26J3985
2724A556999j3338J9452j13684K218l3407O7246j9761k499K5820j02002k6228
2713A360816j04896r4614J15938P5863j5259M2772j15980J29048j2688j9024l3311
2702A328665j34841o2087k164J37899M232m9749o8527N9451k3278L1793k0200
2691A201194q5992l6580m0316O0915j42410r2368J18548J5412j25191J28628o8577
$$ plain form
2769 3474805 3457417 3350215 3423492 3224208 3071661 2993642 2984598 2932764 2794436 2708351 2571350
2758 2571350 2638513 2549209 2413243 2337691 2317401 2316660 2188249 2198237 2166803 2080221 2064772 2119174
2746 2119174 2166053 2124304 2075558 1979195 1850911 1915144 2000197 1986863 1927438 1735462 1665385
2735 1665385 1870308 1664764 1546090 1607018 1637991 1658109 1621652 1573471 1542088 1543014 1556999
2724 1556999 1543661 1563113 1449429 1451647 1418240 1485486 1465725 1463226 1489046 1387044 1360816
2713 1360816 1255920 1161306 1277244 1353107 1337848 1380620 1264640 1393688 1381000 1361976 1328665
2702 1328665 1193824 1131737 1129573 1267472 1271704 1221955 1153428 1212879 1189601 1221394 1201194
2691 1201194 1115202 1078622 1038306 1099221 956811 864443 982991 998403 873212 1001840 933263
2680I33263k2740O7182m2773n8484K3028O9489n5447j48488K4162M1448o8965
2669G61675L7876p9637J0312J4730o0802L2599K3279j24652J2789k1388O8157
2658F74938n9657j13101j4255J38325j7539q5666M7527p6604J44421j910l2565
2647F03914q568p2856j00425o4425K1465O4111o4689J84040l3455j31592r2120
2636C05400L2469l2762N7483J26657J041n729Q5850l6914j37126R6938j21419
2625C71888j43365J79100L6639J0964J26540J06323p5215j31119m2779k018J2499
2614D49457m4802k7998r349l1891q647l1569j91915n218N7735K7696n6001o8357
2602E9141K0958m531P5250N6447n3194q540o0221m1328J77222L8528L6910j21542
$$ plain form
2680 933263 910523 977705 934932 876448 899476 968965 913518 765030 789192 830640 761675
2669 761675 799551 719914 730226 744956 684154 716753 740032 615380 628169 606781 674938
2658 674938 615281 502180 487925 626250 608711 523045 570572 493968 638389 636479 603914
2647 603914 595346 522490 422065 357640 379105 443216 378527 562567 529112 397520 305400
2636 305400 337869 305107 362590 489247 490288 484559 570409 533495 396369 493307 371888
2625 371888 228523 407623 444262 455226 581766 688089 612874 481755 438976 436958 449457
2614 449457 404655 376657 367308 335417 326770 295201 103286 98068 155803 183499 127498 59141
2602 59141 80099 75568 150818 207265 154071 145531 85310 43982 221204 259732 296642 175100
2590A75100r0663o6719o0847k822J10575M8434o5236n1945j0502L3471Q4087P5773
2578A78706m8340J344K3044o6541L1641j1933j42012K975P2210J02156q2125j5949
2566D5176l5744M4274j14592N1887j2237J290j671M3309l8039R3775j0246l7523
2554B9659m601q2101j24545P1090K48610J6097j29887j9977j80101L3877J19907
2543b1972p025j08937J04051M5776M9759L3183Q833j05000k0296N8383k15057
2532a78302K29959p1392j5392l703M1618O5530l1146j36765J04931P4725j14443
2521c4380K3164L5281m551m5432l5741J1407j30168J35645K10740j51552j07740
2510i3327J5071J3495j28966K140R9021j05096l3545O3209K4371L1813j5816Q3925
$$ plain form
2590 175100 84437 17718 -43129 -45951 64624 113058 47822 -4123 -14625 18846 102933 178706
2578 178706 130366 131710 154754 88213 119854 107921 -34091 -31116 41094 143250 61125 45176
2566 45176 9432 53706 -60886 -8999 -21236 -19946 -21617 21692 -16347 77428 67182 29659
2554 29659 25058 -57043 -181588 -110498 138112 154209 24322 4345 -175756 -141879 -21972
2543 -21972 -28997 -137934 -33883 11893 61652 94835 103668 -1332 -21628 36755 -178302
2532 -178302 51657 -19735 -35127 -38830 2788 68318 37172 -99593 5338 80063 -34380
2521 -34380 -11216 24065 19514 -25918 -61659 -50252 -180420 -44775 165965 14413 -93327
2510 -93327 -78256 -64761 -193727 -191587 -92566 -197662 -231207 -167998 -143627 -111814 -127630 -43705
2498d3705o198Q201J35055j34552N6164J567r1374n4237L2774J39871p624n9043
2486b3101r2939j48642j9732J39704L9064r961M2921O611M0597K6403q3806j18172
2474b01053J64856J0469N6909k2607p0341J3149N0816P4880q280K758p5611J37485
2462A33430r0985K7170J2351J4790m2868n5174Q8687L1903q0782M3194Q8320j2156
2450A57880j56711M9762P2413O460k5288j48773Q6113k1723N3053K5466Q1030
2439A79682o3275N9984n2767n9372J62355m4533q9092k9094L9819J63220O9168
2428C36095k0357j91261K506J2468M6583J36410L4653l5286l2867l7680K093P3148
2416C26505j5822P3439k6134L7560O3134J46598j08965J59579N6792p6789M9814
$$ plain form
2498 -43705 -49903 -41702 93353 -41199 14965 16532 -74842 -129079 -96305 43566 35942 -23101
2486 -23101 -116040 -264682 -284414 -144710 -105646 -115607 -72686 -66075 -25478 925 -82881 -201053
2474 -201053 -36197 -25728 31181 8574 -61767 -48618 2198 77078 68798 71556 -4055 133430
2462 133430 42445 69615 81966 96756 53888 -1286 87401 119304 38522 81716 170036 157880
2450 157880 1169 50931 123344 129804 104516 -44257 41856 20133 73186 98652 179682
2439 179682 116407 176391 123624 64252 226607 182074 92982 63888 103707 266927 336095
2428 336095 315738 124477 126983 139451 186034 322444 357097 321811 288944 251264 253357 326505
2416 326505 310683 384122 357988 395548 458682 605280 496315 655894 712686 635897 685711
2405F85711J15674J74144p9767J3253J67567k4204Q8605J35052J64416J06832
2395A547283j4784K08419J63217J69487J16081J5640L37642K67202J83294J75092
2385C168573K08579J99559J92756L23185N41908O35446N69934O70255O29377Q90688
2375H030260Q49789Q07706Q23857Q70317R11076J361534J603399J660344K032349
2366A8950631K788150L867142M596901M826722M374838K447448j82178j608738
2358D0060916k048527k224876k380630k918874l355246l067601k603266k491556
2350A8970340k044461j420079j278480j027936q67936q72416o89963q49227p00072
2341I219770o49492o57700m38946n24325m60755n68569l87469k18780m42645m21064
$$ plain form
2405 685711 801385 975529 895762 909015 1076582 1052378 1140983 1276035 1440451 1547283
2395 1547283 1532499 1740918 1904135 2073622 2189703 2205343 2542985 2810187 2993481 3168573
2385 3168573 3377152 3576711 3769467 4092652 4634560 5270006 5839940 6510195 7139572 8030260
2375 8030260 8880049 9687755 10511612 11381929 12293005 13654539 15257938 16918282 18950631
2366 18950631 21738781 25605923 30202824 35029546 39404384 41851832 41669654 40060916
2358 40060916 38012389 35787513 33406883 30488009 27132763 24065162 21461896 18970340
2350 18970340 16925879 15505800 14227320 13199384 12331448 11459032 10769069 9919842 9219770
2341 9219770 8570278 7912578 7473632 6949307 6488552 5919983 5532514 5313734 4871089 4450025
2331D450025l62072k85853j64319p6884k32925k92060j49073j33246r3943j18599
2321B541051j76742r2349j27327p9505l3333j36290m861k39383o6474M1982j53479
2310A473290r5502m8356k41687L9030P7341j52556m5463j31487J5592k9126K2767
2299H83843r8825J585K9865q6343m5719J1300k3866J5566j18642j59742J15500
2288E24522l918j06910k6825n5515J32153k517k13233o1498J02642J48307j58254
2277B78954n8730p7047L0780l0670J6476k3820k05200Q6458J26777j11475J56683
2266A89186k6793n6927J9282j15951l9003N0872o1789K3979J4681j31015J85245
2255E1767J42767j41443j03036M3909n3884n6459J15331p2090j06152J46378J12413
$$ plain form
2331 4450025 4087953 3802100 3637781 3560897 3327972 3035912 2886839 2753593 2659650 2541051
2321 2541051 2364309 2271960 2144633 2065128 2031795 1895505 1890644 1651261 1584787 1626769 1473290
2310 1473290 1377788 1329432 1087745 1126775 1204116 1051560 1006097 874610 890202 861076 883843
2299 883843 785018 786603 816468 730125 684406 695706 671840 687406 568764 409022 524522
2288 524522 520604 413694 386869 331354 463507 460990 247757 186259 288901 437208 278954
2277 278954 220224 143177 173957 143287 159763 135943 -69257 17201 143978 32503 189186
2266 189186 162393 105466 124748 8797 -30206 20666 -41123 -17144 -2463 -133478 51767
2255 51767 194534 53091 -49945 -6036 -59920 -116379 -1048 -73138 -179290 -32912 79501
2244G9501n3842p795k5842l2394R6760L9461q5830n0216M1266j5104J2873Q0536
2232G9374j04398k3783o6450j43343P0484O9210O0934o2205p5873K5361J1633
2221a59056k9309M7361j5596o8986p5465M5683J1296Q3679Q4678k0440j4314J61955
2209E1486r8629q6330N048J35769n24j41369N535J5905j19873j0431o4257q9290
2197c96960O4576J56619o1866O246k9599K4164J1206R0691L1529n9956l4032j17547
2185c14929m3085r0641J83905n885N3746J83406p3541p9464K9365l2158O7862
2174a21419m9738M0539j05142k1114n5364k9977J16145m7661j337N603P9238j27937
2162c18164p7997K1358N1706O2046j80938P7220J73370n823j04051j02032R8614
$$ plain form
2244 79501 25659 17864 -7978 -40372 56388 95849 10019 -40197 1069 -14035 -1162 79374
2232 79374 -25024 -48807 -115257 -258600 -188116 -118906 -57972 -120177 -196050 -170689 -159056
2221 -159056 -188365 -141004 -156600 -225586 -301051 -255368 -244072 -160393 -75715 -96155 -110469 51486
2209 51486 -47143 -133473 -128425 7344 6820 -134549 -129014 -113109 -232982 -243413 -307670 -396960
2197 -396960 -332384 -175765 -237631 -231385 -260984 -236820 -225614 -134923 -103394 -163350 -197382 -314929
2185 -314929 -358014 -448655 -264750 -270635 -216889 -33483 -107024 -186488 -157123 -189281 -121419
2174 -121419 -171157 -130618 -235760 -256874 -312238 -342215 -226070 -273731 -275068 -269465 -190227 -318164
2162 -318164 -396161 -374803 -323097 -261051 -441989 -364769 -191399 -197222 -301273 -403305 -304691
2151c04691R8092j55121j31031O1435O731p8038J26378J48748o3762J9797K7910
2140b43552l7728o1507k059J59559L5959j38456m3036J59571o1057N4511O075
2129a71720j15916r5967J45575J08437n8570j12485J88913M2801j36662Q3155
2119a22439O6697j36939q1715k6979N6354K5217J5828L6534j42290J21492J884
2108a86356J5011L5894j21154M3114M6099K2688Q083P4299M6778m2320o3557o7133
2096a88554J11792K2958n4891M7192O4666n7399R3344l7021J4831m0040n7979
2085h1101q9443j3845k6996K4828o0228k5012J71238J0564l4598j01904K3236
2074b03261l2155m7134N0548M1653J34842n2284r8810o9707J05150j6949p8375
$$ plain form
2151 -304691 -206599 -361720 -492751 -431316 -424585 -502623 -376245 -227497 -291259 -271462 -243552
2140 -243552 -281280 -342787 -344846 -185287 -149328 -287784 -330820 -171249 -232306 -177795 -171720
2129 -171720 -287636 -383603 -238028 -129591 -188161 -300646 -111733 -68932 -205594 -122439
2119 -122439 -55742 -192681 -274396 -301375 -245021 -219804 -203976 -167442 -309732 -188240 -186356
2108 -186356 -171345 -135451 -256605 -213491 -167392 -144704 -136621 -62322 -15544 -57864 -121421 -188554
2096 -188554 -76762 -53804 -108695 -61503 3163 -54236 39108 2087 16918 -23122 -81101
2085 -81101 -170544 -184389 -211385 -186557 -246785 -271797 -100559 -89995 -124593 -226497 -203261
2074 -203261 -235416 -282550 -232002 -190349 -55507 -107791 -206601 -276308 -171158 -188107 -266482
2063b66482J09780J6115m651j81666j45860J50235j7258K7368o3437J38161K2783
2052b14912q6397M1785p3196O3803K4057K9050K1545j08415q9938N0709M999J38261
2040a98649o9198j8493l5075K4240P4506L1882j53290J4032J13603p1831P2550
2029b15723M0606J7015p4978q5275J41970J2792l0722r5032j6678q168j15663
2018d29856O8066q1350j0778J61005J8143J2999P4572p1683R6396m8550m063O5834
2006a49265j95485O1312J50053n6231j1283R192o3778k7514R6603j8486n5518
1995b60400q3244K2030M3563J2408K4532p4378N645j06849L7879J24375J23016
1984a31423L4494r9575j14661J29321j11539j48061p0722Q912N0873n313O4329
$$ plain form
2063 -266482 -156702 -140587 -145238 -326904 -472764 -322529 -339787 -312419 -375856 -237695 -214912
2052 -214912 -301309 -259524 -332720 -268917 -244860 -215810 -194265 -302680 -392618 -341909 -336910 -198649
2040 -198649 -267847 -286340 -321415 -297175 -222669 -190787 -344077 -330045 -216442 -288273 -215723
2029 -215723 -175117 -158102 -233080 -318355 -176385 -163593 -194315 -289347 -306025 -314193 -429856
2018 -429856 -361790 -443140 -453918 -292913 -274770 -261771 -187199 -258882 -162486 -211036 -215099 -149265
2006 -149265 -344750 -283438 -133385 -189616 -200899 -191707 -255485 -282999 -186396 -204882 -260400
1995 -260400 -343644 -321614 -278051 -265643 -241111 -315489 -309844 -416693 -378814 -254439 -131423
1984 -131423 -96929 -196504 -311165 -181844 -293383 -441444 -512166 -503254 -452381 -457694 -393365
1973c93365N9952Q5888L3894o5314L007p7433J22620M9646M9246n0581m903L0561
1961a56782m8062j2578l8478Q9943j68089O0099O4809n3646P2725k7109j15163
1950c32331R7591j2028K1178j69294R0567m1057P7726J5838N6764K1429n8566
1939b32183N1860k9491j4924q3906M9511N216j25884L4264n1689O11L1829J52161
1927b12625j12747J2003J47002p3995k5401O531K4734p0508J3041R4035P5066
1916a22864p9159N5193o0201K3851k2633J5959J04988k223j71399j02812O8456
1905b92844m4136P1901J4124j03760K57465p2483q4307p9681R2332J40644J16653
1894A5908k08062q4882j8386l4521O0933O3352j00437J1272R2622o3443j8167
$$ plain form
1973 -393365 -333413 -247525 -213631 -278945 -275938 -353371 -230751 -181105 -131859 -182440 -187343 -156782
1961 -156782 -204844 -217422 -255900 -165957 -334046 -273947 -209138 -262784 -190059 -217168 -332331
1950 -332331 -234740 -246768 -225590 -394884 -304317 -345374 -267648 -251810 -195046 -173617 -232183
1939 -232183 -180323 -209814 -224738 -308644 -259133 -253917 -379801 -345537 -397226 -396615 -364786 -212625
1927 -212625 -325372 -313369 -166367 -240362 -265763 -259232 -234498 -305006 -291965 -197930 -122864
1916 -122864 -202023 -146830 -207031 -183180 -205813 -189854 -84866 -87089 -258488 -361300 -292844
1905 -292844 -336980 -265079 -250955 -354715 -97250 -169733 -254040 -333721 -241389 -100745 15908
1894 15908 -192154 -277036 -295422 -329943 -269010 -205658 -306095 -294823 -202201 -265644 -283811
1883b83811o300m414j7068k2058P9480N6471N356J8240m6567k3680K7642O1215
1871a55494M112l0580k4400N544j33294N7602l8090R5965K6765k5433m8943n0553
1859c16799o4897O2316N9673k7240o1328l8923Q6361J4210J9131J6115N7244m2244
1847b36381n8372p8445Q3525m396r9745J38634j20866J61643M8330k5253p9519
1836b70845n8954J13204p3896l257R837J06343p9615r4535N7382R3851n5303J6807
1824b38981N9908r7492m8737J21553O3344p4616o1404O1462M2318j26148m0529
1813c39322M3671J17156q9831P0099Q2914j16036m6557M5469k7778R9033Q1792
1802g9390m4264k6515q7094j19011k357L1036M4706K5184M8780J30714K3906j355
$$ plain form
1883 -283811 -290111 -294525 -311593 -333651 -254171 -197700 -192344 -174104 -220671 -244351 -216709 -155494
1871 -155494 -151382 -181962 -206362 -200818 -334112 -276510 -314600 -218635 -191870 -217303 -266246 -316799
1859 -316799 -381696 -319380 -259707 -286947 -348275 -387198 -300837 -286627 -267496 -251381 -194137 -236381
1847 -236381 -294753 -373198 -289673 -294069 -393814 -255180 -376046 -214403 -166073 -191326 -270845
1836 -270845 -329799 -216595 -290491 -293748 -283911 -177568 -257183 -351718 -294336 -200485 -255788 -238981
1824 -238981 -179073 -276565 -325302 -203749 -140405 -215021 -276425 -214963 -172645 -298793 -339322
1813 -339322 -295651 -178495 -268326 -198227 -115313 -231349 -277906 -232437 -260215 -161182 -79390
1802 -79390 -123654 -150169 -237263 -356274 -358631 -327595 -282889 -257705 -208925 -78211 -54305 -55660
1790e5660r8727p2788j7807P4238N6854l4554k7381O9648r2709m7600o4169M8100
1778b62555q455K8247J1239N4594J4803j2280l0275K3675K6812o4178N1039r0302
1766b57636O8547p5643m6045N8697j20556N3516j48480M1788R0218k7202K9681
1755c33115L9754O0423M6714k0807L8031m9132q6058R7684P2280O2932p7965p6204
1743b25463k1829J10904j1105k6190k7800J49906J48254M5059k34721j6726k5781
1732a35492J32198k5447J8233l1444n2946j63234n3815m270o7787K17559J16533
1721d9912j46862m9914J5962r9578k7315P3644J30316j51650P3366j15335O4391
1710b82887K04368j0299j37051J2157O3247R1177J26914q2039l4417n3180Q3734
$$ plain form
1790 -55660 -154387 -227175 -244982 -170744 -113890 -148444 -175825 -106177 -198886 -246486 -310655 -262555
1778 -262555 -271010 -242763 -231524 -176930 -162127 -174407 -204682 -181007 -154195 -218373 -167334 -257636
1766 -257636 -189089 -264732 -310777 -252080 -372636 -319120 -467600 -425812 -335594 -362796 -333115
1755 -333115 -293361 -232938 -186224 -207031 -169000 -218132 -304190 -206506 -134226 -71294 -149259 -225463
1743 -225463 -247292 -136388 -147493 -173683 -201483 -51577 96677 141736 -92985 -109711 -135492
1732 -135492 -3294 -28741 -10508 -41952 -94898 -258132 -311947 -316217 -384004 -166445 -49912
1721 -49912 -196774 -246688 -230726 -330304 -357619 -283975 -153659 -305309 -231943 -347278 -282887
1710 -282887 -78519 -88818 -225869 -213712 -150465 -59288 67626 -14413 -48830 -102010 -18276
1699a8276o468M7724m9752q1388J46127l6328j46442r091N9125J9741r569l8702
1687a23299K2231l7531p4493o3081J88845j2870j31059n7290P8524p8854Q4997
1676b03880J7753k0378N9947J71967q3344n2903j40388j28004J56781J45724j37802
1665b14527O4156N1006j35024o9863R694J47643J3540J3278k8057l1223L2436
1654a46941Q6193j2580j01959J3070J4453o3619R8018L9379K659j9426k5985m4994
1642a61732L8559K7231m9951n5578P714M9220n8453J46914Q8259q2331m7758J6839
1630h1067l044m5932l7503o5471Q731M2164J91473J5515p8644O605L8559J01105
1618I2491r0290m5047j3038l1653K6722j62580k0184j3777P2143O2598J6908q1929
$$ plain form
1699 -18276 -24744 22980 -26772 -108160 37967 1639 -144803 -153894 -94769 -75028 -84597 -123299
1687 -123299 -101068 -138599 -213092 -276173 -87328 -100198 -231257 -288547 -210023 -288877 -203880
1676 -203880 -186127 -206505 -146558 25409 -57935 -110838 -251226 -379230 -222449 -76725 -214527
1665 -214527 -150371 -99365 -234389 -304252 -294558 -146915 -133375 -120097 -148154 -179377 -146941
1654 -146941 -60748 -73328 -175287 -162217 -147764 -211383 -113365 -73986 -71327 -90753 -116738 -161732
1642 -161732 -123173 -95942 -145893 -201471 -193757 -144537 -202990 -56076 32183 -50148 -97906 -81067
1630 -81067 -84111 -130043 -167546 -233017 -224286 -182122 9351 24866 -53778 -47173 -8614 92491
1618 92491 2201 -42846 -55884 -87537 -60815 -223395 -243579 -257356 -185213 -122615 -105707 -187636
1606a87636Q1756m5167q3726J47790J66337j36263M5264n2359q9348k99K89M3400
1594a09962J4914p7627R6038K11048j37151m1433J36290m3596q6274l1525J77837
1583A08559j69283q4982K7301m7518M6426Q8707j29335K0353J91159j12047n5288
1572a15948N0772K6593j3786l7655L4795O730r4160K5320L4698j07617r2053J16524
1560a65787J05929L9122r4559n0287Q122O0371J7050j3894p6155j15270l612J39502
1548a49468R9196P9141o7139O0974O3190j13463q5026J99337J24214j92718j36120
1537a17882L4240j2799j4835J7733J59063r4282j4458m9574l5464m009m8688J74457
1525f498m1932m2583L5746n1527o4711K8905m5062J7639O0075j29711K13997O0800
$$ plain form
1606 -187636 -105880 -151047 -234773 -86983 79354 -56909 -11645 -64004 -153352 -153651 -153362 -109962
1594 -109962 -95048 -172675 -76637 134411 -2740 -44173 92117 48521 -37753 -69278 108559
1583 108559 -60724 -145706 -118405 -165923 -119497 -30790 -160125 -139772 51387 -60660 -115948
1572 -115948 -65176 -38583 -52369 -90024 -55229 -48499 -142659 -117339 -82641 -190258 -282311 -165787
1560 -165787 -59858 -20736 -115295 -165582 -157460 -97089 -80039 -93933 -170088 -285358 -288970 -149468
1548 -149468 -50272 28869 -38270 22704 85894 -27569 -112595 86742 210956 18238 -117882
1537 -117882 -83642 -96441 -111276 -93543 65520 -28762 -43220 -92794 -128258 -132267 -180955 -6498
1525 -6498 -48430 -91013 -55267 -106794 -171505 -142600 -187662 -170023 -109948 -239659 -25662 35138
1513C5138l8243j63512n135R6535J3505k5024M2768n7425p5182P1681n7821m77
1501a63192q1398m6213J07355J1937m055K5741J0922m8456j5403K4362n0516Q8578
1489a40338J5941k4151N414m796m4O0474K5182n2448L0492R1822o359k9061j05963
1476a33835J147R4922k555l8453O1687l9306j30007Q6341J00486j1334o4630P0454
1464e083q0160K5884L646j9839J02550r0043r1235p2409Q3514M1755K2301j2324
1452i1443k9639n0289j0323K939J20132N626k2414J11970j03534n5616J20371
1441b220M6758k0015k7341j67958p3428J06755J77817K8082n7092N5806M7440
1430A14604l1595k15625J38897Q6159n0672n617n2072k3910J74239r2541j07258
$$ plain form
1513 35138 -3105 -166617 -171752 -75217 -61712 -86736 -43968 -101393 -176575 -104894 -162715 -163192
1501 -163192 -244590 -290803 -183448 -171511 -175566 -149825 -138903 -187359 -202762 -178400 -228916 -140338
1489 -140338 -124397 -148548 -143134 -147930 -147974 -87500 -62318 -114766 -84274 7548 1189 -27872 -133835
1476 -133835 -132688 -37766 -40321 -78774 -17087 -56393 -186400 -100059 427 -10907 -75537 -5083
1464 -5083 -85243 -59359 -55713 -75552 26998 -63045 -154280 -226689 -143175 -101420 -79119 -91443
1452 -91443 -121082 -171371 -181694 -178755 -58623 -52997 -75411 36559 -66975 -122591 -2220
1441 -2220 44538 24523 -2818 -170776 -244204 -137449 40368 68450 11358 67164 114604
1430 114604 83009 -132616 6281 92440 41768 36151 -15921 -39831 134408 41867 -65391
1419f5391O5676K6950P7014r9623j11356m9949K7735J28593Q3094m8689n9451
1408b5397q8127J3621N2019q9023k3891J05638j06190k6071J25882k4488l9605
1397a25632r164M5588J6814R9251J42651n9273j1173n4771j7810r5510l6903J47018
1385D1086o9139p1502L6456O2190j8900j08229k5307J81933j5743J07661r6593
1374B3913J8221L5223j23759k5042M2514J34697j15846r1391J41249n2715M235
1363h701m076o5704J47604n7556O901P2298j15311M9185J26832n1520J9131r7341
1351B1742j06486j16393P5408R1757M6918K7700l6248j33533p0904O4092M6510
1340h9437R1536n5302q6667J26678J22042r8699K1028P5601J0330n1595O9689
$$ plain form
1419 -65391 285 27235 104249 4626 -106730 -156679 -128944 -351 82743 34054 -25397
1408 -25397 -113524 -99903 -47884 -136907 -160798 -55160 -161350 -187421 -61539 -86027 -125632
1397 -125632 -134796 -89208 -72394 26857 169508 110235 99062 44291 26481 -69029 -105932 41086
1385 41086 -28053 -99555 -63099 -909 -19809 -128038 -153345 28588 12845 120506 23913
1374 23913 42134 77357 -46402 -71444 -28930 105767 -10079 -101470 39779 -12936 -8701
1363 -8701 -12777 -78481 69123 11567 18468 90766 -24545 24640 151472 99952 119083 21742
1351 21742 -84744 -201137 -125729 -33972 12946 40646 4398 -129135 -200039 -135947 -89437
1340 -89437 2099 -53203 -139870 -13192 108850 10151 31179 106780 117110 65515 135204
1329A35204p9508q9000Q3997M1106j60295N7367N3266p5298K4815M9169o532n213
1317B9078O1776p6967j5232J1360P5q0646J28268M5885k7239k5063m8757j14799
1305a12261J27752K4425j7254k7333j01527o911J01393q3006J3140N4785Q2880
1294E6083m9748R389j5121j11974l1303P5016N985K5320P3090K3167m7926n9388
1282d7410k0926J2398L8704J12206l9250J0335j4529R8291J26770r7944n5857
1271A22788o6363j01551Q4755q0185k7640J04390M4941j8601j5767O9047r8628
1260A7186L3478K066l349P5416K7044j30922n1354k6250N7453L5226k1827j57558
1248a43391J86416P5456K2341M6811Q943j38183k1810o2404p9358Q3372R1009
$$ plain form
1329 135204 55696 -33304 50693 91799 -68496 -11129 42137 -33161 -8346 40823 34291 29078
1317 29078 90854 13887 -1345 10015 10090 -70556 57712 103597 76358 51295 2538 -112261
1305 -112261 15491 39916 22662 -4671 -106198 -113109 -11716 -94722 -81582 -26797 56083
1294 56083 6335 15724 603 -111371 -142674 -67658 -61673 -36353 36737 59904 11978 -47410
1282 -47410 -68336 -55938 -17234 94972 55722 66057 51528 149819 276589 178645 122788
1271 122788 56425 -45126 39629 -40556 -68196 36194 81135 62534 46767 115814 17186
1260 17186 50664 52730 49381 124797 151841 20919 -30435 -56685 768 35994 14167 -143391
1248 -143391 43025 118481 140822 187633 196576 58393 36583 -25821 -105179 -21807 69202
1237F9202K3761Q410j25660P3901j42999Q901R7626m1957j7320m6390K2682l3041
1225a02884l0547K00439J49321j30615k27613K0277J04563K3059K1072O9943P6598
1214A73613p4159r439k5120K8894j29691N0478J06352m7196L1675M2586r0983
1203E7010j46767N9648J4039J38559L8407m0707L4351l0794r3444K9237Q377j48425
1191h0509J64859R7708q5281j25438n0704N1169J13562n0320M0437j44497M6254
1180b2760P8912j45940N2668L3337n4137R8412O7849j33102M1014j0777q6848
1169h1372K2522o1750N5136J05008O8002n6971j4544J14984M3659j14607j5962
1158F4105R3670q5995k2555N5411o747j57344J5355L113L5180o2149M3886P3847
$$ plain form
1237 69202 92963 101373 -24287 49614 -93385 -84484 13142 -28815 -46135 -92525 -69843 -102884
1225 -102884 -133431 67008 216329 85714 -141899 -121622 -17059 6000 27072 97015 173613
1214 173613 99454 90015 64895 93789 -35902 14576 120928 73732 105407 147993 57010
1203 57010 -89757 -30109 -16070 122489 160896 120189 154540 123746 30302 59539 67916 -80509
1191 -80509 84350 182058 96777 -28661 -79365 -28196 85366 35046 75483 -69014 -22760
1180 -22760 56152 -89788 -37120 -3783 -57920 40492 108341 -24761 16253 5476 -81372
1169 -81372 -58850 -120600 -65464 39544 107546 50575 36031 151015 194674 80067 64105
1158 64105 157775 71780 49225 104636 97889 -59455 -44100 -40987 -5807 -67956 -24070 49777
1146D9777p3151R6777O3914j05810J46675l1928j85573Q1401M44j09981m7845
1135a15300J10888J4402p9881j1491K34341o2676J39781n8272n8989K2311M579
1124A39693Q6281o3024O5249k5101j66847k8172Q1798k5442R1716J09918K972
1113B69041q1108j3429N2665M8205o8553q4773k6554J0150O8433j02526o4271
1102G280l3388k7416m944K04350l087j1530J8204p2860o1322K1770J34293K7398
1090A98748p6545j40949M6805J9631N0973Q5880n6172q2465N173m1398q0871q459
1078g9649J0303k8193J78296O4072m6031q0660P7286R0418N2711j33054o907r027
1066H9565r9774j4284J6349R1211j4706J9601l3113L0410N1402j4532o4078O6117
$$ plain form
1146 49777 -23374 73403 137317 31507 178182 146254 -39319 42082 42526 -67455 -115300
1135 -115300 -4412 9990 -69891 -81382 152959 90283 230064 171792 112803 135114 139693
1124 139693 225974 162950 228199 203098 36251 8079 89877 64435 156151 266069 269041
1113 269041 187933 174504 227169 275374 206821 122048 95494 105644 174077 71551 7280
1102 7280 -26108 -53524 -58468 145882 142795 131265 149469 76609 15287 37057 171350 198748
1090 198748 122203 -18746 28059 47690 98663 184543 128371 45906 51079 9681 -71190 -79649
1078 -79649 -69346 -97539 80757 144829 98798 18138 95424 185842 238553 105499 98592 89565
1066 89565 -10209 -24493 -8144 83067 68361 87962 54849 85259 136661 122129 58051 124168
1054A24168L7264m2326p4228O7625P8280k1366p1930o651J07486p8951q3947J02510
1042A37934K2975Q8780M5732j26779M0702j16552j11453J04753J05141n4301O9293
1031B06225K2924o5839N2521n0157p8388j85561k2231J4851J92288r1971j50745
1020a56083M2500O0623k611P4710J47988K4782o3588q6382Q9330M0888n9285q9525
1008B3347J14288O8561J527n5225n4901j5661l8094j30989R2318O9398P3052K5392
996A73013Q1330j5295q2006l748o1385j45733J03414J16837Q040J35674j84q5598
984B24359m7089Q845n776p185J6341J06321j08443j88606q9946p988K27206J74739
972C02778p8705o365n5082k0976J5056q5305P4359j1227J49308j02461r2537n0337
$$ plain form
1054 124168 161432 119106 44878 112503 190783 169417 97487 90836 198322 119371 35424 137934
1042 137934 160909 249689 295421 168642 209344 92792 -18661 86092 191233 136932 206225
1031 206225 229149 163310 215831 165674 87286 -98275 -120506 -105655 86633 -5338 -156083
1020 -156083 -113583 -52960 -55571 19139 167127 191909 128321 41939 131269 172157 112872 23347
1008 23347 137635 206196 207723 152498 97597 81936 43842 -87147 5171 74569 147621 173013
996 173013 254343 239048 157042 153294 91909 -53824 49590 166427 174467 310141 309957 224359
984 224359 177270 186115 180339 173154 189495 295816 187373 -1233 -91179 -99167 128039 302778
972 302778 224073 217708 162626 141650 156706 71401 145760 134533 283841 181380 88843 38506
960C8506J4465J0287o2563K388L1702J38521k3887K01828j29892J132m5657j41422
948C5408m5739o927J96203J6125l8308o6403k0378Q7748L845n6980j08721k8259
936c2386M7154J05790p4570M2765M3547j6290l1166P198k5764O6503Q1355p70
924B13366j26784j0966M9588j19712J07691j2476N6009l7146j11796m0216J67631
913A35189P297M8067L137j26948k8090K6567J6009L999j27706O3337K0671J6611
901E8140K01526p2734j3107J01892p7495j5117L8708q6098n7759m3776N7133n1003
889D0310n5646J8691N3414M7087J2043J90998O053k21798m5352M2742J27628j55996
877F0174j8614P1887P6824R3674p171J9016p8905o4123Q5561j35173j28343J14334
$$ plain form
960 38506 52971 63258 695 3083 34785 173306 149419 351247 221355 222487 176830 35408
948 35408 -10331 -17258 178945 195070 156762 90359 69981 157729 161574 104594 -4127 -32386
936 -32386 14768 120558 45988 88753 132300 116010 84844 92042 66278 132781 214136 213366
924 213366 86582 75616 125204 5492 113183 100707 156716 119570 7774 -32442 135189
913 135189 142486 190553 193690 66742 38652 65219 81228 85227 -42479 20858 41529 58140
901 58140 259666 186932 173825 275717 198222 183105 221813 135715 77956 34180 91313 40310
889 40310 -15336 3355 56769 103856 115899 306897 312950 91152 45800 88542 216170 60174
877 60174 41560 113447 190271 283945 276774 295790 216885 152762 238323 103150 -25193 89141
865H9141L7635p7486Q2653L1002R160J414l2049J7111r8651M2602N1607q5127
853F9012J43922L1817j08344j35936M8858N8541m2275O7057r2922J8485K8678
842H6893N4996j18291J7211l3912p5490J71749L685k7556m2579P5552m846j5159
830I2253R1181o1719O0443q138N1985Q642j44643J9632N2416n9339j00988O8612
818G0337J03224P2177j30362q2130l3871l6091L7153K510O123Q37P8507N4500
806A42914l7229l9654k5200K3340K6605j3736p701P2045L6796j35624R6992P465
794A47013O813M8179n5258J1175R5683j2499q3128K634J7474l0218j26117m577
782A7174R94M8825l326n3233M0278j1606l8970Q8449o5320k0865J0149J0396M2595
$$ plain form
865 89141 126776 49290 131943 162945 172105 173519 141470 158581 59930 102532 154139 69012
853 69012 212934 244751 136407 471 49329 107870 65595 132652 39730 58215 86893
842 86893 141889 23598 40809 6897 -68593 103156 106841 79285 36706 112258 107412 92253
830 92253 183434 121715 182158 174020 226005 234647 90004 109636 162052 102713 1725 70337
818 70337 173561 245738 115376 33246 -625 -36716 437 2947 9070 9907 88414 142914
806 142914 105685 66031 40831 64171 90776 77040 69339 141384 178180 42556 139548 147013
794 147013 153826 202005 146747 157922 253605 241106 157978 160612 178086 147868 21751 17174
782 17174 18168 66993 63667 10434 50712 39106 136 88585 23265 2400 12549 22945 65540
769F5540j9574L5905K294m6421k9105Q9808K493m559k4135L2218m1795N4533m7197
756G0005J1777k6027q6998M9224N2413N132O1041J219j6292k1028Q1225J8294
744A99985j35797r668Q0478k1618N8393o2141m814L8619r77J25459j33417l1975
732A02527P1366N1881r4033L0970j25824r699R2775r6471R6578Q76o3398k2101
720C5447J542J193P254q9326L0873n4732K6625n470L3041J60905r0519N7786L9408
707A54027k8958K8035M124k3375j2788n8293J549L7734Q780p015O5901k2004j6100
694A31617p1201J75262k4491j65163n6997J97265l8062j17138M418P3172J26061
683B34743j27760j3312K572q769K4202N5350m4758N7958O2487N99k568j18830
$$ plain form
769 65540 45966 81871 84165 37744 8639 98447 100940 96381 72246 104464 62669 117202 70005
756 70005 81782 55755 -31243 17981 70394 75526 136567 137786 121494 100466 181691 199985
744 199985 64188 54520 134998 113380 171773 109632 104818 143437 142460 267919 134502 102527
732 102527 173893 225774 131741 162711 36887 27188 119963 23492 120070 120946 57548 35447
720 35447 36989 38182 45436 -43890 -13017 -67749 -41124 -46594 -13553 147352 56833 114619 154027
707 154027 125069 153104 157228 133853 121065 62772 64321 102055 110835 103820 169721 147717 131617
694 131617 60416 235678 211187 46024 -10973 186292 148230 31092 35510 108682 234743
683 234743 106983 93671 96243 87474 111676 167026 122268 180226 242713 243312 240744 121914
671A21914p0348q6766Q032J89625Q0485q617k9104j34867j38498J22670P1420
660A25946M1001q1943j70299O8257K1310J06640k8491k8461O6514n7402J13253
649A76325j7682j05259J62351N7907j63738J19474N5864j03109K0236j4119r961
638A78289M8113j84514o6300P8509P0437m538L8041n8799n6927N6314j58887K3613
626c6649R5373J7497R3344q8895M4961M1623j27457M4481J0554p3955j15452J68224
614G3649q0517o7454J24803m0941R3761P3181j04778Q79L3929J97181p7617m6584
602A79492J0448K4094q9232k6961J8964o852k5982j2332J17163j41362J268q3218
590c4510q3499J65623N7873j71899R7732K1949J55265o3598l0996R5061j34468
$$ plain form
671 121914 51566 -35200 -27168 162457 242942 234325 205221 70354 -68144 54526 125946
660 125946 166947 85004 -85295 -17038 4272 110912 82421 53960 120474 63072 176325
649 176325 158643 53384 215735 273642 109904 229378 285242 182133 202369 188250 178289
638 178289 226402 41888 -24412 54097 124534 119996 158037 99238 42311 98625 -60262 -36649
626 -36649 58724 76221 169565 80670 125631 167254 39797 84278 94832 20877 -94575 73649
614 73649 -6868 -74322 50481 9540 103301 176482 71704 72583 106512 303693 226076 179492
602 179492 189940 214034 124802 97841 116805 109953 83971 71639 188802 47440 48708 -34510
590 -34510 -118009 47614 105487 -66412 31320 53269 208534 144936 113940 209001 74533
579G4533m3899J9670j42365K6795J32946n5001O6704p4322j06153Q8094J00965
568H7967m6209j68375L9694L7455M6853N2263R8289N8749j00173o5168j25773
557h4428J3543K9071M7668o9518K14770J25380o4771j18847k14788R5990J38107
546A12177j2667j2335m381M3320n1377n2965N4593m508J4239L088j23312j08599
534a42727j22283K1922K18981j22520m0196J16040J28298j8013L252J7244K5906
523H5904N0807J2245p2079L1032k1753l1836L2990l756j9706O1280n2499J1879
511H4508p9048O4010J02350l2261q7527q0886n2660J3737L0812N6203L9977J2928
499G2143k373j39641J8998N2774J45814P2686m864r7678j78522r1434P8282J65913
$$ plain form
579 74533 30634 50304 -92061 -65266 67680 12679 79383 5061 -101092 -12998 87967
568 87967 41758 -126617 -86923 -49468 -2615 49648 147937 206686 106513 41345 -84428
557 -84428 -70885 -41814 5854 -63664 151106 276486 211715 92868 -121920 -25930 112177
546 112177 99510 87175 82794 126114 74737 21772 76365 71857 86096 89184 -34128 -142727
534 -142727 -265010 -243088 -24107 -146627 -186823 -70783 57515 39502 42754 59998 85904
523 85904 136711 148956 76877 107909 86156 54320 87310 83554 63848 125128 72629 84508
511 84508 5460 69470 171820 139559 52032 -28854 -81514 -67777 -36965 19238 59215 72143
499 72143 69770 -69871 -50873 1901 147715 220401 215537 117859 -60663 -152097 -73815 92098
487I2098J04129j13366m6941M1198O6179q8579j09274L4950N843M7395P8408n567
475A06473o2551p2407N3999l7969Q8608N2254j64203j6929Q8562N9574R7330o2896
463A29845O6456J3622j42283m0037j14363O4641K5842J50877L1680k11288j6194
452d1202l2920n95o082J04894P1972J25623j80411r8187K3668O1027p1512N0437
440F712j806P5576o7947p0146J13919M402K4839r4714q7131m0682J08235m3281
428g2024R1465n277j5917P4060k7653l5665J3768R1617O6375j14051n8712J3169
416B1155L6500K6011K1429n7717p0453j14665M2972J61417K7170j61342R5975
405B8452N6017r6970J7071p0606M3358J83739p3369j2716J8473P7318L9159K1097
$$ plain form
487 92098 196227 82861 35920 77118 143297 54718 -54556 -19606 -13763 33632 112040 106473
475 106473 43922 -28485 25514 -12455 76153 128407 -35796 -52725 35837 95411 192741 129845
463 129845 196301 209923 67640 27603 -86760 -22119 3723 154600 186280 -25008 -41202
452 -41202 -74122 -74717 -80799 24095 96067 221690 41279 -56908 -33240 27787 -43725 6712
440 6712 4906 80482 12535 -57611 56308 60710 85549 -9165 -96296 -136978 -28743 -72024
428 -72024 19441 14164 -1753 72307 44654 8989 22757 114374 180749 66698 7986 21155
416 21155 57655 83666 105095 47378 -23075 -137740 -94768 66649 93819 -67523 28452
405 28452 84469 -12501 4570 -66036 -22678 161061 87692 74976 93449 170767 209926 231023
393B31023n8466j66488j10064o1229J57423K13576j24284j15708K1636p3707M8999
382c7289J4424M9701J366J51635j237j48684o2136j1709k0016K16834M2775M648
370B00312j54657n0045J42246j03351J5672L7182q115L0305J46447o5177l57434
359a66615J08575Q5695o5658k1008N4555O9670r3201L3940p6855J00339k5129
348D308p9815J37177j8914m4245R0405R7490m5556p1628R100O5011q323j98378
336f3368J5837O0006R019O1383N156j799j29118m4937J00024J30865p6173j31582
324f4687J5238k0777j5755r697J6022O1411J12019L4564P4853m8664k0931m5869
312H7727J08751j15173n301j10629n54K5699J15194l1463l3755Q969r2878l0973
$$ plain form
393 231023 172557 6069 -103995 -165224 -7801 205775 81491 -34217 -12581 -86288 -37289
382 -37289 -22865 26836 28202 179837 178600 29916 -32220 -43929 -63945 152889 195664 200312
370 200312 45655 -4390 137856 34505 50177 87359 79244 109549 255996 190819 -166615
359 -166615 -58040 27655 -38003 -59011 -4456 65214 -27987 5953 -70902 29437 4308
348 4308 -75507 61670 42756 -1489 88916 186406 140850 69222 78322 143333 135010 -63368
336 -63368 -47531 12475 21494 82877 88033 86234 -42884 -87821 12203 143068 66895 -64687
324 -64687 -49449 -70226 -85981 -95678 -79656 -18245 93774 128338 203191 154527 133596 87727
312 87727 196478 81305 76004 -34625 -35179 -9480 105714 74251 40496 49465 -43413 -74386
300g4386R9248O1739N9011j01560K5680K3759j06554J46998O5981o6543m6718
289H6655N4426q4096J2206m5481o36R996O2163o5927Q6314m2502p6182n6458j4775
276g4297m1494Q8942m5593M1889o9433o7738J7992J15333J30243r1828M5033j09617
264f0568M55N5691O5132j6496R2532q3473j32566L2221J04494N2008l8458r747
252F1225J06637j81311j82437O1151O5087J37707L1519R8266j75723M1830L0494
241I4445m2835K5165m881j35177R7493k8638r9267m1646O3334M2807J34742o2848
229D2694K9888N1361j15930J2005n5393J5788j3548r5058L8347p7382J3998R9386
217e3844J04654k8572Q157J6646j26792O0284J12698K3755K2307j23167q3118
$$ plain form
300 -74386 24862 86601 145612 44052 69732 93491 -13063 133935 199916 133373 86655
289 86655 141081 56985 69191 23710 23074 33070 95233 29306 115620 73118 -3064 -59522 -74297
276 -74297 -115791 -26849 -72442 -30553 -99986 -167724 -149732 -34399 95844 4016 49049 -60568
264 -60568 -60113 -4422 60710 44214 136746 53273 -79293 -47072 57422 109430 70972 61225
252 61225 167862 -13449 -195886 -134735 -69648 68059 99578 197844 22121 63951 94445
241 94445 51610 76775 71894 -63283 34210 5572 -93695 -135341 -72007 -29200 105542 42694
229 42694 72582 123943 8013 20018 -35375 -19587 -33135 -128193 -89846 -167228 -153230 -53844
217 -53844 50810 22238 30395 47041 -79751 -19467 93231 116986 139293 16126 -66992
206f6992J09875K6937o3258k0785J08164p8231k4697o3649Q61N3343M9679p7659
194d6412k9021l737L3061P1653J9056O2233n6393j6968J2624r8287p0227N3269
182f9149Q4485j335m147n1450N3015j5954N2668J06546k3217j19945P7346r2788
170c925O372m880p2819o4362L4810J28979J06659j59730j23862O1113R3607O3777
158F5739N0753l9174n2966O1703K6555N6571O6827j46536j19457m87J0069J1780
146h623o3817J0309O732L8372M015N5778N0078k9625k4542L3765j3963n82K9237
133H7134j1008j6351L0275L6532j34025O435k3513M1839n8533l8096m6280j0644
121a36235P1345L6915k3020M8862L8437L3480J10537j76583r8668n6047J12529
$$ plain form
206 -66992 42883 69820 6562 -14223 93941 15710 -8987 -72636 -71775 -18432 31247 -46412
194 -46412 -75433 -79170 -46109 25544 44600 106833 50440 33472 46096 -52191 -122418 -69149
182 -69149 15336 14001 9854 -41596 11419 -4535 48133 154679 131462 11517 88863 -3925
170 -3925 2447 -2433 -75252 -139614 -104804 24175 130834 -28896 -152758 -91645 1962 65739
158 65739 116492 77318 24352 86055 112610 169181 236008 89472 -29985 -30472 -20403 -8623
146 -8623 -72440 -62131 -55399 -17027 -13012 42766 92844 63219 38677 72442 58479 57897 87134
133 87134 76126 59775 90050 126582 -7443 -1008 -24521 17318 -41215 -79311 -125591 -136235
121 -136235 -64890 -27975 -50995 -2133 36304 69784 180321 3738 -94930 -150977 -38448
110c8448j8742L4748l3060P4755L7623j6949l5463m190R8768l1606j14393Q1672
98C4715m552j18320P946j6273m290J5566O8495L6180k9727j779n4293o2037j7602
85a45971K35957j35725p7380K20336r5901n466p711j05074m9169n9097R5626J37611
73H036k2447K8512J38963r7759r1600L9999j22320k4463L7571R0213n8902l4146
61a08343Q4320N7951M610K171k7987k1397o79K2502l1190m7270o7583M2134M2503
48d8258M7452K6097l7702J0688j78j4766l4967O8982k0620m193J3421m8581Q1976
35C9351j2190j9221K948k0267J0616M3824j58378M6576M2297j5121L1475n8263
23f6353L7230K5417N876o2981M813R785l0371l9647L2168J20264r945M93J4161
$$ plain form
110 -38448 -57190 -22442 -55502 19253 56876 39927 4464 274 99042 67436 -46957 34715
98 34715 30163 -88157 -80211 -96484 -100774 -85208 -16713 19467 -10260 -12039 -66332 -128369 -145971
85 -145971 89986 -45739 -123119 97217 1316 -4150 -11861 -116935 -166104 -225201 -129575 8036
73 8036 -14411 14101 153064 55305 -36295 3704 -118616 -143079 -105508 -15295 -74197 -108343
61 -108343 -24023 33928 38538 40709 12722 -8675 -9354 13148 -18042 -65312 -132895 -90761 -48258
48 -48258 -806 25291 -12411 -1723 -1901 -16667 -51634 17348 -3272 -7465 5956 -42625 39351
35 39351 27161 7940 10888 -9379 1237 45061 -113317 -66741 -24444 -39565 -8090 -66353
23 -66353 -29123 -3706 2170 -60811 -55998 -46213 -76584 -116231 -84063 36201 26256 26749 40910
10D0910r0887J8549j7123j4109K0729Q2460r6593P2K0224j2342
0d8110
$$ plain form
10 40910 -49977 -31428 -48551 -62660 -41931 40529 -56064 -55992 -35768 -48110
0 -48110
$$ Imaginary data points
##PAGE= N=2
##DATA TABLE= (X++(I..I)), XYDATA
16383f132484J96575m9963K2308J37922J02285R0412P8981J99378J33006N6523
16373e165057J11560J09930P401J14771J40273Q3360R9340J09923O2368l4473
16363d360604J69733N2927J42657J62803J13158J4245O0147M3024J43175J38104
16353c320631O3562J59289M03P0906J82595N8336P7426O1237J60028Q1706j8248
16342b423391P2832J75635O2179Q5225J66942J20976R9119O7861O1583J40457
16332a370582L7779R7060M0527J27467J27106j936p540J14261J51292J31538J82778
16321c70250Q7373M4429M1951O9647J39074N288J9339O7640M1311N5217J35944
16310C36963K5594P2388N1059N1531J08244O5296K03598R8928J44556k5423J31339
$$ plain form
16383 -6132484 -5935909 -5985872 -5963564 -5825642 -5723357 -5632945 -5553964 -5354586 -5221580 -5165057
16373 -5165057 -5053497 -4943567 -4936166 -4821395 -4681122 -4597762 -4498422 -4388499 -4326131 -4360604
16363 -4360604 -4190871 -4137944 -3995287 -3832484 -3719326 -3705081 -3644934 -3601910 -3458735 -3320631
16353 -3320631 -3257069 -3097780 -3097377 -3026471 -2843876 -2785540 -2708114 -2646877 -2486849 -2405143 -2423391
16342 -2423391 -2350559 -2174924 -2112745 -2027520 -1860578 -1739602 -1640483 -1572622 -1511039 -1370582
16332 -1370582 -1332803 -1235743 -1195216 -1067749 -940643 -942579 -950119 -835858 -684566 -553028 -370250
16321 -370250 -282877 -238448 -196497 -126850 12224 17512 36851 104491 145802 201019 336963
16310 336963 362557 434945 486004 537535 645779 711075 914673 1013601 1158157 1132734 1264073
$$ [...]
##END NTUPLES=NMR SPECTRUM
##END=
