##TITLE=1H_CA-9376-2
 200.13MHz, CDCl3,
 8 sc
 
 2.9.2025
##JCAMPDX= 6.0         $$ Bruker NMR JCAMP-DX V2.0
##DATA TYPE= NMR SPECTRUM
##DATA CLASS= NTUPLES
##ORIGIN= UXNMR, Bruker Analytische Messtechnik GmbH
##OWNER= pz
$$ XWIN-NMR		Version 3.5
$$ Tue Sep  2 14:50:15 2025 Russian Standard Time (UT+4h)  she@DPX200
##.OBSERVE FREQUENCY= 200.1313
##.OBSERVE NUCLEUS= ^1H
##.ACQUISITION MODE= SIMULTANEOUS
##.ACQUISITION SCHEME= undefined
##.AVERAGES= 8
##.DIGITISER RES= 18
##SPECTROMETER/DATA SYSTEM= spect
##.PULSE SEQUENCE= zg30
##.SOLVENT NAME= CDCl3
##.SHIFT REFERENCE= (INTERNAL, CDCl3, 0, 15.4461)
##AUDIT TRAIL= $$ (NUMBER, WHEN, WHO, WHERE, WHAT)
$$ ##TITLE= Audit trail, XWIN-NMR		Version 3.5
$$ ##JCAMPDX= 5.01
$$ ##ORIGIN= Bruker BioSpin GmbH
$$ ##OWNER= she
$$ F:/spectra/data/she/nmr/H-C/1/pdata/1/auditp.txt
$$ ##AUDIT TRAIL=  $$ (NUMBER, WHEN, WHO, WHERE, WHAT)
(   1,<2025-09-02 14:48:52.40 +0400>,<she>,<DPX200>,
      <created by zg, POWCHK disabled, PULCHK disabled
       configuration hash MD5:
       00 E9 B6 7A A2 85 ED C7 34 08 36 98 17 FE 4E 26
       data hash MD5: 16K
       CA 2D 05 6F 06 13 90 19 72 B8 1A EF DF 4D 5B 05>)
(   2,<2025-09-02 14:48:57.01 +0400>,<she>,<DPX200>,
      <Start of raw data processing
       efp BC_mod = 2 LB = 0.25 FT_mod = 6 PKNL = 1 PHC0 = -1562.751 PHC1 = 16.59228 SI = 16K 
       data hash MD5: 16K
       50 F5 33 93 D8 44 A1 A1 1B 5C DC A4 33 99 E4 D1>)
(   3,<2025-09-02 14:49:18.51 +0400>,<she>,<DPX200>,
      <pk PHC0 = -158.5831 PHC1 = -4.4 
       data hash MD5: 16K
       45 37 97 99 B9 6E 2D 09 59 6C F6 85 A6 57 51 42>)
(   4,<2025-09-02 14:49:23.26 +0400>,<she>,<DPX200>,
      <abs ABSG = 5 
       data hash MD5: 16K
       98 D1 53 1A 8A 6E 42 B0 B3 5F C4 1B 9F 77 BD C5>)
$$ ##END=
$$ 
$$ hash MD5
$$ B0 32 6F 2B 18 B4 F8 EF CB 3D C3 EF 17 46 10 CE
##$RELAX= 
##$RELAX= 
##$RELAX= 
##$RELAX= 
##$RELAX= 
##$RELAX= 
$$ Bruker specific parameters
$$ --------------------------
##$DU= <F:/spectra>
##$EXPNO= 1
##$NAME= <H-C>
##$PROCNO= 1
##$TYPE= <nmr>
##$USER= <she>
##$AMP= (0..31)
100 100 100 100 100 100 100 100 100 100 100 100 100 100 100 100 100 100 
100 100 100 100 100 100 100 100 100 100 100 100 100 100 
##$AQSEQ= 0
##$AQ_mod= 1
##$AUNM= <au_zg>
##$AUTOPOS= <>
##$BF1= 200.13
##$BF2= 200.13
##$BF3= 200.13
##$BF4= 200.13
##$BF5= 200.13
##$BF6= 200.13
##$BF7= 200.13
##$BF8= 200.13
##$BYTORDA= 1
##$CFDGTYP= 0
##$CFRGTYP= 5
##$CHEMSTR= <none>
##$CNST= (0..31)
1 1 145 1 1 1 1 1 1 1 1 1 1 1 1 1 1 1 1 1 1 1 1 1 1 1 1 1 1 1 1 1 
##$CPDPRG= <>
##$CPDPRG1= <>
##$CPDPRG2= <>
##$CPDPRG3= <>
##$CPDPRG4= <mlev>
##$CPDPRG5= <mlev>
##$CPDPRG6= <mlev>
##$CPDPRG7= <mlev>
##$CPDPRG8= <mlev>
##$CPDPRGB= <>
##$CPDPRGT= <>
##$D= (0..31)
0 0.7 0 0 0 0 0 0 0 0 0 0.03 0 0 0 0 0 0 0 0 0 0 0 0 0 0 0 0 0 0 0 0 
##$DATE= 1756810131
##$DBL= (0..7)
120 120 120 120 120 120 120 120 
##$DBP= (0..7)
150 150 150 150 150 150 150 150 
##$DBP07= 0
##$DBPNAM0= <>
##$DBPNAM1= <>
##$DBPNAM2= <>
##$DBPNAM3= <>
##$DBPNAM4= <>
$$ [...]
##$SUBNAM3= <"">
##$SUBNAM4= <"">
##$SUBNAM5= <"">
##$SUBNAM6= <"">
##$SUBNAM7= <"">
##$SUBNAM8= <"">
##$SUBNAM9= <"">
##$SW= 18.0517328524113
##$SWIBOX= (0..15)
0 0 2 0 0 0 0 0 0 0 0 0 0 0 0 0 
##$SW_h= 3612.71676300578
##$TD= 16384
##$TD0= 1
##$TE= 0
##$TE2= 300
##$TE3= 300
##$TEG= 300
##$TL= (0..7)
0 120 120 120 120 120 120 120 
##$TP= (0..7)
150 150 150 150 150 150 150 150 
##$TP07= 0
##$TPNAME0= <>
##$TPNAME1= <>
##$TPNAME2= <>
##$TPNAME3= <>
##$TPNAME4= <>
##$TPNAME5= <>
##$TPNAME6= <>
##$TPNAME7= <>
##$TPOAL= (0..7)
0.5 0.5 0.5 0.5 0.5 0.5 0.5 0.5 
##$TPOFFS= (0..7)
0 0 0 0 0 0 0 0 
##$TUNHIN= 0
##$TUNHOUT= 0
##$TUNXOUT= 0
##$USERA1= <user>
##$USERA2= <user>
##$USERA3= <user>
##$USERA4= <user>
##$USERA5= <user>
##$V9= 5
##$VALIST= <valist>
##$VCLIST= <CCCCCCCCCCCCCCC>
##$VD= 0
##$VDLIST= <DDDDDDDDDDDDDDD>
##$VPLIST= <PPPPPPPPPPPPPPP>
##$VTLIST= <TTTTTTTTTTTTTTT>
##$WBST= 1024
##$WBSW= 4
##$XGAIN= (0..3)
0 0 0 0 
##$XL= 0
##$YL= 0
##$YMAX_a= 455522
##$YMIN_a= -376513
##$ZGOPTNS= <>
##$ZL1= 120
##$ZL2= 120
##$ZL3= 120
##$ZL4= 120
##$ABSF1= 15.47475
##$ABSF2= -2.5771
##$ABSG= 5
##$ABSL= 3
##$ALPHA= 0
##$AQORDER= 0
##$ASSFAC= 0
##$ASSFACI= 0
##$ASSFACX= 0
##$ASSWID= 0
##$AUNMP= <proc_1d>
##$AZFE= 0.1
##$AZFW= 0.1
##$BCFW= 0
##$BC_mod= 2
##$BYTORDP= 0
##$COROFFS= 0
##$CY= -3
##$DATMOD= 1
##$DC= 0
##$DFILT= <>
##$DTYPP= 0
##$F1P= 0
##$F2P= 0
##$FCOR= 1
##$FTSIZE= 16384
##$FT_mod= 6
##$GAMMA= 0
##$GB= 0
##$INTBC= 1
##$INTSCL= 3.241238e-09
##$ISEN= 128
##$LB= 0.25
##$LEV0= 0
##$LPBIN= 0
##$MAXI= 10000
##$MC2= 0
##$MEAN= 0
##$ME_mod= 0
##$MI= 1.114404
##$NCOEF= 0
##$NC_proc= -7
##$NLEV= 6
##$NOISF1= 3.799351
##$NOISF2= 2.8
##$NSP= 0
##$NTH_PI= 0
##$NZP= 0
##$OFFSET= 15.4461
##$PC= 1
##$PHC0= -1721.334
##$PHC1= 12.19228
##$PH_mod= 1
##$PKNL= yes
##$PPARMOD= 0
##$PSCAL= 0
##$PSIGN= 0
##$REVERSE= no
##$SF= 200.130015130767
##$SI= 16384
##$SIGF1= 3
##$SIGF2= 2
##$SINO= 0.751879
##$SIOLD= 32768
##$SREGLST= <19F.Aceton>
##$SSB= 0
##$STSI= 16384
##$STSR= 0
##$SW_p= 3612.71676300578
##$SYMM= 0
##$S_DEV= 0
##$TDeff= 16384
##$TDoff= 0
##$TI= <>
##$TILT= no
##$TM1= 0
##$TM2= 0
##$TOPLEV= 0
##$USERP1= <user>
##$USERP2= <user>
##$USERP3= <user>
##$USERP4= <user>
##$USERP5= <user>
##$WDW= 1
##$XDIM= 16384
##$YMAX_p= 434608512
##$YMIN_p= -212015
$$ End of Bruker specific parameters
$$ ---------------------------------
##NTUPLES= NMR SPECTRUM
##VAR_NAME=  FREQUENCY,     SPECTRUM/REAL,   SPECTRUM/IMAG
##SYMBOL=    X,             R,               I
##VAR_TYPE=  INDEPENDENT,   DEPENDENT,       DEPENDENT
##VAR_FORM=  AFFN,          ASDF,            ASDF
##VAR_DIM=   16384,         16384,           16384
##UNITS=     HZ,            ARBITRARY UNITS, ARBITRARY UNITS
##FACTOR=    0.220516191357247, 1,           1
##FIRST=     3091.22827373896, 0,            0
##LAST=      -521.488489266818, 0,           0
##MIN=       -521.488489266818, -212015,     0
##MAX=       3091.22827373896, 434608512,    0
$$ Real data points
##PAGE= N=1
##DATA TABLE= (X++(R..R)), XYDATA
$$ [...]
8017 173461 196572 195010 196042 177561 189474 136924 115772 95606 194543 251864 206470 208296
8005 208296 234065 201910 235708 256348 266030 202341 245220 263360 246794 188284 160420 234137
7993 234137 233559 187440 199762 202495 194981 234036 218370 249616 207444 187202 194563 244548 165998
7980 165998 194846 215035 169964 165317 239899 238630 249094 300887 262983 278680 227070 176339
7968 176339 177346 178808 201882 213252 225962 222746 186229 200766 156428 164095 193613 188677 248261
7955 248261 219419 215090 275664 294037 299268 320154 312505 352619 345234 349434 266773 202582 221583
7942 221583 215940 173868 137004 174043 240915 284351 274632 330509 301203 282200 289194 251118
7930 251118 258397 209106 198848 230093 171563 94230 143630 216628 219641 221120 222768 250026
7918 250026 300302 321619 270800 248020 278494 269713 267555 241648 159962 184318 228128 238994
7906 238994 208423 198092 231490 268162 303559 236940 189220 214515 292213 253745 271874 230101
7894 230101 258115 224166 213109 300761 307200 266440 280090 235157 257123 259279 204591 246891
7882 246891 203498 173941 249660 227210 238238 182300 190967 180426 223172 319209 271361 229876
7870 229876 224141 207646 206945 277524 286382 302613 249419 254309 216296 226601 299957 257433 307479
7857 307479 333743 272446 271758 249494 312598 269346 253168 302402 324898 268606 309809 287439
7845 287439 274134 301656 303123 285889 299150 328906 317821 331363 286415 293698 351456 315439
7833 315439 337164 338997 360630 340208 296120 290855 249911 266826 282046 247244 242642 267658
7821 267658 250418 239861 184985 205986 226355 215556 247768 278380 283280 255711 246803 237063
7809 237063 232275 197038 254093 288729 233113 192678 125093 209171 269468 375506 479304
7798 479304 416609 427721 411282 402035 405566 382966 390016 459903 493373 386601 295771 292178
7786 292178 355227 348756 305161 332034 336210 328195 368308 337570 307938 354357 350379 308659
7774 308659 328826 337987 296090 366109 362155 343961 327628 309225 363037 436806 438095 359528
7762 359528 300952 367225 315962 333930 357740 361019 375603 352721 425693 450716 426121 402583
7750 402583 426922 438275 373033 426271 402043 354433 423672 389017 381560 370221 410479 406282
7738 406282 354846 355872 375194 413033 489512 492214 441611 434149 442820 409576 421516 395645
7726 395645 394733 446292 490257 467740 502169 503578 501491 520896 491125 512219 564360 526095
7714 526095 538792 575222 632714 701480 702187 617324 668163 727067 728818 773148 829005 854383
7702 854383 809033 790361 782566 800491 845207 844566 814273 776038 728134 779314 801794 806259
7690 806259 814514 832076 832517 867838 870007 855002 824799 825368 849768 860814 888459 916379 830959
7677 830959 851117 910710 922581 896995 899187 921132 842869 902673 889248 901685 889798 844257
7665 844257 779501 805158 888149 902394 841591 786329 817665 863810 781560 728143 702438 710416
7653 710416 703118 693712 709955 698996 653692 604314 688003 694311 664374 717172 685498 683483
7641 683483 623181 633993 618689 587434 623047 601509 614883 608745 548481 609606 653008 599463
7629 599463 634764 536789 594776 577792 577427 585179 586843 639466 593601 544431 531089 574185
7617 574185 596811 624650 645368 622746 672094 683026 673442 710293 757459 695622 737001 820818
7605 820818 827729 775057 734035 772743 823093 798225 794140 821477 828574 885628 925294 907998
7593 907998 920907 906469 864129 853281 817919 799585 782873 721583 700784 703265 719363 710731
7581 710731 740868 773934 727107 705979 735641 639589 611227 613707 559245 602366 593624 628264
7569 628264 625974 615659 571817 613951 605068 598751 582169 611628 618346 545387 559900 537040
7557 537040 491419 513071 526337 465148 463003 493080 547375 527399 551967 554757 554268 574092
7545 574092 524629 482750 510234 513430 401571 464194 527043 477178 457836 439872 457823 483071
7533 483071 499698 473597 519076 563447 624251 567895 548426 571298 511453 528422 601901 586162
7521 586162 578155 658955 621003 614385 649722 617710 625532 641935 698088 661511 648468 720084
7509 720084 729737 791027 857549 926544 937910 1010974 1037509 991046 926481 877918 778603 747407
7497 747407 660900 608077 642320 613694 566659 608300 671256 676376 653055 679235 649551 487809
7485 487809 446186 520717 555563 552046 521301 496482 533988 579970 622475 613027 611794 648269
7473 648269 600681 552580 528685 518262 492784 524235 568397 522538 531358 542636 594916 676283
7461 676283 614673 575395 583612 585051 578048 534098 560888 541219 560714 605855 608664 576630
7449 576630 562250 520176 532265 575506 522402 517400 501345 547491 545772 517476 497615 547172
7437 547172 607992 625311 631736 651840 588423 572922 569923 595249 626593 662030 626859 625090
7425 625090 632925 669669 724107 648230 676378 643887 635020 694545 675641 658974 706580 751795
7413 751795 787895 728747 739495 751891 756323 801559 852465 863322 849242 868858 941185 987675
7401 987675 980496 958326 1066129 1102431 1112791 1138717 1138027 1135511 1173479 1224603 1231906 1178920
7389 1178920 1192770 1177134 1165799 1088180 1076657 1063700 1026219 1021186 891520 909870 912998 927897
7377 927897 1025285 1043965 1015667 996576 981687 967732 952248 1009959 999883 990117 1068811 1127940
7365 1127940 1134406 1102114 1112210 1094032 1097773 1145185 1167738 1227532 1267033 1219788 1226024 1267130
7353 1267130 1315128 1369337 1413171 1436727 1429217 1456515 1462442 1548950 1561366 1563469 1656993 1704084
7341 1704084 1668915 1592504 1635249 1643796 1656534 1582167 1428062 1398118 1356254 1312632 1273428
7330 1273428 1274015 1323075 1282694 1239359 1238547 1226760 1229931 1174497 1175190 1128871 1133189 1202164 1134855
7317 1134855 1057849 1006411 1031750 1076366 1079978 1000260 1012105 1025872 983710 942946 940986 983286
7305 983286 970380 981240 936666 926762 999215 949568 867495 911040 992546 993219 954620 974447
7293 974447 963551 1008504 950644 956417 975802 1026257 1112294 1038093 954994 874169 868366 895491
7281 895491 889774 955305 1013484 958509 869403 912372 924949 887391 912875 943150 949505 980539
7269 980539 1003060 995778 926793 929968 873766 869952 935235 981038 1016430 1002324 1012734 1009220
7257 1009220 1000145 1025945 1062558 1032145 1116885 1172625 1180810 1149450 1100984 1061769 1120615 1118229
7245 1118229 1024277 1081657 1098032 1129995 1134278 1043638 1022968 1018980 1195388 1179510 1100932 1084156
7233 1084156 1049781 1073823 1102881 1076501 1020481 1038047 1065611 1110254 1157776 1186163 1104453
7222 1104453 1103091 1123105 1123723 1179863 1183865 1199771 1158641 1153879 1276468 1346232 1258531 1245915
7210 1245915 1143937 1106897 1218367 1308064 1305548 1229288 1310623 1343838 1339884 1359169 1379057
7199 1379057 1418384 1421378 1414044 1419347 1416262 1390812 1368041 1398473 1440555 1398560 1419382 1466944
7187 1466944 1505844 1546794 1547619 1617864 1613498 1639723 1687987 1681202 1717213 1772295 1758673 1778455
7175 1778455 1769676 1815406 1885355 1936786 1957560 1946192 1950752 2009361 1991300 2007051 2010594 2025371
7163 2025371 2070480 2193370 2250040 2346844 2382046 2455119 2471789 2483203 2642998 2719207 2767683
7152 2767683 2844766 2953242 3015317 3186751 3302494 3403111 3500395 3708997 3959403 4092503
7142 4092503 4255273 4360626 4481947 4697256 4934493 5170489 5396341 5662118 5995876 6259907
7132 6259907 6605015 6980424 7332456 7786916 8240173 8808406 9422131 10141745 10885388 11773710
7122 11773710 12845201 14080955 15360931 16828453 18484421 20387408 22435483 24922463
7114 24922463 27656346 30949578 35044799 40709506 48361467 58063398 67532687 76768249
7106 76768249 85266375 90446368 94574079 94683790 86067039 73751590 63662314 55835664
7098 55835664 49793039 44864136 40604421 37060974 33997216 31039707 28149731 25357200
7090 25357200 23054209 21159036 19579852 18034876 16682429 15467271 14457021 13568957
7082 13568957 12692928 11930174 11208603 10634677 10074890 9633035 9185849 8737374 8465796
7073 8465796 8120251 7776764 7442391 7122682 6849624 6559024 6363849 6181522 5970700 5746524
7063 5746524 5517386 5275188 5029904 4923818 4820083 4495524 4317288 4171095 4135695 4052384
7053 4052384 3937558 3878433 3789344 3708468 3658286 3550587 3466651 3392272 3262314 3152729 3092259
7042 3092259 3075312 3088142 3052287 2944556 2883310 2820167 2736490 2642511 2600250 2569049 2494240
7031 2494240 2509787 2490126 2470695 2422008 2331308 2308365 2269499 2233197 2141962 2173498 2183766
7020 2183766 2192668 2133502 2060737 2049069 1989677 1984527 2010309 2018464 1997369 1928614 1917487 1917522 1879425
7007 1879425 1825594 1777575 1742686 1761465 1738351 1736658 1719569 1765222 1761875 1729232 1677652 1588982
6995 1588982 1651386 1706255 1651303 1627663 1642528 1659262 1691177 1697997 1602349 1551732 1590680 1637303
6983 1637303 1635363 1632815 1576401 1594163 1624651 1579428 1491728 1509487 1446799 1478587 1512541 1509961
6971 1509961 1449952 1383028 1410953 1413821 1349834 1335042 1363753 1311103 1303292 1318118 1319518 1382957
6959 1382957 1338536 1240591 1277751 1250067 1277185 1282868 1310691 1269984 1261997 1177808 1201951 1226113
6947 1226113 1234950 1233131 1222654 1236406 1245844 1246576 1250658 1254770 1269139 1257763 1193333 1204147 1223195
6934 1223195 1213926 1204323 1166136 1201316 1187667 1195492 1174867 1188214 1216923 1189386 1140546 1123373
6922 1123373 1088895 1122355 1123614 1132271 1159945 1176699 1096517 1104479 1114463 1086740 1031254 999807
6910 999807 1019649 1077912 1101158 1091313 1148519 1136020 1113287 1085757 1086928 1088021 1108525 1136583
6898 1136583 1101296 1040547 1054295 1074863 1119130 1067152 1003756 1030416 985283 954002 958412 956048
6886 956048 974881 941721 1040777 1078405 994131 1004124 1000893 995234 992073 1050653 1027166 1040561
6874 1040561 1062378 1071969 1060847 1046775 1085237 1106205 1045753 1023299 1096994 1084828 1032289 997742
6862 997742 1049023 1062799 1033850 994103 1036427 1027321 1050584 1106060 1055062 1066467 1098665 1067692
6850 1067692 1059178 1032750 1038227 1056305 1066740 1066509 1103117 1068933 1010177 998285 1016037 927948
6838 927948 896144 1004444 1074561 1061543 1067040 1051094 995037 1022391 1031539 991645 1032062 967083
6826 967083 978000 1050560 1082501 1074844 1055563 1048122 1096166 1021188 1035955 1068551 1042516 1013697
6814 1013697 1032662 988916 990090 1020945 1084561 1089672 1004380 1029516 1058367 1036143 1000973 1002011
6802 1002011 998820 1011704 1061358 1060368 1023484 1053035 1028701 998097 1069221 1106631 1088521 1046536
6790 1046536 1094573 1118726 1086519 1078753 1018779 1099328 1170294 1118896 1100793 1021384 1050202 1095347
6778 1095347 1049974 1041241 1014341 997071 1068642 1115783 1086079 1169188 1158611 1097100 1064619 1077343
6766 1077343 1048490 1066243 1106989 1057718 1041324 1047854 1105641 1169715 1097320 1097454 1065462 1074297
6754 1074297 1046235 1104894 1156242 1123471 1113190 1150845 1140943 1071981 1025775 1074440 1086453 1086341
6742 1086341 1044714 1033386 1064317 1122743 1109564 1088461 1105581 1178743 1184233 1138788 1115232 1218483
6730 1218483 1226332 1193885 1165954 1154339 1133710 1168099 1115342 1103989 1232005 1198429 1197217 1214979
6718 1214979 1219931 1222172 1295883 1229543 1209929 1234942 1262121 1277699 1260523 1268552 1266528 1246427
6706 1246427 1281523 1386301 1361487 1451458 1494831 1572851 1626104 1599113 1583566 1613054 1587439
6695 1587439 1441736 1385193 1346975 1338194 1354410 1328722 1278159 1245583 1210127 1275908 1351215
6684 1351215 1240620 1208081 1232717 1223723 1182163 1175944 1144571 1144867 1206235 1113385 1108112 1139403
6672 1139403 1194416 1154111 1167388 1157432 1197386 1100816 1097710 1136362 1194106 1226091 1192412 1231237
6660 1231237 1188513 1114137 1167746 1157472 1166700 1179613 1209621 1102201 1075737 1066541 1099204 1165350
6648 1165350 1126247 1135723 1136288 1184362 1295208 1290336 1222557 1209320 1202529 1252553 1219365 1247076
6636 1247076 1259713 1224671 1205212 1210180 1214261 1194738 1167861 1129697 1137469 1191772 1206132 1159897
6624 1159897 1211519 1231153 1197859 1219846 1265483 1207437 1205616 1224980 1190169 1227478 1285949 1284816
6612 1284816 1300043 1247364 1183814 1251163 1218025 1192041 1227983 1202272 1240081 1257435 1257814 1279622
6600 1279622 1292414 1272328 1200511 1210717 1293035 1317916 1206150 1181102 1213408 1244637 1277047
6589 1277047 1240864 1197883 1301613 1345488 1348583 1330830 1308403 1292404 1346202 1410883 1432066
6578 1432066 1428552 1371197 1428661 1468780 1451773 1479059 1475960 1493558 1478926 1546461 1504921 1487321
6566 1487321 1543037 1517052 1455885 1457612 1461096 1530039 1555708 1510637 1578283 1569667 1604186 1652860
6554 1652860 1666277 1673731 1661408 1648686 1671954 1761744 1768604 1747294 1804320 1858563 1922631 1951259
6542 1951259 1907433 1841952 1830797 1791642 1738169 1734892 1711982 1677926 1682066 1668787 1625379 1668149
6530 1668149 1672563 1671418 1643530 1616783 1622598 1645352 1570873 1552494 1619483 1646395 1674184 1699161
6518 1699161 1610342 1629911 1629798 1572837 1613773 1657310 1630012 1613333 1604004 1631321 1610967 1599542
6506 1599542 1627693 1568277 1544268 1605109 1585587 1576428 1605559 1620705 1627251 1634294 1681540 1572429
6494 1572429 1549418 1629033 1700109 1753373 1797145 1795662 1790233 1848904 1852141 1891586 1948550 1872985
6482 1872985 1897341 1913084 1912181 1901379 1946836 1907498 1828097 1809037 1777955 1754815 1729727 1679688
6470 1679688 1657776 1599245 1597414 1661027 1630000 1640737 1663176 1633785 1577096 1557724 1532188 1533169
6458 1533169 1588627 1562603 1584547 1638862 1618447 1565012 1554187 1558164 1621351 1630980 1596209 1644418
6446 1644418 1703255 1711293 1688034 1675272 1725608 1664709 1692998 1690075 1694118 1716524 1799617 1760047
6434 1760047 1679279 1737422 1729767 1709179 1744303 1748300 1726489 1787941 1745778 1768993 1753069 1758099
6422 1758099 1759004 1762587 1765900 1714575 1755380 1782523 1790096 1767856 1775691 1844143 1941212 1969251 1975673
6409 1975673 2060040 2121067 2211763 2197715 2293550 2402013 2496144 2637735 2722041 2806229 2843656
6398 2843656 3011763 3203529 3328710 3371401 3389064 3395181 3282209 3203161 3196728 3145196 2990812
6387 2990812 2889714 2926160 2854541 2836051 2810768 2816285 2873798 2871873 2864205 2937822 2980878 3019678
6375 3019678 3095091 3202929 3317398 3476596 3661368 3758085 3835423 3855094 3846715 3698571 3540786
6364 3540786 3355425 3206027 3082997 2952730 2866791 2822661 2709064 2636878 2538772 2425729
6354 2425729 2325850 2265846 2232144 2213769 2188798 2162936 2103954 2034694 1973095 2003211 1920308
6343 1920308 1952690 1987624 1937712 1881159 1913882 1949652 1945735 1898468 1850730 1897850 1862312 1857999
6331 1857999 1826763 1798117 1774484 1804533 1778108 1780641 1791519 1802421 1768495 1770292 1841525 1767094
6319 1767094 1691509 1700397 1697992 1780489 1755810 1799021 1802332 1725316 1727743 1712390 1751301 1764462
6307 1764462 1746126 1766139 1733288 1787745 1867761 1832583 1813838 1763507 1749070 1777496 1835884
6296 1835884 1792940 1738227 1730039 1750761 1710978 1715732 1723159 1664174 1771974 1838262 1866750 1838464
6284 1838464 1839621 1876933 1817947 1855539 1917868 1840867 1872724 1921099 1880157 1847240 1873475 1881950
6272 1881950 1855318 1856608 1839562 1836976 1861645 1898045 1874601 1883190 1983599 1996440 1985779 1931759
6260 1931759 1881802 1918960 1952549 1988266 1957305 2011921 1981847 1997116 2069655 2046943 2101030
6249 2101030 2142586 2129177 2109874 2043060 2028848 2070639 2120338 2148029 2137740 2183013 2187820 2229328
6237 2229328 2263409 2276166 2320400 2356200 2362515 2391811 2426797 2408324 2416830 2412003 2469027 2471101
6225 2471101 2439085 2488356 2520250 2547870 2567771 2628041 2649373 2680592 2798588 2881897 2897031
6214 2897031 2922182 2949119 2930474 3003679 3094763 3198033 3315795 3372445 3481562 3516187 3549599
6203 3549599 3591190 3567906 3481164 3461775 3470593 3490375 3472756 3492227 3521752 3589030 3592546 3566713
6191 3566713 3614052 3666922 3700776 3793534 3899033 3932947 3999807 4101936 4204176 4321934 4363739
6180 4363739 4373852 4470907 4499896 4627214 4668502 4679270 4609595 4546404 4518646 4509170 4485706
6169 4485706 4366491 4306889 4234556 4230483 4208124 4208518 4152328 4128788 4073578 4012804 4026589 4087859
6157 4087859 4140670 4174207 4218217 4189456 4204241 4238648 4277063 4273947 4234581 4253695 4213131 4175221
6145 4175221 4143582 4030189 3979848 3937955 3908676 3889118 3876783 3893232 3905121 3912586 3880208
6134 3880208 3858712 3907397 3943592 3982058 3908822 3900015 3970732 3903017 3878836 3907531 3837116 3848296
6122 3848296 3858325 3816352 3706788 3774429 3865623 3747645 3714062 3727845 3711144 3708606 3682611
6111 3682611 3606344 3563802 3520791 3474332 3497347 3500108 3455877 3459625 3463087 3438164 3465979 3456519
6099 3456519 3427175 3459730 3500905 3504406 3515415 3509409 3499196 3519356 3543916 3593764 3562589 3550455
6087 3550455 3599283 3617731 3604798 3697946 3707725 3725452 3693758 3690017 3766744 3832505 3818438 3825539
6075 3825539 3865990 3851589 3826193 3812457 3828146 3761863 3863832 3931290 3916498 3913065 3940439
6064 3940439 4017378 4054627 4082806 4130000 4182818 4192165 4214174 4259840 4350040 4413587 4395979 4442769
6052 4442769 4490369 4622611 4785103 4852232 4840755 5020152 5136195 5273491 5304705 5399861
6042 5399861 5537252 5581312 5634768 5651940 5680824 5719143 5797057 5787963 5698082 5629433 5602690
6031 5602690 5621352 5692177 5778342 5719573 5745244 5716045 5736741 5779851 5746980 5828484 5895489
6020 5895489 5958308 6031904 6195143 6248079 6297832 6329092 6362347 6348738 6371897 6392930 6374052
6009 6374052 6329835 6258998 6165359 6132421 6109235 6044476 5976687 5951988 5922150 5953035 5934445
5998 5934445 5977558 5983588 5955248 5952080 6014835 6040433 6079716 6155567 6249992 6317362 6376588 6427780
5986 6427780 6509317 6559492 6583545 6600008 6713889 6811243 6876842 7048173 7167125 7230626 7317711
5975 7317711 7457325 7513937 7591860 7684150 7787392 7888801 7997674 8108238 8167532 8284924
5965 8284924 8419898 8647096 8787948 8925439 9104207 9371783 9553622 9799812 10119561 10377089
5955 10377089 10645716 10913485 11303596 11640905 12043888 12484736 12928334 13348205 13758727
5946 13758727 14138923 14516455 14864793 15161410 15316021 15360956 15327004 15198919 14989369 14823817
5936 14823817 14614831 14446156 14283900 14055125 13934638 13835643 13738437 13700906 13683169 13730531
5926 13730531 13817159 13916648 14065728 14210979 14376393 14606748 14830233 15096007 15404961 15726279
5916 15726279 16125274 16553045 16900901 17399065 17938946 18413948 18936297 19518991 20201274
5907 20201274 20940640 21703882 22508074 23398610 24403870 25400353 26369141 27292881 28154909
5898 28154909 28951316 29583910 30036255 30364118 30423674 30414375 30237377 29976726 29654404 29308098
5888 29308098 28868708 28449916 28012611 27627102 27243252 26838991 26594622 26376533 26273657
5879 26273657 26183796 26141256 26200627 26378783 26556412 26901644 27245371 27618758 28215427 28808907
5869 28808907 29380109 30105136 30848999 31570356 32289426 32958264 33475924 33912647 34127594
5860 34127594 34222773 34169516 33892030 33541593 33123287 32579024 31927837 31324742 30718891 30133878
5850 30133878 29633005 29282270 28901003 28575675 28298692 28083839 28034980 28133638 28287865 28489733
5840 28489733 28805572 29183902 29703197 30350588 31100342 31887266 32784442 33740952 34683310
5831 34683310 35674430 36709905 37708905 38449828 39095991 39560909 39766001 39760962 39557319 39090318
5821 39090318 38411637 37583987 36775830 35922777 34948400 34081811 33255058 32512060 31862191
5812 31862191 31238781 30692149 30251217 29907726 29696472 29422437 29302308 29189542 29080867
5803 29080867 29164623 29315121 29520389 29709737 29941952 30159688 30438397 30751578 31050234 31315996
5793 31315996 31728237 32266429 32827911 33407059 34018449 34739155 35442482 36144718 36848734
5784 36848734 37559542 38246428 38822299 39286692 39769132 40138866 40445706 40682296 40911340
5775 40911340 41113780 41207366 41145793 40928223 40640315 40214761 39701316 39058972 38263082 37434346
5765 37434346 36512378 35640878 34738170 33817299 32851036 31889399 30937949 29984698 29137908
5756 29137908 28335707 27500957 26812970 26113092 25362952 24680877 24108677 23462286 22815878
5747 22815878 22223596 21684502 21138752 20671196 20260837 19801588 19439351 19121181 18804846
5738 18804846 18472199 18223403 18019604 17804753 17525787 17300495 17102141 16931465 16776721
5729 16776721 16579945 16347412 16124003 15973459 15777324 15630675 15532372 15410667 15303362 15143345
5719 15143345 14970479 14872124 14832545 14735807 14655308 14540973 14613939 14586798 14418274 14340850 14370940
5708 14370940 14346358 14304938 14395206 14388372 14371152 14375027 14373433 14438330 14447134 14564958 14703443 14747770
5696 14747770 14815945 14950962 15104778 15214383 15284985 15487737 15658119 15871779 16130530 16392745
5686 16392745 16716957 16990882 17310464 17666953 18134759 18624085 19105487 19637359 20265269
5677 20265269 20897138 21520139 22115088 22798393 23467628 24070908 24684592 25230272 25744039
5668 25744039 26114791 26378911 26539636 26671482 26797049 26848517 26799261 26755678 26653941 26620394
5658 26620394 26565323 26471623 26347896 26323591 26368450 26438445 26549785 26702538 26948531 27256955
5648 27256955 27727831 28251056 28842774 29598864 30533417 31557593 32688382 33919459 35246526
5639 35246526 36651600 38230854 39925543 41623164 43545565 45749602 48306591 51191672
5631 51191672 54375168 57900512 61843251 66186461 70935004 76083199 81603527 87298598
5623 87298598 93301673 99555957 105885832 112172156 118259882 124086457 129259663 133857538
5615 133857538 137511530 140155053 141713757 142168584 141659348 140328195 138425742 135742061
5607 135742061 132444869 128570962 123985537 118982418 113758273 108601127 103655132 99020714
5599 99020714 94611342 90486377 86709693 83284875 80204136 77488776 75207296 73240489
5591 73240489 71616856 70372512 69463887 68714361 68253238 68038659 67984351 67969530 67956671 67993304
5581 67993304 67997175 67875645 67575570 66986725 66135816 64955404 63494177 61623105 59260267
5572 59260267 56707875 54126925 51644707 49236731 46974502 44804965 42729145 40748559
5564 40748559 38953542 37218635 35574295 34039370 32585524 31348661 30206554 29087799
5556 29087799 28065268 27132631 26334408 25539223 24823016 24245802 23676076 23163639 22725128
5547 22725128 22209120 21897118 21624931 21300370 20953849 20527982 20055619 19571069 19101044
5538 19101044 18669657 18319932 18058457 17835630 17610225 17390615 17205107 17128247 17054369 17029503
5528 17029503 17057332 17157869 17242426 17335387 17463986 17605449 17769465 17823591 17835168 17869224
5518 17869224 17800947 17635790 17379562 17051837 16653606 16255588 15872908 15455963 15029619 14509667
5508 14509667 14039353 13599732 13159244 12779948 12388195 12007288 11725727 11350629 11001078
5499 11001078 10807190 10479432 10203803 9963068 9690043 9555765 9387721 9287534 9092603
5490 9092603 8937898 8827288 8679774 8583267 8469637 8327898 8167419 8116379 8048248 7917910
5480 7917910 7837384 7737237 7607270 7612487 7579025 7524266 7436332 7353555 7342617 7280558 7178774
5469 7178774 7120393 7095691 7070128 6992547 6932231 6889834 6835474 6851945 6817786 6788927 6776859
5458 6776859 6745182 6776609 6799084 6765024 6721505 6774140 6761209 6836540 6908223 6904597 6830826 6790845
5446 6790845 6780379 6782257 6775340 6799398 6733676 6698584 6632681 6615270 6641111 6661448 6629896 6615423
5434 6615423 6560088 6591275 6571417 6572743 6731371 6782764 6789860 6837279 6869610 7017367 7014811 6906765
5422 6906765 6888316 6811040 6797386 6770099 6709463 6606976 6562244 6505040 6443531 6353285 6268512
5411 6268512 6204485 6176469 6136552 6115046 6151175 6071829 6021849 5919376 5883760 5945398 5878130
5400 5878130 5848911 5787160 5730740 5709875 5759081 5829445 5861282 5809085 5798711 5761815 5777585
5389 5777585 5807459 5814425 5864857 5882920 5845266 5862220 5860015 5891435 5879933 5936419 6007252 6007150
5377 6007150 6011814 6042308 6097183 6101181 6112976 6110459 6148274 6168354 6178346 6275268 6383976 6374715
5365 6374715 6445164 6472137 6483160 6515844 6597696 6679764 6773923 6999739 7141282 7391059 7607720
5354 7607720 7826984 8120877 8495976 8868788 9242114 9758746 10393883 11216906 12218395
5345 12218395 13552138 15198897 16831335 18441231 19810303 20713694 21286952 21119412 19776674
5336 19776674 17890662 16071647 14676280 13538139 12635522 11804488 11188804 10569283 9952350
5327 9952350 9435390 8992714 8634342 8300511 7996326 7716460 7507635 7405070 7267755 7141833
5317 7141833 7037002 6933459 6897662 6825436 6825919 6890019 6834664 6846729 6905810 6933035 6985593
5306 6985593 6976257 6943969 6947317 7036261 7095922 7188632 7165335 7255623 7255543 7250224 7268586 7307393 7280328
5293 7280328 7241582 7100960 7086666 7036065 6902391 6867858 6848665 6768304 6655755 6623771 6565958
5282 6565958 6507353 6497461 6529185 6512122 6561169 6622847 6798755 6882115 6975173 7048149 7205442
5271 7205442 7405964 7488883 7534851 7590234 7743402 7712696 7666670 7626322 7593315 7570685 7554791
5260 7554791 7470253 7333833 7154053 7083485 6966644 6804741 6681415 6538241 6423761 6353974
5250 6353974 6274858 6252722 6195478 6051505 5966806 6008572 6082129 6184664 6194553 6230122 6202250
5239 6202250 6172685 6208377 6214376 6242428 6239172 6255923 6254615 6211684 6150670 6045587 5975934 5908871
5227 5908871 5815832 5693063 5603451 5562624 5453745 5387816 5321462 5253766 5152974 5117457 5102960
5216 5102960 5033869 4935025 4945630 4985523 4919604 4820780 4815029 4852298 4895373 4865870 4818616 4811683
5204 4811683 4802767 4776357 4813368 4818948 4760202 4810819 4834563 4810497 4793899 4789143 4774915 4715923
5192 4715923 4713761 4704598 4640974 4658940 4637659 4607893 4623103 4636635 4661647 4634176 4612211 4619299
5180 4619299 4638750 4705335 4815286 4714323 4695924 4750147 4800433 4758090 4716482 4780223 4740079
5169 4740079 4692203 4689554 4684200 4630013 4659542 4645011 4567421 4577451 4648330 4612708 4543556 4572467
5157 4572467 4615529 4676632 4723092 4713427 4663234 4696925 4742301 4771533 4871565 4881461 4862977 4921472
5145 4921472 4889221 4882775 4899882 4910831 4897223 4872306 4804561 4815154 4787847 4810731 4758164 4747613
5133 4747613 4714544 4719481 4755673 4664716 4653785 4658530 4633603 4650716 4690189 4641878 4648077 4579719
5121 4579719 4573247 4599832 4579645 4656124 4685509 4605086 4637838 4692024 4787634 4752317 4745075 4779367
5109 4779367 4834419 4883456 4856529 4942649 4962068 4970969 4969473 4989428 5056684 5121630 5209731 5251292
5097 5251292 5313496 5359068 5355283 5399306 5484484 5579448 5638702 5652000 5647087 5682271 5769236 5836247
5085 5836247 5917684 5997314 6087690 6165468 6268329 6319251 6426140 6588030 6748708 6870935
5075 6870935 7024146 7205349 7274784 7384409 7501971 7629800 7674066 7667345 7731918 7733276 7735749
5064 7735749 7738041 7738442 7714986 7691225 7724018 7701762 7697425 7786685 7800632 7854233 7877821 7979726
5052 7979726 8054540 8097629 8196536 8350161 8545081 8698604 8840086 8998171 9084688 9156989
5042 9156989 9270737 9402088 9478634 9505869 9489348 9485653 9534577 9497549 9560754 9485379 9375854
5031 9375854 9350433 9197073 9097243 9029482 8935786 8918528 8870205 8816018 8778957 8670575 8687363
5020 8687363 8723596 8727213 8823504 8831825 8862251 8891956 8975999 9008319 9128547 9167304 9287030
5009 9287030 9322063 9358024 9529105 9544723 9587544 9653959 9637488 9675490 9726943 9755555 9764362
4998 9764362 9765897 9797048 9902269 9983875 10098799 10239430 10360106 10431671 10584259 10818498
4988 10818498 11017121 11180399 11369541 11583347 11809391 12117607 12444837 12774477 13115678
4979 13115678 13576202 14043771 14582600 15148625 15809606 16442822 17259937 18099460 19093533
4970 19093533 20200223 21423682 22973055 24684026 26779318 29528105 32853915 36418535
4962 36418535 40113030 43463004 46199145 48255557 48864018 47878516 45653381 42560669
4954 42560669 39421466 36954786 35020259 33518514 32299349 31393351 30651269 30007229 29453105
4945 29453105 29006466 28755194 28721969 28871725 29181379 29655520 30219489 30998103 31956118 33111879
4935 33111879 34644092 36624926 39108867 41914958 44994153 48343764 51412165 53902767
4927 53902767 55721765 55955845 54710546 52855262 49956817 46567303 43497319 40993662
4919 40993662 39031520 37301654 35781576 34483505 33240675 32215658 31266652 30405892
4911 30405892 29748614 29229979 28740271 28313078 27919804 27573644 27320699 27092263 26877157
4902 26877157 26728229 26534495 26398008 26309093 26221253 26182375 26138133 26108885 26001053 25987938
4892 25987938 25951881 25983422 25960563 25865836 25845890 25906956 25967823 25897100 25898744 25911208 25919885 25934944
4880 25934944 25936377 25911970 25901793 25946377 25986241 26095303 26259731 26402463 26471176 26626472 26880393
4869 26880393 27129594 27425749 27810236 28163929 28462386 28802927 29136932 29583267 29984886
4860 29984886 30271612 30553280 30736509 30918574 31119701 31246448 31225795 31176092 31120880 31138575
4850 31138575 31162409 31146484 31134499 31158466 31201517 31238475 31390830 31521069 31702405 31851863
4840 31851863 32081841 32400856 32836034 33156493 33546997 34044550 34486740 34991478 35575289
4831 35575289 36109807 36619751 37195490 37776509 38363851 38883885 39448586 40090705 40747611
4822 40747611 41379322 42086373 42819667 43576745 44412336 45208122 46047090 46818969 47407242
4813 47407242 48104180 48768576 49352154 49918673 50472077 50976614 51483793 51954674 52558075
4804 52558075 53298645 54003554 54929157 55969406 57025619 58376228 59925899 61559066 63376113
4795 63376113 65345496 67313125 69377918 71615454 74015819 76380053 78792188 81111406
4787 81111406 83196139 84961254 86352595 87215457 87498491 87195271 86345583 85114815 83750421
4778 83750421 82580567 81556166 80771465 80193196 79969329 79997631 80220053 80634989 81316932
4769 81316932 82244014 83327619 84555679 85748507 86856736 87796187 88472968 88697256 88567274
4760 88567274 87954564 86801044 85369998 83594099 81687167 79650313 77580218 75588111
4752 75588111 73711179 71917121 70310432 68753236 67255166 65900485 64691863 63600004
4744 63600004 62461894 61341686 60275794 59238344 58199012 57288955 56437193 55641685 54881922
4735 54881922 54300833 53833137 53441828 53123513 52920038 52955435 53085843 53245663 53520605 53884191
4725 53884191 54380861 55151557 56042026 57146003 58338793 59673809 61209330 62882797 64764316
4716 64764316 66766311 68963906 71319115 73850209 76506503 79219252 81994933 84780771
4708 84780771 87455597 90030040 92506390 94726643 96569757 98257659 99587273 100640818
4700 100640818 101403465 101837457 102137580 102258874 102249186 102262355 102352125 102569431 102801708 103157390
4690 103157390 103701556 104441336 105368840 106425601 107691168 109068436 110477070 111949573
4682 111949573 113461651 114852811 116125211 117323678 118394706 119232243 119928111 120476327
4674 120476327 120976519 121340549 121653509 121974391 122272009 122450417 122578384 122668182 122649550 122612426
4664 122612426 122465687 122299675 122047640 121761696 121469767 121252507 121009140 120779021 120729401
4655 120729401 120857220 121090128 121314236 121647070 122032915 122343433 122597188 122851640 122795281
4646 122795281 122519148 122064784 121270884 120318281 119288419 118260631 117198720 116265878 115411868
4637 115411868 114737328 114184438 113754028 113472833 113276581 113272190 113500122 113943842 114571023 115544636
4627 115544636 116778772 118459652 120664155 123325635 126403406 130167435 134599721 139699380
4619 139699380 145574429 152554808 160717645 170223998 181394329 194294969 208270908 222670179
4611 222670179 236457651 248409385 257078635 261355866 260450739 254114609 243370652 230188923
4603 230188923 216591410 203739824 192136634 181651134 172316759 164004864 156434100
4596 156434100 149582783 143334221 137853980 133139432 129021440 125507165 122530345 120036731
4588 120036731 117932130 116313853 115126156 114369001 114045301 114138084 114690425 115830019 117448901
4579 117448901 119582702 122299188 125548438 129378472 133804038 138892125 144796411 151545212
4571 151545212 159252182 168069595 178121581 189540199 202100020 215536118 229444254
4564 229444254 243073823 255666645 266253441 273899944 278139980 278941062 276788906 272675924
4556 272675924 267813740 263261588 259868822 258480137 259541827 263162087 268924288 276460229
4548 276460229 284766822 292498168 298544756 301228024 299464086 293289297 282884558 268879879
4540 268879879 252659458 235646813 218904469 203358721 189502408 177384359 166577443
4533 166577443 156966087 148299233 140502420 133539859 127391846 121915508 117109268 113017011
4525 113017011 109517813 106579503 104139321 102276814 100752719 99743921 99133261 98890157
4517 98890157 99230127 99922759 101018484 102589773 104546143 106936800 109786437 113092814
4509 113092814 116960319 121366726 126451548 132282271 138805609 146076079 153939617 161911100
4501 161911100 169574935 176247943 181317011 184318064 184924274 182803102 178016669 171273697
4493 171273697 163280395 154643111 145971143 137597697 129673342 122136247 115092348 108486117
4485 108486117 102355707 96598640 91231248 86325812 81807405 77760935 74008169 70535035
4477 70535035 67280735 64348592 61662515 59178219 56819556 54664104 52735524 50979001
4469 50979001 49224475 47714672 46377406 45052570 43898905 42782540 41706674 40785571
4461 40785571 39969181 39146695 38377754 37731930 37068134 36465934 35934962 35499032 35206573
4452 35206573 34874791 34628522 34295354 34022090 33696688 33250521 32830992 32270862 31784544
4443 31784544 31210792 30634786 30110168 29644369 29139588 28721744 28353008 27989530 27611231
4434 27611231 27335583 27095105 26897924 26691449 26451538 26305189 26144048 25964710 25870272 25749872
4424 25749872 25633289 25545722 25386875 25310505 25160566 24902333 24745785 24562486 24400928 24273390
4414 24273390 24148678 24115394 24101237 24195356 24304689 24391294 24512410 24623782 24764031 24962611
4404 24962611 25149080 25273597 25351369 25256551 25165717 24873085 24453134 24002513 23477370 22966457
4394 22966457 22462591 22041909 21684755 21330820 20995631 20698930 20439806 20167106 19951731
4385 19951731 19743034 19547143 19380772 19183929 19084389 18997548 18739937 18498571 18376520 18213043
4375 18213043 18031510 18008512 17988350 17913375 17944407 17971581 18165358 18445874 18746446 19113625
4365 19113625 19619276 20044059 20374360 20649019 20782964 20858783 20837759 20723557 20635642 20561081
4355 20561081 20506954 20362447 20227213 19997327 19486001 18896839 18257691 17562643 16964603 16443362
4345 16443362 15965762 15556792 15214143 14916923 14673349 14394647 14228804 14026191 13774989
4336 13774989 13579423 13397891 13209244 13191568 13085618 12936437 12914559 12852948 12835973 12797974
4326 12797974 12722228 12765584 12772673 12741898 12762257 12796866 12777365 12786996 12698946 12640763 12605981 12669842
4314 12669842 12710380 12681869 12745286 12874466 12960229 13117800 13176711 13307111 13487929 13684982
4304 13684982 13865057 13987196 14164381 14333863 14595618 14928872 15325741 15670502 16073139
4295 16073139 16403555 16650852 16819600 16682112 16308982 15999289 15705256 15577586 15525944 15550497
4285 15550497 15572813 15584017 15625301 15721212 15790065 15896899 16050344 16198173 16397583 16639856
4275 16639856 16772008 16981436 17217825 17370731 17567679 17783805 17952388 18179935 18495468
4266 18495468 18848131 19194846 19526520 19949266 20334140 20765015 21225817 21667091 22134037
4257 22134037 22481770 22842180 23197093 23617068 24076335 24565073 25030443 25641295 26315216
4248 26315216 26981312 27657030 28311142 29021146 29581399 30005256 30581863 31133065 31716989
4239 31716989 32319618 33016574 33800238 34654036 35603855 36524372 37355659 38095022 38809965
4230 38809965 39351900 39694260 40037335 40299133 40494340 40677324 41011680 41407053 41742570
4221 41742570 42079081 42490721 42832142 43050065 43289236 43312202 43120379 42695777 42164090 41597281
4211 41597281 41058579 40468377 39945453 39343927 38799821 38323138 37811097 37318047 36748454
4202 36748454 36091421 35343627 34493861 33619414 32715369 31749916 30803666 29904181 28997294
4193 28997294 28156334 27475961 26769405 26019511 25290734 24572616 23814477 23092964 22490829
4184 22490829 21799219 21206798 20659434 20099836 19611944 19056878 18459744 17906379 17319309
4175 17319309 16793591 16165802 15511882 14972949 14448459 13904289 13355346 12938755 12440854
4166 12440854 12030432 11640224 11326266 10966833 10648716 10291136 10023231 9819540 9508743
4157 9508743 9279562 8972501 8759904 8627462 8536495 8355122 8154437 7980299 7858341 7705659
4147 7705659 7605969 7505965 7445684 7309799 7249897 7218299 7104898 6990472 6920271 6874424 6782252
4136 6782252 6712803 6651286 6583777 6513422 6413328 6312487 6210212 6052119 5989273 5934724 5839974
4125 5839974 5783820 5726907 5654329 5578709 5489966 5445279 5398767 5371122 5285378 5252298 5203927
4114 5203927 5182139 5187441 5093507 5089288 5066315 5131081 5143471 5112318 5049649 4936526 4929909 4920904
4102 4920904 4784089 4676506 4662143 4580535 4550318 4498201 4437166 4464356 4422562 4335324 4257255
4091 4257255 4178576 4135414 4124272 4156756 4133860 4104349 4068600 3996312 3936416 3899343 3836825
4080 3836825 3853026 3870156 3853581 3778110 3686047 3627775 3715609 3771077 3698013 3637435 3652868
4069 3652868 3589680 3533006 3507378 3409937 3365385 3344338 3441282 3498751 3428059 3373350 3385561
4058 3385561 3362215 3368689 3380942 3346720 3259042 3236237 3290182 3237689 3285646 3286144 3260431 3222548
4046 3222548 3113769 3175846 3166460 3113490 3164926 3097586 3125728 3108661 3068937 3066720 2988205 2990568
4034 2990568 2896340 2906209 2900300 2930406 2858399 2874621 2911187 2869676 2883763 2900468 2952248 2889050
4022 2889050 2784038 2825752 2875659 2893760 2941797 2883690 2853125 2826144 2882470 2901658 2878989
4011 2878989 2765873 2771218 2797049 2759396 2757529 2771125 2823847 2766302 2726620 2798636 2775166 2741211
3999 2741211 2689252 2798143 2757585 2692389 2713649 2694271 2677608 2608922 2619768 2644564 2673008
3988 2673008 2613778 2551732 2558255 2588889 2541368 2566764 2575369 2592738 2589245 2545953 2548982 2522278
3976 2522278 2477162 2513091 2525558 2513022 2506175 2524141 2551767 2579211 2600771 2551238 2488529 2474219
3964 2474219 2458162 2457449 2448170 2417913 2429570 2431072 2439979 2557967 2513016 2483779 2494641 2547616
3952 2547616 2524592 2550354 2565697 2504314 2489810 2531840 2517652 2467073 2427622 2435463 2446851 2415118
3940 2415118 2409490 2464643 2460396 2441514 2433748 2446620 2535029 2559180 2545002 2563948 2515761 2493458
3928 2493458 2570491 2581115 2590693 2510933 2491334 2408178 2450450 2431644 2499569 2535818 2514869 2495693
3916 2495693 2508354 2492383 2517736 2505552 2477179 2499289 2483653 2540434 2451410 2438610 2515232
3905 2515232 2564052 2554437 2460899 2523901 2506019 2466826 2510420 2473931 2464981 2523125 2501602 2484042
3893 2484042 2501811 2519508 2498507 2525539 2448847 2420452 2419181 2482814 2503053 2466216 2461412 2375165
3881 2375165 2415283 2469862 2464551 2458717 2482901 2456356 2463780 2444135 2477170 2414825 2476949 2498328
3869 2498328 2463456 2494508 2507549 2511810 2484673 2475342 2416118 2404211 2457974 2463342 2462886 2455118 2465092
3856 2465092 2490869 2503072 2520853 2532522 2537652 2545707 2619385 2651258 2620319 2673709 2658260 2657901
3844 2657901 2646519 2605249 2656635 2669474 2707624 2674182 2718064 2671509 2636136 2682137 2689368 2656788
3832 2656788 2641723 2699998 2641015 2685575 2665353 2582458 2672176 2736417 2753568 2737717 2718038
3821 2718038 2708420 2704590 2782417 2744461 2779244 2771311 2785957 2742053 2738888 2737184 2836162 2909732
3809 2909732 2945031 2897520 2849457 2869623 2951270 2971774 3037617 3059295 2999473 3011514 3124247
3798 3124247 3132302 3052747 3043888 3056853 3088339 3156441 3215766 3339481 3435703 3353055 3352820 3330276
3786 3330276 3371389 3428465 3472260 3493414 3556674 3519397 3494570 3584834 3709371 3666172 3700562
3775 3700562 3791509 3845663 3790720 3825694 3841657 3860095 3933897 3940373 4016104 4055922 4073514 4137901
3763 4137901 4167495 4265243 4293313 4322281 4312208 4264583 4308064 4390685 4424698 4397642 4371246
3752 4371246 4398538 4467277 4484777 4524396 4507391 4446459 4512457 4485548 4483580 4512045 4557438 4536100
3740 4536100 4576766 4575940 4516167 4504967 4509528 4545500 4556237 4565386 4531957 4430808 4412867 4468392
3728 4468392 4486234 4474333 4476733 4523842 4507545 4515679 4442506 4455137 4506998 4532603 4539341 4588973
3716 4588973 4666370 4600785 4621488 4638614 4641903 4747912 4737511 4820401 4832255 4906713 4952675
3705 4952675 4973523 5026119 5120871 5177810 5158639 5223353 5277241 5349802 5436680 5536007 5677111
3694 5677111 5658767 5623851 5700061 5774742 5915901 5910065 5951269 6090087 6189697 6294722 6336888
3683 6336888 6396787 6479617 6580644 6689667 6774140 6877526 6987952 7125012 7223599 7364737
3673 7364737 7508320 7632268 7790851 7980555 8120604 8309048 8450065 8593315 8765596 8957175
3663 8957175 9062521 9197032 9404766 9538299 9655202 9813230 9973882 10143633 10277312 10435313
3653 10435313 10602922 10719368 10872293 11034713 11136723 11238247 11267954 11305975 11430268 11494851
3643 11494851 11635827 11723364 11777788 11800818 11791601 11797266 11822497 11903582 11936478 11971690 11990243
3632 11990243 12038597 12055160 11986590 12053097 12095109 12147145 12153879 12229847 12256785 12304703 12335451
3621 12335451 12434233 12426633 12455399 12499775 12614364 12674981 12868734 13001925 13106639 13241068
3611 13241068 13389087 13596006 13790273 14041454 14238185 14384666 14596657 14857260 15133214
3602 15133214 15341854 15509592 15746077 15927717 16121271 16328370 16530606 16681663 16898585
3593 16898585 17084029 17291375 17482123 17705868 17887795 18060276 18306218 18526399 18748378
3584 18748378 18926304 19091044 19348266 19538587 19738059 19932344 20122939 20325891 20686061
3575 20686061 20972376 21315756 21689318 22155771 22616933 23153596 23664890 24414931 25174719
3566 25174719 26015948 26933548 27769559 28682856 29582139 30438656 31208620 31857621 32475490
3557 32475490 32996767 33351955 33635741 33913388 34194020 34461642 34766891 35067483 35457622
3548 35457622 35855569 36213842 36540121 36899693 37110229 37243948 37168836 37132791 37099402 37043468
3538 37043468 36975650 36927160 36876886 36925911 37047506 37255418 37679330 38190127 38617536 39192678
3528 39192678 40007301 40808751 41793492 42882748 44121824 45500051 46998118 48697044 50471003
3519 50471003 52435669 54548825 56823859 59388716 62045740 64972061 68074549 71484430
3511 71484430 75226690 79071633 83084349 87360389 91876217 96559746 101377161 106133602
3503 106133602 111092739 115984037 120723991 125406286 129863298 134198495 138352540 142284364
3495 142284364 146148095 149790968 153380192 156934784 160403802 164000944 167640754 171370892
3487 171370892 175334089 179428261 183651020 188092564 192781843 197655734 202663866 207814497
3479 207814497 212927055 217965594 222746553 227221186 231100471 234364985 236943065 238671629
3471 238671629 239784884 240258056 240165132 239760138 239057004 238267791 237402972 236310049 234969278
3462 234969278 233299161 231009203 228050912 224334010 219747291 214227293 207926229 200984270
3454 200984270 193536813 185696152 177754679 169895102 162140984 154589636 147330098 140491912
3446 140491912 133969932 127814566 121995367 116577795 111538196 106817791 102436903 98385207
3438 98385207 94625755 91267747 88076489 85189132 82433170 79946304 77745614 75724477
3430 75724477 73966919 72374376 70967196 69816962 68802322 67910472 67242494 66645505 66050883
3421 66050883 65242231 64625602 63669514 62315917 61029914 59853891 58818612 57871566 56998257
3412 56998257 56102798 55342520 54612188 53908530 53313176 52707460 52241313 51861869 51475152
3403 51475152 51200716 51048989 50959072 50911380 51030273 51253121 51633270 52192671 52998800 54051114
3393 54051114 55210512 56403767 57654075 58624525 59459179 60062905 60034444 59539411 59102887
3384 59102887 58954448 59041611 59236326 59451104 59875904 60419418 60989745 61686883 62375412 63234220
3374 63234220 64087875 65116178 66199848 67380478 68615367 69823028 71029210 72204863
3366 72204863 73304636 74227665 74997345 75526996 75996334 76320655 76511654 76686259 76711523
3357 76711523 76698804 76594881 76202655 75756617 75433031 75243281 75159851 75377686 75611573 75898078
3347 75898078 76253803 76628828 77028689 77457899 77912598 78443965 78979008 79634296 80377644
3338 80377644 81321443 82460748 83677544 85142240 86838136 88666029 90673721 92780045
3330 92780045 95013949 97389862 100031090 102665822 105317117 108099226 111037655 113960151
3322 113960151 116880746 119959550 123065897 126201035 129496953 132822542 136110332 139304332
3314 139304332 142423678 145546101 148580059 151492132 154282589 157005692 159658005 162258763
3306 162258763 164748408 167116938 169403468 171650797 173793524 175850417 177763302 179552298
3298 179552298 181212916 182519186 183442098 183901277 183812741 183268219 182074813 180161604 177691526
3289 177691526 174721030 171102544 167101067 162765798 158231224 153505079 148648648 143840867
3281 143840867 139089454 134342363 129674825 125010303 120392166 115847755 111447629 107164430
3273 107164430 102841248 98681231 94583739 90587894 86856518 83198466 79702329 76582905
3265 76582905 73428294 70484076 67767691 65317236 63046883 60881689 58880974 56979106
3257 56979106 55329030 53751126 52314833 50947188 49760247 48643227 47653574 46867775
3249 46867775 46091493 45424062 44840163 44357455 44045983 43761202 43568297 43463639 43422158 43398559
3239 43398559 43382611 43434650 43492430 43574200 43576534 43534226 43453209 43360872 43151159 42952059 42650997
3228 42650997 42201613 41771187 41364568 40806899 40187265 39550951 38801950 38031040 37263165
3219 37263165 36471537 35536049 34611033 33662465 32689678 31753557 30934303 30062854 29218733
3210 29218733 28476483 27811707 27088089 26383401 25777387 25283936 24848364 24345029 23913448
3201 23913448 23510827 23162523 22881349 22601234 22381108 22179249 21904210 21607321 21379594
3192 21379594 21193967 21033249 20820873 20597400 20514100 20412390 20266884 20195815 20049080 19942864
3182 19942864 19901824 19723923 19497246 19426461 19317601 19277956 19221918 19091537 19040758 19082821
3172 19082821 19089729 19057721 19042512 19115609 19137596 19129073 19210972 19296556 19465027 19543404 19662081
3161 19662081 19803430 19999887 20192582 20297855 20417524 20646377 20858748 21004552 21290469
3152 21290469 21577819 21786829 22106967 22495793 22880944 23345306 23810938 24294967 24885091
3143 24885091 25478149 26162112 26833311 27541614 28237101 29005588 29856209 30826405 31886077
3134 31886077 33032271 34248083 35468168 36764337 38154715 39666576 41307230 42935368
3126 42935368 44603264 46457046 48403962 50471341 52594973 54727715 56988575 59378430
3118 59378430 61787284 64261966 66892565 69643275 72702933 76007960 79546535 83305691
3110 83305691 87358253 91753819 96329850 101217633 106505128 112142354 118194527 124825096
3102 124825096 132115275 140042992 148872548 158571136 169118114 180543801 193023331 206482718
3094 206482718 220936790 236565937 253436214 271951377 291935561 313177533 335577329
3087 335577329 358661790 381089907 401424800 418250841 429660416 434608512 433318248
3080 433318248 426133338 413271861 395409848 374031509 350931878 327602930 305051096
3073 305051096 283702424 263725966 245260154 228218240 212476739 197942370 184632026
3066 184632026 172475009 161455895 151355171 142113473 133698517 126039872 118939959 112451799
3058 112451799 106410934 100865465 95693588 90826209 86327482 82216779 78409055 74835533
3050 74835533 71434703 68337778 65399138 62643175 60159538 57780664 55565948 53430149
3042 53430149 51395542 49560393 47761498 46091625 44470833 42961163 41639288 40365037
3034 40365037 39070653 37893850 36805768 35736755 34792027 33809043 32902790 31985869 31057662
3025 31057662 30099447 29299946 28543419 27834092 27038908 26294468 25613288 25011062 24362383
3016 24362383 23856987 23221484 22670249 22214976 21736197 21273718 20758273 20389696 19987107
3007 19987107 19579829 19208193 18798877 18379333 18024860 17784632 17445564 17126285 16852175
2998 16852175 16481070 16252371 15893722 15631948 15341360 15027854 14770266 14491230 14261030
2989 14261030 13990646 13734650 13538932 13316003 13090250 12841283 12638058 12445341 12230663
2980 12230663 12047185 11844493 11686161 11513018 11367748 11221803 11026181 10801862 10706191 10506250
2970 10506250 10275934 10102629 9844320 9685560 9597752 9459351 9271297 9085097 8974823 8862249
2960 8862249 8732154 8615515 8496459 8384693 8259934 8119027 7932222 7790408 7654273 7557496
2950 7557496 7413218 7295977 7199056 7207489 7081416 6953611 6871312 6797412 6687864 6589125 6551692
2939 6551692 6423938 6397594 6305763 6162231 6096772 6027708 5909810 5836690 5800802 5725838 5628631
2928 5628631 5588054 5532021 5470805 5451935 5419913 5372275 5275238 5227986 5165131 5135941 5124247
2917 5124247 5101467 5069308 4968503 4928215 4842000 4835457 4832327 4741846 4674842 4683572 4663546 4641485
2905 4641485 4520165 4504478 4484892 4430390 4413603 4327561 4274044 4206285 4185376 4165842 4121055
2894 4121055 4123537 4033216 3951942 3966732 3922551 3841397 3814123 3839153 3840077 3817091 3790424 3807139
2882 3807139 3725341 3716557 3700006 3620198 3606257 3569221 3530043 3513351 3475006 3472394 3484235 3428007
2870 3428007 3322097 3344285 3357469 3254223 3212684 3247211 3216540 3166606 3171038 3172486 3157094
2859 3157094 3102749 3096959 3151924 3123162 3128023 3133947 3090553 3117749 3133981 3185426 3163901 3154756
2847 3154756 3125067 3023697 3069564 3054143 3001415 2980574 2974575 2995436 3000111 2997305 2961162 2928734
2835 2928734 2964756 2991249 2995263 2962323 2929188 2892697 2931170 2938730 2912099 2868298 2844143 2938112
2823 2938112 2948337 2984959 3006647 2950929 2972877 3036039 3060307 3086055 3145121 3258649 3258567 3329785
2811 3329785 3306029 3354564 3490321 3553985 3625886 3642623 3731567 3918202 3978155 3917328 3988905
2800 3988905 3984358 4050356 4058899 4043159 3919892 3768049 3688436 3554553 3455858 3361143 3224117
2789 3224117 3065562 3008668 2931350 2852722 2689740 2626255 2551846 2412538 2405188 2373764 2314186
2778 2314186 2216299 2111466 2071402 2135204 2113097 2014920 1973817 1869213 1817724 1800986 1832754
2767 1832754 1778885 1687405 1670682 1648692 1614258 1650608 1593829 1563500 1575346 1522235 1545066
2756 1545066 1517605 1464076 1446542 1431305 1449649 1455500 1396841 1335478 1285040 1300965 1301917 1307621
2744 1307621 1353858 1336836 1337159 1383678 1368880 1270836 1263846 1201258 1159984 1160702 1112345 1089291
2732 1089291 1098596 1116227 1108621 1155323 1154805 1096797 1104976 1050822 1023569 1024908 1032860 997611 934711
2719 934711 972196 1032312 1024350 1040077 1008512 1004443 1044820 1026544 1019949 971435 968964 962485 975583
2706 975583 976352 1000889 973515 981290 898757 926353 965962 922191 799410 836876 925502 926764
2694 926764 893891 897888 935620 932219 864746 875110 912508 841210 837818 845926 874655 885893
2682 885893 869829 870153 827535 804054 788442 748307 744842 777382 803255 807905 787776 812602
2670 812602 713729 738118 782196 721697 713703 704830 757616 746872 778802 707753 691833 666878
2658 666878 693121 683041 655627 669438 685319 708379 729389 601804 629093 626318 649105 604402
2646 604402 591433 601392 554258 605507 534560 580174 649951 685779 636180 644402 650995 630189
2634 630189 609431 606025 533801 561850 596333 589970 614129 628547 550578 573788 607262 623534
2622 623534 663757 520460 532295 498608 459091 542132 539414 544224 501000 487076 489267 491455
2610 491455 479057 510946 481008 505288 539343 511568 500673 504341 548594 553180 550633 488712
2598 488712 490178 419165 450137 397532 344655 410279 429462 430285 439934 421991 405106 430394
2586 430394 491327 465934 419326 420503 425679 458409 392008 418956 429404 389602 469042 414731
2574 414731 427784 458969 438921 429179 407550 452682 439617 445549 405183 405236 393872 368511 353891
2561 353891 376733 398491 356238 330330 335843 364448 342003 307661 340855 336471 356456 401192
2549 401192 379770 379515 428200 376673 339891 342732 357228 357506 349245 310732 342761 345870 321422
2536 321422 312472 318455 336708 356358 364235 310621 335797 339263 297494 270588 328168 339906
2524 339906 323316 333751 324028 352571 399852 425400 455470 390793 332086 333449 285064 276007
2512 276007 307294 263991 314747 292376 296834 348521 380839 374966 361416 309571 302232 316877
2500 316877 417386 343034 256043 269732 296568 266270 187298 225380 281354 332055 311610
2489 311610 287291 297007 276989 309575 312914 263082 188271 275055 321301 312620 374023 317817
2477 317817 309741 333857 393336 349577 272023 265727 278589 301839 221172 277285 276594 186224
2465 186224 212927 208189 227978 164830 205651 220128 253759 269008 305633 302969 300410 301221 294339
2452 294339 299024 327356 305147 332311 325043 270067 196835 267258 310555 297880 275247 307217
2440 307217 305752 372516 340539 339412 326711 304176 262597 248744 276959 250022 265269 283708
2428 283708 311817 301343 369650 338146 322367 294134 250642 242698 262301 302059 295093 249063
2416 249063 212015 224219 236394 213510 216072 215452 175887 228084 236930 224239 269849 268903 275406
2403 275406 268056 305424 280579 254428 300771 381556 411815 389615 401627 403611 385268 394588
2391 394588 361231 371054 509744 503689 478748 526598 524906 605902 609471 618458 668066 807529
2379 807529 861607 947686 1023582 1023114 1111778 1222364 1375958 1630656 1800986 2086114 2365016
2368 2365016 2661595 3057890 3421043 3604518 3637758 3549027 3155434 2725171 2390909 2124564
2358 2124564 1944756 1747258 1616854 1473122 1381285 1251716 1117255 1052822 1055759 994237
2348 994237 856269 812798 824671 722643 648831 606280 572012 602551 581250 562826 480755
2337 480755 490275 517881 518336 468204 393951 416657 432925 386025 373021 353490 334016 330509
2325 330509 345374 334831 316769 283322 304982 302018 325481 359832 252022 216405 192760 240317
2313 240317 240860 246728 256121 280330 266532 205712 244511 273317 248912 182023 122704 120582 157127
2300 157127 140925 160714 132854 173702 238586 267104 210553 197199 198243 138811 137074 152671
2288 152671 115205 111481 187176 203256 165957 192266 180417 185136 229742 182349 149483 185056
2276 185056 212129 146047 103278 64668 99714 169898 154735 166489 183510 155934 180213 197637
2264 197637 180600 176423 141550 151550 189606 154727 198732 178630 137772 114690 117375 157269
2252 157269 111538 115939 102415 100223 111521 173117 151454 167576 173732 191499 186655 187575 171956
2239 171956 175721 216580 175106 154323 199708 163026 178936 122906 181940 142245 109748 172407
2227 172407 183727 159653 120347 75699 121444 141888 112538 115294 94054 118793 109835 115400
2215 115400 121041 188549 197420 133716 80796 18430 -10047 10208 49572 153534 103641 37792
2203 37792 16456 116299 103064 41988 73043 140364 124734 132937 148441 132374 65085 32449
2191 32449 31973 67855 76710 87043 83401 61482 119568 130802 147811 88922 96948 76845 85650
2178 85650 111685 112907 78581 164935 168284 81965 76879 77895 96667 49822 80507 88821 105020
2165 105020 89822 31881 65024 85388 125576 90149 66045 34685 33019 80530 51781 73914
2153 73914 80942 42801 101176 111571 31124 57709 36878 568 9334 94846 114630 62427
2141 62427 90712 75576 -1361 -13016 19744 28575 -44244 55838 22244 6010 77627 79756
2129 79756 88509 55988 8094 49590 37837 7854 78469 71872 43597 66462 35662 56877
2117 56877 119026 119456 -39589 -30285 46980 39376 16404 35700 -18303 22302 67396 -9016
2105 -9016 62506 87465 39791 -2374 -37728 4912 45834 44999 -7353 97865 68990 47244
2093 47244 100027 77242 51371 14625 102881 61804 41214 22313 22542 42351 15076 -41092
2081 -41092 -24293 33076 53412 60651 164437 193012 122493 98714 82581 -17671 60719 130749
2069 130749 149072 103697 35535 42299 42003 30181 57946 40996 15315 -4937 23553 36198
2057 36198 90392 83834 50627 -3599 6785 23395 -22382 -22175 50501 74086 76555 89038 106570
2044 106570 46415 94494 140726 70783 61050 105567 113359 116948 123920 68489 54236 57960 62819
2031 62819 32904 25605 92041 110939 88532 70631 137674 92018 78682 93905 81677 109667
2019 109667 47525 17941 12362 66598 7251 9819 71078 32830 42226 38881 35807 78902 68863
2006 68863 85582 106050 32045 -20799 17152 -2483 -63260 -42305 -62542 -14279 5376 -1706
1994 -1706 -8879 -43438 -4117 -62121 42904 60102 -1556 -40410 -1208 50834 13842 -3637
1982 -3637 11206 10605 2752 39523 32115 23307 61506 63351 45050 32027 32118 -8898 51339 16143
1968 16143 13644 44044 44869 57364 5346 -1910 -16226 -5888 43285 56982 48497 -165 -27526
1955 -27526 -45430 -63602 -41002 -46062 -14983 61797 52602 3608 49597 47117 89105 29864
1943 29864 -44094 -88040 -56656 -35173 -69781 3075 25913 -12924 -53536 7307 -25033 -12335
1931 -12335 -29646 -42737 -17941 -19442 6833 39773 31969 -3649 -39466 -78457 564 8215
1919 8215 -17042 -38887 29047 60795 -29140 -18073 1396 -2212 -47471 -36084 -26108 20269
1907 20269 43841 35486 23638 12831 21244 18460 7601 36850 69815 81797 107611 40801
1895 40801 11171 48629 85909 73434 -17192 28745 24540 -7264 11973 -18778 -3950 -28970
1883 -28970 -17477 93745 132785 80733 48750 -760 -34881 26225 45662 20765 25931 47017
1871 47017 39945 67952 39164 -37803 60361 140102 41655 -9892 3348 -41528 37265 -52620
1859 -52620 -33171 61152 -10988 -32990 -57104 21206 93235 68647 2530 -11681 6015 33696
1847 33696 19872 -30409 25165 87816 84346 46048 1134 30885 65176 10966 -6501 -32439
1835 -32439 -7900 17693 50315 69506 31661 8102 -27045 -71130 54301 54551 -30882 -20866
1823 -20866 -10018 18456 78036 64218 66693 32876 -1920 42168 40549 -26468 36538 62057
1811 62057 88973 59546 60239 13211 -80861 -25014 25003 2406 21462 41533 54340 48247
1799 48247 78305 34634 -17937 33382 94020 9483 -31844 -13623 -2042 38214 -269 -32200
1787 -32200 -63670 16259 -26533 -40120 -22342 33440 14197 -9586 21563 19446 -3439 -7905
1775 -7905 -8377 -39777 -18911 -30457 -66765 -44242 23368 75061 -3278 -58094 -40084 -1824
1763 -1824 -9193 23139 4362 11605 57208 60630 31888 66877 34879 33435 10223 24674 -34867
1750 -34867 -15884 -14506 11140 68581 46669 -36854 -46076 -58379 -79479 -25662 22459 11131
1738 11131 -2267 -13768 -1503 40744 16738 -1438 13040 36964 18614 24752 39460 72681
1726 72681 53386 24057 -69274 -4416 -3637 -66869 -72453 6313 19266 -2112 2356 20531 61280
1713 61280 33099 93517 103956 81683 18693 -19284 2941 -23735 -5664 19200 17802 -6638
1701 -6638 -68104 -35711 -4834 -830 -24277 -33282 -45884 -20598 25224 16193 -245 -24762 -23858
1688 -23858 27710 106392 27302 -8329 4251 55409 40341 13340 -9545 -145 -10373 -67699
1676 -67699 -24327 8457 29838 68905 82059 75067 44558 -17329 -60603 8961 6826 -15774
1664 -15774 55279 50372 -30530 7088 -488 -60636 -104350 -159452 -127715 -67906 -101285 -108891
1652 -108891 -54784 9422 -58166 -68291 29407 51545 -4570 -18291 -13605 -43287 -75148 -31816
1640 -31816 -47859 -54362 -19203 -3267 -284 18155 -14268 -37571 -3802 -23863 -11382 -105
1628 -105 -2302 8338 23115 -8924 -11041 -29003 -48309 -7868 -6480 -95067 -71428 -69931 -37327
1615 -37327 -21748 -42637 -23142 52056 4877 -18015 36800 50106 16321 22278 98905 14513
1603 14513 26667 65115 -2504 -50949 -34888 25364 37588 20974 12970 96243 48301 85079
1591 85079 -14150 -84298 -38163 20527 11172 -49988 -56289 -51644 9469 -33093 -104631 -91298
1579 -91298 -85787 -56537 -61534 -71102 -32351 -93031 -91234 -62211 17992 -17461 -39915 34457 29466
1566 29466 40907 13727 -76603 -43865 30449 48560 85601 93072 110849 61860 -6017 -12644
1554 -12644 -17742 12860 38814 11694 -46927 -1855 -9083 -19343 46465 108833 70954 57875
1542 57875 84313 14806 -14029 45891 -16950 -5768 -42498 -80441 -84048 -125039 -69836 -29578
1530 -29578 18245 6222 -14894 8038 74262 29017 -41638 -14541 -36220 10436 -921 -32424
1518 -32424 -58934 -74526 -16293 28551 -38679 -41953 -29110 -27413 23885 59798 80729 44828
1506 44828 28827 -45121 6949 -8946 -61541 -116708 -103456 -15448 23265 40604 -11758 -33975
1494 -33975 -11976 -43717 -19329 1909 58527 119812 15799 -1174 -21753 -35227 -49425 -37234
1482 -37234 24572 -5033 44014 46337 52112 -4335 -48467 1413 -37329 -22444 41172 29123
1470 29123 3306 53053 30796 24722 -41933 -75522 -5588 -23258 -19925 -47584 -89903 -57709
1458 -57709 -23008 -36490 -35756 -45849 -9137 -7704 -35606 4251 -4607 -27898 -23701 2913 -3366
1445 -3366 -2826 18769 -109661 -42927 58671 -3238 -28754 -18519 -4127 -89482 -49387 4354
1433 4354 8906 -28242 -52947 -33665 -38206 -68552 -86482 -81752 -86146 -45977 -45338 -9550 -48973
1420 -48973 7145 45088 6355 11632 -24334 -24651 -54381 -13576 -22347 -29538 -5139 -4215 15226
1407 15226 45332 11712 1855 3887 26125 -11910 -64279 -83836 -44147 -16641 -8328 -10962 5328
1394 5328 49361 -4987 6146 -39874 -33999 -1975 60292 -14385 -103792 -40041 -21734 -3929
1382 -3929 -6994 -36577 -37985 11511 -12632 25487 -26414 -3292 -11876 -37951 -51617 -60378 -710
1369 -710 22439 23695 -26933 2314 887 5489 -28671 -67002 -96696 -64797 -48463 -64159 -95643
1356 -95643 -97371 -96749 -59080 -51387 -68856 -86254 -66441 -33038 -34565 -45064 -25655 13695 42017
1343 42017 15794 -30161 -122605 -78076 -14355 28199 10062 -42356 -47202 -52783 -47678 -103092
1331 -103092 -83010 -37140 -79677 -49335 10711 -11793 25308 22643 40200 682 5443 8073
1319 8073 40302 3475 -26318 -97077 18784 91046 29692 92196 40434 -15711 -20463 -85954
1307 -85954 -87183 -62708 -28989 17400 8502 -26987 -6371 -25875 -12007 -7360 -36727 -23152
1295 -23152 -63343 -49939 8714 -44281 -28676 -47678 -85952 -95497 -43470 -32565 -113866 -32566
1283 -32566 -66591 -48898 -66597 -83704 -89233 -5320 -38332 -60477 -72183 -45488 9630 84900
1271 84900 25471 -15469 61472 6495 -6060 -26418 -42650 -28695 -35224 -77038 -78583 -68153
1259 -68153 -56438 -70559 -34913 -3698 -57645 -52166 -49923 -72174 -19111 34976 44673 56382
1247 56382 56717 19954 15831 1211 -26004 -52480 -77431 -123318 -24070 32483 -37925 -55357
1235 -55357 -73832 -47568 -70124 -85396 -92163 -104656 -59356 -78979 -72807 -32633 27120 -18249
1223 -18249 -53510 -80612 -52844 -27800 -53642 21824 88558 -15101 -64196 27678 -4899 -47848
1211 -47848 -44927 -8116 51603 -59950 -81619 -30647 -50493 -50145 -74594 -42832 50583 19659
1199 19659 -29884 -3300 22472 30321 -18900 -90002 -32727 28556 -58854 -33860 25892 47088
1187 47088 54692 877 -44431 -36844 -51387 8053 58038 23621 -21974 -3592 -19115 -11548
1175 -11548 -18977 40001 44925 3816 -64460 -60526 -54231 -86113 -3527 -26826 -47505 -31046 -24990
1162 -24990 -82457 -54428 -88686 -75163 7416 23044 13263 -25356 -21161 -32150 35706 30320
1150 30320 95780 100805 24483 61377 1143 -50284 -76287 -62565 -9312 -23997 14894 16275
1138 16275 -54685 -50897 -10597 -26047 -57561 -60312 -29883 2077 2880 -7279 9193 66906 92
1125 92 1653 -17886 -67982 -25522 -14227 -42171 31899 62871 47725 -374 -74508 -8650 596
1112 596 -22134 24234 45011 36504 17689 2228 -23068 -65373 -45086 -123859 -85966 -62876
1100 -62876 -71957 -33726 35693 473 -29641 -31277 -39210 -13996 -18 -19838 21213 43605
1088 43605 10095 37475 75049 -2307 -66654 -37501 -56523 -31268 42246 68933 -3380 -39288
1076 -39288 -38014 2 -40452 -84274 -40841 45730 62017 78622 50980 16 17474 1542
1064 1542 22871 70840 40716 5095 -12870 30532 17167 15864 -34071 -16997 -47516 -6593
1052 -6593 -43616 -43453 -11307 -82145 -41392 -50123 -65085 -50679 -41335 -21508 7454 90998 44765
1039 44765 -15040 1658 39586 -5918 -25774 -22770 -16581 -27959 -3508 25685 -34218 -70735
1027 -70735 -57951 -24985 -1009 30043 12786 -20568 -45002 -65903 1116 2324 -8839 -16483
1015 -16483 -2805 -11052 8644 9564 -6982 5821 -17126 1943 -7288 2322 8172 709 27968
1002 27968 79319 44328 -39980 -109948 -41118 26377 33088 32349 14621 -46452 9617 -13422
990 -13422 -38595 -110680 -44008 -47987 3443 40186 -14862 -29835 36635 14423 18993 70681
978 70681 59996 14656 -16587 -7240 24111 9283 47414 6678 -5088 19405 -21177 -2412
966 -2412 6563 -54836 -40637 -18394 64716 74103 26204 -14451 -31417 765 47246 7740 -4821
953 -4821 -41483 -47594 -15455 -31745 -14011 27830 56284 3721 14949 -56187 20266 109694
941 109694 104496 28697 -9303 16827 31650 47893 20469 -43308 -6547 -18189 55565 5803
929 5803 64209 95835 -10780 -16437 3104 -8025 69316 4389 8404 -23023 -80201 -62305
917 -62305 -56692 -29134 3675 27576 33075 40886 43221 21967 11408 -902 -3966 -11554 7367
904 7367 54496 16629 -27858 -52342 -30829 4291 19727 6100 17913 43891 -14375 -60133
892 -60133 -65851 -41610 11784 -81998 -122428 -36619 -83691 -56633 10286 -49658 -52561 -64365
880 -64365 -2879 -34605 -26109 -42968 -60002 -33472 -77530 -44474 -67877 -65889 -22820 -11114
868 -11114 -36001 -15755 -44307 38968 11553 -1269 26784 54582 27441 -13219 16053 -333
856 -333 3022 -49329 -25163 -52438 -31907 1176 17292 -24947 -25303 6444 40581 39761 -57358
843 -57358 -69704 -4890 -33922 -76383 -65811 -79335 -37255 19102 -10883 -7701 61343 56360
831 56360 59822 74487 2352 -3589 -6023 1035 49959 23439 2290 67163 64596 26646 92231
818 92231 84952 58425 20820 -2595 56840 36447 19063 -23637 13056 53579 4989 -58850
806 -58850 -79210 -108634 -112913 -70770 -80514 -43979 8187 8661 26898 -3896 -3476 -30530 -35484
793 -35484 10139 -63170 -56962 -15197 -2925 31517 -15841 -35307 -12549 32785 47329 11948
781 11948 -15023 -23289 -48524 -39328 9233 6425 -7370 15552 -19110 -16662 21488 21419 -56271
768 -56271 -30108 67128 71325 -3295 12361 47137 79667 72774 27334 34551 91285 128897 93096
755 93096 20008 -18946 42021 41888 2340 -50908 -43693 -55806 27959 76269 16569 -52893 -111022
742 -111022 -94036 -15550 -7017 21248 5473 -11343 -102469 -82340 -48355 -29814 -35433 -3259
730 -3259 -22450 -71413 16649 4095 2998 -1837 -41715 -23384 -37949 5005 36438 -24965 -81897
717 -81897 -38275 -38669 -55729 -41907 -61146 -31758 -13273 127 -3166 70070 44894 -29134 14717
704 14717 -26304 -89296 36293 30484 -5674 -33734 -9720 1947 27178 19894 -6700 -18074
692 -18074 15860 60308 66288 7633 -81902 -61477 -40566 -37571 -7380 -14286 -62137 -36818 -27130
679 -27130 -12326 24043 31331 51764 11335 18162 76855 94353 59316 43149 -24864 -46896
667 -46896 -40972 16330 35022 -19973 21077 1962 -7554 -24896 18950 6956 -30487 -55416
655 -55416 -1805 34910 -21447 12701 3648 -31363 634 -5568 27507 -40057 -7212 30881
643 30881 -26389 -75069 -124154 -46031 -10802 -45389 -34426 -52110 -20688 15722 32309 -43
631 -43 2512 25012 66440 24584 29905 114363 90383 -9379 -13269 31959 44040 13777 9554
618 9554 4315 -33977 -46801 -83576 -2410 -35136 -17260 -25803 -22123 -42437 -106331 -80141 -78311
605 -78311 -97774 -96369 -61132 -53572 -30908 -60567 -11145 25787 39705 78727 44765 10381
593 10381 11571 -1144 -7322 56294 52254 26676 43812 21689 40172 44960 18217 -14947 2221
580 2221 45580 3493 -25031 53639 43503 22999 40475 14917 18539 37725 72699 23577
568 23577 505 -10434 -1500 15478 1281 -63225 -2658 14488 8468 28560 53011 49763 40322
555 40322 452 16848 13006 34115 26997 55778 47766 59128 20262 -7770 79635 35888 48133
542 48133 51681 17413 68065 14577 25069 18806 -52462 -16129 -1019 -8594 -6927 -34001 -9905
529 -9905 -24556 -83322 -40401 -47265 20398 37430 44962 7152 6538 -22360 -19155 33889 -6841
516 -6841 14601 23458 29611 23195 51988 97922 32587 -3067 22433 51463 7660 -15294 -19524
503 -19524 -58181 -52767 -7192 -9108 87529 64278 15216 2836 6670 33419 50705 57275 18385
490 18385 -5491 -19080 -92681 -52728 -62451 -62125 -35236 -41275 -49802 -94961 -28609 28756 -15723
477 -15723 24860 56611 1516 32949 20478 21322 9911 -12256 15103 -6603 -8201 -49870 4676
464 4676 80164 7336 82227 35697 -15346 73269 43094 15073 46834 41879 28605 79127
452 79127 102463 28646 -251 14518 11594 9686 31709 7901 -21698 1326 53700 -6196
440 -6196 -68496 -63793 -70289 -74901 10755 -19066 51358 123370 140207 108100 53387 19182 7658
427 7658 45862 95492 100487 62388 2941 -68750 -24475 -15965 854 -65583 -38976 58600 98451
414 98451 68055 70612 46832 36625 30905 -4886 -17872 12016 36684 15619 42901 59489
402 59489 57338 55011 23592 24078 25766 36835 -7227 -2551 81656 102140 14769 30525 39567
389 39567 -32723 -4531 32752 94075 120807 96383 121618 74762 -5299 -797 60175 84816
377 84816 61057 37905 53917 114052 121582 148531 178035 86455 63747 91577 31506 4668
365 4668 11479 27186 -26078 -31067 -91104 -86467 -64699 -44418 42679 -14871 13004 14453 8233
352 8233 37052 97799 89656 13588 63437 64144 115872 133602 64532 18648 -5069 -23329 40101
339 40101 12132 12088 57553 76201 4481 -45169 -36793 -38224 26717 -55034 -73336 -10175 33047
326 33047 136784 111722 33206 -24620 -11409 18322 48452 66060 99293 97563 89225 52720
314 52720 23576 337 65688 144642 100034 123805 121430 119201 76847 5740 25492 10593
302 10593 -10681 20628 53059 95649 86333 29691 4399 -25574 -1258 31871 21655 32522
290 32522 19349 79360 66556 70169 79994 86889 34489 54624 131847 86995 56566 76168 35047
277 35047 54464 37979 58417 110349 79875 20567 52178 -32660 -49204 -9623 -16567 -1977
265 -1977 14471 11238 -13400 58055 83764 105676 79139 105760 87331 51029 39348 46061 -6177
252 -6177 21797 62577 -34 -1229 39806 46061 56541 22028 -4150 -3050 25240 72336 90165
239 90165 42518 82375 134237 97674 73689 36927 55815 24039 21429 67579 57516 91670
227 91670 79441 19923 41069 31330 57846 32068 58448 67545 127574 94823 36156 33725 56080
214 56080 91370 33365 -24307 -17093 -12606 -11989 54915 101684 111898 59559 45382 6704 81691
201 81691 74278 39983 18529 -48316 -52953 -8977 64738 98864 58927 42087 90382 98894 19448
188 19448 6768 -35140 -7841 6334 -17804 5603 48168 30048 -34685 25884 35872 4927
176 4927 29755 80715 105811 92275 97173 50800 42028 96029 54530 45141 40211 58781 73793
163 73793 28338 35561 14024 -82 -11474 3347 11784 6518 96250 136287 94738 68179 52825
150 52825 56263 52686 58578 97152 85397 84818 122499 97967 131304 86674 67576 45643 7682
137 7682 15701 10210 54683 20653 5238 47081 96994 68481 74647 63916 75085 33336 25042
124 25042 25689 76951 71829 23893 66538 74434 87964 55758 85377 57541 22154 43150 73426
111 73426 104682 117938 104339 59028 69501 64933 116229 116127 134916 150174 109979 24695 47522
98 47522 63039 55750 34597 3037 -22622 -15596 13900 23554 49948 85748 54474 52177 30461
85 30461 23442 32782 19369 36671 47522 78756 48293 42144 -15896 19567 71643 46254 66696
72 66696 46753 22030 37500 28076 8611 3038 39927 30057 52698 70789 68453 61539 12362
59 12362 13064 39245 9392 16736 33890 74241 115797 120475 65538 32692 37112 72759 -6276
46 -6276 12761 50997 39419 47557 65475 57020 108957 117760 69661 72697 87030 45651 64918
33 64918 60029 54196 83813 118041 104793 35855 53777 96212 146772 78286 44301 36457 68501
20 68501 32827 20118 58032 71619 45315 -11062 52929 67992 98027 77869 26624 15758
8 15758 26695 60935 80055 68858 76881 81251 46347 32280
0 32280
$$ Imaginary data points
##PAGE= N=2
##DATA TABLE= (X++(I..I)), XYDATA
16383 -3119622 -3096065 -3012888 -2941277 -2910435 -2873226 -2842678 -2789852 -2741953 -2688848 -2626815 -2570461
16372 -2570461 -2501129 -2474082 -2449351 -2388085 -2372718 -2307933 -2246905 -2226302 -2188639 -2101298 -2074363
16361 -2074363 -2025291 -1984119 -1909682 -1858537 -1819518 -1781456 -1772106 -1691289 -1603499 -1583448 -1595351
16350 -1595351 -1574976 -1484379 -1386584 -1342721 -1344607 -1329938 -1256337 -1160237 -1110140 -1070629 -1012641
16339 -1012641 -988861 -922522 -910067 -879708 -839960 -770439 -732703 -677116 -649572 -612035 -541209
16328 -541209 -476075 -444453 -411762 -370347 -351874 -306911 -226258 -158760 -98131 -99913 -122932 -38326
16316 -38326 6368 99953 105300 149508 202207 283501 345341 286780 299515 396204 462535 476023
16304 476023 523420 527279 587794 662176 681474 703744 747922 768155 824395 849029 855565 914690
16292 914690 970790 1045408 1015726 1057897 1117778 1129129 1157925 1236965 1266201 1297302 1327922
16281 1327922 1350147 1371777 1397692 1428587 1514091 1561560 1589308 1611227 1654639 1631992 1640508
16270 1640508 1737084 1773158 1786666 1772808 1847521 1934324 1944413 1971904 2004312 2066789 2065191
16259 2065191 2051291 2078023 2118119 2139508 2168919 2233017 2279114 2286012 2301475 2325916 2357539
16248 2357539 2411415 2419522 2475770 2497503 2482132 2562318 2599862 2589764 2619077 2573851 2611567
16237 2611567 2678763 2692315 2688412 2726743 2784903 2806049 2818536 2898704 2851529 2879488 2986238
16226 2986238 2967603 2991332 2982866 2957628 3042462 3093376 3071023 3129630 3200529 3211615 3213006 3212416
16214 3212416 3256435 3256816 3250511 3266494 3284283 3284651 3265044 3322541 3383000 3461967 3466233 3473435 3460448
16201 3460448 3429599 3496050 3503909 3512588 3595526 3651751 3576120 3565284 3562219 3568487 3653450 3648334
16189 3648334 3688837 3692068 3700390 3728475 3758341 3679359 3698342 3734708 3729361 3744003 3806723 3834269
16177 3834269 3753736 3799492 3891285 3921423 3900966 3941722 3914436 3898926 3843372 3937660 3984455
16166 3984455 3985860 4024351 3969896 3969709 4005813 3984135 4034165 4058972 4093945 4080785 4031381 4052457
16154 4052457 4059007 4059037 4008207 4072839 4148430 4126260 4136614 4110303 4121719 4170382 4180064 4239598
16142 4239598 4277051 4297692 4297812 4258387 4257808 4276010 4235453 4253149 4225669 4208071 4179031 4199548
16130 4199548 4226275 4284450 4367539 4350836 4366628 4329858 4400137 4422461 4354579 4284191 4319679
16119 4319679 4430967 4364503 4351668 4344782 4400079 4422604 4366960 4368393 4370256 4381761 4435587 4460061
16107 4460061 4467998 4426707 4399738 4401365 4457471 4480891 4445852 4493058 4499568 4505172 4489216 4477426
16095 4477426 4501777 4482280 4411074 4444995 4457320 4504681 4536609 4476780 4440144 4530427 4557375
16084 4557375 4538006 4488402 4515065 4566541 4568495 4504003 4532753 4581928 4551411 4564177 4534773
16073 4534773 4518601 4517841 4529119 4573513 4595087 4511561 4504081 4501346 4513064 4592679 4583620 4511529
16061 4511529 4551252 4461888 4440328 4564005 4574136 4535468 4502402 4532307 4562054 4566829 4573219
16050 4573219 4543752 4548747 4504525 4456514 4491670 4556404 4490346 4502365 4571602 4609766 4644507
16039 4644507 4579585 4614328 4660375 4647007 4612823 4598576 4657783 4696178 4669481 4648333 4645898
16028 4645898 4655374 4646904 4639760 4666666 4623164 4578060 4625848 4634486 4557373 4591713 4584575 4603384
16016 4603384 4558506 4544233 4610992 4579694 4519321 4590986 4577791 4617414 4598071 4584304 4561502
16005 4561502 4542336 4574292 4569879 4573188 4592702 4615396 4592654 4591968 4582616 4610374 4687624 4674362
15993 4674362 4667276 4640228 4582974 4565764 4563937 4558279 4642974 4595676 4588897 4650169 4605664 4660233
15981 4660233 4620258 4634683 4584862 4499557 4540781 4575905 4523875 4580084 4620483 4650772 4632244
15970 4632244 4679202 4703703 4631045 4542933 4569889 4612285 4650391 4642847 4628574 4701400 4671063
15959 4671063 4623586 4670721 4605246 4601424 4606477 4662832 4620448 4618008 4633394 4667751 4698836 4700087
15947 4700087 4632901 4629412 4632896 4644762 4579928 4615516 4684125 4693744 4673896 4637048 4656016 4647571
15935 4647571 4603441 4608036 4595581 4632558 4683362 4634996 4635410 4621890 4543776 4547646 4672744 4685468
15923 4685468 4609723 4664317 4690695 4677760 4655227 4655399 4729725 4697899 4733531 4688384 4659149 4671183
15911 4671183 4653242 4632917 4611212 4649321 4721321 4630698 4643933 4570791 4588785 4619106 4640620
15900 4640620 4652424 4675859 4657083 4638008 4631794 4718684 4662894 4646420 4642456 4610856 4612364 4630595
15888 4630595 4601250 4598698 4638810 4687155 4683095 4679171 4626220 4626318 4635941 4608406 4673932 4629187 4671009
15875 4671009 4645394 4635142 4662738 4747723 4711079 4707454 4626105 4603644 4638474 4650593 4670208
15864 4670208 4718518 4672282 4667930 4707825 4718840 4726245 4727743 4690611 4671990 4723180 4722458 4674618
15852 4674618 4671195 4652616 4645081 4698341 4649417 4628688 4544806 4620622 4630375 4616314 4635459 4688524
15840 4688524 4672594 4720895 4728503 4698708 4683609 4669754 4679213 4639859 4733856 4726073 4711940 4678379
15828 4678379 4608376 4659300 4704769 4737235 4746544 4699170 4721170 4743202 4695366 4650229 4609984
15817 4609984 4600042 4673645 4669988 4656003 4694976 4700606 4690268 4679275 4633907 4669199 4739400 4744194
15805 4744194 4665430 4657648 4693894 4770707 4756655 4645591 4645790 4716596 4803988 4747746 4723721 4667983
15793 4667983 4622242 4659073 4695540 4703420 4759617 4805333 4740616 4729915 4695071 4680303 4635282
15782 4635282 4642312 4669502 4688507 4698378 4693675 4678956 4632326 4707111 4698018 4736406 4720233 4753289
15770 4753289 4730751 4695274 4754080 4658210 4648300 4676363 4701966 4692189 4708797 4727724 4767795 4730989
15758 4730989 4741422 4644970 4708033 4731370 4674892 4718469 4654640 4680111 4690533 4707375 4703984
15747 4703984 4683941 4692110 4662488 4715767 4750438 4724321 4737260 4744061 4691463 4737433 4757703 4712081
15735 4712081 4695579 4777682 4716927 4691152 4692748 4718184 4759227 4720668 4713856 4693785 4769842 4777276
15723 4777276 4828668 4793143 4736106 4742863 4749839 4735137 4769442 4810542 4790305 4749829 4720499 4747030
15711 4747030 4712860 4646846 4636253 4632024 4643931 4709033 4739405 4665488 4650659 4688514 4656808
15700 4656808 4663005 4706268 4752880 4813386 4751719 4733209 4783478 4782549 4750876 4722452 4712817 4753030
15688 4753030 4740055 4799766 4778584 4748230 4690896 4710909 4720569 4734802 4777274 4763004 4759954 4846306
15676 4846306 4863821 4806013 4806770 4796882 4838450 4821729 4828279 4811675 4819462 4782839 4772046 4820443
15664 4820443 4797484 4760110 4681036 4716424 4766297 4753159 4787919 4749314 4781615 4761131 4754948
15653 4754948 4752213 4761833 4781951 4792156 4883549 4864371 4801916 4823130 4811948 4728755 4658550 4757419
15641 4757419 4781384 4745313 4764276 4792798 4757672 4736402 4760305 4738323 4747839 4743224 4725660 4739046
15629 4739046 4746442 4773424 4773116 4738050 4794630 4884932 4881413 4833302 4846793 4801877 4757682 4777640
15617 4777640 4788251 4743694 4768471 4770217 4756989 4757854 4795696 4818401 4805929 4775646 4773804 4823127
15605 4823127 4823046 4801597 4788293 4800306 4723790 4698080 4753542 4788675 4791395 4808956 4806344 4781791
15593 4781791 4811682 4877148 4869644 4824120 4860177 4870495 4824921 4863391 4888314 4806840 4817042
15582 4817042 4794129 4860533 4844290 4828877 4838095 4774490 4750724 4737594 4788060 4858079 4888684
15571 4888684 4809800 4806869 4763308 4788944 4846290 4768521 4839113 4768078 4709173 4759608 4802727
15560 4802727 4781606 4828253 4861941 4820047 4822319 4812660 4820043 4792212 4801597 4785695 4776585 4775267
15548 4775267 4818497 4828553 4839268 4836633 4834169 4812140 4845696 4861543 4839317 4794433 4807657 4791320
15536 4791320 4765112 4814240 4836102 4846416 4823469 4829647 4843086 4833246 4825584 4846631 4868019 4818783
15524 4818783 4830501 4783759 4779241 4796490 4842294 4874704 4819083 4811682 4828869 4825976 4826240 4862185
15512 4862185 4855543 4859020 4854955 4866043 4863129 4849622 4835314 4870353 4888657 4893246 4875067 4800277
15500 4800277 4803725 4792056 4801563 4779769 4755567 4775056 4835786 4813124 4773957 4830272 4875615 4772370
15488 4772370 4784117 4826189 4863733 4833219 4791352 4838615 4828693 4827153 4819646 4798614 4794198 4808203
15476 4808203 4820258 4844786 4800603 4835973 4928907 4932592 4888249 4915163 4871885 4805063 4844286
15465 4844286 4826087 4835423 4873372 4855202 4920302 4899609 4874266 4804578 4827530 4841206 4883193
15454 4883193 4875700 4869986 4824083 4889239 4910073 4875208 4884723 4832620 4861068 4857433 4896012 4845139
15442 4845139 4866945 4857609 4829841 4795816 4757477 4801401 4872408 4917341 4915215 4876138 4845874 4819377
15430 4819377 4844106 4865626 4885628 4844699 4873570 4846713 4834693 4876458 4911751 4932053 4835592
15419 4835592 4904342 4946695 4908366 4879169 4945294 4925765 4920710 4938453 4957821 4919112 4894166
15408 4894166 4868821 4808874 4846969 4916196 4915914 4895354 4874973 4862159 4861716 4871454 4853451 4874031
15396 4874031 4855648 4842907 4881553 4867105 4887947 4893724 4850231 4895644 4854308 4829333 4840969
15385 4840969 4897278 4901621 4900517 4835238 4786906 4848091 4842643 4839904 4885996 4926991 4917734 4879135
15373 4879135 4883410 4886860 4933858 4991181 4932803 4899339 4854877 4915844 4937285 4945086 4956350 5017315
15361 5017315 4982209 4860779 4858178 4865541 4802367 4852345 4877742 4880332 4981023 5009310 4966270
15350 4966270 5010627 4953026 4952032 4926994 4966874 4962159 4996125 5006239 4997006 4970487 4922557 4993932
15338 4993932 5002641 4972603 5002933 4957549 4951747 4937578 4896968 4882381 4905890 4889748 4865618 4866286
15326 4866286 4904418 4928808 4912102 4880452 4835318 4837850 4885269 4898854 4928753 4893563 4874325
15315 4874325 4901485 4893634 4935339 4946654 4893071 4898402 4950138 4880789 4919093 4999849 4921124 4917434
15303 4917434 4910502 4886529 4957701 4953640 4936338 4883587 4924227 4939688 4978697 4922419 4892048 4859862
15291 4859862 4908967 4929393 4881328 4920650 4950460 4927404 4798930 4867957 4976832 4931279 4987166
15280 4987166 5010530 4956387 4914403 4936861 4960715 5012295 4978125 4995374 5005593 5036228 5024688
15269 5024688 4995686 4974647 4976012 4979627 5049156 4954015 4915492 5029501 5031415 4938249 5017980 5025403
15257 5025403 4954045 4962137 4995657 5074120 4983943 4988135 4995004 4978405 4990674 5038486 5011244 5006498
15245 5006498 5049010 5088505 5046854 5024421 4949384 4985879 5032225 4970446 4981742 4995538 4935436
15234 4935436 4934475 4899223 4897182 4898150 4930926 4932825 4926244 4924426 4939962 4966065 4879900 4919381 5009980
15221 5009980 5018453 5041447 4976767 4950624 5018534 5036888 4991285 5001923 5053493 4925934 4941844
15210 4941844 4980473 4980025 5020116 4979153 5017646 5020389 4948744 4968801 4977405 4931810 4969198 4983297
15198 4983297 5009468 5027986 4974639 4966268 4999781 5015227 5014099 5030553 5021138 5007667 5027888 5027006
15186 5027006 5015146 5057710 5024991 5063863 5065635 5072634 5022606 5022477 5003830 5025679 5001117 4975709
15174 4975709 4927201 4880516 4944901 4995423 4993552 4920294 5000401 5022185 5032279 4964216 4992867
15163 4992867 5052738 5001984 5049838 4984027 5002537 5031843 5000186 4955039 4929724 5012315 5018636
15152 5018636 5040117 5013882 5037934 5038466 5042471 5007084 5027703 5007028 5054286 5065966 5061397 5054420
15140 5054420 5077513 5031972 4987171 5006928 5032271 5063558 4998196 5018252 5010644 4999055 5018809
15129 5018809 5071781 5059002 5061189 5063971 5063668 5086701 5049583 5034383 5011993 5026348 4990283 4983057
15117 4983057 5085060 5050778 5022373 5057507 5035111 5074087 5115267 5090674 5060917 4984135 5033854
15106 5033854 5087535 5056769 5112670 5063956 5052172 5053304 5034851 4988377 4969082 5011924 4982759
15095 4982759 4991261 4977579 4973791 4951695 5026549 5064996 5042607 4984795 4947082 4945969 4997352 5002747
15083 5002747 5034015 5093176 5096846 5072904 4984062 5052956 5059322 5101658 5041146 5051664 5065309 5083763
15071 5083763 5115078 5050211 5035557 5104418 5090115 5080208 5026449 5018678 5063396 5088303 5118619 5101287
15059 5101287 5111031 5115418 5095457 5066206 5082898 5035412 5057289 5046616 5065209 5050745 5130125 5077329
15047 5077329 5029201 5034735 5107451 5107687 5204731 5143777 5117078 5123437 5066519 5085929 5088742 5081372
15035 5081372 5133785 5099682 5051974 5096305 5060583 5070107 5074880 5052999 5094436 5093220 5070491 5094241
15023 5094241 5106956 5096876 5096945 5114998 5099623 5097968 5159096 5201566 5183253 5165852 5121684 5114885
15011 5114885 5103450 5123599 5096478 5150661 5202519 5168261 5075766 5117777 5130820 5105554 5135850
15000 5135850 5133018 5088869 5114013 5116853 5128714 5137858 5162425 5145871 5118877 5122901 5056990 5090724
14988 5090724 5039663 5031763 5081580 5086171 5097627 5127452 5107672 5064062 5078471 5128520 5130314 5108591
14976 5108591 5153222 5075901 5157917 5146065 5137965 5196630 5167237 5126655 5124598 5100124 5111212 5091976
14964 5091976 5079515 5088573 5086961 5065333 5144346 5168042 5120565 5204641 5196184 5172911 5180111 5174486
14952 5174486 5156779 5161807 5208239 5255191 5237450 5220774 5227648 5187510 5147489 5200936 5223527 5207063
14940 5207063 5121727 5113823 5145365 5202667 5217306 5169454 5147808 5167047 5087399 5104097 5136014
14929 5136014 5097419 5148746 5210029 5159310 5115041 5159944 5164636 5125416 5136916 5130091 5125056 5147879
14917 5147879 5159763 5164632 5073449 5108829 5201115 5244852 5196115 5154750 5176632 5219999 5247413
14906 5247413 5201826 5173721 5184515 5160178 5142215 5162634 5172033 5132999 5102759 5095147 5131126 5140757
14894 5140757 5155282 5155018 5148111 5088387 5078830 5181487 5210400 5177601 5104595 5147244 5201126 5149336
14882 5149336 5148197 5226577 5239131 5212243 5246778 5267065 5211671 5201426 5185138 5172829 5217636
14871 5217636 5164966 5155745 5242886 5190488 5159287 5204819 5168970 5204744 5180263 5190895 5167232
14860 5167232 5136818 5156507 5129863 5185386 5189767 5165132 5144999 5188900 5180149 5235719 5279594 5192667
14848 5192667 5172672 5248356 5205530 5171514 5188297 5178110 5220395 5239162 5222111 5164964 5141168
14837 5141168 5207607 5199702 5157170 5158659 5146411 5152243 5156393 5155045 5181436 5175475 5101596 5114297
14825 5114297 5160878 5119803 5182345 5155658 5206663 5313706 5262545 5183284 5203037 5255539 5207877
14814 5207877 5177277 5179264 5134500 5203189 5210701 5204981 5170706 5113673 5185767 5222281 5284741 5255654
14802 5255654 5239289 5258813 5253606 5203155 5208708 5219311 5224291 5236963 5243994 5246244 5222514 5178581
14790 5178581 5132499 5169277 5229933 5188927 5204033 5267352 5264561 5251219 5238673 5254824 5229038
14779 5229038 5213026 5218746 5218255 5233488 5219294 5240341 5248694 5254057 5270824 5201650 5222537 5249526
14767 5249526 5224841 5257262 5237323 5216698 5252749 5232137 5272071 5227296 5219093 5267074 5207034
14756 5207034 5217310 5173757 5160000 5180174 5209431 5301634 5326322 5241345 5235301 5254386 5252260 5237414
14744 5237414 5356594 5348108 5268012 5229728 5255178 5255072 5209843 5204448 5260953 5317073 5305565 5251096
14732 5251096 5131819 5195190 5238131 5253081 5260878 5258498 5288740 5257946 5238231 5274949 5321298
14721 5321298 5298049 5286448 5218875 5220822 5285811 5363575 5341140 5274382 5260470 5226303 5145100
14710 5145100 5137741 5238860 5288296 5303988 5273129 5266848 5278579 5182783 5154795 5222296 5204556
14699 5204556 5288242 5333570 5290673 5283531 5235846 5267944 5318841 5295865 5269359 5310639 5269518
14688 5269518 5322988 5364893 5332688 5401568 5353110 5297660 5269163 5306670 5248465 5301443 5302281 5265346
14676 5265346 5239405 5285670 5267099 5262465 5285405 5220607 5251259 5236489 5242527 5291057 5313854 5248638
14664 5248638 5233402 5311245 5317050 5285967 5266506 5234738 5226918 5217822 5287117 5277845 5282512 5348221
14652 5348221 5376934 5342647 5347145 5420009 5482713 5420662 5352680 5321813 5288146 5287971 5251399 5268472
14640 5268472 5295212 5331011 5298944 5316581 5303816 5294580 5327500 5324913 5352209 5370860 5348296 5364230
14628 5364230 5313443 5292483 5269058 5226254 5235359 5295814 5332077 5327040 5359194 5303038 5309831 5362769
14616 5362769 5380915 5376617 5294763 5309628 5332891 5299933 5311848 5350970 5345727 5240707 5350059
14605 5350059 5330647 5283444 5319923 5337731 5338562 5253314 5318606 5344489 5350757 5345012 5358685 5407207
14593 5407207 5425941 5360115 5353599 5383771 5392818 5375758 5391924 5419524 5371153 5335183 5332768 5416677
14581 5416677 5344038 5271925 5331881 5327625 5333819 5317338 5304793 5265617 5245711 5365361 5362247 5350595
14569 5350595 5379632 5354512 5336923 5300526 5374333 5426997 5393705 5395855 5406946 5392840 5358048
14558 5358048 5358028 5427584 5421710 5345007 5365807 5411295 5411042 5351545 5346786 5324508 5352767 5360639 5350178
14545 5350178 5363883 5340959 5362401 5387808 5428800 5440363 5455869 5425871 5340333 5389963 5364110
14534 5364110 5440162 5503849 5482443 5444102 5404369 5373754 5378550 5389836 5349835 5381427 5303935
14523 5303935 5310474 5406831 5425666 5435199 5446303 5400909 5394871 5415046 5392870 5384963 5381828 5312932
14511 5312932 5337050 5407597 5382014 5425509 5409507 5349254 5380685 5365147 5362548 5427855 5396085
14500 5396085 5440369 5496390 5459203 5462903 5457214 5406602 5344039 5415746 5382995 5416287 5452039 5431730
14488 5431730 5398864 5379801 5418516 5388528 5404876 5423906 5425268 5395201 5419309 5429588 5425228 5436962
14476 5436962 5431021 5397325 5400983 5435445 5461869 5525344 5520696 5455018 5411849 5355327 5445085 5432675
14464 5432675 5397789 5428826 5424704 5388155 5398211 5383815 5400222 5409186 5415004 5429732 5431624 5388752
14452 5388752 5395386 5420684 5426277 5424297 5388054 5400769 5383202 5424134 5410758 5408837 5388964 5470232
14440 5470232 5459573 5454435 5480975 5480718 5452019 5408304 5430387 5423407 5477643 5491731 5432573 5446399
14428 5446399 5419533 5443977 5556147 5550705 5497232 5469685 5446303 5441064 5421054 5494194 5437010
14417 5437010 5433675 5419838 5439456 5490034 5466673 5480132 5509971 5488367 5461098 5498635 5528045
14406 5528045 5463548 5416389 5441089 5452126 5473290 5412685 5458075 5444088 5392818 5384740 5419909
14395 5419909 5473961 5438792 5403257 5360968 5391735 5410467 5457878 5429499 5451129 5508146 5469046
14384 5469046 5439651 5475656 5518668 5481533 5441025 5464660 5531634 5477463 5555428 5551575 5521398
14373 5521398 5473356 5474913 5512515 5489187 5540265 5524668 5565282 5543094 5466403 5489824 5486120 5462003
14361 5462003 5491384 5464954 5552149 5594139 5528279 5537615 5530800 5503808 5550651 5542993 5541098 5486184
14349 5486184 5504238 5503155 5476284 5531483 5578021 5575087 5525417 5484710 5477309 5496111 5471276 5502850
14337 5502850 5521636 5498668 5457399 5466006 5486834 5508629 5488746 5527357 5507340 5554425 5514185
14326 5514185 5539709 5547436 5534105 5501405 5470628 5534552 5517449 5493813 5469239 5453453 5503121
14315 5503121 5487291 5483848 5543109 5533545 5507864 5562038 5528622 5493574 5524337 5543741 5597026 5621387
14303 5621387 5549800 5599561 5584316 5564737 5570444 5556455 5530299 5529147 5550461 5525486 5570031 5573766
14291 5573766 5583822 5570492 5561944 5536126 5605426 5580694 5502529 5509575 5524824 5519180 5580944 5566176
14279 5566176 5617338 5573303 5471502 5551978 5615061 5579656 5525316 5540886 5644801 5631930 5593004
14268 5593004 5604862 5527201 5598044 5573283 5581575 5562437 5558382 5561491 5562096 5563584 5655210 5650152 5651208
14255 5651208 5612347 5533281 5502275 5476752 5500656 5547481 5516302 5500701 5544463 5544539 5582053 5528149
14243 5528149 5490621 5533138 5605878 5548313 5524165 5529059 5594069 5562622 5562284 5587350 5583694 5582435
14231 5582435 5609574 5569638 5597038 5613464 5605852 5599880 5657262 5612772 5602695 5557046 5606236 5654398
14219 5654398 5603675 5556226 5534594 5529272 5531710 5457775 5482002 5528008 5497974 5529344 5589019 5564167
14207 5564167 5582432 5608900 5592667 5585238 5539789 5537953 5572947 5505622 5477537 5522232 5571521 5562221
14195 5562221 5612755 5675534 5641210 5619385 5595482 5582185 5595639 5545582 5501182 5570659 5544964
14184 5544964 5557656 5588807 5627839 5596189 5622810 5624608 5581859 5610608 5621959 5586152 5591857 5606917
14172 5606917 5620532 5657817 5683480 5653578 5738442 5671178 5660043 5612079 5573594 5573740 5601495 5570245
14160 5570245 5532807 5566597 5592973 5550860 5562276 5526496 5554136 5612639 5629400 5592494 5556848
14149 5556848 5617611 5630140 5668482 5670220 5681712 5673672 5559434 5565842 5624635 5613649 5594686 5622123
14137 5622123 5635082 5661351 5664300 5608923 5604775 5597614 5670739 5713246 5675207 5670085 5617705 5572752
14125 5572752 5608566 5624739 5628467 5644158 5684294 5659271 5638256 5635133 5626272 5620995 5627539 5642436
14113 5642436 5616651 5621835 5637190 5663488 5694721 5676287 5672457 5638574 5714152 5727874 5681816 5661791
14101 5661791 5672773 5711906 5692603 5647874 5598766 5687847 5712301 5638419 5628135 5619558 5681831
14090 5681831 5677816 5630300 5706422 5730734 5691345 5718918 5763798 5705048 5632951 5691346 5675147
14079 5675147 5688968 5706708 5703042 5727142 5743480 5692219 5677117 5742912 5677391 5665727 5681739
14068 5681739 5701478 5697929 5680416 5656579 5621015 5617711 5638176 5608490 5639958 5705275 5679981 5685802
14056 5685802 5675135 5692746 5667389 5650716 5684297 5686176 5680895 5680482 5618330 5649950 5646140 5640845
14044 5640845 5717777 5665062 5656250 5638093 5616382 5634334 5665270 5669078 5694744 5736258 5726018 5735529
14032 5735529 5705072 5690739 5713169 5757974 5738283 5679275 5683386 5787179 5771983 5798732 5778612
14021 5778612 5749361 5732373 5723566 5684018 5691650 5703212 5698376 5702925 5718122 5750287 5774873 5730370
14009 5730370 5700517 5761305 5830217 5819995 5766712 5712108 5678769 5707931 5720190 5746743 5751907
13998 5751907 5770138 5755456 5752194 5755114 5761056 5703348 5741535 5783006 5736605 5690879 5680880 5650758
13986 5650758 5655514 5707423 5794995 5792203 5693540 5736535 5717802 5661388 5738054 5706290 5632117 5684966
13974 5684966 5752551 5757569 5726200 5694009 5787490 5768297 5803516 5803343 5758564 5749221 5806964 5825366
13962 5825366 5828320 5822483 5842698 5842273 5828537 5799128 5741614 5754102 5814114 5785270 5766285 5778809
13950 5778809 5717623 5700877 5781283 5794385 5763343 5808697 5776088 5720854 5715271 5705591 5732103 5785374
13938 5785374 5767647 5740451 5700476 5798325 5830089 5826542 5810912 5825962 5784464 5738017 5745796 5785971
13926 5785971 5789852 5768931 5744623 5713727 5733806 5728075 5674878 5776463 5807251 5787117 5759205
13915 5759205 5740972 5789928 5767867 5823171 5910582 5859577 5853301 5832425 5801770 5806006 5795640 5828025
13903 5828025 5792405 5805330 5792567 5791905 5773785 5752896 5765740 5818639 5842979 5826853 5808580 5706157
13891 5706157 5673697 5726984 5787380 5785797 5804592 5815763 5780149 5817637 5823065 5792483 5807896 5829400
$$ [...]
##END NTUPLES=NMR SPECTRUM
##END=
