##TITLE=1H_CA-9376-1x
 200.13MHz, CDCl3,
 8 sc
 
 4.9.2025
##JCAMPDX= 6.0         $$ Bruker NMR JCAMP-DX V2.0
##DATA TYPE= NMR SPECTRUM
##DATA CLASS= NTUPLES
##ORIGIN= UXNMR, Bruker Analytische Messtechnik GmbH
##OWNER= pz
$$ XWIN-NMR		Version 3.5
$$ Thu Sep  4 14:11:21 2025 Russian Standard Time (UT+4h)  she@DPX200
##.OBSERVE FREQUENCY= 200.1313
##.OBSERVE NUCLEUS= ^1H
##.ACQUISITION MODE= SIMULTANEOUS
##.ACQUISITION SCHEME= undefined
##.AVERAGES= 8
##.DIGITISER RES= 18
##SPECTROMETER/DATA SYSTEM= spect
##.PULSE SEQUENCE= zg30
##.SOLVENT NAME= DMSO
##.SHIFT REFERENCE= (INTERNAL, DMSO, 0, 15.51)
##AUDIT TRAIL= $$ (NUMBER, WHEN, WHO, WHERE, WHAT)
$$ ##TITLE= Audit trail, XWIN-NMR		Version 3.5
$$ ##JCAMPDX= 5.01
$$ ##ORIGIN= Bruker BioSpin GmbH
$$ ##OWNER= she
$$ F:/spectra/data/she/nmr/H-C/1/pdata/1/auditp.txt
$$ ##AUDIT TRAIL=  $$ (NUMBER, WHEN, WHO, WHERE, WHAT)
(   1,<2025-09-04 14:09:43.29 +0400>,<she>,<DPX200>,
      <created by zg, POWCHK disabled, PULCHK disabled
       configuration hash MD5:
       00 E9 B6 7A A2 85 ED C7 34 08 36 98 17 FE 4E 26
       data hash MD5: 16K
       BA 14 12 59 7A EC 44 C1 94 21 DD C5 92 93 BD 3F>)
(   2,<2025-09-04 14:09:45.78 +0400>,<she>,<DPX200>,
      <Start of raw data processing
       efp BC_mod = 2 LB = 0.25 FT_mod = 6 PKNL = 1 PHC0 = -1559.813 PHC1 = 10.19228 SI = 16K 
       data hash MD5: 16K
       77 54 29 E2 C1 DE 5D EA 77 EF 72 5C 9F 3A 0D 5A>)
(   3,<2025-09-04 14:10:12.06 +0400>,<she>,<DPX200>,
      <pk PHC0 = -9.654606 PHC1 = 9.000001 
       data hash MD5: 16K
       71 EC F9 63 74 A7 26 57 26 D5 61 CC A9 94 C4 76>)
(   4,<2025-09-04 14:10:16.09 +0400>,<she>,<DPX200>,
      <abs ABSG = 5 
       data hash MD5: 16K
       14 36 AB 14 19 CA 34 11 45 27 6F 1A 3A 89 3B 94>)
$$ ##END=
$$ 
$$ hash MD5
$$ DB CB BD 22 8D E0 ED B6 60 D1 25 40 72 74 B5 C2
##$RELAX= 
##$RELAX= 
##$RELAX= 
##$RELAX= 
##$RELAX= 
##$RELAX= 
$$ Bruker specific parameters
$$ --------------------------
##$DU= <F:/spectra>
##$EXPNO= 1
##$NAME= <H-C>
##$PROCNO= 1
##$TYPE= <nmr>
##$USER= <she>
##$AMP= (0..31)
100 100 100 100 100 100 100 100 100 100 100 100 100 100 100 100 100 100 
100 100 100 100 100 100 100 100 100 100 100 100 100 100 
##$AQSEQ= 0
##$AQ_mod= 1
##$AUNM= <au_zg>
##$AUTOPOS= <>
##$BF1= 200.13
##$BF2= 200.13
##$BF3= 200.13
##$BF4= 200.13
##$BF5= 200.13
##$BF6= 200.13
##$BF7= 200.13
##$BF8= 200.13
##$BYTORDA= 1
##$CFDGTYP= 0
##$CFRGTYP= 5
##$CHEMSTR= <none>
##$CNST= (0..31)
1 1 145 1 1 1 1 1 1 1 1 1 1 1 1 1 1 1 1 1 1 1 1 1 1 1 1 1 1 1 1 1 
##$CPDPRG= <>
##$CPDPRG1= <>
##$CPDPRG2= <>
##$CPDPRG3= <>
##$CPDPRG4= <mlev>
##$CPDPRG5= <mlev>
##$CPDPRG6= <mlev>
##$CPDPRG7= <mlev>
##$CPDPRG8= <mlev>
##$CPDPRGB= <>
##$CPDPRGT= <>
##$D= (0..31)
0 0.7 0 0 0 0 0 0 0 0 0 0.03 0 0 0 0 0 0 0 0 0 0 0 0 0 0 0 0 0 0 0 0 
##$DATE= 1756980582
##$DBL= (0..7)
120 120 120 120 120 120 120 120 
##$DBP= (0..7)
150 150 150 150 150 150 150 150 
##$DBP07= 0
##$DBPNAM0= <>
##$DBPNAM1= <>
##$DBPNAM2= <>
##$DBPNAM3= <>
##$DBPNAM4= <>
$$ [...]
##$SUBNAM3= <"">
##$SUBNAM4= <"">
##$SUBNAM5= <"">
##$SUBNAM6= <"">
##$SUBNAM7= <"">
##$SUBNAM8= <"">
##$SUBNAM9= <"">
##$SW= 18.0517328524113
##$SWIBOX= (0..15)
0 0 2 0 0 0 0 0 0 0 0 0 0 0 0 0 
##$SW_h= 3612.71676300578
##$TD= 16384
##$TD0= 1
##$TE= 0
##$TE2= 300
##$TE3= 300
##$TEG= 300
##$TL= (0..7)
0 120 120 120 120 120 120 120 
##$TP= (0..7)
150 150 150 150 150 150 150 150 
##$TP07= 0
##$TPNAME0= <>
##$TPNAME1= <>
##$TPNAME2= <>
##$TPNAME3= <>
##$TPNAME4= <>
##$TPNAME5= <>
##$TPNAME6= <>
##$TPNAME7= <>
##$TPOAL= (0..7)
0.5 0.5 0.5 0.5 0.5 0.5 0.5 0.5 
##$TPOFFS= (0..7)
0 0 0 0 0 0 0 0 
##$TUNHIN= 0
##$TUNHOUT= 0
##$TUNXOUT= 0
##$USERA1= <user>
##$USERA2= <user>
##$USERA3= <user>
##$USERA4= <user>
##$USERA5= <user>
##$V9= 5
##$VALIST= <valist>
##$VCLIST= <CCCCCCCCCCCCCCC>
##$VD= 0
##$VDLIST= <DDDDDDDDDDDDDDD>
##$VPLIST= <PPPPPPPPPPPPPPP>
##$VTLIST= <TTTTTTTTTTTTTTT>
##$WBST= 1024
##$WBSW= 4
##$XGAIN= (0..3)
0 0 0 0 
##$XL= 0
##$YL= 0
##$YMAX_a= 338929
##$YMIN_a= -423651
##$ZGOPTNS= <>
##$ZL1= 120
##$ZL2= 120
##$ZL3= 120
##$ZL4= 120
##$ABSF1= 15.47034
##$ABSF2= -2.58151
##$ABSG= 5
##$ABSL= 3
##$ALPHA= 0
##$AQORDER= 0
##$ASSFAC= 0
##$ASSFACI= 0
##$ASSFACX= 0
##$ASSWID= 0
##$AUNMP= <proc_1d>
##$AZFE= 0.1
##$AZFW= 0.1
##$BCFW= 0
##$BC_mod= 2
##$BYTORDP= 0
##$COROFFS= 0
##$CY= -3
##$DATMOD= 1
##$DC= 0
##$DFILT= <>
##$DTYPP= 0
##$F1P= 0
##$F2P= 0
##$FCOR= 1
##$FTSIZE= 16384
##$FT_mod= 6
##$GAMMA= 0
##$GB= 0
##$INTBC= 1
##$INTSCL= 3.241238e-09
##$ISEN= 128
##$LB= 0.25
##$LEV0= 0
##$LPBIN= 0
##$MAXI= 10000
##$MC2= 0
##$MEAN= 0
##$ME_mod= 0
##$MI= 1.114404
##$NCOEF= 0
##$NC_proc= -5
##$NLEV= 6
##$NOISF1= 3.799351
##$NOISF2= 2.8
##$NSP= 0
##$NTH_PI= 0
##$NZP= 0
##$OFFSET= 15.51
##$PC= 1
##$PHC0= -1569.468
##$PHC1= 19.19228
##$PH_mod= 1
##$PKNL= yes
##$PPARMOD= 0
##$PSCAL= 0
##$PSIGN= 0
##$REVERSE= no
##$SF= 200.130002341296
##$SI= 16384
##$SIGF1= 3
##$SIGF2= 2
##$SINO= 0.751879
##$SIOLD= 32768
##$SREGLST= <19F.Aceton>
##$SSB= 0
##$STSI= 16384
##$STSR= 0
##$SW_p= 3612.71676300578
##$SYMM= 0
##$S_DEV= 0
##$TDeff= 16384
##$TDoff= 0
##$TI= <>
##$TILT= no
##$TM1= 0
##$TM2= 0
##$TOPLEV= 0
##$USERP1= <user>
##$USERP2= <user>
##$USERP3= <user>
##$USERP4= <user>
##$USERP5= <user>
##$WDW= 1
##$XDIM= 16384
##$YMAX_p= 276151397
##$YMIN_p= -192967
$$ End of Bruker specific parameters
$$ ---------------------------------
##NTUPLES= NMR SPECTRUM
##VAR_NAME=  FREQUENCY,     SPECTRUM/REAL,   SPECTRUM/IMAG
##SYMBOL=    X,             R,               I
##VAR_TYPE=  INDEPENDENT,   DEPENDENT,       DEPENDENT
##VAR_FORM=  AFFN,          ASDF,            ASDF
##VAR_DIM=   16384,         16384,           16384
##UNITS=     HZ,            ARBITRARY UNITS, ARBITRARY UNITS
##FACTOR=    0.220516191357247, 1,           1
##FIRST=     3104.01638211962, 0,            0
##LAST=      -508.700380886157, 0,           0
##MIN=       -508.700380886157, -192967,     0
##MAX=       3104.01638211962, 276151397,    0
$$ Real data points
##PAGE= N=1
##DATA TABLE= (X++(R..R)), XYDATA
$$ [...]
$$ plain form
8855 5246802 4947761 4663358 4362137 4018472 3760976 3509348 3253854 2998858 2862448 2687830
8845 2687830 2478580 2283960 2162205 2014170 1870235 1795118 1687869 1562271 1490075 1407454
8835 1407454 1341649 1313645 1229600 1147284 1077880 1048712 1034195 1056129 1008225 950065 925325
8824 925325 908809 890712 850476 769920 749573 738370 653270 617772 534588 511592 514008 519436
8812 519436 458466 446817 481976 449123 410213 435481 431642 378596 381862 391271 341544 308941
8800 308941 326435 353867 323405 302676 333009 335026 321252 284519 322171 294414 298926 240839
8788 240839 259046 255874 203808 223628 221246 239565 213918 183141 152490 184616 202330 204143
8776 204143 200889 234439 273152 281323 258201 195015 241474 222385 140193 157560 195978 188312
$$ packed form
8855E246802k99041k84403l01221l43665k57496k51628k55494k54996j36410j74618
8845B687830k09250j94620j21755j48035j43935p5117j07249j25598p2196q2621
8835A407454o5805k8004q4045q2316o9404k9168j4517K1934m7904n8160k4740
8824I25325j6516j8097m0236q0556k0347j1203q5100l5498q3184k2996K416N428
8812E19436o0970j1649L5159l2853l8910K5268l839n3046L266R409m9727l2603
8800C08941J7494K7432l0462k0729L0333K017j3774l6733L7652k7757M512n8087
8788B40839J8207l172n2066J9820k382J8319k5647l0777l0651L2126J7714J813
8776B04143l254L3550L8713Q171k3122o3186M6459j9089q2192J7367L8418p666
$$ plain form
8764 188312 136023 165209 206092 235244 202981 210506 249293 279828 261446 257772 309006 276977
8752 276977 257839 232454 272141 278054 290197 284564 285367 256988 258511 257977 243499 245586 237519
8739 237519 264497 300033 311880 318335 319833 293148 275139 318631 329637 269432 242833 309535
8727 309535 346522 374980 382748 353023 340623 346893 404184 410957 370187 408989 444649 446449
8715 446449 473635 469704 493388 513071 539315 588784 615511 616236 617535 641924 655417 669852
8703 669852 756773 785172 823306 863082 968764 1058800 1135218 1193076 1273640 1361803 1450433
8692 1450433 1569295 1639228 1782554 1894203 2060365 2223381 2402716 2554599 2730840 2873803
8682 2873803 3008623 3188755 3330396 3450467 3466815 3545893 3655165 3626334 3596579 3604605 3509017
$$ packed form
8764A88312n2289K9186M0883K9152l2263P525L8787L0535j8382l674N1234l2029
8752B76977j9138k5385L9687N913J2143n633Q03k8379J523n34j4478K087q067
8739B37519K6978L5536J1847O455J498k6685j8009M3492J1006o0205k6599O6702
8727C09535L6987K8458P768k9725j2400O270N7291O773m0770L8802L5660J800
8715D46449K7186l931K3684J9683K6244M9469K6727P25J299K4389J3493J4435
8703F69852Q6921K8399L8134L9776J05682R0036P6418N7858Q0564Q8163Q8630
8692A450433J18862O9933J43326J11649J66162J63016J79335J51883J76241J42963
8682B873803J34820J80132J41641J20071J6348P9078J09272k8831k9755Q026r5588
$$ plain form
8671 3509017 3467807 3384281 3284164 3132543 3056982 2970657 2826963 2704028 2597667 2548981
8661 2548981 2512640 2471120 2431913 2388923 2287986 2271994 2232210 2245763 2328196 2354381 2388764
8650 2388764 2495882 2593100 2654323 2765106 2840633 2885883 2961881 3065542 3106615 3172705 3209729
8639 3209729 3211647 3207711 3197118 3140137 3067734 2978290 2902006 2764117 2613860 2437034 2327975
8628 2327975 2234745 2071181 1927282 1848555 1746384 1618955 1495012 1413186 1341365 1243264
8618 1243264 1151852 1119681 1048167 999536 947904 882026 902440 844371 806772 753748 740023
8607 740023 736039 689588 634868 668232 595527 524948 553173 469290 436485 438504 353684 366548
8595 366548 326826 301691 334049 347282 341312 348365 280048 283614 336677 315434 311119 296622
$$ packed form
8671C509017m1210q3526j00117j51621p5561q6325j43694j22935j06361m8686
8661B548981l6341m1520l9207m2990j00937j5992l9784J3553Q2433K6185L4383
8650B388764J07118R7218O1223J10783P5527M5250P5998J03661M1073O6090L7024
8639C209729J918l936j0593n6981p2403q9444p6284j37889j50257j76826j09059
8628B327975r3230j63564j43899p8727j02171j27429j23943q1826p1821r8101
8618A243264r1412l2171p1514m8631n1632o5878K0414n8069l7599n3024j3725
8607G40023l984m6451n4720L3364p2705p0579K8225q3883l2805K019q4820J2864
8595C66548l9722k5135L2358J3233n970P053o8317L566N3063k1243m315j4497
$$ plain form
8583 296622 239631 295843 255986 257848 308435 297864 246868 280791 305691 262670 211310 195190
8571 195190 193957 229320 214406 179577 201784 183055 236691 250670 207972 174495 151280 147304
8559 147304 132864 161140 124900 106005 103443 86112 128175 137866 110023 71561 45575 54104
8547 54104 48067 8831 7980 21166 45331 67269 52876 44106 68331 76207 99787 141131 93285
8534 93285 45868 20152 5563 48482 42829 117626 84460 40512 1562 1781 49456 84568
8522 84568 46913 39741 13621 -6307 -12988 20482 66937 35376 -114 18778 25281 79171
8510 79171 86225 51960 55550 22807 17990 -8638 -14234 28875 18472 8600 -11974 -11386 -1182
8497 -1182 7202 27335 14686 32856 -690 -40894 -59006 -52098 -23437 11670 -15026 -17245 30559
$$ packed form
8583B96622n6991N6212l9857J862N0587j0571n0996L3923K4900m3021n1360j6120
8571A95190j233L5363j4914l4829K2207j8729N3636J3979m2698l3477k3215l976
8559A47304j4440K8276l6240j8895k562j7331M2063R691k7843l8462k5986Q529
8547E4104o037l9236q51J3186K4165K1938j4393q770K4225P876K3580M1344m7846
8534I3285m7417k5716j4589M2919n653P4797l3166m3948l8950K19M7675L5112
8522H4568l7655p172k6120j9928o681L3470M6455l1561l5490J8892O503N3890
8510G9171P054l4265L590l2743m817k6628n596M3109j0403r872k0574N88J0204
8497a182Q384K0133j2649J8170l3546m0204j8112O908K8661L5107k6696k219M7804
$$ plain form
8484 30559 2926 -30377 -28929 -66316 -77279 -46275 -38178 -15045 -45343 -82659 -28520 -29985
8472 -29985 -65308 -56259 -43367 -27323 -24450 -50822 -72863 -31468 -50287 -29714 -6143 -18167
8460 -18167 -37902 14070 -15564 -10258 16211 21968 9678 20494 7051 -42642 -23937 -43581
8448 -43581 -79203 -105331 -57450 -51332 -42649 -60197 -57667 -50071 -29997 -63069 -67075 -53408 -34042
8435 -34042 -43959 -67443 11195 -17535 -71427 -72449 -76817 -55995 -33497 -76036 -42885 -18646
8423 -18646 -27733 1978 -96157 -82076 -54968 -51979 -63714 -91341 -100549 -73722 -46636 -96153
8411 -96153 -136152 -91827 -54257 -26502 -72673 -109473 -78816 -112535 -98452 -124739 -104129 -118202
8399 -118202 -124966 -87669 -87123 -82301 -36567 -54757 -64656 -65534 -109867 -77055 -103230 -41927 -48924
$$ packed form
8484C0559k7633l3303J448l7387j0963L1004Q097K3133l0298l7316N4139j465
8472b9985l5323R049J2892J6044K873k6372k2041M1395j8819K0573K3571j2024
8460a8167j9735N1972k9634N306K6469N757j2290J0816j3443m9693J8705j9644
8448d3581l5622k6128M7881O118Q683j7548K530P596K0074l3072m006J3667J9366
8435c4042r917k3484P8638k8730n3892j022m368K0822K2498m2539L3151K4239
8423a8646r087K9711r8135J4081K7108K989j1735k7627r208K6827K7086m9517
8411i6153l9999M4325L7570K7755m6171l6800L0657l3719J4083k6287K0610j4073
8399a18202o764L7297N46M822M5734j8190r899q78m4333L2812k6175O1303o997
$$ plain form
8386 -48924 -67908 -41119 -28510 -39761 -31320 -53397 -83547 -25624 -53051 -112442 -145099 -110511
8374 -110511 -29998 -5038 13848 -26848 -21226 -39511 -52794 -120088 -68325 -35772 -40769 -105774
8362 -105774 -109517 -62749 -41172 -44788 -45820 -59334 -70424 -72443 -62865 -7391 -48812 -76078 -89664
8349 -89664 -39003 -42692 -49156 -64897 -68129 -82702 -107290 -82808 -42547 -70331 -63567 -91302 -101646
8336 -101646 -95923 -83818 -77193 -32584 -69761 -30146 -27454 -79470 -38900 -42824 -33298 -3455 -4475
8323 -4475 -25732 -3956 -36686 -73048 -83896 -92470 -54564 -53038 -37019 -54173 -70102 -60422 -57208
8310 -57208 -58964 -11878 -22858 -33751 -61585 -33584 -8916 9532 -5474 960 21258 -32759
8298 -32759 -35827 -32296 -47368 -36784 -26652 -20419 -22910 -70778 -59510 -28540 -47175 -69925 -75508
$$ packed form
8386d8924j8984K6789J2609j1251Q441k2077l0150N7923k7427n9391l2657L4588
8374a10511Q0513K4960J8886m0696N622j8285j3283o7294N1763L2553m997o5005
8362a05774l743M6768K1577l616j032j3514j1090k019R578N5474m1421k7266j3586
8349h9664N0661l689o464j5741l232j4573k4588K4482M0261k7784O764k7735j0344
8336a01646N723J2105O625M4609l7177L9615K692n2016M0570l924R526K9843j020
8323d475k1257K1776l2730l6362j0848q574L7906J526J6019j7154j5929R680L214
8310e7208j756M7086j0980j0893k7834K8001K4668J8448j5006O434K0298n4017
8298c2759l068L531j5072J0584J0132O233k491m7868J1268L0970j8635k2750n583
$$ plain form
8285 -75508 -49700 -25333 -24797 -4221 -49602 -77290 -99158 -80679 -45185 -10459 -93839 -75912
8273 -75912 -6834 -45248 -113728 -102034 -72191 -103567 -61053 -40877 -47531 -107036 -118612 -71224
8261 -71224 -35388 37358 20421 -2162 -19279 -83256 -90755 -93993 -110468 -96758 -78372 -108746
8249 -108746 -95305 -81069 -93519 -101145 -97079 -67386 -48807 -7081 -58364 -65390 -27282 -78801
8237 -78801 -111851 -73512 -83377 -62640 -70874 -131740 -101810 -71993 -119239 -142572 -108306 -108905 -69757
8224 -69757 -10175 -20167 -56659 -72801 -61205 -44612 -91476 -68118 -30720 -20137 -30743 -22020
8212 -22020 -65958 -73443 -66141 -64883 -82743 -92162 -59637 -22866 -57536 -50501 -37371 -80224 -58215
8199 -58215 -75949 -82016 -41382 -45101 -40694 -80475 -64294 -131929 -176314 -83488 -135538 -94334
$$ packed form
8285g5508K5808K4367N36K0576m5381k7688k1868J8479L5494L4726q3380J7927
8273g5912O9078l8414o8480J1694K9843l1376M2514K0176o654n9505j1576M7388
8261g1224L5836P2746j6937k2583j7117o3977p499l238j6475J3710J8386l0374
8249a08746J3441J4236j2450p626M066K9693J8579M1726n1283p026L8108n1519
8237g8801l3050L8339r865K0737q234o0866K9930K9817m7246k3333L4266n99L9148
8224f9757N9582r992l6492j6142J1596J6593m6864K3358L7398J0583j0606Q723
8212b2020m3938p485P302J258j7860r419L2525L6771l4670P035J3130m2853K2009
8199e8215j7734o067M0634l719M407l9781J6181o7635m4385R2826n2050M1204
$$ plain form
8187 -94334 -96325 -110943 -83015 -52446 -115565 -85279 -65801 -28943 4300 -2070 10935 -51739
8175 -51739 -37526 -13179 -22584 -6682 -23767 -24844 -18373 -17062 -16571 -54966 -70079 -63703 -73312
8162 -73312 -86333 -61089 -49663 -93097 -111785 -67461 -54014 -47751 -7919 -35042 -76223 -32855
8150 -32855 -22216 -44204 -22824 -32515 -60612 -24088 6777 3665 52374 -30366 -54930 -37495
8138 -37495 -61644 -21617 -976 1575 -7903 -19443 -57512 -67937 -50881 -77382 -47901 -34462
8126 -34462 -69290 -19965 -56950 -55966 -67966 -110646 -55497 -61576 -93654 -72449 -104124 -79453
8114 -79453 -52501 -32740 -17469 -53547 -42687 -39762 -18400 28648 -6689 -31621 -71123 -79478
8102 -79478 -61902 -68762 -55256 -56557 -45381 -21302 -7597 -17161 -40320 -36230 -27221 -51757 -85603
$$ packed form
8187i4334j991j4618K7928L0569o3119L0286J9478L6858L3243o370J3005o2674
8175e1739J4213K4347r405J5902j7085j077O471J311M91l8395j5113O376r609
8162g3312j3021K5244J1426m3434j8688M4324J3447O263L9832k7123m1181M3368
8150c2855J0639k1988K1380r691k8097L6524L0865l112M8709q2740k4564J7435
8138c7495k4149M0027K0641K551r478j1540l8069j0425J7056k6501K9481J3439
8126c4462l4828M9325l6985R84j2000m2680N5149o079l2078K1205l1675K4671
8114g9453K6952J9761J5271l6078J0860K925K1362M7048l5337k4932l9502q355
8102g9478J7576o860J3506j301J1176K4079J3705r564k3159M090R009k4536l3846
$$ plain form
8089 -85603 -55990 -56972 -48983 -2466 -48035 -44313 -49169 -18772 -41796 -100966 -117572 -111212 -70159
8076 -70159 -14024 -56329 -82319 -59317 -68964 -54053 -41722 -14287 -15691 -46098 -22504 32552
8064 32552 -5490 -6420 -8276 -2676 -32029 -34694 -35813 -35424 -14386 -21977 -30115 -37537 -21923 -13361
8050 -13361 -27303 -49629 30683 -19074 -41140 -80412 -123535 -59897 -64726 -80290 -82196 -20593
8038 -20593 -2718 -15800 -41184 -13186 -16484 3203 17471 -7398 -15543 13682 23974 -38133
8026 -38133 -18878 -29797 -65507 -43192 -44540 -30846 -63003 -56441 -15315 -11962 -53541 -70495
8014 -70495 -59589 -65818 -60638 -37690 -35853 8992 -25050 -28981 -12207 -73685 -20537 -28523 -38638
8001 -38638 -53044 -59124 4438 -8898 -9188 -25750 -17591 10982 10485 -15544 8324 22924 -2626
$$ packed form
8089h5603K9613r82P989M6517m5569L722m856L0397k3024n9170j6606O360M1053
8076g0159N6135m2305k5990K3002r647J4911J2331K7435j404l0407K3594N5056
8064C2552l8042r30j856N600k9353k665j119L89K1038p591q138p422J5614Q562
8050a3361j3942k2326Q0312m9757k2066l9272m3123O3638m829j5564j906O1603
8038b0593J7875j3082k5384K7998l298J9687J4268k4869q145K9225J0292o2107
8026c8133J9255j0919l5710K2315j348J3694l2157O562M1126L353m1579j6954
8014g0495J0906o229N180K2948J837M4845l4042l931J6774o1478N3148p986j0115
8001c8638j4406o080O3562j3336k90j6562Q159K8573m97k6029K3868J4600k5550
$$ plain form
7988 -2626 -11341 -34629 -22754 21403 -19559 -53041 -57094 -64761 -46439 -30179 -24816 -2311 8580
7975 8580 36828 -22349 -18601 -12704 -17447 61145 -2472 -6947 4378 30322 5016 45707 56830
7962 56830 39738 -13410 11788 58369 -10466 -38856 -28270 14795 -1446 -62728 -33472 -38436
7950 -38436 -19334 27558 27221 531 -29395 -31938 -28856 -22963 3911 -51673 -22748 7234 -10416
7937 -10416 -16736 -6798 -13795 -11722 28166 3173 -76764 -40537 -20869 -29259 -32482 -35225 -39799
7924 -39799 -33319 -66130 -19066 25858 20894 23648 -10626 39703 23660 -16238 -15831 4013 -63692
7911 -63692 -22592 -41204 -78360 -97628 -87799 -82808 -92177 -42004 -30757 39950 51170 18566
7899 18566 -15392 -15903 9247 -4900 -25748 -38305 -21722 -54671 -13657 45831 49283 -25945
$$ packed form
7988b626q715k3288J1875M4157m0962l3482m053p667J8322J6260N363K2505J0891
7975H580K8248n9177L748N897m743P8592o3617m475J1325K5944k5306M0691J1123
7962E6830j7092n3148K5198M6581o8835k8390J0586M3065j6241o1282K9256m964
7950c8436J9102M6892l37k6690k9926k543L082N893K6874n5584K8925K9982j7650
7937a0416o320R938o997K073L9888k4993p9937L6227J9668q390l223k743m574
7924c9799O480l2811M7064M4924m964K754l4274N0329j6043l9898M07J9844o7705
7911f3692M1100j8612l7156j9268R829M991r369N0173J1247P0707J1220l2604
7899A8566l3958n11K5150j4147k0848j2557J6583l2949M1014N9488L452p5228
$$ plain form
7887 -25945 -18173 -1193 11883 19279 9762 10067 -11197 11196 12026 -9732 6394 21871 34096
7874 34096 32644 13247 13309 -54389 -30730 -9668 19091 4797 -1746 8668 1250 24986 61313
7861 61313 2364 -55580 -39958 15811 56495 18394 -18479 18384 60812 43664 34438 22447
7849 22447 5073 61934 41250 55328 23889 9600 3929 -1478 32507 25083 -32580 4510
7837 4510 93031 57150 61100 45499 59857 -23255 18251 12164 18945 -22749 -7666 38623 41229
7824 41229 40929 54193 44311 44460 22665 49115 117024 116532 88764 73854 65550 57304 47074 78679
7810 78679 88360 81532 39208 66289 33810 98112 36011 68538 -117816 -192967 41561 84496
7798 84496 106512 59029 74368 68777 67680 91715 78377 67636 63202 44202 42822 -10438 67459
$$ packed form
7887b5945P772J6980J3076P396r517L05k1264K2393Q30k1758J6126J5477J2225
7874C4096j452j9397O2o7698K3659K1062K8759j4294o543J0414p418K3736L6327
7861F1313n8949n7944J5622N5769M0684l8101l6873L6863M2428j7148r226j1991
7849B2447j7374N6861k0684J4078l1439j4289n671n407L3985p424n7663L7090
7837D510Q8521l5881L950j5601J4358q3112M1506o087O781m1694J5083M6289K606
7824D1229l00J3264r882J49k1795K6450O7909m92k7768j4910q304q246j0230L1605
7810G8679R681o828m2324K7081l2479O4302o2101L2527j86354p5151K34528M2935
7798H4496K2016m7483J5339n591j097K4035j3338j0741m434j9000j380n3260P7897
$$ plain form
7785 67459 115067 99334 82138 109172 60394 68324 61405 120092 103958 84449 112393 135344
7773 135344 100216 58526 37419 91073 146158 145676 129315 133045 147990 115067 143246 158554
7761 158554 122701 150860 184342 172309 133685 182318 149423 173505 185747 189833 204290 187110
7749 187110 173250 174386 143164 159358 190413 216589 228426 231774 241247 198220 219060 246500
7737 246500 282837 266831 291784 296076 235998 242350 221714 209790 253740 217936 252529 237362
7725 237362 276586 332359 286593 254636 245841 292964 298731 305448 349024 398673 387752 356649
7713 356649 390909 412215 429823 429523 333290 340965 370304 383779 408094 441915 414819 430934
7701 430934 443120 466275 459196 405752 442031 453120 445389 430453 485943 510620 544057 552063
$$ packed form
7785F7459M7608j5733j7196K7034m8778P930o919N8687j6134j9509K7944K2951
7773A35344l5128m1690k1107N3654N5085m82j6361L730J4945l2923K8179J5308
7761A58554l5853K8159L3482j2033l8624M8633l2895K4082J2242M086J4457j7180
7749A87110j3860J136l1222J6194L1055K6176J1837L348R473m3027K0840K7440
7737B46500L6337j6006K4953M292o0078O352k0636j1924M3950l5804L4593j5167
7725B37362L9224N5773m5766l1957q795M7123N767O717M3576M9649j0921l1103
7713C56649L4260K1306J7608l00r6233P675K9339J3475K4315L3821k7096J6115
7701D30934J2186K3155p079n3444L6279J1089p731j4936N5490K4677L3437Q006
$$ plain form
7689 552063 547813 564241 594345 614959 644488 653401 644728 663040 680777 677691 643726 712439
7677 712439 774095 734661 748337 774634 790075 827834 836127 764792 770117 850808 862955 895305
7665 895305 920234 885396 893979 905300 934107 929557 955259 974493 942087 985513 948327 959927
7653 959927 971119 964213 1065187 1031264 1011411 1020137 1028549 1024638 1083018 1099880 1110089 1113199
7641 1113199 1036881 1036442 1041254 1052640 1071398 1085010 1104188 1110504 1082939 1041151 1061162 1035005
7629 1035005 1033578 1058649 1113207 1158002 1117598 1129438 1124609 1097082 1078837 1078877 1125254 1162895
7617 1162895 1146290 1155476 1189934 1183536 1161944 1149335 1148317 1110686 1097721 1072709 1075738 1081346
7605 1081346 1122635 1128193 1088140 1124009 1201210 1125848 1138598 1121164 1095860 1074495 1045750 1101435
$$ packed form
7689E52063m250J6428L0104K0614K9529Q913q673J8312J7737l086l3965O8713
7677G12439O1656l9434J3676K6297J5441L7759Q293p1335N325Q0691J2147L2350
7665H95305K4929l4838Q583J1321K8807m550K5702J9234l2406M3426l7186J1600
7653I59927J1192o906J00974l3923j9853Q726Q412l911N8380J6862J0209L110
7641A113199p6318m39M812J1386J8758J3612J9178O316k7565m1788K0011k6157
7629A035005j427K5071N4558M4795m0404J1840m829k7527j8245M0M6377L7641
7617A162895j6605R186L4458o398k1592j2609j018l7631j2965k5012L029N608
7605A081346M1289N558m0053L5869P7201p5362J2750j7434k5304k1365k8745N5685
$$ plain form
7593 1101435 1092660 1047402 1077422 1087009 1159002 1090998 1073793 1133987 1113769 1132959 1106215 1095554
7581 1095554 1024908 1013744 1046288 1071247 1050187 1042899 1048350 1060021 1018745 1046647 1052268 1068020
7569 1068020 978931 1011496 1019906 947937 932545 957812 931769 901819 918185 893993 857949 913746
7557 913746 972929 931570 908849 935746 911717 950767 974600 956521 927542 954204 941919 919480
7545 919480 967842 993040 972097 977583 964043 960887 1010287 1045751 1060429 1066432 1057309 1013392
7533 1013392 975010 929984 881556 878345 821799 767276 746788 732615 705305 656292 629805 650741
7521 650741 653977 571156 585053 513335 510570 499513 464405 480478 482143 460955 386775 369933
7509 369933 383291 373720 436830 440125 423144 408610 387482 399728 384893 347094 359807 343566
$$ packed form
7593A101435q775m5258L0020R587P1993o8004j7205O0194k0218J9190k6744j0661
7581A095554p0646j1164L2544K4959k1060p288N451J1671m1276K7902N621J5752
7569A068020q9089L2565Q410p1969j5392K5267k6043k9950J6366k4192l6044N5797
7557I13746N9183m1359k2721K6897k4029L9050K3833j8079k8979K6662j2285k2439
7545I19480M8362K5198k0943N486j3540l156M9400L5464J4678O003r123m3917
7533A013392l8382m5026m8428l211n6546n4523k0488j4173k7310m9013k6487K0936
7521F50741L236q2821J3897p1718k765j1057l5108J6073J665k1188p4180j6842
7509C69933J3358r571O3110L295j6981j4534k1128J2246j4835l7799J2713j6241
$$ plain form
7497 343566 322231 355166 375816 333050 319811 294812 300670 300775 320604 328566 309632 301686 244020
7484 244020 279544 273919 262058 264754 284399 322339 294128 222611 203389 210443 194774 205526
7472 205526 230039 168464 218767 275934 275337 263337 277069 250076 240412 206292 178568 143725
7460 143725 132202 153705 144569 165749 154530 115462 98173 142375 170507 127745 136620 181193
7448 181193 126790 152562 167672 170778 200821 157691 115768 114979 159599 181623 187719 154957
7436 154957 170986 202082 132121 122454 144330 166419 176760 108595 78321 147570 150052 122792
7424 122792 118266 90125 85420 131145 138879 98052 64060 67730 55017 128839 123409 73668 46780
7411 46780 82635 117145 107953 84869 54909 58323 64144 52878 77113 124370 70056 33840
$$ packed form
7497C43566k1335L2935K0650m2766j3239k4999N858J05J9829P962j8934p946n7666
7484B44020L5524n625j1861K696J9645L7940k8211p1517j9222P054j5669J0752
7472B05526K4513o1575N0303N7167n97j2000J3732k6993r664l4120k7724l4843
7460A43725j1523K1503r136K1180j1219l9068j7289M4202K8132m2762Q875M4573
7448A81193n4403K5772J5110L106L0043m3130m1923p89M4620K2024O096l2762
7436A54957J6029L1096o9961r667K1876K2089J0341o8165l0274O9249K482k7260
7424A22792m526k8141m705M5725P734m0827l3992L670j2713P3822n430m9741k6888
7411D6780L5855L4510r192k3084k9960L414N821j1266K4235M7257n4314l6216
$$ plain form
7399 33840 78203 109199 112998 96315 94336 49339 63395 113418 94819 60576 134860 137991
7387 137991 77791 97456 100750 107753 79208 27270 44775 45556 38716 35254 61875 88493 97942
7374 97942 88864 72460 33288 11000 65140 70870 50233 44687 60957 45311 12747 69995
7362 69995 52820 -1172 32606 12722 11958 63065 69932 53792 51404 49424 63294 46619 51028
7349 51028 60502 22467 42216 64030 54460 45320 20690 13380 25642 45466 60541 47106 50968
7336 50968 64158 50664 56141 61669 93165 101470 47839 -19359 3708 88883 100627 105433 89986
7323 89986 39487 57267 30175 36904 49792 66441 38690 -2295 20099 54389 42949 53497
7311 53497 17129 23273 27969 42929 44701 72495 85442 34627 69802 46034 -5215 -24838
$$ packed form
7399C3840M4363L0996L799j6683j979m4997J4056N0023j8599l4243P4284L131
7387A37991o0200J9665L294P003k8545n1938J7505P81o840l462K6621K6618R449
7374I7942r078j6404l9172k2288N4140N730k0637n546J6270j5646l2564N7248
7362F9995j7175n3992L3778j9884p64N1107O867j6140k388j980J3870j6675M409
7349E1028R474l8035J9749K1814r570r140k4630p310J2262J9824J5075j3435L862
7336E0968J3190j3494N477N528L1496Q305n3631o7198K3067Q5175J1744M806j5447
7323H9986n0499J7780k7092O729J2888J6649k7751m0985K2394L4290j1440J0548
7311E3497l6368O144M696J4960J772K7794J2947n0815L5175k3768n1249j9623
$$ plain form
7299 -24838 383 39581 42920 33502 -23063 -3085 38036 8119 59284 59588 65069 124763 110411
7286 110411 55673 9555 55699 54504 54957 78638 48503 -673 26261 25995 32428 7265 11050
7273 11050 62066 7272 -26059 81400 48123 65875 80207 17304 -12146 6947 -9085 18143
7261 18143 45668 81227 70054 -11370 -13631 -6771 37361 48550 7372 7584 23191 21308 33642
7248 33642 -2103 -5321 15614 45445 12616 51378 27400 68101 92283 64542 69067 49029
7236 49029 35618 46080 13319 24683 19604 56389 67042 23736 -12799 15455 66703 51327
7224 51327 19434 -9429 -23026 -41086 -9772 10562 27909 47304 -34544 -31636 -20247 -8368
7212 -8368 63951 53378 8782 -5362 -30340 -6569 31553 46265 53860 50653 -2848 27591
$$ packed form
7299b4838K5221L9198L339r418n6565J9978M1121k9917N1165L04N481N9694j4352
7286A10411n4738m6118M6144j195M53K3681l0135m9176K6934k66O433k5163L785
7273A1050N1016n4794l3331J07459l3277J7752J4332o2903k9450J9093j6032K7228
7261A8143K7525L5559j1173q1424k261O860M4132J1189m1178K12J5607j883J2334
7248C3642l5745l218K0935K9831l2829L8762k3978M0701K4182k7741M525k0038
7236D9029j3411J0462l2761J1364n079L6785J0653m3306l6535K8254N1248j5376
7224E1327l1893k8863j3597j8060L1314K0334J7347J9395q1848K908J1389J1879
7212h368P2319j0573m4596j4144k4978K3771L8122J4712P595l207n3501L0439
$$ plain form
7200 27591 33 -29401 -13437 23695 -5358 657 43095 81464 67899 111306 104287 6834
7188 6834 53833 56285 13509 -4992 29740 98008 88878 62010 10041 9253 49584 30261 26529
7175 26529 25372 28605 72685 15423 4860 -9582 -42950 11972 2896 42296 69951 40463
7163 40463 -23401 -21772 -9563 41292 4814 -43901 -12500 -12874 -41119 -6268 27085 20384 10306
7150 10306 53040 22623 48938 41113 -46014 -20031 35011 55529 7728 10984 -27376 9771
7138 9771 13608 -8747 -19111 75489 97585 22105 38767 50937 60142 27512 50780 25328
7126 25328 101214 56338 23061 17492 4893 954 9903 55868 54062 57799 79979 30720 19660
7113 19660 6336 44872 74947 61052 78106 42110 27678 40405 12737 71674 79764 66949
$$ packed form
7200B7591k7558k9434J5964L7132k9053O015M2438L8369j3565M3407p019r7453
7188F834M6999K452m2776j8501L4732O8268r130k6868n1969p88M0331j9323l732
7175B6529j157L233M4080n7262j0563j4442l3368N4922r076L9400K7655k9488
7163D0463o3864J629J2209N0855l6478m8715L1401l74k8245L4851L3353o701j0078
7150A0306M2734l0417K6315p825q7127K5983N5042K0518m7801L256l8360L7147
7138I771L837k2355j0364R4600K2096p5480J6662J2170R205l2630K3268k5452
7126B5328P5886m4876l3277n569j2599l939Q949M5965j806L737K2180m9259j1060
7113A9660j3324L8536L0075j3895J7054l5996j4432J2727k7668N8937Q090j2815
$$ plain form
7101 66949 44295 47028 45579 44194 24428 61844 39890 23921 72496 42705 3363 -15623
7089 -15623 -21493 -2685 34739 45175 76093 29741 23092 -30522 -24647 12806 -8874 -5848 -23819
7076 -23819 -36221 16393 13391 37753 19201 7306 41434 58667 36092 13353 14440 3316
7064 3316 43343 -20785 -4727 36253 3716 -27537 -59959 -8795 33475 71815 17446 -3360
7052 -3360 57923 32196 17876 40761 30774 10166 19207 11898 43868 47925 15366 23753 46525
7039 46525 28487 -18765 30681 30220 4379 25965 49151 72726 54983 33321 2546 12114
7027 12114 86730 100654 88278 49301 47679 38893 58621 42562 -4642 -3479 -20215 -81963
7015 -81963 2083 73559 79410 24090 44467 78018 23098 23907 47513 39561 -26511 -56670 2409
$$ packed form
7101F6949k2654K733j449j385j9766L7416k1954j5969M8575k9791l9342j8986
7089a5623n870J8808L7424J0436L0918m6352o649n3614N875L7453k1680L026j7971
7076b3819j2402N2614l002K4362j8552j1895L4128J7233k2575k2739J087j1124
7064C316M0027o4128J6058M0980l2537l1253l2422N1164M2270L8340n4369k0806
7052c360O1283k5727j4320K2885r987k0608R041p309L1970M057l2559Q387K2772
7039D6525j8038m7252M9446m61k5841K1586K3186K3575j7743k1662l0775R568
7027A2114P4616J3924j2376l8977j622q786J9728j6059m7204J163j6736o1748
7015h1963Q4046P1476N851n5320K0377L3551n4920Q09K3606p952o6072l0159N9079
$$ plain form
7002 2409 27021 38093 34305 49122 24499 402 -14622 -4382 28283 1963 17047 39742
6990 39742 2033 9724 9848 2679 73541 66175 6684 -3810 13030 76014 67171 39627 40000
6977 40000 3176 -3437 37516 83882 127750 107067 75231 30578 10685 21673 -36723 -12484
6965 -12484 -14541 8219 -7 37942 60845 31949 42399 113158 89004 10130 31101 36747
6953 36747 15197 49285 89429 59027 13028 61741 32772 22538 59994 22094 -1731 16755
6941 16755 79335 88037 49921 31886 53591 58530 2821 20489 51263 90559 69864 32572
6929 32572 58715 88441 79352 41933 23030 44031 98770 85935 28077 40141 60007 68798
6917 68798 65792 26033 77679 98998 68935 30162 41992 61684 48913 68599 69975 87689
$$ packed form
7002B409K4612J1072l788J4817k4623k4097j5024J0240L2665k6320J5084K2695
6990C9742l7709P691J24p169P0862p366n9491j0494J6840O2984q843k7544L73
6977D0000l6824o613M0953M6366M3868k0683l1836m4653j9893J0988n8396K4239
6965a2484k057K2760q226L7949K2903k8896J0450P0759k4154p8874K0971N646
6953C6747k1550L4088M0144l0402m5999M8713k8969j0234L7456l7900k3825J8486
6941A6755O2580Q702l8116j8035K1705M939n5709J7668L0774L9296k0695l7292
6929C2572K6143K9726r089l7419j8903K1001N4739j2835n7858J2064J9866Q791
6917F8798l006l9759N1646K1319l0063l8773J1830J9692j2771J9686J376J7714
$$ plain form
6905 87689 58173 44222 68236 42559 -694 52626 58109 -2311 -1438 35136 39024 45840 69345
6892 69345 33327 -13310 55613 85559 75989 75207 69877 82622 64064 64957 17057 30421 72658
6879 72658 77912 136159 112991 90908 66257 18398 91615 91455 44290 -6489 11464 32089
6867 32089 30279 20520 37065 80597 77565 94428 101842 49978 28330 60854 114602 96678 102942
6854 102942 84203 61721 73346 32100 56311 82687 89111 76735 23528 63035 52835 68080
6842 68080 79158 51168 69646 50465 62591 66256 67294 73852 124834 81584 41270 93629
6830 93629 58149 -6198 6671 -35938 31208 49062 35511 27239 28988 65971 46534 72016
6818 72016 66769 58772 88438 73918 76866 63569 42643 64609 62608 78459 67283 5550 -22154
$$ packed form
6905H7689k9516j3951K4014k5677m3253N3320N483o0420Q73L6574L888O816K3505
6892F9345l6018m6637O8923K9946r570p82n330J2745j8558Q93m7900J3364M2237
6879G2658N254N8247k3168k2083k4651m7859P3217j60m7165n0779J7953K0625
6867C2089j810r759J6545M3532l032J6863P414n1864k1648L2524N3748j7924O264
6854A02942j8739k2482J1625m1246K4211K6376O424j2376n3207L9507j0200J5245
6842F8080J1078k7990J8478j9181J2126L665J038O558N0982m3250m0314N2359
6830I3629l5480o4347J2869m2609O7146J7854j3551q272J749L6983j9437K5482
6818G2016n247p997K9666j4520K948j3297k0926K1966k001J5851j1176o1733k7704
$$ plain form
6805 -22154 82122 93566 80157 42162 22106 24385 37643 53256 28017 24964 39282 98821
6793 98821 57916 8906 25431 56783 101076 88021 50946 85704 75771 71412 69454 9070
6781 9070 59995 88814 62638 97362 109002 62690 35994 69630 86590 51931 76391 140966
6769 140966 110725 62112 74861 109999 149611 142781 105197 107377 57879 11705 19556 40575
6757 40575 58939 75757 118351 104614 95142 63929 38328 88955 94614 112148 107142 72915
6745 72915 112585 65654 89875 85001 80507 81156 54849 98537 140564 51124 65830 49872 44847
6732 44847 67088 86802 85521 89544 139958 133295 68349 100861 86842 57984 84104 45938
6720 45938 119576 91416 104952 117015 165864 144538 105743 130403 139392 142380 150235 126765
$$ packed form
6805b2154J04276J1444j3409l7995k0056K279J3258J5613k5239l053J4318N9539
6793I8821m0905m9010J6525L1352M4293j3055l7075L4758r933m359j958o0384
6781I070N0925K8819k6176L4724J1640m6312k6696L3636J6960l4659K4460O4575
6769A40966l0241m8613J2749L5138L9612o830l7584K180m9498m6174P851K1019
6757D0575J8364J6818M2594j3737r472l1213k5601N0627N659J7534n006l4227
6745G2915L9670m6931K4221m874m494O49k6307M3688M2027q9440J4706j5958n025
6732D4847K2241J9714j281M023N0414o663o4946L2512j4019k8858K6120l8166
6720D5938P3638k8160J3536J2063M8849k1326l8795K4660Q989K988P855k3470
$$ plain form
6708 126765 121860 104444 95365 60946 38850 69845 90873 72725 87913 121711 152395 176592
6696 176592 154571 75059 106944 142211 147997 172548 137478 88931 94534 97093 96644 101770 122257
6683 122257 145878 124729 104694 152885 156088 138668 117730 143371 115204 109766 112227 127207
6671 127207 93548 50533 56344 94927 104114 91301 137677 131236 125969 149138 151294 134745 140539
6658 140539 140081 142565 85109 83849 84142 107227 129999 170537 175059 206409 171708 172683 170361 129987
6644 129987 91455 103843 103709 93499 125340 93992 70578 123781 149948 92531 93440 129503
6632 129503 114337 180442 171692 95040 121618 121513 135505 133947 96383 118490 109034 156246 196263
6619 196263 219380 183281 182022 168916 128399 177259 211635 215505 234648 224259 159973 147961
$$ packed form
6708A26765m905j7416r079l4419k2096L0995K1028j8148J5188L3798L0684K4197
6696A76592k2021p9512L1885L5267N786K4551l5070m8547N603K559m49N126K0487
6683A22257K3621k1149k0035M8191L203j7420k0938K5641k8167n438K461J4980
6671A27207l3659m3015N811L8583R187j2813M6376o441n267K3169K156j6549N794
6658A40539m58K484n7456j260K93K3085K2772M0538M522L1350l4701R75k322m0374
6644A29987l8532J2388j34j0210L1841l1348k3414N3203K6167n7417R09L6063
6632A29503j5166O6105q750p6652K6578j05J3992j558l7564K2107r456M7212M0017
6619A96263K3117l6099j259j3106m0517M8860L4376L870J9143j0389o4286j2012
$$ plain form
6607 147961 166983 169157 146115 186282 193063 132480 124180 153232 167178 157124 205064 192984
6595 192984 193037 206346 191092 127593 108660 157042 161308 195080 183434 197191 202743 208656 223457
6582 223457 230871 283212 257944 238736 212125 196151 266506 258069 247409 254707 261884 242613
6570 242613 227070 201487 212698 225498 246502 231195 231956 293865 327784 276177 321016 278883
6558 278883 306609 297792 273129 274367 277901 305200 295175 278160 250796 277867 297246 317713
6546 317713 283834 302421 312140 328421 374215 335313 283166 345671 370050 346457 315511 304575
6534 304575 366300 375025 361884 390630 383460 395004 380158 379178 436114 444148 443073 441336 513288
6521 513288 468409 465961 463837 510082 523790 530079 528127 577766 639130 650427 648046 653393 678900
$$ packed form
6607A47961J9022K174k3042M0167O781o0583q300K9052J3946j0054M7940j2080
6595A92984N3J3309j5254o3499j8933M8382M266L3772j1646J3757N552N913J4801
6582B23457P414N2341k5268j9208k6611j5974P0355q437j0660P298P177j9271
6570B42613j5543k5583J1211J2800K1004j5307P61O1909L3919n1607M4839m2133
6558B78883K7726q817k4663J238L534K7299j0025j7015k7364K7071J9379K0467
6546C17713l3879J8587R719J6281M5794l8902n2147O2505K4379k3593l0946j0936
6534C04575O1725Q725j3141K8746p170J1544j4846r80N6936Q034j075j737P1952
6521E13288m4879k448k124M6245J3708O289j952M9639O1364J1297k381N347K5507
$$ plain form
6508 678900 672172 674134 732168 797158 771183 805842 809517 852739 852897 911426 889598 961545 1016565
6495 1016565 1114728 1089489 1134802 1229752 1257938 1290190 1287256 1311209 1377867 1427661 1449045 1439295
6483 1439295 1453345 1513073 1587980 1618001 1617195 1629651 1720882 1735053 1756588 1761389 1749840 1755219
6471 1755219 1743095 1760483 1776230 1816546 1808743 1837410 1859505 1843810 1779277 1796135 1853239 1799918
6459 1799918 1813245 1845177 1805351 1779382 1755197 1780875 1737427 1729993 1736223 1732396 1685948 1668597
6447 1668597 1652090 1640394 1641465 1612966 1621059 1641675 1628506 1614404 1645546 1634765 1661909 1658921
6435 1658921 1689725 1762242 1759850 1805108 1831208 1818926 1816273 1903752 2007054 2025352 2031391 2118142
6423 2118142 2162788 2250015 2259278 2278709 2361291 2408897 2408919 2471160 2546291 2549548 2586575 2628742
$$ packed form
6508F78900o728J962N8034O4990k5975L4659L675M3222J58N8529k1828P1947N5020
6495A016565R8163k5239M5313R4950K8186L2252k934K3953O6658M9794K1384r750
6483A439295J4050N9728P4907L0021q06J2456R1231J4171K1535M801j1549N379
6471A755219j2124J7388J5747M0316p803K8667K2095j5695o4533J6858N7104n3321
6459A799918J3327L1932l9826k5969k4185K5678m3448p434O230l827m6448j7351
6447A668597j6507j1696J071k8499Q093K0616j3169j4102L1142j0781K7144k988
6435A658921L0804P2517k392M5258K6100j2282k653Q7479J03302J8298O039Q6751
6423B118142M4646Q7227R263J9431Q2582M7606K2O2241P5131L257L7027M2167
$$ plain form
6411 2628742 2667202 2633963 2666354 2729370 2706451 2693737 2660095 2720544 2724209 2691053 2653273 2617941
6399 2617941 2551609 2543697 2524657 2459459 2449822 2370534 2283801 2291057 2263726 2170975 2077248 1984427
6387 1984427 1980386 1982181 1894193 1855994 1789921 1721572 1658073 1650034 1640810 1568373 1527753 1491091
6375 1491091 1463760 1385156 1342379 1281745 1263754 1216355 1191124 1173160 1109439 1073857 1070260 987055
6363 987055 928582 965793 959524 929558 944002 949230 907792 914124 922387 866939 863890 872408 808403
6350 808403 754822 736758 797282 754137 731408 748028 735024 716967 697869 684082 696633 719418
6338 719418 708761 682350 656271 665779 657119 684147 664648 651648 640836 669959 685770 633684
6326 633684 633866 675403 630963 634444 674448 649583 625524 630887 637051 666006 689607 677232 615255
$$ packed form
6411B628742L8460l3239L2391O3016k2919j2714l3642O0449L665l3156l7780l5332
6399B617941o6332p912j9040o5198r637p9288q6733P256k7331r2751r3727r2821
6387A984427m041J795q7988l8199o6073o8349o3499q039r224p2437m0620l6662
6375A491091k7331p8604m2777o0634j7991m7399k5231j7964o3721l5582l597q3205
6363I87055n8473L7211o269k9966J4444N228m1438O332Q263n5448l049Q518o4005
6350H08403n3581j8064O0524m3145k2729J6620j3004j8057j9098j3787J2551K2785
6338G19418j0657k6411k6079R508q660K7028j9499j3000j0812K9123J5811n2086
6326F33684J82M1537m4440L481M0004k4865k4059N363O164K8955K3601j2375o1977
$$ plain form
6313 615255 619568 645012 664054 641289 644866 635923 637024 659981 702124 712333 707145 642533 689100
6300 689100 698395 680610 720633 695858 716247 733617 717873 669390 702294 691754 645499 700948
6288 700948 710405 690607 708326 752280 728025 709656 725529 739383 750403 805048 801893 789780
6276 789780 816209 809293 816242 820952 863776 883830 892636 894016 889766 921275 910090 929176 1000621
6263 1000621 994035 987688 1007118 1080725 1138917 1172940 1147898 1168144 1197182 1214854 1230904 1284749
6251 1284749 1308039 1353908 1380757 1426131 1439291 1525704 1550436 1549758 1609720 1682393 1741812 1760608
6239 1760608 1771414 1850267 1891291 1929623 2002489 2020190 2037072 2118954 2180539 2251427 2238438
6228 2238438 2250890 2298939 2310632 2358199 2393419 2419341 2466401 2503112 2496295 2520753 2547445 2553281
$$ packed form
6313F15255M313K5444J9042k2765L577q943J101K2957M2143J0209n188o4612M6567
6300F89100R295j7785M0023k4775K0389J7370j5744m8483L2904j0540m6255N5449
6288G00948R457j9798J7719M3954k4255j8369J5873J3854J1020N4645l155j2113
6276G89780K6429o916O949M710M2824K0054Q806J380m250L1509j1185J9086P1445
6263A000621o586o347J9430P3607N8192L4023k5042K0246K9038J7672J6050N3845
6251A284749K3290M5869K6849M5374J3160Q6413K4732o78N9962P2673N9419J8796
6239A760608J0806P8853M1024L8332P2866J7701J6882Q1882O1585P0888j2989
6228B238438J2452M8049J1693M7567L5220K5922M7060L6711o817K4458K6692N836
$$ plain form
6216 2553281 2601305 2683904 2744444 2830910 2828624 2806253 2815730 2891471 2931300 2892434 2962860 3011732
6204 3011732 3001423 3061378 3071743 3173787 3217075 3246692 3299316 3361678 3364101 3448967 3458036 3476845
6192 3476845 3485007 3526483 3667481 3713097 3718440 3759348 3871516 3853523 3951032 4060422 4139474
6181 4139474 4177482 4168128 4221551 4260985 4283773 4345589 4382620 4404225 4461526 4521570 4548846 4553578
6169 4553578 4598618 4624713 4628279 4652142 4723020 4726721 4725468 4736667 4760068 4736103 4734003 4762145
6157 4762145 4725842 4664455 4616921 4568677 4532698 4517570 4462615 4459453 4446160 4408795 4319156 4252447
6145 4252447 4209737 4150641 4166079 4151915 4078923 4011691 3983871 3952959 3915971 3934955 3937193 3940417
6133 3940417 3896251 3889590 3863969 3875731 3900464 3889422 3871860 3865481 3861561 3856402 3844590 3829656
$$ packed form
6216B553281M8024Q2599O0540Q6466k286k2371R477P5741L9829l8866P0426M8872
6204C011732j0309N9955J0365J02044M3288K9617N2624O2362K423Q4866R069J8809
6192C476845Q162M1476J40998M5616N343M0908J12168j7993R7509J09390P9052
6181D139474L8008r354N3423L9434K2788O1816L7031K1605N7301O0044K7276M732
6169D553578M5040K6095L566K3863P0878L701j253J1199K3401k3965k100K8142
6157D762145l6303o1387m7534m8244l5979j5128n4955l162j3293l7365q9639o6709
6145D252447m2710n9096J5438j4164p2992o7232k7820l0912l6988J8984K238L224
6133C940417m4166o661k5621J1762K4733j1042j7562o379l920n159j1812j4934
$$ plain form
6121 3829656 3775073 3826971 3884848 3839157 3834464 3797517 3769980 3772874 3806416 3837650 3814332 3809831
6109 3809831 3840846 3859895 3854545 3887078 3907520 3880465 3917066 3922418 3918124 3985776 4019013 4025726
6097 4025726 4013055 4006078 4060547 4088451 4115352 4153921 4200465 4204403 4160853 4132542 4123820 4114490
6085 4114490 4162380 4220734 4184228 4164205 4168799 4113604 4128917 4102015 4092512 4032156 4090408 4095855
6073 4095855 4029170 4021807 3990314 3974971 3917804 3890795 3898196 3858822 3826267 3825624 3860691 3895499
6061 3895499 3901361 3877191 3878843 3832855 3807215 3807714 3839178 3860731 3912496 3972297 4003264 4028666
6049 4028666 4012080 4021761 4047864 4113113 4100800 4108186 4126839 4204342 4211772 4212259 4271918 4321257
6037 4321257 4303925 4351990 4372533 4395987 4409920 4404653 4427784 4403682 4405323 4428218 4414802 4415506
$$ packed form
6121C829656n4583N1898N7877m5691m693l6947k7537K894L3542L1234k3318m501
6109C809831L1015J9049n350L2533K0442k7055L6601N352m294O7652L3237O713
6097D025726j2671o977N4469K7904K6901L8569M6544L938m3550k8311q722r330
6085D114490M7890N8354l6506k0023M594n5195J5313k6902r503o0356N8252N447
6073D095855o6685p363l1493j5343n7167k7009P401l9374l2555o43L5067L4808
6061C895499N862k4170J652m5988k5640M99L1464K1553N1765N9801L0967K5402
6049D028666j6586R681K6103O5249j2313P386J8653P7503P430M87N9659M9339
6037D321257j7332M8065K0543K3454J3933n267K3131k4102J641K2895j3416P04
$$ plain form
6025 4415506 4391919 4345312 4281013 4148666 4136864 4097082 3976490 3862471 3778297 3664659 3595506
6014 3595506 3553328 3467399 3363330 3283813 3182928 3119614 3061469 2965720 2868183 2867003 2876280
6003 2876280 2783953 2753555 2646293 2588159 2601425 2618611 2603261 2573476 2509048 2515598 2525664
5992 2525664 2456018 2492731 2523475 2488907 2522213 2504860 2452299 2416525 2427686 2441363 2433528 2429405
5980 2429405 2377752 2383045 2407933 2390326 2370540 2375635 2410017 2449197 2532537 2533404 2472562 2494907
5968 2494907 2515509 2516754 2544792 2548140 2556395 2553044 2521592 2479471 2454920 2421837 2359419 2311932
5956 2311932 2267132 2202265 2174034 2120435 2057820 2059466 2006002 1913447 1889439 1898211 1890857 1835427
5944 1835427 1834127 1809123 1834428 1819792 1824560 1866280 1825131 1795233 1796510 1819325 1806541 1842645
$$ packed form
6025D415506k3587m6607o4299j32347j1802l9782j20592j14019q4174j13638o9153
6014C595506m2178q5929j04069p9517j00885o3314n8145r5749r7537j180R277
6003B876280r2327l0398j07262n8134J3266J7186j5350k9785o4428O550J0066
5992B525664o9646L6713L0744l4568L3306j7353n2561l5774J1161J3677p835m123
5980B429405n1653N293K4888j7607j9786N095L4382L9180Q3340Q67o0842K2345
5968B494907K0602J245K8038L348Q255l351l1452m2121k4551l3083o2418m7487
5956B311932m4800o4867k8231n3599o2615J646n3464r2555k4008Q772p354n5430
5944A835427j300k5004K5305j4636M768M1720m1149k9898J277K2815j2784L6104
$$ plain form
5932 1842645 1812650 1791797 1801608 1777881 1698825 1679111 1676348 1684424 1637253 1602505 1563147 1543915
5920 1543915 1518366 1465405 1475958 1487745 1435393 1439556 1396881 1353583 1307654 1315821 1274134 1214208
5908 1214208 1260294 1200138 1200884 1211412 1142044 1129191 1143618 1158152 1128922 1058947 1030221 1048509
5896 1048509 1080645 1093357 1098279 1051524 1024462 1023581 1016034 1021620 980215 932057 931631 972816 1014423
5883 1014423 993647 980738 1015132 1015728 986167 946278 956215 972580 974817 1019741 1020019 1002549 1024587
5870 1024587 1052169 1043251 979380 935479 982644 1026289 1063637 1044600 1040270 1016558 1013758 1034544
5858 1034544 993454 1016613 1039038 1016793 1001266 983521 1071125 1062303 1047327 1037696 1082029 1091292
5846 1091292 1094077 1097470 1103942 1081309 1049813 1106471 1131562 1169246 1058667 1039565 1134131 1140602
$$ packed form
5932A842645k9995k0853R811k3727p9056j9714k763Q076m7171l4748l9358j9232
5920A543915k5549n2961J0553J1787n2352M163m2675m3298m5929Q167m1687n9926
5908A214208M6086o0156P46J0528o9368j2853J4427J4534k9230o9975k8726J8288
5896A048509L2136J2712M922m6755k7062q81p547N586m1405m8158m26M1185M1607
5883A014423k0776j2909L4394N96k9561l9889R937J6365K237M4924K78j7470K2038
5870A024587K7582q918o3871m3901M7165M3645L7348j9037m330k3712k800K0786
5858A034544m1090K3159K2425k2245j5527j7745Q7604q822j4976r631M4333R263
5846A091292K785L393O472k2633l1496N6658K5091L7684j10579j9102R4566O471
$$ plain form
5834 1140602 1102041 1151756 1114303 1087728 1156497 1146933 1134280 1185402 1161274 1161034 1181026 1188238
5822 1188238 1249465 1231472 1224830 1260294 1239340 1209325 1226247 1240966 1243086 1216908 1225652 1244547
5810 1244547 1230971 1248191 1281686 1336956 1329975 1256444 1250701 1327526 1320886 1365226 1352380 1343950
5798 1343950 1340421 1371062 1384980 1391464 1436190 1395215 1398043 1395593 1421407 1469300 1478533 1526065
5786 1526065 1480826 1503934 1551543 1554722 1549991 1589535 1617976 1612680 1680660 1639714 1655378 1702314
5774 1702314 1724783 1717485 1742359 1807137 1831145 1862179 1879430 1916759 1971506 1952582 1959583 1957650
5762 1957650 1998038 2054767 2116458 2125969 2173129 2240638 2285839 2286527 2320320 2351067 2396152 2434141
5750 2434141 2469928 2519359 2563218 2572188 2633179 2681681 2728005 2796956 2849312 2864906 2906447 2973534
$$ packed form
5834A140602l8561M9715l7453k6575O8769r564j2653N1122k4128k40J9992P212
5822A188238O1227j7993o642L5464k0954l0015J6922J4719K120k6178Q744J8895
5810A244547j3576J7220L3495N5270o981p3531n743P6825o640M4340j2846q430
5798A343950l529L0641J3918O484M4726m0975K828k450K5814M7893R233M7532
5786A526065m5239K3108M7609L179m731L9544K8441n296O7980m0946J5664M6936
5774A702314K2469p298K4874O4778K4008L1034J7251L7329N4747j8924P001j933
5762A957650M0388N6729O1691R511M7160O7509M5201O88L3793L0747M5085L7989
5750B434141L5787M9431M3859Q970O0991M8502M6324O8951N2356J5594M1541O7087
$$ plain form
5738 2973534 2982274 2968754 3042781 3057587 3141763 3201605 3232056 3300090 3363993 3427698 3437228 3502085
5726 3502085 3497701 3511525 3485326 3541581 3576376 3646831 3713965 3785102 3820498 3847353 3835088 3906229
5714 3906229 3952785 3992907 4047185 4101359 4106902 4106924 4183017 4208925 4209762 4227727 4280224 4331339 4399609
5701 4399609 4382343 4423136 4442436 4444886 4458135 4522249 4538541 4598665 4661730 4673193 4680087 4748644
5689 4748644 4775669 4798666 4845908 4844712 4848584 4882517 4971576 4959325 5029223 5003934 5003116 5036180
5677 5036180 5017940 5044440 5063982 5069183 5088336 5086285 5132796 5154194 5107497 5072334 5075929 5117383
5665 5117383 5118112 5115414 5091643 5022643 5011775 4994345 5012063 5020879 5060910 5023326 5034548 5036262
5653 5036262 5044525 5080032 5048822 5043006 5010733 5021024 5063702 5098842 5081838 5115878 5120997 5068894
$$ packed form
5738B973534Q740j3520P4027J4806Q4176N9842L0451O8034O3903O3705R530O4857
5726C502085m384J3824k6199N6255L4795P0455O7134P1137L5396K6855j2265P1141
5714C906229M6556M0122N4278N4174N543K2P6093K5908Q37J7965N2497N1115O8270
5701D399609j7266M0793J9300K450J3249O4114J6292O0124O3065J1463O894O8557
5689D748644K7025K2997M7242j196L872L3933Q9059j2251O9898k5289q18L3064
5677E036180j8240K6500J9542N201J9153k051M6511K1398m6697l5163L595M1454
5665E117383P29k698k3771o9000j0868j7430J7718Q816M0031l7584J1222J714
5653E036262Q263L5507l1210n816l2273J0291M2678L5140j7004L4040N119n2103
$$ plain form
5641 5068894 5053908 5113999 5150227 5136633 5171178 5174499 5117088 5147834 5198784 5263168 5242752 5238127
5629 5238127 5306761 5358418 5415826 5461653 5501241 5491971 5570897 5615445 5641083 5670524 5662476 5745933
5617 5745933 5801434 5895907 5937018 5970087 5968292 6065047 6144381 6247661 6305445 6369950 6460517
5606 6460517 6523327 6532185 6546791 6663143 6802442 6922779 6969662 6990012 7104127 7229742 7326794
5595 7326794 7438838 7494765 7636403 7737591 7833103 7907271 8001931 8114469 8245385 8413481
5585 8413481 8563645 8651236 8760737 8891310 9107420 9259932 9460320 9662967 9790847 9943821
5575 9943821 10128416 10345040 10512073 10703489 10925681 11181347 11384221 11599200 11864741 12140742
5565 12140742 12376849 12642442 12911579 13164828 13498105 13797566 14111625 14471965 14799708
$$ packed form
5641E068894j4986O0091L6228j3594L4545L321n7411L0746N0950O4384k0416m625
5629E238127O8634N1657N7408M5827L9588r270P8926M4548K5638K9441q048Q3457
5617E745933N5501R4473M1111L3069j795R6755P9334J03280N7784O4505R0567
5606F460517O2810Q858J4606J16352J39299J20337M6883K0350J14115J25615R7052
5595G326794J12044N5927J41638J01188R5512P4168R4660J12538J30916J68096
5585H413481J50164Q7591J09501J30573K16110J52512K00388K02647J27880J52974
5575I943821J84595K16624J67033J91416K22192K55666K02874K14979K65541K76001
5565A2140742K36107K65593K69137K53249L33277K99461L14059L60340L27743
$$ plain form
5556 14799708 15105582 15451117 15737117 16177386 16635773 17019773 17460654 17848467 18312668
5547 18312668 18809247 19369844 19895643 20437595 21062810 21658851 22267240 22860034 23552651
5538 23552651 24264407 25080439 25923773 26711595 27582033 28537415 29507348 30523944 31562546
5529 31562546 32652344 33924854 35212781 36579493 37981462 39460641 41037659 42692104
5521 42692104 44486432 46371806 48290894 50322193 52519113 54912619 57357700 60018342
5513 60018342 62830720 65848409 69043189 72425057 76030990 79848859 83956417 88282073
5505 88282073 92944800 97985333 103289790 108943680 115008587 121458599 128300746 135563362
5497 135563362 143267735 151398224 159980468 168956526 178296647 187912321 197819437 207730465
$$ packed form
5556A4799708L05874L45535K86000M40269M58387L84000M40881L87813M64201
5547A8312668M96579N60597N25799N41952O25215N96041O08389N92794O92617
5538B3552651P11756Q16032Q43334P87822Q70438R55382R69933J016596J038602
5529C1562546J089798J272510J287927J366712J401969J479179J577018J654445
5521D2692104J794328J885374J919088K031299K196920K393506K445081K660642
5513F0018342K812378L017689L194780L381868L605933L817869M107558M325656
5505H8282073M662727N040533N304457N653890O064907O450012O842147P262616
5497A35563362P704373Q130489Q582244Q976058R340121R615674R907116R911028
$$ plain form
5489 207730465 217667203 227481546 236939523 245820784 253979533 261173016 267155639 271765317
5481 271765317 274791269 276151397 275774047 273762251 270252391 265258319 259088137 251974169
5473 251974169 244140578 235739630 226961560 217950054 208894763 199932392 191040127 182320837
5465 182320837 173813417 165573571 157641514 150010638 142661622 135785908 129250350 123085221
5457 123085221 117178207 111637696 106460362 101594743 97032851 92726291 88701912 84886049
5449 84886049 81301396 77913519 74726332 71738838 68893575 66269947 63750008 61344704
5441 61344704 59081813 56886302 54775534 52847974 51044088 49314694 47656001 46078321
5433 46078321 44540557 43129436 41751665 40452456 39286157 38075479 36928603 35880708
$$ packed form
5489B07730465R936738R814343R457977Q881261Q158749P193483N982623M609678
5481B71765317L025952J360128l77350k011796l509860m994072o170182p113968
5473B51974169p833591q400948q778070r011506r055291q962371q892265q719290
5465A82320837q507420q239846p932057p630876p349016o875714o535558o165129
5457A23085221n907014n540511n177334m865619m561892m306560m024379l815863
5449H4886049l584653l387877l187187k987494k845263k623628k519939k405304
5441F1344704k262891k195511k110768j927560j803886j729394j658693j577680
5433D6078321j537764j411121j377771j299209j166299j210678j146876j047895
$$ plain form
5425 35880708 34865431 33846099 32883791 31994051 31149035 30311348 29519753 28765923 28033485
5416 28033485 27306347 26677322 26038898 25453158 24893356 24337177 23732341 23230965 22743437
5407 22743437 22283267 21832003 21363262 20933684 20470147 20106346 19742777 19314108 18921309
5398 18921309 18549259 18199025 17867568 17544712 17249271 16909012 16610900 16297314 16028357
5389 16028357 15795915 15533958 15228417 14962249 14737282 14493337 14299608 14005392 13764589
5380 13764589 13575493 13411273 13204286 12957103 12759701 12596141 12417733 12227844 12019097
5371 12019097 11810597 11633978 11472124 11327765 11200094 10989658 10851572 10715194 10518367
5362 10518367 10365693 10235733 10124696 9997364 9874730 9741300 9568287 9442495 9287634
$$ packed form
5425C5880708j015277j019332r62308q89740q45016q37687p91595p53830p32438
5416B8033485p27138o29025o38424n85740n59802n56179o04836n01376m87528
5407B2743437m60170m51264m68741m29578m63537l63801l63569m28669l92799
5398A8921309l72050l50234l31457l22856k95441l40259k98112l13586k68957
5389A6028357k32442k61957l05541k66168k24967k43945j93729k94216k40803
5380A3764589j89096j64220k06987k47183j97402j63560j78408j89889k08747
5371A2019097k08500j76619j61854j44359j27671k10436j38086j36378j96827
5362A0518367j52674j29960j11037j27332j22634j33430j73013j25792j54861
$$ plain form
5353 9287634 9185951 9076981 8905034 8754147 8683472 8550826 8412595 8350063 8253195 8125856
5343 8125856 8030393 7932638 7777485 7690045 7624001 7546071 7423199 7323738 7170775 7082973 6998252
5332 6998252 6937507 6884820 6811863 6649030 6547836 6487362 6487887 6367806 6253136 6201364 6168693
5321 6168693 6114385 6042831 5986069 5898644 5793013 5758016 5768110 5726920 5647322 5571975 5525725
5310 5525725 5512568 5487672 5433123 5367216 5319983 5302704 5269537 5208942 5167740 5116110 5038700
5299 5038700 5031752 5018477 4950100 4893815 4896806 4851433 4784271 4746595 4699276 4713113 4631136 4579992
5287 4579992 4555398 4493475 4525694 4545299 4532748 4525188 4530362 4497671 4494611 4515154 4525995 4504236
5275 4504236 4465933 4460054 4479458 4490706 4475753 4471729 4508877 4510301 4509011 4534711 4536828 4536387 4564521
$$ packed form
5353I287634j01683j08970j71947j50887p0675j32646j38231o2532r6868j27339
5343H125856r5463r7755j55153q7440o6044p7930j22872r9461j52963q7802q4721
5332F998252o0745n2687p2957j62833j01194o0474N25j20081j14670n1772l2671
5321F168693n4308p1554n6762q7425j05631l4997J0094m1190p9598p5347m6250
5310E525725j3157k4896n4549o5907m7233j7279l3167o0595m1202n1630p7410
5299E038700o948j3275o8377n6285K991m5373o7162l7676m7319J3837q1977n1144
5287D579992k4594o1923L2219J9605j2551p560N174l2691l060K0543J0841k1759
5275D504236l8303n879J9404J1248j4953m024L7148J424j290K5700K117m41K8134
$$ plain form
5262 4564521 4587318 4672685 4656065 4671195 4673068 4732522 4784448 4798267 4845292 4879771 4946940 4975906
5250 4975906 5016029 5054202 5109763 5117528 5139208 5188876 5233243 5299802 5363151 5458293 5438974 5533972
5238 5533972 5639391 5692124 5734940 5754866 5809005 5875383 5967603 6044739 6084701 6130006 6162312
5227 6162312 6205920 6252756 6308780 6424490 6482340 6501797 6564543 6635180 6629543 6681829 6685931 6667179
5215 6667179 6771420 6819844 6853808 6895979 6916694 6880610 6844559 6859771 6889427 6897768 6898450 6936465
5203 6936465 6908488 6886102 6897399 6874071 6838994 6830633 6799306 6750050 6754477 6696374 6675710 6642358
5191 6642358 6639071 6620273 6580503 6576388 6516390 6504573 6436424 6418124 6396642 6343884 6276531 6273451
5179 6273451 6267140 6241959 6193202 6180711 6108701 6012976 6031161 5989474 5939162 5907149 5843623 5816321
$$ packed form
5262D564521K2797Q5367j6620J5130J873N9454N1926J3819M7025L4479O7169K8966
5250D975906M0123L8173N5561P765K1680M9668M4367O6559O3349R5142j9319R4998
5238E533972J05419N2733M2816J9926N4139O6378R2220P7136L9962M5305L2306
5227F162312M3608M6836N6024J15710N7850J9457O2746P0637n637N2286M102j8752
5215F667179J04241M8424L3964M2171K0715l6084l6051J5212K9656Q341O82L8015
5203F936465k7977k2386J1297k3328l5077q361l1327m9256M427n8103k0664l3352
5191F642358l287j8798l9770m115n9998j1817o8149j8300k1482n2758o7353l080
5179F273451o311k5181m8757j2491p2010r5725J8185m1687n0312l2013o3526k7302
$$ plain form
5167 5816321 5755688 5686322 5631388 5552973 5487561 5429975 5334201 5276665 5188344 5095444 4998613
5156 4998613 4961768 4935603 4836264 4733715 4654212 4631222 4561983 4481138 4382243 4324689 4202294
5145 4202294 4149158 4096821 4039327 3965631 3929468 3900252 3843331 3772051 3671845 3637941 3590674
5134 3590674 3570782 3455107 3417611 3374856 3341361 3313784 3234782 3190761 3127986 3129124 3136130 3108382
5122 3108382 3085724 3079557 3086546 3000036 2893583 2914732 2916485 2812871 2797537 2799900 2748355 2747696
5110 2747696 2727160 2738469 2745524 2691768 2635900 2609266 2616241 2554937 2536823 2503607 2449636 2458064
5098 2458064 2461470 2453057 2391069 2356742 2352690 2335981 2318875 2302945 2298831 2296542 2277145 2278073 2243305
5085 2243305 2220134 2220072 2187577 2212883 2193074 2145345 2138975 2126625 2101574 2082291 2108533 2101741
$$ packed form
5167E816321o0633o9366n4934p8415o5412n7586r5774n7536q8321r2900r6831
5156D998613l6845k6165r9339j02549p9503k2990o9239q0845r8895n7554j22395
5145D202294n3136n2337n7494p3696l6163k9216n6921p1280j00206l3904m7267
5134C590674j9892j15675l7496m2755l3495k7577p9002m4021o2775J138P006k7748
5122C108382k2658o167O989q6510j06453K1149J753j03614j5334K363n1545o59
5110B747696k0536J1309P055n3756n5868k6634O975o1304j8114l3216n3971Q428
5098B458064L406q413o1988l4327m052j6709j7106j5930m114k289j9397R28l4768
5085B243305k3171o2l2495K5306j9809m7729o370j2350k5051j9283K6242o792
$$ plain form
5073 2101741 2049267 2079187 2136067 2130290 2106715 2067197 2044425 2025936 2011347 1976700 2008162 2026595
5061 2026595 2021793 2085311 2081077 2097459 2113880 2108447 2139381 2125654 2129865 2186632 2212143 2237696
5049 2237696 2262697 2280699 2322404 2362656 2401422 2378463 2426464 2504875 2552982 2601207 2656982
5038 2656982 2699705 2802054 2843821 2915854 3012022 3102025 3163782 3260260 3361622 3417519 3597048
5027 3597048 3745871 3829748 3936448 4073608 4286206 4443262 4616686 4789160 4966003 5210284
5017 5210284 5413035 5635337 5885689 6211781 6497190 6772910 7038390 7416162 7798897 8147239
5007 8147239 8540815 8952108 9347388 9730733 10115455 10598512 10989921 11353503 11724888 12092402
4997 12092402 12453405 12792830 13149181 13457222 13685952 13939454 14140874 14302833 14489699
$$ packed form
5073B101741n2474K9920N6880n777k3575l9518k2772j8489j4589l4647L1462J8433
5061B026595m802O3518m234J6382J6421n433L0934j3727M211N6767K5511K5553
5049B237696K5001J8002M1705M0252L8766k2959M8001P8411M8107M8225N5775
5038B656982M2723J02349M1767P2033R6168R0003O1757R6478J01362N5897J79529
5027C597048J48823Q3877J06700J37160K12598J57056J73424J72474J76843K44281
5017E210284K02751K22302K50352L26092K85409K75720K65480L77772L82735L48342
5007H147239L93576M11293L95280L83345L84722M83057L91409L63582L71385L67514
4997A2092402L61003L39425L56351L08041K28730K53502K01420J61959J86866
$$ plain form
4988 14489699 14646009 14685653 14669223 14686243 14670487 14625891 14540139 14442632 14289941 14120866 13880605
4977 13880605 13697967 13418076 13108683 12825831 12511829 12167693 11836759 11481521 11085200
4968 11085200 10718545 10397972 10081245 9718824 9378930 9065268 8732860 8482447 8216348
4959 8216348 7879213 7589537 7328961 7146083 6910755 6672475 6480529 6325649 6140927 5977868
4949 5977868 5799239 5672423 5537234 5401268 5277731 5153268 5076496 5047987 4996050 4903466
4939 4903466 4900270 4869869 4860563 4836060 4835166 4869044 4841294 4806635 4775904 4645105 4475978 4394549
4927 4394549 4298943 4125562 4024382 3916308 3830309 3731836 3654759 3575553 3509538 3411914 3288238
4916 3288238 3236230 3187604 3126187 3107498 3039550 3004574 2925282 2880715 2871165 2806503 2749292 2698723
$$ packed form
4988A4489699J56310L9644j6430J7020j5756m4596q5752r7507j52691j69075k40261
4977A3880605j82638k79891l09393k82852l14002l44136l30934l55238l96321
4968A1085200l66655l20573l16727l62421l39894l13662l32408k50413k66099
4959H216348l37135k89676k60576j82878k35328k38280j91946j54880j84722j63059
4949E977868j78629j26816j35189j35966j23537j24463p6772k8509n1937r2584
4939D903466l196l0401r306k4503q94L3878k7750l4659l0731j30799j69127q1429
4927D394549r5606j73381j01180j08074q5999r8473p7077p9206o6015r7624j23676
4916C288238n2008m8626o1417j8689o7948l4976p9292m4567r550o4662n7211n0569
$$ plain form
4904 2698723 2658118 2583101 2512535 2449548 2400874 2358287 2366683 2367916 2369202 2288824 2243389 2176956
4892 2176956 2199984 2144169 2097686 2134321 2089876 2028199 1997335 1934348 1888115 1874565 1834916
4881 1834916 1798081 1746268 1725921 1676767 1690130 1683903 1652776 1564149 1494937 1504109 1486473 1465410
4869 1465410 1448931 1410115 1412489 1377711 1416231 1411438 1363069 1335231 1263720 1245539 1257958 1243541
4857 1243541 1216452 1167410 1192297 1175784 1133702 1136800 1117415 1049951 1016461 1008500 958995 1001716
4845 1001716 966200 953314 912916 909632 949587 981548 931912 868986 830397 858194 843148 837639
4833 837639 858927 912184 905393 902711 883255 848738 911174 926859 875327 803443 805168 813730
4821 813730 795646 827209 838270 811315 807114 818554 774579 755215 783951 730426 764950 767486
$$ packed form
4904B698723m0605p5017p0566o2987m8674m2587Q396J233J286q0378m5435o6433
4892B176956K3028n5815m6483L6635m4445o1677l0864o2987m6233j3550l9649
4881A834916l6835n1813k0347m9154J3363o227l1127q8627o9212R172j7636k1063
4869A465410j6479l8816K374l4778L8520m793m8369k7838p1511j8181J2419j4417
4857A243541k7089m9042K4887j6513m2082L098j9385o7464l3490p961m9505M2721
4845A001716l5516j2886m0398l284L9955L1961m9636o2926l8589K7797j5046n509
4833H37639K1288N3257o791k682j9456l4517O2436J5685n1532p1884J725Q562
4821H13730j8084L1563J1061k6955m201J1440m3975j9364K8736n3525L4524K536
$$ plain form
4809 767486 767142 796809 848261 832758 797630 865274 855346 888492 890516 873560 930458 1008748
4797 1008748 1060032 1093690 1131369 1195214 1201363 1278633 1374669 1417907 1509487 1538976 1542593 1562001
4785 1562001 1562275 1506147 1451046 1389187 1358098 1233268 1195444 1154358 1118294 1122109 1114232 1039616
4773 1039616 1001259 941921 847463 832764 842265 816147 764817 755314 786028 787515 772363 783313
4761 783313 754294 751667 768036 770960 759268 754347 765712 726526 757163 737873 719706 745047
4749 745047 737920 709926 641009 595859 604003 682541 659147 631015 600795 585330 620507 555306
4737 555306 519473 536557 580530 601205 621511 603668 533590 525984 550390 547008 522836 515162
4725 515162 536407 499110 485719 545012 554066 612250 584154 595323 531405 538292 562355 541916
$$ packed form
4809G67486l44K9667N1452j5503l5128O7644r928L3146K024j6956N6898P8290
4797A008748N1284L3658L7679O3845O149P7270R6036M3238R1580K9489L617J9408
4785A562001K74n6128n5101o1859l1089j24830l7824m1086l6064L815p877p4616
4773A039616l8357n9338r4458j4699R501k6118n1330r503L0714J487j5152J0950
4761G83313k9019k627J6369K924j1692m921J1365l9186L0637j9290j8167K5341
4749G45047p127k7994o8917m5150Q144P8538k3394k8132l0220j5465L5177o5201
4737E55306l5833J7084M3973K0675K0306j7843p0078p606K4406l382k4172p674
4725E15162K1245l7297j3391N9293R054N8184k8096J1169o3918O887K4063k0439
$$ plain form
4713 541916 619286 559926 527135 532553 542108 529953 561270 534791 563795 603543 584165 613051
4701 613051 611513 586729 580019 630537 656169 632870 654772 662141 679938 634260 648928 659274
4689 659274 664736 694631 664634 680946 676766 707266 744211 719266 725672 807525 796797 811736
4677 811736 843872 833307 805630 842705 864800 883655 933262 982603 999959 1000884 1009621 1034262
4665 1034262 1060743 1092272 1101117 1162657 1186535 1240624 1272783 1294413 1311800 1356325 1344374 1382485
4653 1382485 1380109 1482961 1544148 1572073 1651509 1713338 1824784 1939492 2034794 2109182 2193315
4642 2193315 2295256 2401390 2465262 2631044 2861963 3034249 3221427 3462122 3645388 3963706
4632 3963706 4291852 4669957 5036451 5451056 5929330 6433116 6915872 7451791 8004689 8511855
$$ packed form
4713E41916P7370n9360l2791N418R555j2155L1317k6479K9004L9748j9378K8886
4701F13051j538k4784o710N0518K5632k3299K1902P369J7797m5678J4668J0346
4689F59274N462K9895k9997J6312m180L0500L6945k4945O406Q1853j0728J4939
4677H11736L2136j0565k7677L7075K2095J8855M9607M9341J7356R25Q737K4641
4665A034262K6481L1529Q845O1540K3878N4089L2159K1630J7387M4525j1951L8111
4653A382485k376J02852O1187K7925P9436O1829J11446J14708R5302P4388Q4133
4642B193315J01941J06134O3872J65782K30919J72286J87178K40695J83266L18318
4632C963706L28146L78105L66494M14605M78274N03786M82756N35919N52898N07166
$$ plain form
4622 8511855 8983651 9303688 9371882 9352303 9229569 9117627 9059220 9082901 9183786 9356422
4612 9356422 9619525 9928875 10248747 10694351 11244212 11808608 12419092 13122149 13868863 14605984
4602 14605984 15397511 16194044 17051441 17894428 18744170 19549695 20446678 21303905 22044383
4593 22044383 22743870 23345215 23879359 24304887 24769404 25160809 25453574 25657128 25633571 25463052
4583 25463052 25174032 24720680 24228154 23687349 23157819 22602365 21948340 21238895 20374428
4574 20374428 19492241 18546354 17581900 16703664 15829535 14982150 14175916 13351096 12462967
4565 12462967 11655273 10914458 10179905 9449644 8838083 8310341 7822936 7333969 6912099
4556 6912099 6497163 6157730 5876636 5600819 5333150 5059129 4838884 4572029 4363726 4212663
$$ packed form
4622H511855M71796L20037O8194j9579j22734j11942n8407K3681J00885J72636
4612I356422K63103L09350L19872M45604N49861N64396O10484P03057P46714P37121
4602A4605984P91527P96533Q57397Q42987Q49742Q05525Q96983Q57227P40478
4593B2044383O99487O01345N34144M25528M64517L91405K92765K03554k3557j70519
4583B5463052k89020m53352m92526n40805n29530n55454o54025p09445q64467
4574B0374428q82187r45887r64454q78236q74129q47385q06234q24820q88129
4565A2462967q07694p40815p34553p30261o11561n27742m87405m88967m21870
4556F912099m14936l39433k81094k75817k67669k74021k20245k66855k08303j51063
$$ plain form
4546 4212663 4080907 3925441 3803906 3740250 3630137 3510977 3392879 3300466 3231965 3120233
4536 3120233 3022879 2935711 2869799 2865883 2825240 2785504 2762554 2723277 2675323 2676628 2634124 2632361
4524 2632361 2600577 2573959 2610907 2620055 2614403 2626368 2657744 2671660 2716216 2700384 2747220 2753030
4512 2753030 2799906 2873779 2893244 2965961 3050428 3078201 3128452 3223389 3331389 3439243 3582104
4501 3582104 3637835 3738133 3859092 4023440 4184136 4385662 4581379 4709717 4928450 5248685
4491 5248685 5560867 5850714 6174875 6554286 6998998 7484886 7949916 8480121 9087927 9671826
4481 9671826 10347779 11116912 11898310 12699041 13538075 14440810 15362548 16176878 16979560 17783918
4471 17783918 18470501 18916918 19190313 19314809 19191692 18921871 18425460 17775103 17047884
$$ packed form
4546D212663j31756j55466j21535o3656j10113j19160j18098r2413o8501j11732
4536C120233r7354q7168o5912l916m0643l9736k2950l9277m7954J305m2504j763
4524B632361l1784k6618L6948R148n652J1965L1376J3916M4556j5832M6836N810
4512B753030M6876P3873J9465P2717Q4467K7773N0251R4937J08000J07854J42861
4501C582104N5731J00298J20959J64348J60696K01526J95717J28338K18733L20235
4491E248685L12182K89847L24161L79411M44712M85888M65030N30205O07806N83899
4481I671826O75953P69133P81398Q00731Q39034R02735R21738Q14330Q02682Q04358
4471A7783918O86583M46417K73395J24496j23117k69821m96411o50357p27219
$$ plain form
4462 17047884 16329604 15536257 14740995 13942007 13179448 12503763 11827540 11205252 10551445
4453 10551445 10027202 9518553 8987054 8520034 8050348 7570308 7167283 6789254 6405128
4444 6405128 6075122 5739619 5424590 5187085 4950607 4656451 4419411 4225318 4046534 3901732
4434 3901732 3730459 3563996 3423335 3291684 3119815 3032155 2962847 2859785 2705985 2644398
4424 2644398 2556635 2428043 2338368 2233471 2179465 2151867 2077829 2008688 1952522 1912739 1834702
4413 1834702 1748223 1704122 1693506 1686481 1616299 1578249 1567671 1563569 1529588 1444478 1360215 1315317
4401 1315317 1360060 1324212 1308868 1283050 1271360 1236101 1154605 1173621 1199877 1193177 1148580 1136971
4389 1136971 1112063 1128080 1102920 1090042 1083152 998932 939981 972095 969880 993578 982142 944563
$$ packed form
4462A7047884p18280p93347p95262p98988p62559o75685o76223o22288o53807
4453A0551445n24243n08649n31499m67020m69686m80040m03025l78029l84126
4444F405128l30006l35503l15029k37505k36478k94156k37040j94093j78784j44802
4434C901732j71273j66463j40661j31651j71869q7660o9308j03062j53800o1587
4424B644398q7763j28592q9675j04897n4006k7598p4038o9141n6166l9783p8037
4413A834702q6479m4101j0616p025p0182l8050j0578m102l3981q5110q4263m4898
4401A315317M4743l5848j5344k5818j1690l5259q1496J9016K6256o700m4597j1609
4389A136971k4908J6017k5160j2878o890q4220n8951L2114k215K3698j1436l7579
$$ plain form
4377 944563 1003472 984628 923196 924447 921113 925424 955975 926428 915494 886967 901088 932635
4365 932635 913268 890825 886058 841203 809146 810080 823572 841529 829231 879440 864715 858481
4353 858481 926697 911240 887375 912337 951403 926451 949684 915987 947871 973102 1069632 1133045
4341 1133045 1096430 1077665 1080699 1111926 1103616 1136240 1201130 1239182 1246501 1262682 1327563 1347112
4329 1347112 1392062 1457349 1476762 1555564 1616861 1658115 1652870 1732920 1815799 1893276 1973995 2029013
4317 2029013 2084339 2178961 2300564 2398320 2434805 2565170 2643913 2721203 2765324 2842974 2964917
4306 2964917 3045691 3133212 3127571 3202918 3374793 3429950 3491509 3531933 3635507 3649935 3714519
4295 3714519 3791592 3895338 3947078 4005594 3993746 3998768 4033250 4066042 4089416 4099581 4061859
$$ packed form
4377I44563N8909j8844o1432J251l334M311L0551k9547j0934k8527J4121L1547
4365I32635j9367k2443m767m4855l2057R34J3492J7957j2298N0209j4725o234
4353H58481O8216j5457k3865K4962L9066k4952K3233l3697L1884K5231R6530O3413
4341A133045l6615j8765L034L1227q310L2624O4890L8052P319J6181O4881J9549
4329A347112M4950O5287J9413P8802O1297M1254n245Q0050Q2879P7477Q0719N5018
4317B029013N5326R4622J21603R7756L6485J30365P8743P7290M4121P7650J21943
4306B964917Q0774Q7521n641P5347J71875N5157O1559M0424J03574J4428O4584
4295C714519P7073J03746N1740N8516j1848N022L4482L2792K3374J0165l7722
$$ plain form
4284 4061859 4038893 4034005 3995794 3966987 3942562 3903813 3794885 3763327 3696024 3685833 3631797
4273 3631797 3580291 3519700 3415108 3335586 3226462 3121543 3062369 3018790 2966614 2835083 2742127
4262 2742127 2678176 2581986 2472846 2408235 2365117 2316051 2155473 2054973 2007660 1977532 1875411
4251 1875411 1786115 1703516 1616569 1574615 1531125 1452512 1438243 1387388 1324779 1241942 1192907
4240 1192907 1155299 1112486 1085499 1052842 991124 982404 975109 933986 898720 877369 822190 747905
4228 747905 755138 747600 726722 681289 654893 641534 667499 626865 604381 644293 625826 633298
4216 633298 637482 594131 582344 539714 556999 575157 548488 559406 531664 519425 517579 511886
4204 511886 467497 446189 466706 518629 480251 495583 537650 533184 472260 470418 521575 486876
$$ packed form
4284D061859k2966m888l8211k8807k4425l8749j08928l1558o7303j0191n4036
4273C631797n1506o0591j04592p9522j09124j04919n9174m3579n2176j31531r2956
4262B742127o3951r6190j09140o4611m3118m9066j60578j00500m7313l0128j02121
4251A875411q9296q2599q6947m1954m3490p8613j4269n0855o2609q2837m9035
4240A192907l7608m2813k6987l2657o1718q720p295m1123l5266k1351n5179p4285
4228G47905P233p538k0878m5433k6396j3359K5965m0634k2484L9912j8467P472
4216F33298M184m3351j1787m2630J7285J8158k6669J0918k7742j2239j846n693
4204E11886m4389k1308K0517N1923l8378J5332M2067m466o0924j842N1157l4699
$$ plain form
4192 486876 481359 538696 544087 495482 477620 434786 410009 460982 496237 494113 485159 476357 493331
4179 493331 516081 491016 452530 387770 377494 404110 370595 386418 427320 403839 391019 407686
4167 407686 417556 455486 475102 470330 399966 394488 393097 329404 307593 338795 391584 399317 346855
4154 346855 399387 386536 399915 373202 322299 315601 279276 293077 306728 361617 381702 356745
4142 356745 354729 336591 320561 302287 311688 315181 316290 307927 348544 267971 262164 271836 287938
4129 287938 333314 311614 273967 266395 309218 314042 246080 239796 257736 307170 276274 245586
4117 245586 307352 300424 308559 290835 255262 272787 291851 275014 248877 254607 241100 241951 234334
4104 234334 195838 251218 269780 264268 274046 278167 307854 290296 297725 346219 363296 337319
$$ packed form
4192D86876n517N7337N391m8605j7862m2834k4777N0973L5255k124q954q802J6974
4179D93331K2750k5065l8486o4760j0276K6616l3515J5823M0902k3481j2820J6667
4167D07686R870L7930J9616m772p0364n478j391o3693k1811L1202N2789P733n2462
4154C46855N2532j2851J3379k6713n0903o698l6325J3801J3651N4889K0085k4957
4142C56745k016j8138j6030j8274R401L493J109q363M0617q0573n807R672J6102
4129B87938M5376k1700l7647p572M2823M824o7962o284J7940M9434l0896l0688
4117B45586O1766o928Q135j7724l5573J7525J9064j6837k6137N730j3507Q51p617
4104B34334l8496N5380J8562n512R778M121K9687j7558P429M8494J7077k5977
$$ plain form
4092 337319 362977 391871 340943 362986 375249 368858 362184 330443 321822 353423 385663 382968
4080 382968 401858 483660 487285 451585 474507 497885 524449 594302 603970 626037 674355 703117
4068 703117 772802 799345 835494 902615 934621 981846 1025612 1136747 1201338 1321014 1414964
4057 1414964 1527507 1633655 1827418 2006621 2180334 2429025 2694448 2963888 3230784 3480488
4047 3480488 3762928 4034373 4187688 4176102 4076378 3942483 3728277 3498652 3208737 2970764
4037 2970764 2804684 2724148 2631405 2549118 2435678 2274950 2163677 2053155 1980175 1912754
4027 1912754 1840965 1722188 1635286 1611753 1547453 1487616 1447081 1373971 1292355 1248655 1208351
4016 1208351 1132178 1092846 1092574 1061260 996740 986195 965576 952058 913567 929649 925503 870419
$$ packed form
4092C37319K5658K8894n0928K2043J2263o391o674l1741q621L1601L2240k695
4080C82968J8890Q1802L625l5700K2922K3378K6564O9853R668K2067M8318K8762
4068G03117O9685K6543L6149O7121L2006M7225M3766J11135O4591J19676R3950
4057A414964J12543J06148J93763J79203J73713K48691K65423K69440K66896K49704
4047C480488K82440K71445J53315j1586r9724j33895k14206k29625k89915k37973
4037B970764j66080q0536r2743q2287j13440j60728j11273j10522p2980o7421
4027A912754p1789j18777q6902k3533o4300n9837m0535p3110q1616m3700m0304
4016A208351p6173l9332k72l1314o4520j0545k0619j3518l8491J6082m146n5084
$$ plain form
4004 870419 907020 899617 865277 854199 826969 878485 899071 858364 820304 824624 830734 794613
3992 794613 861691 865026 848799 861688 906879 942643 896634 885082 887803 938801 949715 930936
3980 930936 962196 978683 948579 945468 980463 1013917 1025869 1031037 1068134 1092760 1108196 1157306
3968 1157306 1219707 1190283 1244584 1276898 1264694 1275032 1308771 1359708 1411647 1472324 1502465
3957 1502465 1425789 1416828 1398880 1447493 1481570 1546954 1596066 1590375 1585200 1646428 1646044 1659105
3945 1659105 1713889 1685885 1700492 1707167 1732062 1751341 1794936 1817047 1890794 1959795 1981360 1989482
3933 1989482 2004225 2124301 2150784 2174983 2211227 2322974 2390496 2490054 2535608 2627979 2721481
3922 2721481 2851173 2969937 3057212 3210227 3292139 3438696 3569247 3735485 3858431 3988601
$$ packed form
4004H70419L6601p403l4340j1078k7230N1516K0586m0707l8060M320O110l6121
3992G94613O7078L335j6227J2889M5191L5764m6009j1552K721N0998J0914j8779
3980I30936L1260J6487l0104l111L4995L3454J1952N168L7097K4626J5436M9110
3968A157306O2401k9424N4301L2314j2204J0338L3739N0937N1939O0677L0141
3957A502465p6676q961j7948M8613L4077O5384M9112n691n175O1228l84J3061
3945A659105N4784k8004J4607O675K4895J9279M3595K2111P3747O9001K1565Q122
3933A989482J4743J20076K6483K4199L6244J11747O7522R9558M5554R2371R3502
3922B721481J29692J18764Q7275J53015Q1912J46557J30551J66238J22946J30170
$$ plain form
3912 3988601 4126419 4253552 4352827 4524818 4678547 4788482 4910991 5037331 5142807 5297173
3902 5297173 5419378 5557408 5641562 5732296 5840606 5856310 5952372 6023533 6080097 6177942 6236711
3891 6236711 6244865 6211134 6261402 6262811 6214113 6200037 6117789 6077860 6029540 5951062 5935017 5850498
3879 5850498 5800719 5711633 5681921 5594504 5447326 5363946 5277538 5182666 5042876 4866024 4782792
3868 4782792 4685072 4509269 4349107 4239023 4105021 3946720 3821620 3772404 3655615 3537245
3858 3537245 3389629 3267839 3217037 3119824 3062898 2948247 2868631 2831743 2745428 2679327 2660144
3847 2660144 2606614 2559778 2507891 2448846 2436567 2418718 2412890 2413013 2366606 2314624 2339054 2331580
3835 2331580 2359032 2330394 2318708 2367986 2376332 2339308 2313760 2332358 2309463 2302760 2316840 2285062
$$ packed form
3912C988601J37818J27133R9275J71991J53729J09935J22509J26340J05476J54366
3902E297173J22205J38030Q4154R0734J08310J5704R6062P1161N6564R7845N8769
3891F236711Q154l3731N0268J409m8698j4076q2248l9929m8320p8478j6045q4519
3879E850498m9779q9086k9712q7417j47178q3380q6408r4872j39790j76852q3232
3868D782792r7720j75803j60162j10084j34002j58301j25100m9216j16789j18370
3858C537245j47616j21790n0802r7213n6926j14651p9616l6888q6315o6101j9183
3847B660144n3530m6836n1887n9045j2279j7849n828J23m6407n1982K4430p474
3835B331580K7452k8638j1686M9278Q346l7024k5548J8598k2895o703J4080l1778
$$ plain form
3823 2285062 2234022 2184694 2209839 2263991 2260610 2255799 2257413 2250872 2250802 2272703 2334224 2440438 2422111
3810 2422111 2407671 2398055 2407159 2434527 2474996 2484284 2546578 2550597 2566377 2681579 2695601 2717897
3798 2717897 2774590 2783630 2871071 2901002 2926145 2967770 2967272 2955771 3032394 3092926 3110669 3053872
3786 3053872 3031198 3028207 3012463 2992591 2979172 3050107 3062181 3039063 3023144 3061037 3037361 3085446
3774 3085446 3118888 3122533 3146370 3199302 3226431 3261312 3354448 3416628 3490102 3566249 3634561 3730517
3762 3730517 3766373 3850083 3950188 4057064 4223001 4371723 4533581 4648009 4828438 5004717
3752 5004717 5184256 5391016 5616444 5785288 5938594 6141213 6374842 6646786 6860530 7025237
3742 7025237 7299700 7555310 7752333 7955944 8186385 8402245 8660306 8861819 9104138 9264802
$$ packed form
3823B285062n1040m9328K5145N4152l381m811J614o541p0K1901O1521J06214j8327
3810B422111j4440r616R104K7368M0469R288O2294M019J5780J15202J4022K2296
3798B717897N6693R040Q7441K9931K5143M1625m98j1501P6623O0532J7743n6797
3786C053872k2674k991j5744j9872j3419P0935J2074k3118j5919L7893k3676M8085
3774C085446L3442L645K3837N2932K7129L4881R3136O2180P3474P6147O8312R5956
3762C730517L5856Q3710J00105J06876J65937J48722J61858J14428J80429J76279
3752E004717J79539K06760K25428J68844J53306K02619K33629K71944K13744J64707
3742G025237K74463K55610J97023K03611K30441K15860K58061K01513K42319J60664
$$ plain form
3732 9264802 9449388 9725515 9896391 10135162 10344997 10604650 10805125 11012447 11180774 11364935
3722 11364935 11518112 11657663 11790088 11866982 11922891 11963274 11982143 11965427 11897295 11794431
3712 11794431 11696021 11610331 11464244 11302801 11130492 10966396 10769742 10569999 10397373 10165047
3702 10165047 9909013 9710951 9570247 9369847 9162275 8941042 8769342 8540440 8375330
3693 8375330 8142260 7913565 7707213 7481591 7283463 7086727 6873962 6666327 6448278 6239146
3683 6239146 6022993 5821072 5657607 5493847 5321171 5157672 4964646 4789898 4686096 4560517
3673 4560517 4415251 4307787 4137517 3957624 3892346 3865260 3798911 3682707 3595524 3517296
3663 3517296 3398485 3377202 3312558 3263470 3287906 3169448 3149315 3120258 3139881 3129014 3148051
$$ packed form
3732I264802J84586K76127J70876K38771K09835K59653K00475K07322J68327J84161
3722A1364935J53177J39551J32425P6894N5909M0383J8869j6716o8132j02864
3712A1794431r8410q5690j46087j61443j72309j64096j96654j99743j72626k32326
3702A0165047k56034j98062j40704k00400k07572k21233j71700k28902j65110
3693H375330k33070k28695k06352k25622j98128j96736k12765k07635k18049k09132
3683F239146k16153k01921j63465j63760j72676j63499j93026j74748j03802j25579
3673D560517j45266j07464j70270j79893o5278k7086o6349j16204q7183p8228
3663C517296j18811k1283o4644m9088K4436j18458k0133k9057J9623j0867J9037
$$ plain form
3652 3148051 3035689 3027385 3038930 2981711 3000831 3007837 3035858 3060876 2998444 2938520 2884398 2859340
3640 2859340 2869834 2850637 2833685 2805908 2754104 2687541 2679188 2657343 2586190 2518146 2458334 2427654
3628 2427654 2375955 2292693 2261305 2243868 2213987 2190870 2135803 2112656 2059475 2024215 1965406
3617 1965406 1959474 1923485 1874008 1832667 1742474 1793558 1820364 1788883 1726736 1728696 1738348 1712955
3605 1712955 1691516 1675535 1649345 1647503 1648192 1633224 1595108 1534271 1533784 1567644 1531533 1520036
3593 1520036 1503560 1482461 1441100 1490001 1510492 1522504 1513200 1550535 1543368 1505256 1523873 1535891
3581 1535891 1473563 1482203 1511440 1512815 1553672 1587813 1612938 1564293 1534166 1556111 1676853 1692040
3569 1692040 1705397 1686892 1703110 1723357 1780181 1780398 1800131 1815096 1869310 1917371 1956267 2014017
$$ packed form
3652C148051j12362q304J1545n7219J9120P006K8021K5018o2432n9924n4122k5058
3640B859340J0494j9197j6952k7777n1804o6563q353k1845p1153o8044n9812l0680
3628B427654n1699q3262l1388j7437k9881k3117n5067k3147n3181l5260n8809
3617A965406n932l5989m9477m1341r0193N1084K6806l1481o2147J960R652k5393
3605A712955k1439j5981k6190j842O89j4968l8116o0837m87L3860l6111j1497
3593A520036j6476k1099m1361M8901K0491J2012r304L7335p167l8112J8617J2018
3581A535891o2328Q640K9237J375M0857L4141K5125m8645l0127K1945J20742J5187
3569A692040J3357j8505J6218K0247N6824K17J9733J4965N4214M8061L8896N7750
$$ plain form
3557 2014017 2031876 2070527 2092591 2128401 2169939 2223725 2283571 2311406 2366712 2459964 2493936
3546 2493936 2590077 2650872 2687424 2746115 2815569 2895227 3015627 3095340 3150012 3242243 3328528
3535 3328528 3414200 3565000 3643573 3777646 3942277 4125721 4291265 4438437 4637107 4844397
3525 4844397 5013298 5303149 5519594 5715946 5995794 6247530 6539591 6891539 7219106 7565971
3515 7565971 7932266 8317137 8714073 9152974 9541681 9983159 10461164 10936555 11414629 11884921
3505 11884921 12321296 12770729 13151596 13600505 14080632 14472093 14734274 14965073 15279700
3496 15279700 15457752 15693692 15851396 15962194 16040186 16082741 15998829 15910588 15843589 15655931
3486 15655931 15510577 15315384 15029807 14767158 14490727 14083296 13639306 13290349 12891469
$$ packed form
3557B014017J7859L8651K2064L5810M1538N3786N9846K7835N5306R3252L3972
3546B493936R6141O0795L6552N8691O9454P9658J20400P9713N4672R2231Q6285
3535C328528Q5672J50800P8573J34073J64631J83444J65544J47172J98670K07290
3525D844397J68901K89851K16445J96352K79848K51736K92061L51948L27567L46865
3515G565971L66295L84871L96936M38901L88707M41478M78005M75391M78074M70292
3505A1884921M36375M49433L80867M48909M80127L91461K62181K30799L14627
3496A5279700J78052K35940J57704J10798P7992M2555q3912q8241o6999j87658
3486A5655931j45354j95193k85577k62649k76431m07431m43990l48957l98880
$$ plain form
3477 12891469 12470352 12033617 11608937 11201072 10832137 10395426 9935980 9528889 9225672
3468 9225672 8882141 8560759 8246405 7912823 7583266 7291612 7008727 6754072 6537494 6300994
3458 6300994 6071119 5881146 5702527 5519408 5310204 5137845 5024135 4914982 4781339 4698203
3448 4698203 4555812 4451974 4312915 4216255 4140890 4093460 4023564 3902612 3853362 3784703 3727800
3437 3727800 3678064 3670965 3581484 3522547 3517866 3475344 3454092 3403695 3364234 3338738 3254333 3169764
3425 3169764 3190841 3180337 3112914 3068081 3044562 2995807 2949311 2976960 2983934 2925535 2882828 2877816
3413 2877816 2866291 2898180 2823376 2789130 2795542 2786196 2782007 2736476 2719450 2751983 2746080 2700267
3401 2700267 2687982 2715503 2747759 2743336 2759312 2709151 2659485 2641040 2619387 2619947 2585003 2634903
$$ packed form
3477A2891469m21117m36735m24680m07865l68935m36711m59446m07091l03217
3468I225672l43531l21382l14354l33582l29557k91654k82885k54655k16578k36500
3458F300994k29875j89973j78619j83119k09204j72359j13710j09153j33643q3136
3448D698203j42391j03838j39059r6660p5365m7430o9896j20952m9250o8659n6903
3437C727800m9736p099q9481n8937m681m2522k1252n0397l9461k5496q4405q4569
3425C169764K1077j0504o7423m4833k3519m8755m6496K7649O974n8399m2707n012
3413B877816j1525L1889p4804l4246O412r346m189m5531j7026L2533n903m5813
3401B700267j2285K7521L2256m423J5976n0161m9666j8445k1653N60l4944M9900
$$ plain form
3389 2634903 2664802 2704822 2689044 2713696 2751508 2795310 2846078 2882920 2974779 3053129 3068612
3378 3068612 3159184 3253372 3307066 3425486 3519281 3590951 3676173 3773652 3901848 4015315 4088920
3367 4088920 4273068 4472640 4629821 4829072 5027675 5238822 5445542 5635550 5796690 5984220
3357 5984220 6236002 6526267 6710451 6907520 7121778 7268404 7444112 7619392 7792925 7961303
3347 7961303 8087491 8128047 8238241 8265070 8312517 8349276 8267375 8249236 8205255 8114728 7989835
3336 7989835 7851877 7682336 7559222 7398279 7212303 7007582 6731393 6523089 6359628 6161006
3326 6161006 5957075 5753860 5574635 5367477 5087006 4917122 4746241 4530036 4385323 4254792
3316 4254792 4062075 3893836 3698957 3608085 3524986 3398266 3292171 3186438 3087845 2957038
$$ packed form
3389B634903K9899M0020j5778K4652L7812M3802N0768L6842R1859P8350J5483
3378C068612R0572R4188N3694J18420R3795P1670Q5222R7479J28196J13467P3605
3367D088920J84148J99572J57181J99251J98603K11147K06720J90008J61140J87530
3357E984220K51782K90265J84184J97069K14258J46626J75708J75280J73533J68378
3347G961303J26188M0556J10194K6829M7447L6759q1901j8139m3981r0527j24893
3336G989835j37958j69541j23114j60943j85976k04721k76189k08304j63461j98622
3326F161006k03931k03215j79225k07158k80471j69884j70881k16205j44713j30531
3316D254792j92717j68239j94879r0872q3099j26720j06095j05733r8593j30807
$$ plain form
3306 2957038 2880347 2785432 2753166 2630347 2527911 2436690 2430483 2394809 2369846 2297695 2246881
3295 2246881 2208919 2141706 2084129 2025917 2027206 2033882 2031124 1996532 2003596 2050696 2031493 2014085
3283 2014085 2018822 1962671 1937007 1910848 1890734 1803660 1747576 1729567 1725502 1675882 1643264 1619949
3271 1619949 1597803 1567110 1521377 1505932 1423499 1398209 1405176 1352787 1363161 1347066 1335562 1290912
3259 1290912 1276292 1245670 1184183 1106773 1066272 1110098 1140574 1133000 1116192 1100878 1077521 1057104
3247 1057104 1071492 1071397 1073259 1057326 1071935 1035381 995493 1046605 1020960 967193 952981 947675
3235 947675 967301 965903 914268 908578 892979 889902 850172 821372 905229 931144 945302 971112
3223 971112 956128 927204 964381 974686 971849 922757 914799 929401 902874 921021 932164 907415
$$ packed form
3306B957038p6691r4915l2266j22819j02436r1221o207l5674k4963p2151n0814
3295B246881l7962o7213n7577n8212J289O676k758l4592P064M7100j9203j7408
3283B014085M737n6151k5664k6159k0114q7074n6084j8009m065m9620l2618k3315
3271A619949k2146l0693m5733j5445q2433k5290O967n2389J0374j6095j1504m4650
3259A290912j4620l0622o1487p7410m0501M3826L0476p574j6808j5314k3357k0417
3247A057104J4388r5J862j5933J4609l6554l9888N1112k5645n3767j4212n306
3235I47675J9626j398n1635n690j5599l077l9730k8800Q3857K5915J4158K5810
3223I71112j4984k8924L7177J0305k837m9092p958J4602k6527J8147J1143k4749
$$ plain form
3211 907415 915390 893893 895263 898000 917010 948494 943975 934311 962391 997905 992649 965046 925993
3198 925993 959051 1026516 1024574 1011759 1047373 1073726 1050842 1072611 1130778 1073540 1064528 1036477
3186 1036477 1028870 1013141 1070424 1124003 1126214 1160002 1178231 1179952 1184123 1216918 1219463 1268227
3174 1268227 1306255 1305519 1315001 1371505 1365136 1335713 1392161 1423545 1407734 1465061 1501874 1572448
3162 1572448 1604774 1616715 1686018 1712532 1739924 1768316 1828552 1875189 1944841 2018621 2032964
3151 2032964 2047937 2128281 2209145 2346716 2412154 2455869 2525925 2587883 2701001 2823777 2917883
3140 2917883 3050116 3138685 3272318 3439135 3590909 3698878 3880734 4048906 4220368 4454771
3130 4454771 4613511 4852348 5113846 5301655 5590390 5913150 6218206 6498044 6848687 7216157
$$ packed form
3211I07415P975k1497J370K737J9010L1484m519r664K8080L5514n256k7603l9053
3198I25993L3058O7465j942j2815L5614K6353k2884K1769N8167n7238r012k8051
3186A036477p607j5729N7283N3579K211L3788J8229J721M171L2795K545M8764
3174A268227L8028p36R482N6504o369k9423N6448L1384j5811N7327L6813P0574
3162A572448L2326J1941O9303K6514K7392K8392O0236M6637O9652P3780J4343
3151B032964J4973Q0344Q0864J37571O5438M3715P0056O1958J13118J22776R4106
3140B917883J32233Q8569J33633J66817J51774J07969J81856J68172J71462K34403
3130D454771J58740K38837K61498J87809K88735L22760L05056K79838L50643L67470
$$ plain form
3120 7216157 7583275 8032560 8496819 9004641 9536568 10092306 10720344 11450292 12189760 12970623
3110 12970623 13814095 14739240 15686975 16716567 17868575 19091498 20351122 21680432 23074830
3101 23074830 24492463 25927720 27393412 28814041 30048998 31203251 32262509 33045706
3093 33045706 33564858 33754643 33633923 33248212 32557465 31697310 30684006 29508527 28209142
3084 28209142 27010116 25782584 24578852 23320762 22173275 21080500 19997023 18920673
3076 18920673 17885278 16964050 16057062 15235484 14473719 13732445 12986806 12324705 11676939
3067 11676939 11104937 10565586 10054093 9619446 9183273 8765215 8374301 7956433 7610954
3058 7610954 7384230 7150931 6828588 6565738 6355654 6081948 5812635 5618054 5415846 5257771
$$ packed form
3120G216157L67118M49285M64259N07822N31927N55738O28038P29948P39468P80863
3110A2970623Q43472R25145R47735J029592J152008J222923J259624J329310J394398
3101B3074830J417633J435257J465692J420629J234957J154253J059258P83197
3093C3045706N19152J89785j20720l85711o90747q60155j013304j175479j299385
3084B8209142j199026j227532j203732j258090j147487j092775j083477j076350
3076A8920673j035395r21228r06988q21578p61765p41274p45639o62101o47766
3067A1676939n72002n39351n11493m34647m36173m18058l90914m17868l45479
3058G610954k26724k33299l22343k62850k10084k73706k69313j94581k02208j58075
$$ plain form
3048 5257771 5103499 4931038 4744560 4586100 4428402 4302062 4123700 4021075 3936652 3781312
3038 3781312 3685086 3574512 3418649 3352860 3272997 3207143 3152651 3038788 2921776 2875422 2782169
3027 2782169 2694494 2647241 2591091 2500024 2401056 2380862 2376766 2276848 2244064 2178632 2155795 2110493
3015 2110493 2062293 1997042 1940935 1903630 1857126 1846985 1835956 1835408 1737400 1693228 1750310 1731824
3003 1731824 1632321 1585817 1569091 1525504 1511300 1526070 1503350 1424841 1395196 1383574 1383223 1396358
2991 1396358 1371584 1325840 1293717 1247468 1223048 1238645 1227432 1245324 1206216 1163681 1133712
2980 1133712 1147892 1114836 1080939 1063922 1034189 1026068 1020228 1030854 1025017 993286 954316 926476
2968 926476 957298 947919 918180 955990 902480 882601 872530 891763 877063 798114 764710 784467
$$ packed form
3048E257771j54272j72461j86478j58460j57698j26340j78362j02625q4423j55340
3038C781312r6226j10574j55863o5789p9863o5854n4492j13863j17012m6354r3253
3027B782169q7675m7253n6150r1067r8968k0194m096r9918l2784o5432k2837m5302
3015B110493m8200o5251n6107l7305m6504j0141j1029n48r8008m4172N7082j8486
3003A731824r9503m6504j6726m3587j4204J4770k2720p8509k9645j1622l51J3135
2991A396358k4774m5744l2123m6249k4420J5597j1213J7892l9108m2535k9969
2980A133712J4180l3056l3897j7017k9733q121n840J0626n837l1731l8970k7840
2968I26476L0822r379k9739L7810n3510j9879j0071J9233j4700p8949l3404J9757
$$ plain form
2956 784467 837398 844987 795932 800411 845521 773731 774972 720463 720937 694925 709506 728362 699521
2943 699521 667644 661852 665195 654281 623133 619206 613750 662507 621484 570145 549500 586298
2931 586298 610680 561191 555590 577749 552897 552517 565861 547081 537644 555147 554078 477510 466324
2918 466324 553876 497017 488533 467010 464817 441838 439520 431744 409276 407123 431954 449691 405355
2905 405355 428950 418258 385596 380389 399725 381430 390551 339322 330988 372677 398478 439947
2893 439947 428991 372161 370122 419040 424259 367673 331613 300669 335164 343246 357483 313481
2881 313481 342443 337144 307916 270574 301613 329355 332444 289268 282298 328634 325134 299229
2869 299229 300086 328608 321913 312040 314244 290805 277709 305173 314729 309854 252226 268548 287869
$$ packed form
2956G84467N2931P589m9055M479M5110p1790J241n4509M74k6012J4581J8856k8841
2943F99521l1877n792L343j0914l1148l927n456M8757m1023n1339k0645L6798
2931E86298K4382m9489n601K2159k4852l80J3344j8780r437J7503j069p6568j1186
2918D66324Q7552n6859q484k1523k193k2979k318p776k2468k153K4831J7737m4336
2905D05355K3595j0692l2662n207J9336j8295R121n1229q334M1689K5801M1469
2893D39947j0956n6830k039M8918N219n6586l6060l0944L4495Q082J4237m4002
2881C13481K8962n299k9228l7342L1039K7742L089m3176o970M6336l500k5905
2869B99229Q57K8522o695r873K204k3439j3096K7464R556m875n7628J6322J9321
$$ plain form
2856 287869 262332 265709 240089 287419 223176 201295 209683 198815 209017 239200 257240 273957
2844 273957 285347 265107 243880 256836 274373 260031 276675 264031 240211 224503 191847 223510
2832 223510 259747 227352 274724 253216 274424 266461 231072 198279 191031 251538 211306 241901
2820 241901 269396 316670 302071 263374 337998 309400 335618 377976 356697 379301 351229 277719
2808 277719 270730 282869 280956 289675 313394 357352 328604 269469 245638 280989 299199 208458
2796 208458 230339 305893 262811 214015 269905 286677 246498 265067 241381 203836 209934 204135
2784 204135 185898 229178 231484 237132 192185 200618 140854 149225 121529 124730 153800 138122 141976
2771 141976 173832 203788 135820 136014 147175 181433 180468 169089 153650 118740 146641 150880 117638
$$ packed form
2856B87869k5537L377k5620M7330o4243k1881Q388j0868J0202L0183J8040J6717
2844B73957J1390k0240k1227J2956J7537j4342J6644j2644k3820j5708l2656L1663
2832B23510L6237l2395M7372k1508K1208p963l5389l2793p248O0507m0232L0595
2820B41901K7495M7274j4599l8697P4624k8598K6218M2358k1279K2604k8072p3510
2808B77719o989J2139j913Q719K3719M3958k8748n9135k3831L5351J8210r0741
2796B08458K1881P5554m3082m8796N5890J6772m0179J8569k3686l7545O098n799
2784B04135j8237M3280K306N648m4947Q433n9764Q371k7696L201K9070j5678L854
2771A41976L1856K9956o7968J94J1161L4258r65j1379j5439l4910K7901M239l3242
$$ plain form
2758 117638 128759 113578 136939 162749 138225 127542 141709 97978 100260 102252 124097 107166
2746 107166 113328 63079 95320 82963 98633 78585 128803 88132 139316 183927 176849 175817
2734 175817 107534 48479 90543 39190 24634 54283 94092 107157 107424 51604 60160 66977
2722 66977 35762 156989 121510 64357 56542 57705 35455 44896 44176 84975 55536 46098 96245
2709 96245 133044 99351 53293 45105 53187 51095 126378 115852 121930 99239 22374 -10246 44498
2696 44498 66597 62342 93525 104350 44685 19693 12661 72220 136237 186401 110625 98121
2684 98121 70746 71439 113513 131186 127192 141168 132013 96729 109107 104698 84676 53661 71555
2671 71555 41090 49998 68282 85149 84207 75339 83894 80978 87800 87915 19451 24569 53497 82794
$$ packed form
2758A17638J1121j5181K3361K5810k4524j0683J4167m3731K282J992K1845j6931
2746A07166O162n0249L2241j2357J5670k0048N0218m0671N1184M4611p078j032
2734A75817o8283n9055M2064n1353j4556K9649L9809J3065K67n5820Q556O817
2722F6977l1215J21227l5479n7153p815J163k2250R441p20M0799k9439r438N0147
2709I6245L6799l3693m6058q188Q082k092P5283j0526O078k2691p6865l2620N4744
2696D4498K2099m255L1183J0825n9665k4992p032N9559O4017N0164p5776j2504
2684I8121k7375O93M2074J7673l994J3976r155l5284J2378m409k0022l1015J7894
2671G1555l0465Q908J8284J6867r42q868Q555k916O822J15o8464N118K8928K9297
$$ plain form
2657 82794 68808 63002 93685 9307 14942 22913 39399 52169 50876 50988 2362 22495 39897
2644 39897 42510 67309 42176 23186 29832 49600 20083 -14514 -34769 34069 45292 52004
2632 52004 55040 31032 76651 96180 22780 7963 17102 18124 28373 36246 65005 18824 8341
2619 8341 41581 51534 -17421 22489 12131 50818 38737 60596 43087 49640 33422 36593 63521
2606 63521 56457 47542 42438 68063 38131 22410 12145 30328 24439 -21483 219 48160 40456
2593 40456 49308 38651 52265 69624 49525 42888 22328 21826 68778 11363 30793 69228 73575
2580 73575 44822 -34396 -50508 -8360 31095 51291 57432 47228 38808 48416 36614 54694
2568 54694 67773 48054 46491 39711 59885 2750 -5391 9139 92141 58621 17698 51055
$$ packed form
2657H2794j3986n806L0683q4378N635P971J6486J2770j293J12m8626K0133J7402
2644C9897K613K4799k5133j8990O646J9768k9517l4597k0255O8838J1223O712
2632E2004L036k4008M5619J9529p3400j4817R139J022J0249P873K8759m6181j0483
2619H341L3240R953o8955L9910j0358L8687j2081K1859j7509O553j6218L171K6928
2606F3521p064q915n104K5625k9932j5721j0265J8183n889m5922K1702M7941p704
2593D0456Q852j0657J3614J7359k0099o637k0560n02M6952n7415J9430L8435M347
2580G3575k8753p9218j6112M2148L9455K0196O141j0204q420R608j1802J8080
2568E4694J3079j9719j563o780K0174n7135q141J4530Q3002l3520m0923L3357
$$ plain form
2556 51055 72538 68508 57850 55017 72743 32957 15107 55715 -6185 -33154 -27025 -10143
2544 -10143 6418 -20548 -16570 25148 -34 46090 -2059 19757 59963 49670 3035 -29715
2532 -29715 -493 11 3650 31319 33633 26974 33495 46772 30908 -28455 -23556 3891 25313
2519 25313 29270 18208 56965 28334 28782 37544 5049 39059 6979 39076 44059 24590 21274
2506 21274 3765 -9949 -29965 13127 24142 23805 -117 17485 30755 7727 12163 14882 9182
2493 9182 2706 -6776 -4834 -17020 -59000 -10580 35588 -15589 -30311 5600 24343 28810 -15584
2480 -15584 -11850 9506 66190 56768 45730 23477 -10333 2013 -16360 14014 60645 8404
2468 8404 42173 84211 28374 33598 -187 -5437 39281 83252 51956 48967 -8961 4070 38475
$$ packed form
2556E1055K1483m030j0658k833J7726l9786j7850M0608o1900k6969O129J6882
2544a0143J6561k6966L978M1718k5182M6124m8149K1816M0206j0293m6635l2750
2532b9715K9222N04L639K7669K314o659O521J3277j5864n9363M899K7447K1422
2519B5313L957j1062L8757k8631M48Q762l2495L4010l2080L2097M983j9469l316
2506B1274j7509j3714k0016M3092J1015l37k3922J7602J3270k3028M436K719n700
2493I182o476r482J942j2186m1980M8420M6168n1177j4722L5911J8743M467m4394
2480a5584L734K1356N6684r422j1038k2253l3810J2346j8373L0374M6631n2241
2468H404L3769M2038n5837N224l3785n250M4718M3971l1296k989n7928J3031L4405
$$ plain form
2455 38475 24843 15303 -598 2208 -12623 -17788 -46816 -2078 -4604 -12190 4379 -25372 -7285
2442 -7285 -3350 70642 25029 -3669 59334 28323 30291 -11849 28745 86088 47938 37247
2430 37247 -5623 1414 -13301 -41271 -666 26506 66144 50105 28389 32041 18380 -10013
2418 -10013 32751 61302 87885 15232 5750 58793 71806 87623 90239 74094 76603 59606
2406 59606 34971 3911 11428 -8187 -35191 10451 27741 16561 47163 44694 12655 -10707
2394 -10707 -22173 10234 -2340 38338 58138 17762 -5848 27708 -32068 -6720 18695 26002
2382 26002 43645 -309 6414 53549 60566 52912 47061 66478 22543 22683 16611 -6682 31160
2369 31160 43560 75472 130599 134747 131087 121368 143858 78626 52181 87919 92680 110905 106008
$$ packed form
2455C8475j3632r540j5901K806j4831n165k9028M4738k526p586J6569k9751J8087
2442g285L935P3992m5613k8698O3003l1011J968m2140M0594N7343l8150j0691
2430C7247m2870P037j4715k7970M0605K7172L9638j6039k1716L652j3661k8393
2418a0013M2764K8551K6583p2653r482N3043J3013J5817K616j6145K509j6997
2406E9606k4635l1060P517j9615k7004M5642J7290j1180L0602k469l2039k3362
2394a0707j1466L2407j2574M0678J9800m0376k3610L3556n9776K5348K5415P307
2382B6002J7643m3954O723M7135P017p654n851J9417m3935J40o072k3293L7842
2369C1160J2400L1912N5127M148l660r719K2490o5232k6445L5738M761J8225m897
$$ plain form
2356 106008 107869 106836 157091 180125 195416 214000 252679 229942 230192 226205 193812 240658 270170
2343 270170 223456 287373 287478 328977 363206 402489 425791 460476 488100 510066 569559 613096
2331 613096 625353 679120 798459 895094 895926 1018414 1174096 1169938 1303440 1482895 1647537
$$ packed form
2356A06008J861j033N0255K3034J5291J8584L8679k2737K50l987l2393M6846K9512
2343B70170m6714O3917J05M1499L4229L9283K3302L4685K7624K1966N9493M3537
2331F13096J2257N3767J19339R6635Q32J22488J55682m158J33502J79455J64642
$$ [...]
##END NTUPLES=NMR SPECTRUM
##END=
