##TITLE=1H_CA-9376-1
 200.13MHz, CDCl3,
 8 sc
 
 2.9.2025
##JCAMPDX= 6.0         $$ Bruker NMR JCAMP-DX V2.0
##DATA TYPE= NMR SPECTRUM
##DATA CLASS= NTUPLES
##ORIGIN= UXNMR, Bruker Analytische Messtechnik GmbH
##OWNER= pz
$$ XWIN-NMR		Version 3.5
$$ Tue Sep  2 14:43:05 2025 Russian Standard Time (UT+4h)  she@DPX200
##.OBSERVE FREQUENCY= 200.1313
##.OBSERVE NUCLEUS= ^1H
##.ACQUISITION MODE= SIMULTANEOUS
##.ACQUISITION SCHEME= undefined
##.AVERAGES= 8
##.DIGITISER RES= 18
##SPECTROMETER/DATA SYSTEM= spect
##.PULSE SEQUENCE= zg30
##.SOLVENT NAME= CDCl3
##.SHIFT REFERENCE= (INTERNAL, CDCl3, 0, 15.4747)
##AUDIT TRAIL= $$ (NUMBER, WHEN, WHO, WHERE, WHAT)
$$ ##TITLE= Audit trail, XWIN-NMR		Version 3.5
$$ ##JCAMPDX= 5.01
$$ ##ORIGIN= Bruker BioSpin GmbH
$$ ##OWNER= she
$$ F:/spectra/data/she/nmr/H-C/1/pdata/1/auditp.txt
$$ ##AUDIT TRAIL=  $$ (NUMBER, WHEN, WHO, WHERE, WHAT)
(   1,<2025-09-02 14:41:55.87 +0400>,<she>,<DPX200>,
      <created by zg, POWCHK disabled, PULCHK disabled
       configuration hash MD5:
       00 E9 B6 7A A2 85 ED C7 34 08 36 98 17 FE 4E 26
       data hash MD5: 16K
       D8 3D 56 55 0D 2C BB 52 BF 49 A7 9E F0 F1 A1 03>)
(   2,<2025-09-02 14:41:58.82 +0400>,<she>,<DPX200>,
      <Start of raw data processing
       efp BC_mod = 2 LB = 0.25 FT_mod = 6 PKNL = 1 PHC0 = -1566.788 PHC1 = 17.99228 SI = 16K 
       data hash MD5: 16K
       EC 1E 0F 78 1F 7F F3 A1 2E C9 06 56 2E 42 E8 AF>)
(   3,<2025-09-02 14:42:13.57 +0400>,<she>,<DPX200>,
      <pk PHC0 = -0.06604242 PHC1 = -1.4 
       data hash MD5: 16K
       07 F8 5D FD 39 E3 A8 C1 60 9F 47 B2 C5 4A E8 B7>)
(   4,<2025-09-02 14:42:17.20 +0400>,<she>,<DPX200>,
      <abs ABSG = 5 
       data hash MD5: 16K
       22 AE C5 C5 66 F1 DB BB 2A 99 15 51 19 77 77 A5>)
$$ ##END=
$$ 
$$ hash MD5
$$ BB 58 1F 4B 05 99 EA A5 04 DE 0A A0 9E 91 4B 7A
##$RELAX= 
##$RELAX= 
##$RELAX= 
##$RELAX= 
##$RELAX= 
##$RELAX= 
$$ Bruker specific parameters
$$ --------------------------
##$DU= <F:/spectra>
##$EXPNO= 1
##$NAME= <H-C>
##$PROCNO= 1
##$TYPE= <nmr>
##$USER= <she>
##$AMP= (0..31)
100 100 100 100 100 100 100 100 100 100 100 100 100 100 100 100 100 100 
100 100 100 100 100 100 100 100 100 100 100 100 100 100 
##$AQSEQ= 0
##$AQ_mod= 1
##$AUNM= <au_zg>
##$AUTOPOS= <>
##$BF1= 200.13
##$BF2= 200.13
##$BF3= 200.13
##$BF4= 200.13
##$BF5= 200.13
##$BF6= 200.13
##$BF7= 200.13
##$BF8= 200.13
##$BYTORDA= 1
##$CFDGTYP= 0
##$CFRGTYP= 5
##$CHEMSTR= <none>
##$CNST= (0..31)
1 1 145 1 1 1 1 1 1 1 1 1 1 1 1 1 1 1 1 1 1 1 1 1 1 1 1 1 1 1 1 1 
##$CPDPRG= <>
##$CPDPRG1= <>
##$CPDPRG2= <>
##$CPDPRG3= <>
##$CPDPRG4= <mlev>
##$CPDPRG5= <mlev>
##$CPDPRG6= <mlev>
##$CPDPRG7= <mlev>
##$CPDPRG8= <mlev>
##$CPDPRGB= <>
##$CPDPRGT= <>
##$D= (0..31)
0 0.7 0 0 0 0 0 0 0 0 0 0.03 0 0 0 0 0 0 0 0 0 0 0 0 0 0 0 0 0 0 0 0 
##$DATE= 1756809715
##$DBL= (0..7)
120 120 120 120 120 120 120 120 
##$DBP= (0..7)
150 150 150 150 150 150 150 150 
##$DBP07= 0
##$DBPNAM0= <>
##$DBPNAM1= <>
##$DBPNAM2= <>
##$DBPNAM3= <>
##$DBPNAM4= <>
$$ [...]
##$SUBNAM3= <"">
##$SUBNAM4= <"">
##$SUBNAM5= <"">
##$SUBNAM6= <"">
##$SUBNAM7= <"">
##$SUBNAM8= <"">
##$SUBNAM9= <"">
##$SW= 18.0517328524113
##$SWIBOX= (0..15)
0 0 2 0 0 0 0 0 0 0 0 0 0 0 0 0 
##$SW_h= 3612.71676300578
##$TD= 16384
##$TD0= 1
##$TE= 0
##$TE2= 300
##$TE3= 300
##$TEG= 300
##$TL= (0..7)
0 120 120 120 120 120 120 120 
##$TP= (0..7)
150 150 150 150 150 150 150 150 
##$TP07= 0
##$TPNAME0= <>
##$TPNAME1= <>
##$TPNAME2= <>
##$TPNAME3= <>
##$TPNAME4= <>
##$TPNAME5= <>
##$TPNAME6= <>
##$TPNAME7= <>
##$TPOAL= (0..7)
0.5 0.5 0.5 0.5 0.5 0.5 0.5 0.5 
##$TPOFFS= (0..7)
0 0 0 0 0 0 0 0 
##$TUNHIN= 0
##$TUNHOUT= 0
##$TUNXOUT= 0
##$USERA1= <user>
##$USERA2= <user>
##$USERA3= <user>
##$USERA4= <user>
##$USERA5= <user>
##$V9= 5
##$VALIST= <valist>
##$VCLIST= <CCCCCCCCCCCCCCC>
##$VD= 0
##$VDLIST= <DDDDDDDDDDDDDDD>
##$VPLIST= <PPPPPPPPPPPPPPP>
##$VTLIST= <TTTTTTTTTTTTTTT>
##$WBST= 1024
##$WBSW= 4
##$XGAIN= (0..3)
0 0 0 0 
##$XL= 0
##$YL= 0
##$YMAX_a= 674271
##$YMIN_a= -897336
##$ZGOPTNS= <>
##$ZL1= 120
##$ZL2= 120
##$ZL3= 120
##$ZL4= 120
##$ABSF1= 15.49127
##$ABSF2= -2.560579
##$ABSG= 5
##$ABSL= 3
##$ALPHA= 0
##$AQORDER= 0
##$ASSFAC= 0
##$ASSFACI= 0
##$ASSFACX= 0
##$ASSWID= 0
##$AUNMP= <proc_1d>
##$AZFE= 0.1
##$AZFW= 0.1
##$BCFW= 0
##$BC_mod= 2
##$BYTORDP= 0
##$COROFFS= 0
##$CY= -3
##$DATMOD= 1
##$DC= 0
##$DFILT= <>
##$DTYPP= 0
##$F1P= 0
##$F2P= 0
##$FCOR= 1
##$FTSIZE= 16384
##$FT_mod= 6
##$GAMMA= 0
##$GB= 0
##$INTBC= 1
##$INTSCL= 3.241238e-09
##$ISEN= 128
##$LB= 0.25
##$LEV0= 0
##$LPBIN= 0
##$MAXI= 10000
##$MC2= 0
##$MEAN= 0
##$ME_mod= 0
##$MI= 1.114404
##$NCOEF= 0
##$NC_proc= -6
##$NLEV= 6
##$NOISF1= 3.799351
##$NOISF2= 2.8
##$NSP= 0
##$NTH_PI= 0
##$NZP= 0
##$OFFSET= 15.47474
##$PC= 1
##$PHC0= -1566.854
##$PHC1= 16.59228
##$PH_mod= 1
##$PKNL= yes
##$PPARMOD= 0
##$PSCAL= 0
##$PSIGN= 0
##$REVERSE= no
##$SF= 200.130009396793
##$SI= 16384
##$SIGF1= 3
##$SIGF2= 2
##$SINO= 0.751879
##$SIOLD= 32768
##$SREGLST= <19F.Aceton>
##$SSB= 0
##$STSI= 16384
##$STSR= 0
##$SW_p= 3612.71676300578
##$SYMM= 0
##$S_DEV= 0
##$TDeff= 16384
##$TDoff= 0
##$TI= <>
##$TILT= no
##$TM1= 0
##$TM2= 0
##$TOPLEV= 0
##$USERP1= <user>
##$USERP2= <user>
##$USERP3= <user>
##$USERP4= <user>
##$USERP5= <user>
##$WDW= 1
##$XDIM= 16384
##$YMAX_p= 427023455
##$YMIN_p= -611509
$$ End of Bruker specific parameters
$$ ---------------------------------
##NTUPLES= NMR SPECTRUM
##VAR_NAME=  FREQUENCY,     SPECTRUM/REAL,   SPECTRUM/IMAG
##SYMBOL=    X,             R,               I
##VAR_TYPE=  INDEPENDENT,   DEPENDENT,       DEPENDENT
##VAR_FORM=  AFFN,          ASDF,            ASDF
##VAR_DIM=   16384,         16384,           16384
##UNITS=     HZ,            ARBITRARY UNITS, ARBITRARY UNITS
##FACTOR=    0.220516191357247, 1,           1
##FIRST=     3096.95986729289, 0,            0
##LAST=      -515.756895712892, 0,           0
##MIN=       -515.756895712892, -611509,     0
##MAX=       3096.95986729289, 427023455,    0
$$ Real data points
##PAGE= N=1
##DATA TABLE= (X++(R..R)), XYDATA
$$ [...]
7995 6923 15816 56374 95787 225794 224987 124481 136865 94395 -5345 -55852 2488 30462
7983 30462 48193 82321 193774 255786 156061 107556 -7686 -6682 118357 162486 124065
7972 124065 119107 183895 85344 108535 45427 18448 122236 128008 136502 148168 91144 89883
7960 89883 127212 156985 171219 194432 185347 137152 204513 194033 181257 239080 239697 102963
7948 102963 104190 41363 125918 170104 112370 156983 105003 130345 122164 91774 131206 151763
7936 151763 227449 203317 84265 29579 11431 195427 171914 67040 184851 227652 156653
7925 156653 127447 94925 106646 122032 141024 205731 79667 6271 104826 157129 155752 134950
7913 134950 159527 199198 156251 165612 148044 73438 58452 -13999 56988 109360 95534 83870
7901 83870 139770 124522 122923 217681 134674 106416 63013 69293 44350 124608 57346 51155
7889 51155 177075 201389 196084 262763 155594 -31379 -80228 80853 335536 285135 205272
7878 205272 208090 123716 45455 43800 101249 103360 -14894 -53252 26119 147461 66261 39964
7866 39964 55104 67553 23207 82383 127734 154626 163579 167580 115401 46490 103419 132963
7854 132963 158598 203714 171696 156999 154489 62784 56488 130309 199766 255226 181414 214906
7842 214906 257091 212229 137516 238408 203768 189839 176344 168420 160138 147470 70981 56445
7830 56445 95213 98277 73682 91477 160936 191616 234197 251775 337238 330249 324223 265257
7818 265257 287309 245163 374463 289283 298613 348346 332649 416804 471588 455582 442930 400373
7806 400373 417710 426045 451531 487313 571585 314414 277056 408770 279347 198157 180835
7795 180835 164809 207511 179089 111085 231068 231573 300000 292944 212586 246514 255630 176259
7783 176259 130146 118244 222398 273093 248825 264910 232147 218182 260913 281404 230177
7772 230177 213377 233725 272987 304260 322213 264922 286591 370249 219877 237923 345693
7761 345693 398369 378265 249086 265562 252622 262406 292022 210237 206636 186924 237070 175420
7749 175420 317976 313380 253029 249904 226134 241878 293399 236727 90480 231967 371168
7738 371168 421255 465103 403049 343126 330288 374179 391986 483244 411231 334112 310738 347282
7726 347282 416625 310531 333198 430042 432667 404812 379752 455342 514799 528693 464708 363930
7714 363930 426877 472903 608577 603614 652809 586068 536601 595417 576167 506411 522971 543265
7702 543265 547387 570909 604382 562645 533535 491164 539164 685127 665900 597071 505161 488963
7690 488963 531764 597530 553563 555571 540513 592618 733328 628418 664460 690432 625302
7679 625302 648274 689654 755137 786513 823243 898604 890536 928015 958886 1032830 1042613 1068871
7667 1068871 1057323 1203291 1221157 1209571 1239211 1171379 1287512 1286999 1157773 1131276 1125044
7656 1125044 1219245 1242948 1319971 1322487 1224158 1223614 1245809 1328127 1345983 1273151 1234648 1243482
7644 1243482 1235424 1251949 1147062 1162651 1189602 1170371 1177699 1161987 1064483 1001975 853259
7633 853259 827201 864973 822418 837654 806344 726745 664656 715923 690792 627241 650256 632816
7621 632816 583427 662687 717820 542100 530641 548241 610442 607145 645434 650773 703999 625622
7609 625622 644456 633746 640448 659865 616283 696481 631984 593591 612977 640579 643424 758753
7597 758753 820382 756526 853498 876945 956029 1021456 1062348 1027903 957093 907268 947504 881228
7585 881228 937810 1137069 1130881 1079962 1157264 1229916 1098226 1034877 1151731 1098280 1152823
7574 1152823 1212551 1255690 1144337 1173719 1230508 1130286 1111303 1139256 1158331 1078337 991183
7563 991183 942973 1112699 1092606 1054604 1072265 1049858 939975 925272 831773 957965 981713
7552 981713 895269 835680 755324 687140 710162 726856 695982 613295 667853 676188 600282 590495
7540 590495 655872 647420 608766 553600 614108 600281 522406 524905 508865 601587 669510 669131
7528 669131 564926 555904 677858 633662 651090 712569 784258 755134 741252 685357 563128
7517 563128 540515 581266 582911 607955 529565 555380 445458 462961 413900 397389 435079 505492
7505 505492 494719 422210 472712 428890 452515 497760 479406 512279 527193 399445 379674
7494 379674 428528 473761 373390 408783 390379 396901 365955 412055 385623 429934 348209 397262
7482 397262 412851 343041 346983 328599 314049 383918 461496 423754 442869 411313 393312 369308
7470 369308 336992 389894 422206 394471 383377 301288 313576 368943 374066 377251 383711 394929
7458 394929 416542 395581 381772 346721 289591 376837 385730 393814 430849 447389 373709 424792
7446 424792 391634 345285 404636 411615 409586 443137 503767 462256 438377 524943 487157 536058
7434 536058 557163 528610 547859 492792 489034 514434 450809 463181 543825 515738 651194 617773
7422 617773 607151 604436 511411 559472 567358 658808 711955 794102 762417 815094 757155 770398
7410 770398 872005 991628 937477 964592 1043125 1199874 1306257 1366874 1517866 1606313 1746916
7399 1746916 1811208 1876191 1858282 1920706 1947083 1954957 1975827 2061670 2090010 2064393 2094165 2116211
7387 2116211 1912891 1777605 1742351 1730965 1668105 1567075 1454050 1351510 1360723 1248531
7377 1248531 1205059 1241902 1228191 1171961 1082520 1083664 1110505 1108591 1074745 1119779 1101080 1002528
7365 1002528 1016538 1123355 1212322 1193463 1176045 1216851 1193508 1193425 1202800 1286600 1347438 1424069
7353 1424069 1423773 1464927 1491876 1484610 1604818 1762462 1776947 1852155 1858214 1967973 1966877 1969681
7341 1969681 1980525 1988545 1934318 1999379 2058694 1988912 1963075 2015326 1969238 1829004 1728679
7330 1728679 1686806 1581103 1574919 1405586 1261711 1282741 1400019 1285674 1177415 1204245
7320 1204245 1169395 1103242 979287 1042278 926012 931927 928850 916710 893318 881499 862859
7309 862859 921919 956459 918161 947149 974669 869272 997870 926347 896839 968766 1009425
7298 1009425 986688 923704 919280 1074967 997429 944200 841238 919336 921347 907874 1015346
7287 1015346 1008182 1028334 1054822 1068716 1059465 999744 993957 1029515 996384 1059868 1064068 1080495
7275 1080495 1169136 1326355 1273281 1195645 1206935 1300278 1273004 1303582 1368369 1322628 1374882
7264 1374882 1306030 1270611 1295932 1335572 1359165 1247134 1178165 1165187 1309488 1253510 1273397
7253 1273397 1281920 1265067 1165289 1219680 1210391 1136804 1109023 1098208 1121484 1110583 1152537 1053284
7241 1053284 1023145 987306 979004 949823 990692 1053246 1126830 898569 812964 977642 960254
7230 960254 900302 866878 922049 929715 986535 970393 970204 887272 906534 882979 909923 966671
7218 966671 905338 941619 888555 946299 1012365 1017787 960381 973431 1004314 938826 902258 914786
7206 914786 929862 916445 929271 948371 1038201 1150711 1144896 1068743 1108104 1042776 979706 1069204
7194 1069204 1090812 1191380 1160046 1265279 1219103 1241531 1235939 1230512 1280514 1242686 1297823
7183 1297823 1393860 1327918 1302216 1353262 1372046 1308386 1500710 1518122 1538986 1567654 1544151
7172 1544151 1685288 1741278 1749161 1731906 1969822 2027956 2071598 2164762 2194182 2178846 2272445
7161 2272445 2296398 2497450 2609619 2547393 2579619 2672038 2798975 2934074 3117680 3251942
7151 3251942 3319329 3484114 3671414 3883980 4066385 4381387 4646779 4903427 5188969 5362742
7141 5362742 5844391 6470324 7010699 7662158 8409327 9247933 10059282 11074555 12075342
7132 12075342 13270274 14684461 16315521 18374804 20920574 24295046 28935021 34158400
7124 34158400 38987970 43506037 47649826 48738572 46331825 41817788 35927389 31484646
7116 31484646 28587596 25928019 23412311 21257159 19491988 17766282 16272129 14967074
7108 14967074 13576304 12302702 11343921 10562197 9859792 9177069 8600418 8070931 7534409
7099 7534409 7130763 6739093 6377001 6092916 5801320 5516694 5209739 4880085 4689116 4564363
7089 4564363 4434706 4208630 3951151 3800996 3670779 3462472 3371486 3301164 3232294 3156732
7079 3156732 3083155 2909313 2804105 2701887 2613547 2529804 2455198 2308158 2247873 2186325 2132750
7068 2132750 2065092 2013522 2003326 2059928 2017196 1887866 1758918 1879302 1856535 1855119 1815575
7057 1815575 1709481 1690315 1669576 1652209 1523788 1506620 1441758 1518215 1526820 1462228 1459289
7046 1459289 1460071 1415852 1457766 1336883 1376645 1425029 1343745 1303691 1260332 1184915 1139525 1146572
7034 1146572 1224952 1187538 1098816 1084564 1035995 1181786 1192977 1113430 1132935 1066738 1178390
7023 1178390 1128960 1076350 1199407 1194310 1110299 1030591 1046202 1043364 969650 981319 920575 937027
7011 937027 914142 995011 1055354 990732 958446 967439 1096977 1085957 1073279 1099228 1121607 1097305
6999 1097305 1003312 936382 986111 1031900 1072574 1085274 1083444 1039545 1021968 987695 1049522 1009854
6987 1009854 917959 942526 855324 794959 840386 887978 936119 996219 912482 853686 855824 745816
6975 745816 748113 894652 857275 880351 930761 813220 780914 766731 707823 767403 843759
6964 843759 867870 840293 773841 789290 819449 766513 711362 672799 684284 757716 848360 921843
6952 921843 895354 814083 740712 809828 726880 746278 697109 557327 549480 600520 686221 722431
6940 722431 741754 745538 752374 746665 745786 726669 812996 682837 675840 612897 523920 540278 620406
6927 620406 676449 624345 639025 629616 741386 711809 636248 618843 577191 689295 688068 738694
6915 738694 655504 557831 636661 679547 701070 693125 734182 679859 679175 629188 631773 633756 701505
6902 701505 680394 648086 631960 644096 701921 674082 747189 717908 743254 689883 581638
6891 581638 694225 806245 777957 732852 707234 647424 591829 615318 734000 689868 716413
6880 716413 758486 653436 647666 557376 596092 682948 636638 657778 677189 666607 589079 618123
6868 618123 612334 531913 538570 614641 638625 714984 706349 627219 672704 639864 653331 712284
6856 712284 730258 721927 679739 775306 732336 706824 710672 680100 763103 735265 711517 821350
6844 821350 811143 758065 705690 664310 697234 706528 713200 701969 697564 647667 667827 687102
6832 687102 715682 708427 729502 745787 703625 653924 697941 798113 810210 774139 648753
6821 648753 548000 605482 599383 574365 646212 748999 756232 785585 851041 865813 924720 795879
6809 795879 676676 702450 722113 785777 745910 808194 866741 891054 862720 795317 751672
6798 751672 732319 661038 733785 751046 808716 960236 931187 920229 846891 763460 840863
6787 840863 911949 806065 931178 1029705 953988 864471 882356 807550 758971 720139 735162
6776 735162 796912 753772 782385 826828 826779 810172 824348 900010 884455 721173 759583 830089
6764 830089 774712 742412 849310 793004 812748 923275 879154 760497 767510 725798 780059
6753 780059 813415 723786 726282 752625 773660 858726 839026 820529 832107 782395 818712 780273
6741 780273 768567 810514 903003 922560 807447 829713 869328 852250 908549 820693 809734
6730 809734 837972 886391 847657 882483 824230 906130 886611 859611 821256 884036 925600 888712
6718 888712 1037516 1042554 1034521 1102531 1141829 1004059 979563 964724 958519 935760 910528 814420
6706 814420 881381 928211 961239 1016045 955068 987100 997692 951360 917831 952567 902527 855007
6694 855007 757850 768919 891097 1000009 970803 881136 744865 811407 943670 958903 903171
6683 903171 910921 899138 794149 750842 773420 891758 989412 991653 906432 910640 946780 927365
6671 927365 971458 1029238 926596 930281 926133 845486 939705 976502 895394 921274 936174 806858
6659 806858 680551 761787 758928 910706 926261 896709 789807 785933 943074 857156 812205
6648 812205 828770 826882 916985 925742 952176 831112 806250 940396 917393 956408 878676 806220
6636 806220 936689 959652 947675 981162 975545 1022125 1046115 927865 858873 908669 859033
6625 859033 991231 958552 1092997 1116044 1007137 977385 984581 1004574 945815 933321 941867
6614 941867 1028195 1012910 932027 936683 1034788 1060356 1061457 1038179 992561 1057014 1165609 1136157
6602 1136157 1029635 1055430 983211 1042143 1109158 1155607 1109598 1053851 1119655 1147984 1198431
6591 1198431 1202720 1127302 1034235 1114785 1114761 1099302 1094266 1076148 1064799 1103004 1138790 1268123
6579 1268123 1251668 1169413 1176045 1109524 1114693 1181252 1229297 1219801 1250700 1298734 1189556 1217566
6567 1217566 1266353 1249737 1206965 1196955 1246413 1290579 1298163 1355985 1452302 1358718 1357294 1438085
6555 1438085 1357868 1328134 1410367 1376592 1394373 1540358 1542674 1613086 1598663 1594103 1578382 1519991
6543 1519991 1493234 1596097 1568987 1489909 1579620 1629489 1572945 1484769 1432734 1477015 1514738
6532 1514738 1483163 1493999 1548575 1564198 1536107 1622536 1612685 1654542 1631314 1582668 1552529 1638424
6520 1638424 1682890 1732787 1655944 1663345 1619158 1573165 1731107 1800826 1672564 1628220 1733432
6509 1733432 1810008 1925762 1984545 2062817 2158412 2323535 2437420 2551282 2575836 2519481 2499746
6498 2499746 2419628 2334672 2206917 2167341 2099618 2020569 2078123 2028400 1945677 1881032 1876690
6487 1876690 1923875 1780661 1743177 1717878 1742703 1768317 1738834 1693343 1618086 1630588 1624999
6476 1624999 1652777 1554917 1544492 1572536 1586079 1580162 1588512 1552256 1459904 1440189 1414617 1337297
6464 1337297 1464877 1542245 1505561 1461856 1506069 1565044 1615447 1684847 1646326 1521805 1494459
6453 1494459 1551583 1512747 1553858 1517115 1508547 1550510 1592733 1604231 1512484 1531949 1560236 1579451
6441 1579451 1576979 1441768 1547601 1683948 1682528 1582591 1581265 1647910 1667231 1700275 1804059
6430 1804059 1793373 1808604 1840994 1895576 1935265 1965106 1878564 1871495 1878093 1983379 2111221
6419 2111221 2208188 2319680 2381445 2495735 2691947 2732826 2842063 2907677 3061266 3340904
6409 3340904 3604499 3974195 4153337 4351962 4517463 4689565 4673385 4617225 4526449 4388381
6399 4388381 4108684 3931780 3840150 3661164 3487651 3389818 3325268 3214988 3143376 3117688
6389 3117688 3076015 3068694 3053172 2997633 2981652 3003016 2992567 3081507 3108302 3115012 3253920 3432444
6377 3432444 3401442 3372356 3468638 3649583 3750902 3807313 4090149 4559094 4744597 5062103
6367 5062103 5421761 5611780 5884546 5885984 5780667 5597929 5189401 4977949 4720241 4380199
6357 4380199 4076347 3951944 3734877 3538219 3519272 3484428 3283877 3082742 3068918 3078006
6347 3078006 3034209 2925747 2764520 2732429 2606409 2502733 2450161 2463530 2473897 2397469 2446493
6336 2446493 2450803 2310139 2130688 2212379 2177481 2207977 2204882 2100575 2106155 2096297 1995331
6325 1995331 2003494 1976352 2012803 2053622 2000948 1935526 1874709 1905863 1892019 1775576 1859725
6314 1859725 1977925 1935096 1960475 1946997 1910861 1943852 2011850 2018148 1957344 1970152 1940995
6303 1940995 1984291 1943880 1933825 1963133 2009658 1977687 1973465 2021395 2114308 2162786 2115422 2076890
6291 2076890 2157977 2178083 2176180 2024876 2045028 2117135 2136673 2113288 2080160 2138815 2184210
6280 2184210 2255505 2178350 2123900 2124853 2178253 2279609 2252917 2171239 2207683 2187508 2159717 2321133
6268 2321133 2273497 2210639 2230163 2295334 2357916 2340853 2372503 2374070 2418667 2517028 2673863
6257 2673863 2598829 2662148 2866118 2979124 2901741 2800404 2724225 2754896 2868153 2805326 2760102
6246 2760102 2697580 2660621 2688756 2642980 2604886 2686112 2711262 2753121 2740166 2764097 2743617
6235 2743617 2674520 2661518 2728499 2865921 2910733 2949337 2912531 3019462 3086377 3162018 3144065
6224 3144065 3142336 3071049 3097322 3176832 3202606 3276960 3219790 3167396 3228840 3245933 3237715 3246402
6212 3246402 3321177 3324377 3332446 3413688 3430075 3448732 3527302 3576143 3563676 3562757 3620580 3739669
6200 3739669 3856906 3797688 3844200 3879594 3919787 3997707 4032997 3967480 3889731 4021977 3973832
6189 3973832 3968894 4004619 4050771 4283453 4356860 4356672 4510998 4571201 4538544 4582241 4754494
6178 4754494 4805895 4733166 4714821 4763028 4791089 4797551 4743973 4712488 4619115 4604151 4543479 4584384
6166 4584384 4399820 4266843 4232901 4242698 4168605 4122523 4084756 4029618 4085511 4018078 4061364
6155 4061364 4054119 4098012 4073881 4022000 4087856 4189987 4182647 4242073 4312526 4477784 4392917
6144 4392917 4322697 4469953 4587133 4587554 4641292 4632020 4670354 4730799 4709411 4563129 4489414
6133 4489414 4533873 4389851 4278992 4348691 4314283 4327539 4307945 4235014 4254051 4209762 4270288
6122 4270288 4267533 4234889 4285195 4292975 4300799 4292168 4301455 4323704 4297132 4385332 4535641 4565782
6110 4565782 4503057 4662509 4620771 4603372 4580915 4432868 4545098 4612264 4503844 4492828 4491065
6099 4491065 4548547 4547257 4578115 4553392 4540666 4578685 4705347 4748680 4734078 4798599 4885563
6088 4885563 4869484 4894281 4972469 4924458 4961698 5004809 5130963 5177153 5244581 5374825 5381598
6077 5381598 5480617 5574779 5506442 5551849 5556766 5656219 5772734 5810462 5885604 5969959 5973254 5990091
6065 5990091 6070762 6185184 6208609 6399325 6454745 6446067 6606866 6839307 6966879 6971611 7047444
6054 7047444 7147671 7357622 7486254 7705533 7963844 8146100 8383873 8590843 8703642 8784553
6044 8784553 8717355 8713528 8732583 8670603 8546339 8515135 8399224 8450357 8616165 8534538 8510316
6033 8510316 8507622 8621052 8663171 8719862 8896813 9025762 9070322 9153585 9225910 9318163 9300646
6022 9300646 9352498 9464704 9363010 9338341 9289575 9306142 9263815 9145344 9085559 9039312 8895099
6011 8895099 8744466 8619475 8529993 8445486 8288579 8216505 8170400 8074244 8005209 7897969 7911002
6000 7911002 7924619 7959122 7926669 8008747 8091734 8111092 8181035 8289929 8423752 8532879 8575352
5989 8575352 8606255 8735024 8787403 8839798 8936849 8984210 9000040 9052139 9133701 9208942 9324708
5978 9324708 9395445 9405357 9550523 9673992 9831754 9966361 10144400 10365361 10503583 10722130
5968 10722130 11024500 11310113 11636539 12068153 12487626 12890154 13241417 13598422 14124716
5959 14124716 14668290 15222602 15764912 16240310 16592223 16849733 17013118 17057554 16899994 16752401
5949 16752401 16700482 16539478 16295869 16131275 16027956 15980983 15904844 15880281 15881319 15893460 16023595
5938 16023595 16125547 16128628 16266898 16568922 16825771 17018367 17361087 17648904 17912425 18269865
5928 18269865 18650282 18998287 19359508 19794963 20215584 20738073 21327723 21950864 22592503
5919 22592503 23417991 24347404 25275242 26180050 27154267 28162849 29099195 29915077 30488638
5910 30488638 31032007 31180507 31174001 31022599 30746508 30429265 30081514 29707385 29300372 29129195
5900 29129195 28931766 28647866 28537323 28676576 28776816 28936326 29244065 29450595 29903884
5891 29903884 30502158 31306487 32265030 33055763 34030305 35201776 36461521 37763223 39143079
5882 39143079 40402215 41515901 42518215 43270020 43833303 44121586 44075637 43969260 43686552
5873 43686552 43246582 42600252 42042042 41613818 40996220 40367292 39957774 39522257 39188693
5864 39188693 39011449 38883398 38915874 38961875 39201897 39502149 39971025 40603291 41264406 42119974
5854 42119974 43214799 44340192 45458796 46495158 47333909 48105968 48645874 48918349 48786871
5845 48786871 48435887 47943211 47152973 46206568 45265854 44315476 43426471 42608501 41880793
5836 41880793 41231987 40497109 39944412 39296176 38691018 38251078 37684397 37123060 36550767
5827 36550767 36173272 35845799 35650486 35411670 35250344 35080604 35014071 34913563 34839284 34938314
5817 34938314 34850422 34878527 35068368 35185335 35349853 35610698 35872385 36323758 36919905 37700258
5807 37700258 38587525 39415750 40205103 41030142 41639784 42051545 42236371 42109613 41840308
5798 41840308 41361843 40653887 39900934 38987833 38097464 37307835 36389641 35452874 34416963
5789 34416963 33336681 32269036 31116781 30001576 29164123 28179333 27194138 26312556 25356184
5780 25356184 24518915 23841478 23109062 22392801 21817975 21240585 20679716 20171420 19728831
5771 19728831 19298204 18786510 18402605 18135182 17918729 17650189 17253861 16953500 16548195
5762 16548195 16293977 16045397 15846726 15608281 15304735 15148139 14916085 14679812 14525344
5753 14525344 14355707 14194442 14113880 13903808 13620347 13543988 13361425 13058941 12907396 12742170
5743 12742170 12653490 12583485 12481485 12340230 12285574 12262494 12108890 12004457 12062208 12002856
5733 12002856 11883958 11822744 11736767 11753619 11711975 11628672 11625500 11628656 11628614 11653508 11585055 11555534
5721 11555534 11624416 11597272 11663982 11726421 11832424 11965457 12146551 12288115 12350047 12411188
5711 12411188 12485939 12514437 12529615 12748273 12838001 12959096 13047282 13198894 13363134 13518965
5701 13518965 13706201 13879465 14043646 14147300 14271318 14417210 14456994 14553564 14550535 14549193
5691 14549193 14541539 14546829 14536311 14545685 14597028 14622163 14741525 14721599 14805700 14983690 15050178
5680 15050178 15101456 15161656 15278491 15412261 15637328 15908063 16057125 16197989 16469679 16621330
5670 16621330 16797131 17077037 17284389 17531360 17691385 17888533 18143599 18444751 18855581
5661 18855581 19235355 19742396 20167321 20643960 21211176 21798277 22458789 23135880 23762543
5652 23762543 24519952 25354621 26279969 27129401 27857505 28746835 29619951 30599422 31506537
5643 31506537 32227712 32905256 33395499 33836420 34076122 34292341 34407313 34361051 34037991 33500875
5633 33500875 32773338 32062272 31304552 30605857 30010861 29419818 28881385 28478645 28108061
5624 28108061 27749137 27596956 27393087 27357264 27406192 27510668 27816287 28203579 28590075 29227430
5614 29227430 29879283 30760389 31796650 32983911 34424759 36092085 37830803 39756890
5606 39756890 41646488 43791545 45730387 47819005 49795768 51725250 53433708 55122633
5598 55122633 56711781 58036582 59115680 59680657 60087131 60411848 60606107 60837588 60968247
5589 60968247 61232549 61468875 61617995 61815278 62024942 62129604 61868780 61451175 60856343
5580 60856343 59947241 58914857 57647239 56138235 54461708 52755052 51068314 49230271
5572 49230271 47445530 45800151 44143875 42586249 41189968 40018784 39018830 38218305
5564 38218305 37636996 37173503 36894276 36752190 36828181 37063424 37507826 38019258 38783399 39736697
5554 39736697 40758406 41889042 43069360 44145286 45413822 46614755 47648845 48497061
5546 48497061 49248359 49637958 49776139 49510177 48949478 48166742 47144540 45694834 44103695
5537 44103695 42590632 41037235 39345964 37698109 36090066 34470851 32937766 31519923
5529 31519923 30065684 28594862 27263280 26163886 25125007 24193611 23250992 22356742 21550152
5520 21550152 20799685 20267773 19699039 19041917 18599123 18231096 17804734 17353152 17106004
5511 17106004 16789121 16463254 16269467 15992692 15827543 15791743 15679553 15572923 15641370 15664247
5501 15664247 15546431 15469115 15630678 15770311 15927921 16242985 16475586 16831230 17261196 17639680
5491 17639680 18096293 18484320 18969810 19418879 19772077 20157378 20443299 20660530 20778029
5482 20778029 20787118 20783565 20654307 20409321 20190777 19858045 19537704 19263718 18935625 18609239
5472 18609239 18184867 17698259 17324095 16898472 16525733 16205039 15802964 15276579 14849402
5463 14849402 14522396 14086821 13702950 13375892 12942257 12562029 12403721 12116670 11906283
5454 11906283 11825763 11616770 11373382 11201370 11062258 10928455 10681574 10519710 10323469 10167442
5444 10167442 9871728 9719408 9662484 9515327 9348184 9185665 9077428 8934323 8690996 8630474
5434 8630474 8673594 8505460 8382349 8272390 8152934 8187272 8155769 7941342 7959182 7911214
5424 7911214 7838324 7807600 7893362 7891449 7788952 7731437 7767592 7842635 7677864 7657643 7645050
5413 7645050 7606822 7624400 7593575 7515623 7674394 7713181 7719900 7797551 7903531 7841442 7928427
5402 7928427 7818610 7838246 7902377 7992571 8109430 8106460 8167777 8082609 8073029 8219353 8388527
5391 8388527 8539018 8641701 8986836 9220908 9385257 9679404 10011330 10407620 10690389 11143905
5381 11143905 11872531 12720486 13767464 15142158 16476531 17644318 18705647 19433091 19507085
5372 19507085 18795541 17378753 15933511 15040911 14443947 13896706 13389412 12831766 12443953
5363 12443953 12169530 11946473 11697286 11292071 10984653 10728499 10370241 10059205 9675631
5354 9675631 9406131 9121863 8961773 8805346 8596883 8409415 8273703 8271280 8202980 8049675
5344 8049675 7975253 7878747 7750213 7654664 7527978 7511595 7453625 7363504 7336766 7347273 7309448
5333 7309448 7301770 7234869 7124993 7096516 7054230 7071698 7135791 7093915 6865628 6893682 6862873
5322 6862873 6873517 6806848 6738967 6659784 6802138 6720967 6837174 6974900 6854234 6747003
5312 6747003 6781647 6746708 6764796 6842111 6820366 6769372 6767411 6781895 6855567 6939008 6861365 6892921
5300 6892921 6946327 6968835 7027165 6945375 6912239 6950150 7070088 7075479 6978756 7021624 6928008
5289 6928008 6934593 6847766 6764580 6673592 6687360 6645927 6671133 6567907 6565778 6645458 6529626
5278 6529626 6405103 6305359 6276127 6191877 6180468 6212211 6154941 6170440 6204883 6197941 6181519
5267 6181519 6157025 6134453 6132311 6127459 6075601 6016360 6068915 6044729 6144265 6160661 6128500 6146325
5255 6146325 6109677 6129536 6137619 6087548 6211251 6206409 6242913 6316032 6410224 6493136 6482247 6542269
5243 6542269 6586765 6601110 6565982 6525336 6559712 6509827 6434783 6355312 6338495 6383755 6371162
5232 6371162 6377273 6429970 6405900 6444945 6477990 6544141 6458600 6376724 6319471 6356327 6336084 6232980
5220 6232980 6305962 6371425 6435123 6464979 6623928 6600876 6636521 6585258 6513326 6620877 6673043
5209 6673043 6601510 6591308 6692825 6764798 6730217 6711335 6805661 6798758 6779769 6817881 6849450
5198 6849450 7039784 7088130 7059803 6944992 6954819 6986156 6999170 7079069 6993637 7037995 7126456
5187 7126456 7159763 7080315 7054561 7228037 7322323 7380093 7340507 7280796 7345010 7491324 7519050
5176 7519050 7525790 7596189 7631666 7649046 7657655 7630448 7725887 7727793 7688585 7685870 7606507 7511474
5164 7511474 7395853 7468761 7453258 7467335 7476949 7377963 7345485 7304847 7342553 7375054 7342269
5153 7342269 7399580 7442311 7382180 7317009 7443495 7509303 7415897 7419586 7553773 7632226 7651363
5142 7651363 7737528 7763790 7684917 7781839 7830024 7814041 7866656 7880854 7807013 7708338 7731434
5131 7731434 7755523 7715264 7738606 7700904 7665751 7658072 7714280 7743811 7691995 7770727 7922638
5120 7922638 8010336 7953328 7903722 7988092 8041430 8048663 8121836 8141437 8100881 8039893 7999679 8103176
5108 8103176 8064434 7935929 7965373 7959801 8070683 8095185 8105114 8137002 8184868 8164373 8030356
5097 8030356 8050429 8065131 8088287 8126753 8161373 8128136 8170572 8266784 8305572 8332238 8326413 8276154
5085 8276154 8317885 8462679 8524605 8520490 8593124 8713001 8731767 8793805 8892199 8985791 8928319
5074 8928319 8946252 8915591 8868099 8876685 8874970 8894529 8978085 9038436 9060290 8987081 9016854 9038679
5062 9038679 8951239 8931446 8970712 9023835 9016404 9015222 9125943 9270029 9326762 9382861 9558519
5051 9558519 9645462 9687051 9790439 9892762 9939269 10046662 10076315 10106679 10123447 10111119 10277204
5040 10277204 10338405 10325047 10314869 10324543 10518009 10640426 10713100 10814630 10925366 10972837 11129561
5029 11129561 11151531 11112857 11224671 11240177 11312398 11413672 11657074 11814761 12005661 12202423
5019 12202423 12324028 12492196 12692274 12859065 13175318 13473515 13770343 14058764 14310584
5010 14310584 14692496 15056824 15445127 15847777 16308431 16820321 17314569 18047254 18800009
5001 18800009 19564931 20352661 21341108 22600947 23762478 25062837 26642499 28397296 30424742
4992 30424742 32839717 36011080 40084817 45100040 50611548 56526152 62216277 66680347
4984 66680347 68980070 68646847 65348781 60407351 55088232 50263666 46484719 43552246
4976 43552246 40959410 38555191 36570471 34967651 33458844 31969122 30622152 29465881
4968 29465881 28590696 27940706 27380115 26993456 26713927 26395512 26286633 26210560 26217644 26303618
4958 26303618 26441204 26528231 26590833 26865196 27328338 27656702 28133173 28789829 29533208 30261987
4948 30261987 31076419 31994898 33155478 34394000 35717085 37293833 38900900 40678505
4940 40678505 42676512 45147786 48107829 51671751 56149736 61172885 66636051 72203405
4932 72203405 76618952 78937633 79397098 77428283 73508278 69016993 63959215 59147161
4924 59147161 55670139 52754052 50082005 47748897 45749935 44011307 42497883 40995410
4916 40995410 39814103 38750931 37842625 37272155 36846887 36357194 35931222 35619389 35393551
4907 35393551 35286927 35073160 34886487 34793656 34704573 34688752 34660489 34592121 34505760 34396588
4897 34396588 34424979 34314633 34331805 34314518 34323946 34290532 34273524 34283063 34189041 34164242 34230306
4886 34230306 34256945 34200686 34335935 34339898 34357896 34540141 34681958 34871252 35105488 35294636
4876 35294636 35531228 35773718 36154610 36785485 37117981 37468172 37898508 38320897 38590767
4867 38590767 38818614 38948199 39020472 38902565 38696356 38418372 38022672 37622436 37250556 36743357
4857 36743357 36194492 35697715 35180744 34773253 34310430 33825204 33449019 33263252 32973960
4848 32973960 32872540 32772990 32623461 32669585 32710968 32574790 32709428 32887842 32909230 33002420
4838 33002420 33210538 33343996 33444477 33596125 33691661 33768370 33811238 33925189 33908565 34032629
4828 34032629 34149564 34228292 34364564 34649055 34947246 35206745 35472006 35820800 36226004 36620053
4818 36620053 36936744 37202069 37452924 37765164 38068801 38431048 38736423 39152043 39661845
4809 39661845 40051165 40577303 41261004 42035398 42690507 43579245 44597265 45815712 47225629
4800 47225629 48657945 50121773 51667840 53126593 54603270 55827939 56891381 57725397
4792 57725397 58333507 58976735 59594334 60333412 61231103 62349481 63503825 64710621 66043389
4783 66043389 67198115 68315323 69234173 69964757 70395225 70549112 70529193 70233099 69813725
4774 69813725 69340973 68755079 68085956 67467577 66799843 65863038 65042332 64221386 63252036
4765 63252036 62171243 61163278 60094094 58984426 57986312 56952080 56060668 54993487
4757 54993487 54036029 53008503 52027272 51069840 50122113 49209457 48286807 47372210 46711193
4748 46711193 45998628 45310897 44814953 44345548 43944199 43430261 43052876 42886376 42604605
4739 42604605 42469222 42539221 42622789 42779551 43035929 43303643 43510612 43795750 44195083 44468904
4729 44468904 44888577 45287006 45639278 46039164 46530250 47081346 47628486 48159172 48712722
4720 48712722 48980637 49292885 49411425 49479423 49390132 49149782 48916893 48604805 48390012 47996230
4710 47996230 47639460 47384326 47055359 46803697 46729105 46547561 46449189 46437648 46500757 46701634
4700 46701634 46995298 47465431 48067276 48619279 49367355 50372905 51455255 52581269 53906131
4691 53906131 55255858 56702369 58108733 59497504 60836737 62202841 63476293 64737353
4683 64737353 65855966 66940702 67866046 68570347 69183134 69569630 69890730 70364599 70740281
4674 70740281 71055978 71553450 72065389 72554463 73062724 73544269 73982250 74134711 74230596 74053034
4664 74053034 73683258 73331134 72964431 72537250 72173380 71747328 71396986 71199367 71003760
4655 71003760 70971853 70953680 70993813 71222499 71510557 72049510 72691728 73433601 74143198 74904012
4645 74904012 75618858 76367338 77167956 77697304 78264261 78944652 79500653 80147233 80915883
4636 80915883 81899014 82900926 83814402 84779033 85599572 86174399 86359300 86368290 86078779 85854062
4626 85854062 85728852 85701336 85829357 86220684 86690236 87260055 87737822 88152693 88369115 88392125
4616 88392125 88456528 88452095 88478778 88673102 89005338 89537066 90253630 91199260 92255336 93592866
4606 93592866 95194273 97062663 99384650 102363583 105743831 109718201 113947921 117517929
4598 117517929 120391658 121818252 121136155 118545055 114425550 110020851 105646291 101558244
4590 101558244 97691521 94078286 90774549 87566658 84625614 81974137 79514304 77290138
4582 77290138 75428052 73639232 72200299 70942740 70056306 69468702 69199861 69250000 69379120
4573 69379120 69821522 70481121 71510299 72583544 73727233 75045441 76297193 77384367
4565 77384367 78558468 79637900 80537892 81511920 82514405 83703862 85226210 86953020
4557 86953020 88936452 91373775 94118172 97343783 101211880 105509998 110499070 116043277
4549 116043277 122221047 129112383 136529403 145040975 154459739 164643133 176028113 188434893
4541 188434893 201592345 215358142 229125425 241987671 252895989 261047244 265870564
4534 265870564 266946768 264660930 259840309 252696374 243972264 234086301 223415594 212047319
4526 212047319 200159018 187881884 175725576 164015141 153035986 143072042 134104813
4519 134104813 126176056 119068926 112706957 107160376 102026659 97491647 93326666 89530748
4511 89530748 86254195 83237374 80426560 77892481 75795126 74017684 72350924 70999591
4503 70999591 69907629 68869296 68164918 67513024 67028183 66679022 66526825 66623075 66951848
4494 66951848 67440590 68022484 68901676 70117161 71596496 73302775 75332249 77596548 80387758
4485 80387758 83562075 87035834 91062784 95546851 100577783 106321730 112722336 119858306
4477 119858306 127898575 136874959 146554245 156212817 165497361 173513493 179353521 182351083
4469 182351083 182023630 178362588 171985619 163807850 154940284 146147980 137478677 129162327
4461 129162327 121396021 114237149 107572021 101251689 95438938 90148412 85237943 80740229
4453 80740229 76784858 73156873 69883882 66796953 63968098 61287874 58770232 56392047
4445 56392047 54114562 52092591 50189216 48581838 47051449 45460823 44212520 43255690
4437 43255690 42278097 41410330 40629576 39897051 39348123 38791377 38292469 37771620 37276738
4428 37276738 36773954 36194876 35598156 35016056 34496755 33967877 33584604 33167170 32723500
4419 32723500 32277270 31892448 31279894 30791689 30113835 29431393 28824807 28380496 27908503
4410 27908503 27426840 27039598 26590750 26199055 25846749 25624265 25323411 25133296 24938667
4401 24938667 24797194 24826632 24888756 24850988 24838719 24682704 24551519 24379117 24272090 24003374
4391 24003374 23597752 23298488 23059793 22849319 22703959 22535760 22339630 22127940 21991062
4382 21991062 21809603 21703465 21705198 21543979 21398485 21317085 21198839 21138460 20975788 20935219
4372 20935219 20843335 20768204 20773973 20875940 20970292 21116408 21451486 21992541 22595741 23201613
4362 23201613 23809124 24301140 24644710 24649261 24263360 23429371 22616034 21667824 20688254 19931091
4352 19931091 19332710 18728163 18172765 17620470 17124335 16688767 16286708 15853805 15455986
4343 15455986 15159396 14846905 14529912 14260055 14000753 13860997 13625270 13496811 13334624
4334 13334624 13226511 13006552 12856492 12761807 12524907 12405500 12294815 12256078 12132972 12039322
4324 12039322 12167002 12113395 12116107 12116015 12007711 12019574 12042706 12048165 12068077 12094803 12018772 12069157
4312 12069157 12092589 12094368 12111159 12267832 12360127 12374327 12386790 12351960 12418838 12611814 12601985
4301 12601985 12502995 12582700 12620599 12723045 12870331 13048263 13218113 13235456 13224987 13243552
4291 13243552 13295465 13254077 13342116 13473345 13445629 13483380 13568945 13767507 13971866 14073046
4281 14073046 14122618 14199958 14388248 14557261 14650578 14820493 14939589 15108687 15237398 15456622
4271 15456622 15629424 15972995 16193465 16261359 16637694 16934678 17189529 17415009 17756740 18113177
4261 18113177 18439284 18797995 19122704 19406027 19739805 20125475 20565114 20864590 21288963
4252 21288963 21617261 21985749 22399765 22752379 23125922 23568433 23947749 24332766 24657176
4243 24657176 25052602 25486885 25995087 26527204 26959270 27498887 27871312 28216149 28693534
4234 28693534 29210553 29749614 30240999 30785814 31437984 32047320 32897091 33666724 34414823
4225 34414823 35131724 35908464 36578303 37231399 37981760 38597466 39031020 39365031 39757272
4216 39757272 40115235 40489292 40875092 41357562 41850328 42145496 42557241 43031770 43290430
4207 43290430 43470405 43596039 43503031 43338390 43053703 42696994 42291548 41803390 41343569 40847179
4197 40847179 40484011 40036358 39446978 38843418 38352766 37671060 36867622 35993482 35073729
4188 35073729 34119627 33097021 32126194 31126503 30183325 29300729 28400273 27577485 26778129
4179 26778129 25924750 25183180 24478251 23718044 22930164 22184382 21510637 20781576 19964996
4170 19964996 19447167 18841340 18151503 17641168 17113241 16605652 16124634 15624066 15145184
4161 15145184 14766356 14262929 13824367 13429256 13027544 12589602 12137907 11674098 11414849
4152 11414849 11274955 11082528 10865287 10651778 10365296 10177959 9931481 9675773 9533354
4143 9533354 9363208 9276599 9171694 9106441 8971449 8816684 8640157 8462176 8283148 8093463
4133 8093463 7957305 7961880 7793862 7706177 7525073 7378785 7276647 7194069 6997205 6893905
4123 6893905 6858218 6719014 6702075 6643933 6590139 6453238 6326315 6285667 6151505 6059563 5956239
4112 5956239 5903948 5766493 5543575 5509883 5337565 5370483 5372332 5269778 5202549 5117561 5059593
4101 5059593 4979093 4911813 4877205 4870230 4822142 4721866 4628381 4565709 4567073 4575635 4562793 4597001
4089 4597001 4575034 4499321 4444670 4309558 4262006 4379282 4390472 4426892 4324163 4130835 4146459
4078 4146459 4149955 4142717 4095378 4033855 3945016 3858559 3820518 3757535 3724187 3716079 3601987 3581679
4066 3581679 3517082 3467585 3497838 3574428 3534180 3433292 3458622 3379896 3413868 3346570 3379178
4055 3379178 3388969 3350552 3388943 3339219 3282779 3244695 3221332 3114361 3070131 3050933 3114463
4044 3114463 3220207 3085793 3064581 3045626 3012715 2943409 2917990 3026547 2982846 2918844 2887544
4033 2887544 2988865 3039709 2984258 2821294 2797404 2913167 2905800 2839058 2833520 2922441 2985113
4022 2985113 3013737 3041317 2951584 2963535 2950831 2825670 2820255 2756832 2699840 2790346 2757994
4011 2757994 2770835 2721628 2731602 2814482 2838383 2779787 2743529 2678059 2715179 2642930 2555506 2601878
3999 2601878 2481403 2472385 2427557 2506223 2602973 2533845 2507686 2518151 2479561 2465894 2545754
3988 2545754 2497165 2447555 2499199 2432090 2334703 2409584 2464539 2401536 2430589 2393672 2464411
3977 2464411 2476959 2377007 2485845 2540893 2425287 2349986 2373415 2423970 2370598 2433377 2396462
3966 2396462 2405864 2320762 2333885 2330271 2314611 2280662 2236461 2407351 2466394 2368451 2395450 2439579
3954 2439579 2341660 2371636 2304126 2340661 2379394 2449096 2369985 2316780 2313603 2317511 2258088 2193580
3942 2193580 2261806 2358836 2306512 2289285 2264841 2348102 2371723 2324301 2299379 2227045 2191794
3931 2191794 2219532 2287948 2176497 2106821 2173827 2244412 2342754 2383361 2291358 2340242 2283379
3920 2283379 2287220 2259672 2310985 2264273 2369669 2418766 2440915 2439705 2426010 2307258 2264811
3909 2264811 2263525 2362631 2411869 2347796 2289272 2356505 2522418 2341027 2306838 2338050 2369932
3898 2369932 2445941 2356137 2277543 2439531 2417738 2431096 2446751 2453359 2332446 2439758 2402894
3887 2402894 2266112 2290612 2319064 2380818 2394489 2354947 2326728 2419340 2356866 2359185 2346890
3876 2346890 2346061 2330256 2376178 2412128 2402868 2376215 2401732 2488029 2500196 2473605 2462337 2543180
3864 2543180 2588163 2577475 2617104 2589378 2597689 2572287 2573299 2603761 2582262 2627743 2595584 2731905
3852 2731905 2652164 2565483 2640206 2588140 2580208 2641060 2679027 2723761 2702882 2723945 2611650
3841 2611650 2599504 2664498 2686043 2616164 2627120 2724562 2700589 2751371 2712431 2788477 2843804
3830 2843804 2920319 2957917 2935517 3013271 3037605 2941788 2923866 2954106 3085609 3123415 3102530
3819 3102530 3095268 3191276 3229091 3100569 3138845 3173413 3151229 3096575 3030702 3171596 3209595
3808 3209595 3159922 3262265 3241160 3289601 3215728 3234293 3292496 3412985 3456037 3405885 3395793
3797 3395793 3387962 3442745 3468301 3472318 3555123 3562511 3580345 3588046 3561089 3540948 3590274 3549001
3785 3549001 3535103 3654314 3625176 3625961 3683788 3827659 3900670 3841837 3847956 3907321 3985063 4033686
3773 4033686 4011495 3959861 3879482 3981737 4076506 4102841 4139349 4135622 4197855 4229903 4195208
3762 4195208 4297944 4408050 4520214 4512980 4503126 4543649 4491833 4542669 4572679 4594609 4533429
3751 4533429 4573585 4702307 4631877 4703884 4712067 4718255 4779389 4714109 4753704 4787348 4870958 4909286
3739 4909286 4897053 4817767 4694262 4795664 4794546 4804188 4846252 4818160 4873737 5000343 4896334
3728 4896334 4869177 4841547 4853478 4815910 4841083 4898436 4943250 4965220 5058891 5063479 5151596 5328531
3716 5328531 5297812 5190473 5212018 5266474 5335458 5328108 5324420 5373565 5399685 5445554 5579036
3705 5579036 5493479 5479198 5577958 5662337 5741597 5758566 5813476 5856359 5982595 6130108 6239032
3694 6239032 6253357 6302868 6437269 6601211 6598778 6667196 6826822 7031319 7042854 7254694 7388728
3683 7388728 7485562 7578364 7771403 7824855 7943818 8103884 8248839 8364852 8466777 8605813
3673 8605813 8787935 8973127 9210223 9384040 9608058 9812028 10001614 10238617 10461336 10603547
3663 10603547 10889773 11153964 11403510 11735397 11951646 12240417 12452780 12612045 12802914
3654 12802914 13168575 13366878 13557897 13800332 13931990 14220315 14408322 14550843 14698859
3645 14698859 14713779 14813491 14943481 15158983 15290714 15370539 15524476 15653438 15745543 15784395
3635 15784395 15784102 15731436 15766438 15721708 15745749 15804644 15787440 15823933 15843304 15892547 15936434 15944321
3623 15944321 15959019 16056327 16089506 16076035 16113379 16164878 16189685 16262383 16361592 16349960 16284963
3612 16284963 16351536 16379809 16345201 16364918 16405593 16470207 16627204 16744780 16684107 16685485 16669663
3601 16669663 16676873 16819710 16830814 16830813 16741787 16823918 16879070 16887664 16938646 17000828 17068619 17206074
3589 17206074 17317040 17423011 17503987 17707616 17856752 18053722 18211028 18352150 18659501 18997658
3579 18997658 19240290 19514466 19836568 20217888 20647080 21189373 21842134 22371741 22965980
3570 22965980 23578600 24207024 24983374 25692123 26274049 26899321 27531638 27956362 28351738
3561 28351738 28865528 29321399 29605953 29923060 30302897 30602168 30952771 31357932 31795745
3552 31795745 32169253 32381976 32569258 32789876 32931638 32961982 32862230 32792332 32783504 32598725
3542 32598725 32452961 32345196 32252211 32204644 32085758 32261378 32382052 32350299 32404548 32706999
3532 32706999 32840257 33004240 33328462 33741502 34322620 34946072 35514893 36132552 36940722
3523 36940722 37769971 38581369 39609365 40781561 42102009 43404080 44851238 46341171
3515 46341171 48157189 50228994 52240466 54467255 56979299 59627485 62642831 65841986
3507 65841986 69296144 73043704 76948487 80953104 85157450 89430052 93962444 98460801
3499 98460801 102910652 107459238 111732962 116013534 120107207 123982985 127591605 131067159
3491 131067159 134409120 137634099 140730315 143690459 146520016 149342864 152123547 154824845
3483 154824845 157344197 159871248 162381581 164730141 166944755 169195272 171462419 173713978
3475 173713978 176160926 178830489 181632193 184894834 188374984 192334059 196473813 200888394
3467 200888394 205554143 210278634 214999961 219610977 224004398 227903967 231303337 234077384
3459 234077384 236262905 237690612 238654560 239116667 238967272 238311189 237464144 236368391 234924723
3450 234924723 233132390 230897180 227903224 224476441 220254509 215285674 209635827 203223184
3442 203223184 196295256 189124548 181746383 174583978 167520814 160685666 154136400 147818486
3434 147818486 141790225 135880120 130421728 125113201 120272933 115765744 111616159 107744572
3426 107744572 104034935 100656813 97482644 94407250 91603506 88785198 86173529 83723089
3418 83723089 81444302 79290201 77255846 75284280 73482935 71831789 70238656 68715698
3410 68715698 67444536 66227778 65132983 64232701 63475480 62777770 62222806 61511359 60536306
3401 60536306 59491974 58217560 57023611 56125346 55304240 54617139 54190348 53746595 53574843
3392 53574843 53419860 53431773 53594086 53805190 54121734 54536353 55261823 56040699 56849767 57768996
3382 57768996 58727068 59780000 60971089 62189995 63260041 64193260 65078092 65911696 66697860
3373 66697860 67428162 67971874 68164557 68224857 68168326 68014771 67832841 67758379 67770626 67879034
3363 67879034 68045405 68105915 68247903 68444762 68580976 68696333 68878718 68961963 68978223 68801260
3353 68801260 68713584 68566592 68202151 67801885 67458152 67122929 66853866 66585404 66305754 66152088
3343 66152088 66171296 66140009 66392926 66771285 67279329 67870813 68760235 69804773 71091668
3334 71091668 72475957 74030595 75767071 77620986 79633016 81557459 83690180 85769247
3326 85769247 87750081 89825919 91799474 93702526 95592894 97348492 99015214 100644522
3318 100644522 102283056 103945738 105648542 107405895 109497226 111833074 114565330 117608381
3310 117608381 121040394 124867081 129204457 133875292 138779886 144084534 149677124 155421407
3302 155421407 161062988 166645613 171983747 176915923 181434238 185282805 188455603 191091971
3294 191091971 192913011 193884913 194321522 194017156 193060238 191591718 189678052 187249661 184612526
3285 184612526 181889401 178799266 175437735 171958286 168276055 164393408 160320478 156066524
3277 156066524 151536463 146881957 141945263 136912910 131713665 126501345 121357111 116270848
3269 116270848 111288975 106326169 101621948 97097983 92883331 88940484 85303026 81739081
3261 81739081 78405372 75395875 72512443 69946059 67646719 65243063 63133008 61283788
3253 61283788 59384258 57736466 56297453 54930358 53692303 52386547 51191858 50218139
3245 50218139 49267864 48453618 47692520 47119918 46561690 46100349 45755976 45430619 45192905
3236 45192905 45030774 44966240 44801936 44676010 44776751 44867128 44966867 45020806 45192460 45265323
3226 45265323 45308465 45261192 45029452 44798249 44474472 43947631 43415766 42785184 41915060 41019938
3216 41019938 40167613 39260223 38217033 37194374 36062248 35194013 34355378 33562045 32644544
3207 32644544 31816137 31190365 30520543 29969060 29544025 29034186 28510802 28068509 27530389
3198 27530389 26941084 26498718 25932568 25508052 25095623 24719590 24401609 24026131 23687178
3189 23687178 23266486 22812999 22440343 22157894 21922970 21590710 21363301 21223828 21124174 20975834
3179 20975834 20785239 20715851 20560012 20560393 20478253 20501223 20570197 20603651 20554137 20606815 20711270
3168 20711270 20850329 20808784 20785437 20774525 20721801 20649910 20636419 20696462 20679443 20625998 20553600
3157 20553600 20509267 20512506 20527569 20561416 20715808 20804775 20741894 20840149 20978936 21059347 21185143
3146 21185143 21353501 21547118 21845934 22116598 22307242 22552043 22919502 23185481 23507229
3137 23507229 23816346 24138780 24739040 25086681 25530206 25916090 26448423 26997317 27664386
3128 27664386 28344769 28910478 29598041 30377747 31247115 32196466 33148172 34197262 35446944
3119 35446944 36832931 38306161 39989671 41795556 43498844 45300779 47164949 48852385
3111 48852385 50339155 51948864 53602538 55306065 57192856 59234807 61550359 64213539
3103 64213539 66971736 69983981 73116498 76284894 79850990 83520009 87244762 91219423
3095 91219423 95412945 99867529 104476627 109101162 113947198 119194224 124581244 130191253
3087 130191253 136238454 142837260 150093516 157766084 165865267 174676488 184217342 194423021
3079 194423021 205904392 218720558 233053096 248549000 265040096 282168429 299368335
3072 299368335 316197458 333221525 350851911 369439255 388484241 406056465 419806071
3065 419806071 427023455 426334362 417464110 401598879 381162934 358624841 335719562 313611127
3057 313611127 292736810 273317476 255389045 238943222 223576010 209266610 196151403
3050 196151403 183901959 172586360 162499378 153163085 144618282 136696229 129488563 122717219
3042 122717219 116360107 110478784 104807119 99572376 94760896 90207978 86049061 82119111
3034 82119111 78415738 75097860 71913062 68956530 66265602 63683500 61225144 58930493
3026 58930493 56703931 54580404 52655259 50854629 49092835 47499471 45896329 44319563
3018 44319563 42812792 41387753 40115796 38802388 37597076 36400284 35273107 34200537
3010 34200537 33217986 32286562 31349942 30509202 29691674 28883304 28174426 27326734 26611224
3001 26611224 26048870 25333558 24631381 24115306 23678718 23119083 22595439 22154733 21585131
2992 21585131 21175096 20746233 20254813 19872965 19464908 19065912 18674651 18329517 18067081
2983 18067081 17674774 17436775 17229931 16959518 16689860 16436021 16119244 15893264 15632785
2974 15632785 15306802 15168334 14940578 14697846 14440830 14163509 13787897 13577349 13282953
2965 13282953 13033360 12769829 12573543 12429611 12235758 11982725 11778093 11636680 11570873 11428663
2955 11428663 11345208 11228237 11286080 11171918 10889279 10728947 10629434 10435018 10211969 10056055
2945 10056055 9901490 9604284 9428494 9252704 9120742 9018101 8848592 8642699 8565550 8468937
2935 8468937 8342745 8179782 7971394 7973483 7798346 7685991 7674580 7661680 7471451 7248587
2925 7248587 7200494 7122580 6912383 6895962 6877265 6789975 6651336 6578255 6587398 6497306 6304918
2914 6304918 6217720 6056816 5997676 6107942 6047124 5887585 5895475 5901563 5837633 5751518 5678481
2903 5678481 5561563 5455261 5426954 5356327 5301285 5202272 5171684 5070162 5015638 5023507 4991508
2892 4991508 5019185 4987903 5030268 5036060 5012463 5040746 5008235 4996099 4978893 4777351 4660507
2881 4660507 4691257 4647525 4537076 4454009 4370275 4385348 4289510 4272545 4208812 4147407 4128469
2870 4128469 4102226 4037094 4024306 4096746 4171309 4177153 4150785 4096334 4072797 4132107 4100323 4110321
2858 4110321 4146099 4144604 4059456 4124066 4174477 4224133 4116602 4096238 4101799 4123165 4119534 4086364
2846 4086364 4114596 4121115 4078106 3974554 3969789 4071510 3927635 3929963 3898819 3934302 3857837
2835 3857837 3836598 3933590 3845023 3889545 3950887 4033699 3995999 3958810 4023296 3978399 3937777
2824 3937777 4006413 4017430 4098454 4030735 4002059 3981196 3971619 3960181 3869046 3843144 3888361 3841954
2812 3841954 3764468 3757597 3831532 3808266 3769642 3807758 3835550 3869846 3923137 4010819 3965436 3869423
2800 3869423 3890454 4027641 4068045 4034311 3996545 3992969 4044015 4294610 4505707 4492586 4488576
2789 4488576 4528958 4614519 4726438 4898654 4983510 4957785 4891838 4904249 4774084 4689816 4532362
2778 4532362 4438358 4263460 4169893 4080081 3834724 3712083 3593568 3489999 3425688 3315087
2768 3315087 3250424 3200136 3177638 3106386 2964935 2906150 2840901 2781551 2772829 2626108 2547713
2757 2547713 2438016 2449445 2353242 2263905 2217568 2166552 2251265 2142132 2116321 2176569 2159880
2746 2159880 2043499 2059864 2079887 1989253 1962621 1877149 1764170 1721567 1655933 1700848 1695123
2735 1695123 1778080 1746680 1743318 1709127 1609751 1564120 1597112 1476318 1474312 1458492 1497074 1515165
2723 1515165 1436218 1393701 1393683 1355933 1326638 1389812 1292544 1356237 1322067 1317514 1277080 1275651
2711 1275651 1231984 1156720 1187591 1205704 1240638 1214442 1244632 1136479 1176522 1166189 1115168
2700 1115168 1098618 1117780 1176217 1157895 1090181 1174657 1168116 1099600 1122992 1131275 1054355 1068174
2688 1068174 990284 1089325 1126090 1126580 1039172 1062555 1109091 1056973 1063452 1028116 985052 993428
2676 993428 953502 955354 987156 896020 979615 1058589 928052 851403 967246 971138 943759 878306
2664 878306 872056 813780 839476 858820 837723 881877 916702 790744 850600 885283 911621 805437
2652 805437 770673 830478 903650 889069 889025 896321 860306 826297 900123 886154 796784 774282
2640 774282 739697 713507 754746 619336 676823 667410 602776 711068 723439 708657 661792
2629 661792 678854 787435 614048 579358 647725 663680 730694 792676 765265 725274 720488
2618 720488 624177 632015 655992 617318 713651 651416 636851 672332 659129 849174 752628 742378
2606 742378 680374 723289 657064 690737 620973 574255 600872 693309 628986 510174 494645
2595 494645 559688 539540 500484 490598 461875 607865 595345 547760 612093 577857 570106 553379
2583 553379 587919 567277 559153 563734 555290 552648 495549 585749 569821 619200 574350 553024
2571 553024 592035 527672 477528 510165 490185 528556 454390 515876 600628 520785 476641 486141
2559 486141 433228 519787 498897 486032 526251 543841 579420 522760 490853 497861 523410 490723
2547 490723 573158 612562 603342 513095 385709 406892 348074 439029 538076 483376 453237 386748
2535 386748 432963 451661 397983 328835 318760 342824 489424 484295 445229 479054 479113 440863
2523 440863 487791 543656 482522 405869 336665 309662 304110 310756 292459 365828 392399 397428
2511 397428 405338 355473 407818 332779 301102 449244 428943 412950 365606 342602 365172 415300
2499 415300 421375 467963 440948 354526 352644 415014 365032 424309 446602 367209 322090 318478
2487 318478 401261 379321 348035 434026 493848 405807 342294 345309 508916 466435 465894 411722
2475 411722 434937 340859 371117 333125 310218 285902 225402 267943 363465 349920 419733 270538
2463 270538 224729 207072 321258 406323 320289 300087 308338 277609 227936 376905 338599
2452 338599 310875 341113 421066 373283 406570 498053 565951 517718 342121 326939 353126
2441 353126 345073 435397 372669 310667 322837 372051 335565 400860 311580 232344 306709 327271
2429 327271 362139 376212 360546 408263 308339 325117 406287 364944 412827 460371 313842
2418 313842 274455 227367 352973 388875 380576 347612 370168 367554 318270 287074 376310 442282
2406 442282 431568 458430 482064 529499 496450 477638 410651 359019 390108 359808 264356 209628
2394 209628 313927 370414 447542 386332 318359 276495 333558 412005 469430 466457 379278 463498
2382 463498 456053 458063 487057 562849 594410 569897 497969 542608 467450 643941 726861 739557
2370 739557 724652 650008 670131 663181 678446 784121 870438 809169 882943 959791 991437 1016791
2358 1016791 1062549 1177442 1309895 1364526 1505293 1689353 1708015 1816521 2073938 2251603
2348 2251603 2490141 2744684 3074688 3504759 4069178 4826327 5591475 6397147 7036088 7393091
2338 7393091 7156145 6665087 5836064 5169075 4591118 4129620 3776035 3368461 3112447 2846540
2328 2846540 2637494 2476423 2292156 2054528 1990919 1978086 1761608 1517852 1460149 1413223
2318 1413223 1176656 1096464 1170813 1036778 1008365 971519 921002 940669 871745 861887 829263
2307 829263 760985 717736 679771 715862 767620 761489 718256 680086 654303 627225 564627 633040
2295 633040 596720 565787 531126 489524 490072 503625 534948 473294 415837 340015 363572 465240
2283 465240 434883 422506 461376 432762 350652 405578 411818 443644 348701 253827 294837 321831
2271 321831 283148 246900 283646 193330 264113 338645 261694 264221 301576 315082 310162 284589
2259 284589 359292 428723 356457 315997 391495 311835 315873 302942 308297 296843 342906 312122
2247 312122 311181 266606 371036 362206 367400 326668 276687 277378 248153 265256 175273 168772 257351
2234 257351 298982 179579 268284 203253 232933 239874 148972 170578 274233 292491 263420
2223 263420 236278 281182 231166 299826 273633 237310 311215 222823 256662 253047 224479 239522
2211 239522 261887 186943 199956 240333 266928 332848 290321 209319 198769 266337 252609 329920
2199 329920 255588 214787 185885 206079 208702 183086 103126 32376 31569 159054 267892 326232
2187 326232 269612 194910 276066 235245 282569 255981 179097 132133 186422 189327 194729 291462
2175 291462 259993 157251 161466 217878 291558 423109 374475 377149 331629 383360 313531 236286
2163 236286 217124 174666 202347 120854 77031 122026 334494 303073 133649 151753 168199
2152 168199 178501 109238 102185 198577 161963 220167 127902 163392 206436 110532 130703 216664
2140 216664 188988 178451 304285 163999 121924 27037 52063 144348 51337 94991 99363
2129 99363 97053 101448 191495 172045 219407 175461 132463 162371 149298 74505 121904 238532
2117 238532 176519 150941 166921 236099 198988 202510 208237 156366 166465 195277 127433 143402
2105 143402 90577 93133 195898 158737 155843 53313 129391 168890 173622 37464 93644 176966
2093 176966 203432 139321 287764 301718 105693 159746 169899 123936 177897 209320 261381
2082 261381 244615 213657 247409 308508 271126 139236 174481 141690 148435 176762 211665 156841
2070 156841 117762 210586 200909 218223 207154 161677 177643 63448 25326 92011 84794 123240
2058 123240 148837 215108 96224 62047 217968 217328 186657 176995 235780 141787 121333 160016
2046 160016 231572 141390 188822 172819 96360 7246 96728 37036 59074 118020 152674 171802
2034 171802 207787 166373 173273 164578 135838 113541 94440 205434 116037 2444 3945 104582
2022 104582 128870 158825 173936 14443 -29666 60109 101755 59193 -58907 -5536 27321
2011 27321 37702 75041 13102 -19914 -48749 1934 51970 27920 3893 57205 204488 218469
1999 218469 168206 49093 45616 203285 144413 157955 261320 161492 99749 76256 149050
1988 149050 186817 206023 65656 7439 11075 75558 134990 165461 166648 162739 156560 114577
1976 114577 105226 36043 10990 82979 47638 69971 143165 124821 28111 -34772 -50034 15377
1964 15377 536 7950 78206 107761 82711 92226 59185 112708 175521 189561 124446 44978
1952 44978 2635 -52708 72336 114028 79787 47129 5097 14023 86609 24023 -60962 -45218
1940 -45218 64910 -84109 -22466 96385 58367 32205 33142 50332 -7251 6205 53607 121106
1928 121106 152002 175595 116934 32787 27515 121282 185711 137183 143422 144464 108741 128112
1916 128112 117732 141640 52262 36239 64837 -6808 35961 100536 -43250 -82859 134007
1905 134007 140024 147628 146655 182683 127947 92670 98487 159308 89086 40683 62468 -43962
1893 -43962 -54130 55659 88472 73803 195298 228698 156977 45846 29174 25283 88802
1882 88802 111563 99461 29356 64382 99192 119744 103872 51153 12414 -29933 -12197 -23470
1870 -23470 -46360 -22864 -20654 13198 115174 57963 40725 57302 98875 96070 97106 118906
1858 118906 62342 66720 47649 16222 79223 45714 3665 -35537 -61271 64104 79192 92351
1846 92351 95110 91992 25238 33258 56842 42814 13559 -20482 41368 40801 43226 118570 101787
1833 101787 63865 140221 119202 137313 73294 19491 125080 147095 130114 8437 -13525
1822 -13525 157238 105120 63065 138513 110760 58408 22463 96775 118938 77373 95573 127659
1810 127659 113481 60622 70849 20969 51064 22651 -28362 117078 84400 119628 44916
1799 44916 81687 139684 164186 177177 94817 64998 37134 51264 -30034 62193 71427 106225
1787 106225 75293 62630 -28787 141223 161308 104843 148014 106060 99219 29033 46352 29763
1775 29763 -46570 -31729 -28502 19911 99746 22085 69711 75424 139367 111010 -10303 15967
1763 15967 24808 21672 67778 125213 84953 124591 115416 84514 125311 129013 49820 31485 48475
1750 48475 102360 134228 97868 109675 36658 71168 90133 167706 122328 33485 -13128 86200
1738 86200 56561 81828 133636 137179 158709 201717 96402 -24956 -23522 59730 148318 212575
1726 212575 231034 237668 206259 50558 60781 171898 100766 9257 -6918 -8827 20369 72415
1714 72415 118472 89144 107680 117334 16437 50588 117073 30508 53646 -3783 95264 107480
1702 107480 87765 33426 -38413 -10582 8769 34158 3188 -28568 19817 129717 78656
1691 78656 -20321 18890 12654 112834 90749 94669 125362 95078 95250 -23601 -21837 7346
1679 7346 54424 101572 240781 113312 28131 77237 47531 68957 49937 31738 28357 98041
1667 98041 20047 4488 71438 102377 92163 122007 136529 66811 80195 55491 11636 42629
1655 42629 32307 29661 -25800 -22155 -18078 -34652 -70839 -40976 19413 70321 -8073 -72526
1643 -72526 -62827 66146 111851 77013 37660 19028 37652 -26743 38196 23038 32504 -32367
1631 -32367 53840 57883 61240 11333 -19108 71693 54433 55493 13687 20246 -108177 -72381
1619 -72381 42054 36985 40349 78836 12591 -35593 -28312 2309 -9312 45345 43807 -45540
1607 -45540 -39126 71422 150386 69805 69371 66821 72416 114747 177324 277959 175444 21770
1595 21770 89289 156487 198825 218128 121390 968 74079 195890 127508 30264 81283
1584 81283 69289 81 -57812 31589 52595 48727 83775 167024 892 44156 74310 132652
1572 132652 117948 83769 144271 125072 85091 161847 112562 -65912 16810 17987 67766 48034
1560 48034 145932 115861 31352 26813 66128 82193 43961 92614 9738 -7014 7452 -7131
1548 -7131 28104 -17948 -25958 -16719 21122 92853 157284 113481 88833 109040 90649 78407
1536 78407 22333 -13052 48819 73381 46816 27857 -31543 -41419 23199 56990 18125 1498
1524 1498 49266 122494 78967 -47622 9780 -100538 -146234 -53864 105 89719 -95128
1513 -95128 -89782 -17801 -89109 -2869 -39677 22654 52279 49679 -40755 -41681 25283 39447 -15664
1500 -15664 -19534 28748 4711 91152 49089 35911 146670 153494 129803 129014 37666 -91848
1488 -91848 -13122 -69142 -32424 -65791 -150475 -73655 -50152 111269 79190 58323 12377 -12
1476 -12 12620 10719 -38227 -53474 18877 75049 75921 82114 85098 -68063 -34778 -17272 12375
1463 12375 41938 9616 -42490 -15931 32132 68261 93265 36768 113685 101542 78861 54139
1451 54139 66154 43325 30631 81422 -11787 -94418 -119236 -88000 -35091 57304 162439 103888
1439 103888 967 15463 -57780 -128034 -48563 -22076 -84185 -64900 -14025 19761 -50802
1428 -50802 50350 115080 101419 17542 -12616 -38677 -62235 -81115 30839 135999 34519
1417 34519 3280 -20137 -324 -30369 -40097 -49739 36015 -4039 80480 -11447 -109765 -77371
1405 -77371 -140563 -130393 -118956 -41799 136804 124476 -41160 -38920 58734 1823 35695 -11914
1393 -11914 16859 -28358 9108 88122 80959 58084 93437 58821 124017 20527 -24047 44719
1381 44719 90854 103472 52940 40444 47609 58811 4338 32883 -26340 6491 8059 7016
1369 7016 -35734 50283 86116 157542 133217 46589 49031 59399 65267 69273 88859 35406 13295
1356 13295 -23927 -38284 24509 -7830 25731 29862 26884 37744 68072 72027 87007 -10465
1344 -10465 -21272 36044 67757 79078 173885 176881 40844 -36462 15392 35623 18441 -11805
1332 -11805 -109738 -63289 -17126 -15650 18561 21684 -24344 35581 45061 -50229 -76593 8179
1320 8179 81268 3231 23036 21642 27647 -36001 -191513 -105859 -69631 -57396 -980 44155
1308 44155 89509 110690 120321 77848 -11735 32433 23917 -56533 -66399 1506 28376 155820
1296 155820 135165 49829 -25162 -20472 14516 16118 62184 23308 8689 412 144138 130968
1284 130968 61504 -31188 -27624 -25620 -17113 -73074 -98779 -24366 -44232 -25473 41261 6913
1272 6913 52971 121561 116481 23836 37878 73378 10074 133628 63335 -57226 -1826 8929
1260 8929 -37739 -55875 25946 84008 115373 54626 30545 -15208 90242 138699 88489 36978
1248 36978 -33613 -7486 -5760 58624 20789 -121515 -156415 21948 -4014 -83747 -51152 -31635
1236 -31635 -7252 -20014 32503 13584 -35483 36782 57325 75091 162255 82442 -102549 -46808
1224 -46808 -84277 -99017 -103334 -110857 -116486 53472 47151 -36981 2779 -57529 -62471 -60774 -34099
1211 -34099 -543 47683 -38331 -64650 3675 -29776 -85141 -54340 6417 -46650 -83639 -23469
1199 -23469 -39460 -69992 18498 1664 -55473 5919 75172 7557 100170 96566 101335 40675
1187 40675 25066 47001 -25783 -103973 -84822 23163 30644 22362 -70852 -73164 -3012 -5184
1175 -5184 -72330 -63950 -14164 32356 78719 41155 49850 29631 37875 21604 -12654 28273 81972
1162 81972 6833 -80067 -129771 -31546 -76466 -50874 -117032 -65452 35408 -17836 72598 23628
1150 23628 -3053 -28176 116535 190977 97614 66612 105578 47081 21196 -137127 -68555
1139 -68555 -76126 -15359 -24506 -83045 -19520 -77837 -75636 -69765 -61806 -43370 -132151 -149394 -101821
1126 -101821 -94991 -155540 -30159 -20302 56937 5591 24033 57038 -10073 8311 -37622 -41716
1114 -41716 3056 5444 96663 26214 13258 -7254 1873 -85630 -59448 6950 76617 90092
1102 90092 16781 22693 -18368 96843 111270 64369 -4618 -34984 -47842 -64166 -64102 11564
1090 11564 -59366 -29154 -4100 -36738 -17153 115327 91245 55262 66360 64761 71671 129688
1078 129688 97801 51729 1451 -72405 -122493 -13172 6032 73750 75487 79591 -104741 -170299
1066 -170299 -67019 -116038 -36116 -6989 -40890 -107996 -225008 -235667 -176221 -133461 -43426
1055 -43426 -6266 -2021 -9385 -92193 -30595 848 84976 678 7184 -1697 63952 190322
1043 190322 68212 -9783 -47160 -56655 -47655 21740 -59221 -165525 -100832 -12986 -42558 -41865
1031 -41865 -9753 -4831 -4808 35869 71009 91488 76839 92532 -40504 -63263 -112693 -110908 -70992
1018 -70992 -33904 -85360 -16762 8348 24152 8691 -44852 -57913 -7845 6409 80993 17215
1006 17215 -133451 -83687 -56342 -96785 13981 52549 22418 121669 57744 104559 -3802
995 -3802 -57344 -30637 -26767 -30096 -124399 -231569 -87883 22879 -27677 -20663 -41535 -8891
983 -8891 -20173 -51183 -67957 -15832 19884 -14201 45371 9012 41231 6025 43028 -41287
971 -41287 -52977 -130752 -137450 -174055 -144252 -120625 -149531 -22351 -12240 -58858 -154594 -88411
959 -88411 -75696 -109438 -48367 6309 -35300 -81820 -59667 -52723 -58022 -87792 -101862 -102160 -155893
946 -155893 -112654 -45859 -8318 3768 2855 -837 -10363 -74947 -71876 -84365 -101422 -79189 -58438
933 -58438 -71995 18851 28696 -80082 -168105 -66582 -47628 -18905 -64904 -67757 -334 -22793
921 -22793 -50536 -67202 30586 4135 -3377 -52066 -7339 52471 -14988 26811 -18952 43163
909 43163 9187 19998 26426 4425 119553 56401 18544 91967 19293 -41143 -32550 40439
897 40439 20607 41477 91517 57140 44597 44138 35949 -2607 -83008 -51106 -62853 -44797 -106117
884 -106117 -71858 42048 58877 -12867 -36261 11014 -74750 -67253 27014 73418 59766 97022
872 97022 -7625 23475 90093 56654 75573 40870 -937 85030 95073 72587 -26516 15037
860 15037 -70444 -97118 -86461 -103975 -82332 -116072 -13037 59726 65273 67339 67901 50907 -26415
847 -26415 -70147 -75284 -65369 -74875 -57572 -106645 -34012 -52898 -81693 -66073 -38121 53524 -6404
834 -6404 63017 66548 29204 99574 71763 69888 103262 14652 -77558 -5980 -32570 -62409 47679
821 47679 7669 16123 -9490 31414 86881 -93083 -89079 -82839 -119293 -86293 -86080 -17598 -42961
808 -42961 -155234 -69889 -39378 -134478 -91475 -75271 -97270 -46006 -61468 -67629 -149326 -118958
796 -118958 -110102 -125549 -75184 -1819 -40365 -27019 -58736 -31706 61817 -49334 27178 -23410
784 -23410 -124137 -160486 -57245 -14496 12659 18050 36708 82340 37806 9705 -85842 -96885
772 -96885 -108650 -22643 -57991 -75043 -11177 6669 -16016 -29738 12303 -6434 50892 24433
760 24433 -50785 -166352 -111035 -58685 -6617 -4988 -39964 -81453 46254 81494 19004 29374
748 29374 -83118 -69707 -58888 -145537 -194398 -150819 -81474 -28471 66433 -672 -5694 14509
736 14509 41082 12197 41297 26651 -18891 -17105 -177 -41485 -90182 -27618 -95779 15022
724 15022 -29 -76322 -39044 -109939 -103198 -48446 -93277 -140803 12862 -50400 -70668 -42643
712 -42643 -31156 31741 60912 20354 -41946 -40305 -84408 14674 -53060 -94723 -98570 -95640 -41760
699 -41760 -120871 -105040 -64426 -178024 -47502 -12216 14788 26901 -65583 -57283 -16202 51414
687 51414 -6869 19362 -17821 -48570 14891 -10832 -44743 -58719 -16253 -93682 -111383 -46682
675 -46682 -48518 -125860 -136017 -124934 -198622 -162839 -91120 -84482 -43274 -50993 -2673 -78677 -87532
662 -87532 -60020 -105774 -55609 -79173 -39926 -4570 -63072 -48374 -104811 -194516 -187056 -203147
650 -203147 -54855 33235 34209 4962 -32511 109002 73623 -66210 -77601 -127561 -65897 27484
638 27484 46993 -59699 -160731 -94271 -85702 -13652 10232 -40654 -15166 -59162 -28131 49252
626 49252 60968 -9067 8524 -17397 -66697 -129452 -31170 -23062 7499 -70807 -166376 -91175
614 -91175 -100987 6281 15253 3806 -84700 -41606 4545 -59600 -98980 -130617 -59284 -31520
602 -31520 -39138 100047 86052 -9499 9735 -13243 -42018 -114387 -86605 -89318 -101053 -43963
590 -43963 -64151 60336 -4954 -93724 -137166 -98080 -128069 -129131 -62545 -133509 -103845 -100582
578 -100582 -37431 52068 -6387 -34847 -18288 -24725 -19847 -67308 -113215 -42225 -42074 -24066 -12191
565 -12191 -4564 -10182 54049 64161 5391 51688 23991 -4253 -63277 -69272 -40498 -146072
553 -146072 -111872 -25220 -60479 62650 141129 83605 41937 71376 97525 15851 59625 -67526
541 -67526 -184608 -145875 -109478 -110793 -105177 -17205 13829 96210 37365 43819 34927 -48368 -42176
528 -42176 -26432 -1433 -4786 -64653 -101912 -111965 -39322 -63505 21158 -64296 -67822 36988
516 36988 30597 34281 104634 75066 -80537 -108524 -40322 -23908 59420 74710 136185 50743
504 50743 -34155 -28348 -49185 -57115 -99063 -52740 -35772 6949 5555 52730 -38209 -93285 -26371
491 -26371 -126714 -74846 33490 -83670 -54201 40101 117047 145600 54045 20024 -71666
480 -71666 -48655 -37097 -21035 43016 -68481 -51337 -66669 -50745 -33473 -36363 -45328 -72731
468 -72731 -151787 -93680 -70599 -86861 -115298 34691 -72364 -90123 56398 20576 -115038
457 -115038 -151975 -170447 -203256 -123434 -17497 -16307 -12137 19626 80114 41913 922 15590
445 15590 -73632 -17482 30775 47928 83601 92369 -83493 -32423 -21381 -12136 -68007 -83853
433 -83853 -169817 -110884 -85857 -61661 -35899 49744 -40790 -137265 -102131 -117590 -63018 -89930
421 -89930 -63882 -60218 -188183 -156419 -152975 -133739 -142907 -77301 -11995 7685 -52264 -20679
409 -20679 7623 -105041 -62167 -24603 23830 -90287 -93189 -133552 -117667 -74586 -6141 -12287
397 -12287 21986 -13135 18247 -63142 -55104 -51867 -73244 -98980 -79057 -52057 -50543 53956
385 53956 31853 20281 -1309 -76837 -45094 -80738 -103907 -110504 -124397 -94977 -32145 76895
373 76895 26741 -12900 -21313 -47576 26919 46553 -5928 20287 -9712 -106419 -73596 -40345
361 -40345 -66861 -72829 -76869 -176218 -145278 -123327 -14730 7623 -88453 -66530 -63832 -121180
349 -121180 -68554 33042 -3966 -2072 22955 15348 18933 -51315 -69085 -56466 -34861 -93250
337 -93250 -40330 71641 41146 4069 -83887 -64915 -12989 3377 -38560 -83237 -153285 -121306
325 -121306 -135362 -164591 -180997 -84224 -23502 8113 -46596 -13829 81774 103194 74687 -59491
313 -59491 -46559 9014 -14177 70285 106500 183073 88513 -55299 -56203 -16204 48737 30473
301 30473 -17818 34514 -53457 -47126 -81352 -89834 -121362 -82062 -85949 -43106 -2365 -1964 17205
288 17205 -119376 -115280 -135477 -101376 -191013 -55350 -20400 6183 -15686 -109301 -60481 11858
276 11858 -41330 -66238 -33055 -78951 -31922 -85223 -78580 -103330 -122708 -94634 -107670 -132783
264 -132783 -57918 -57448 10871 -92058 -64704 55374 37608 -32716 -59092 -57980 -25788 -41858
252 -41858 -118522 -31833 -12249 -4170 2367 -16071 42785 72708 -20847 39689 17902 1624
240 1624 -61134 24557 -1990 -117886 -139696 -95595 5553 -19943 -71724 -158626 -97923 -33568
228 -33568 -37370 -17881 -72348 -56128 -140925 -107163 -70617 -134811 -101604 -48207 -52651 -64959
216 -64959 -41854 29424 -20479 -62503 -66857 -64275 -70526 -49840 13827 40253 29864 -73603
204 -73603 -72151 7093 60830 -46009 245 -4349 -117996 3979 77832 67323 -46693 -50091
192 -50091 -17856 -35457 -80230 -46267 29767 -1837 -50076 -43221 -44421 -58180 -12993 30794
180 30794 -16835 -124899 -31352 -43346 -126243 -95430 -75520 -125968 -40563 36226 -42509 -88655
168 -88655 -260 -13246 -63261 -109870 -140171 -106709 -94120 -105824 -128804 -120841 -104521 -84068
156 -84068 -56991 6392 10895 37229 -3232 5255 44988 30736 3636 63774 38562 46211 96959
143 96959 96769 -17256 -22377 10131 -11045 -67455 -67550 -70385 -126552 -61636 -101537 -152130 -61778
130 -61778 -21208 -29129 23283 -37289 -5712 24899 -4181 -53954 -47594 51784 21660 9066
118 9066 -22991 -13798 -68918 -20597 -4599 -66923 -42294 -20409 2372 38969 46718 -52780 39243
105 39243 -44345 -37971 -17326 -24852 -71884 -24770 2116 -41957 -16158 12786 -21950 -44330
93 -44330 -32 886 -11534 -11228 -77907 -33867 4855 -65081 -46128 -60263 -123582 -84039 -52827
80 -52827 -49322 -112578 -71574 -28608 -40050 -82133 -97975 -44612 -3940 -34387 -119474 -93948
68 -93948 -103740 -67372 -2496 -17455 -15643 -15857 -74162 -50096 -31768 17039 61652 -21184 -42313
55 -42313 -13125 -58315 -14612 -46328 -78766 -78430 -85629 -29557 6454 -59367 -99874 18255 14324
42 14324 -23927 4822 -45113 -61890 -109785 -148898 -74733 -36069 20341 24430 -28116 -2938
30 -2938 -46465 -105139 -117792 -108091 -57031 -56930 -81128 -20278 2372 -66963 -103505 -36622 -89857
17 -89857 -38638 65876 59655 8145 6340 30531 -15144 -25072 -418 33553 -10485 -24707 -51263
4 -51263 -54478 -79411 -26291 16554
0 16554
$$ Imaginary data points
##PAGE= N=2
##DATA TABLE= (X++(I..I)), XYDATA
16383 -2921668 -2897657 -2868071 -2851190 -2778876 -2729661 -2701570 -2670022 -2593319 -2497952 -2475412 -2469466
16372 -2469466 -2451232 -2369861 -2337037 -2301687 -2260701 -2279916 -2168564 -2165695 -2105917 -2001047 -1887211
16361 -1887211 -1835336 -1850391 -1791054 -1816866 -1752710 -1668632 -1644053 -1653171 -1542399 -1549563 -1469464
16350 -1469464 -1455978 -1437897 -1373691 -1328664 -1258964 -1176425 -1120815 -1071637 -1086879 -1096189 -1116901
16339 -1116901 -1005289 -932276 -876327 -786021 -758792 -708864 -713753 -644696 -634171 -724188 -647341
16328 -647341 -593039 -540899 -403596 -390120 -308301 -292257 -262124 -261728 -282391 -233558 -123845
16317 -123845 -120332 -47886 -29289 -1967 106133 122916 95802 145715 143597 171777 257475 327083
16305 327083 384016 441575 511565 526440 545931 570469 567683 600651 630824 627091 693731 765958
16293 765958 797325 850105 894632 897198 962360 837733 881541 926191 1010690 1030617 1147488
16282 1147488 1222379 1224753 1235152 1273627 1321518 1340997 1338983 1300784 1376065 1394205 1383024 1466533
16270 1466533 1513355 1510539 1522926 1623433 1734125 1728941 1708738 1752287 1737423 1715289 1793475
16259 1793475 1814945 1843870 1889947 1898952 1850911 1918853 1927803 2008850 2046865 2057643 2059546 2098703
16247 2098703 2181017 2194495 2205487 2226545 2175721 2189133 2306373 2367310 2352591 2446336 2450845
16236 2450845 2452137 2495645 2510498 2434012 2531858 2664517 2647159 2567769 2534781 2562416 2536567
16225 2536567 2664368 2649520 2633869 2704963 2825746 2821282 2797983 2871957 2870488 2901118 2946385
16214 2946385 2915672 2892037 2961034 2992854 2908981 2909752 2952316 2948423 3036547 3130990 3083406 3139451
16202 3139451 3081259 3144493 3196127 3139106 3105023 3148426 3223952 3164336 3161192 3191219 3169353
16191 3169353 3187954 3318423 3326135 3349182 3324407 3307739 3321684 3312122 3338522 3374776 3363860
16180 3363860 3436851 3391158 3487420 3592283 3525703 3561035 3578444 3459557 3504193 3561250 3577562
16169 3577562 3626085 3543053 3547328 3576131 3516551 3538524 3606040 3648486 3659228 3677714 3679939 3646316
16157 3646316 3718701 3713189 3624554 3747806 3777953 3662681 3684411 3724030 3805407 3838652 3702482
16146 3702482 3640267 3700055 3704768 3700471 3779233 3718834 3763586 3745626 3673072 3813918 3755120
16135 3755120 3725678 3743543 3736232 3791020 3877752 3861412 3845167 3828780 3770674 3853461 3863505
16124 3863505 3846514 3851739 3871208 3908951 3868180 3844682 3872457 3905939 3925461 3944162 3957115
16113 3957115 3977219 3917687 3895853 3853280 3947106 3952017 3972534 3985062 4006306 3971603 4011485
16102 4011485 4087491 4057382 3973764 3981371 3966524 4037975 4048817 4088382 4163789 4118329 3963881
16091 3963881 3862171 3951553 4018575 4046636 3927473 3947812 3930872 3969062 3962727 3992569 3982369
16080 3982369 4131415 4062502 4008733 4066427 4031917 4019260 4023927 4073630 4026045 3928368 3950185
16069 3950185 4004513 4016058 3995819 4077011 4104368 4042650 4076231 4159202 4226762 4256861 4103127
16058 4103127 4009582 4215557 4095035 4038778 4112619 4142551 4079750 4109783 4060057 3976517 4019513
16047 4019513 4015186 4200356 4132486 4068232 4116318 4039320 4046577 3964097 3881239 3925708 4055933
16036 4055933 4027309 4069993 4081268 4075848 3984652 4008307 4045524 4075885 4222197 4231589 4167838
16025 4167838 4134058 3978317 4115257 4106635 4111816 4089057 4044765 4172470 4124844 4108240 4033529
16014 4033529 4177274 4117280 4060823 4059361 4060132 4085637 4118377 4134298 4195357 4225790 4219784 4140676
16002 4140676 4101793 4055873 4021180 4039876 4009059 3980456 4045857 4091802 4047743 3980119 4083877
15991 4083877 4161962 4167475 4129763 4125944 4106728 4061695 4087762 4168133 4154010 4210082 4213228 4184764
15979 4184764 4190237 4126987 4148627 4038648 4111374 4130990 4075634 4133323 4171810 4149073 4104667
15968 4104667 4114030 4143742 4221234 4249338 4216121 4200092 4205901 4249729 4247232 4153848 4225998 4243525
15956 4243525 4200062 4219024 4118851 4167112 4116092 4071937 4081416 4064571 4090031 4048192 4122381
15945 4122381 4148631 4128343 4162329 4193337 4281570 4307452 4241390 4202013 4148378 4066619 4076515
15934 4076515 4115916 4117715 4136929 4197829 4189920 4190835 4214188 4154608 4107419 4081979 4237037 4207956
15922 4207956 4285017 4222806 4157406 4167887 4181820 4156750 4090338 4184562 4231064 4156808 4059072
15911 4059072 4063789 4056588 4129157 4215943 4245844 4272118 4394139 4311323 4239849 4259505 4283556
15900 4283556 4142317 4094470 4194078 4208714 4137938 4167351 4224041 4250455 4251199 4255139 4216017 4242271
15888 4242271 4153321 4209969 4069032 4055080 4140440 4109009 4127131 4217057 4277177 4220106 4153329
15877 4153329 4136557 4165019 4160174 4278146 4317224 4188311 4162893 4225362 4144572 4285528 4270268
15866 4270268 4119354 4163777 4226435 4222728 4213381 4247792 4254949 4224627 4208290 4134904 4160220 4123988
15854 4123988 4108527 4140818 4189361 4128056 4227064 4281015 4288449 4339369 4218599 4123834 4134989
15843 4134989 4223941 4216111 4209932 4217642 4184834 4166421 4237750 4214256 4211174 4302887 4200497 4231233
15831 4231233 4304106 4224795 4195606 4173684 4108689 4154527 4252026 4251477 4282704 4209971 4168485 4192280
15819 4192280 4069562 4183778 4192503 4115284 4179475 4185259 4115028 4105365 4146378 4141734 4173494 4255939
15807 4255939 4200793 4148709 4267118 4228391 4228310 4191381 4235980 4254182 4302658 4232408 4139094 4218092
15795 4218092 4214651 4211276 4160416 4099466 4143111 4210341 4134377 4200734 4150422 4189485 4241605 4200653
15783 4200653 4206221 4241004 4302261 4252224 4249122 4172460 4241956 4310218 4189777 4159904 4053940
15772 4053940 4001367 4141137 4253769 4306472 4196872 4230363 4297841 4278724 4189356 4087380
15762 4087380 4184261 4257034 4322265 4345283 4265372 4266730 4256799 4205736 4200151 4224331 4266591 4238927
15750 4238927 4148913 4112011 4154483 4160483 4173090 4264261 4187587 4199973 4317293 4343068 4324219
15739 4324219 4266457 4251666 4205599 4270602 4257277 4226808 4196986 4183431 4157403 4239594 4246367
15728 4246367 4184577 4229902 4188085 4196726 4282974 4194693 4147071 4193018 4205982 4143851 4139246 4338365
15716 4338365 4307925 4250448 4205912 4157380 4172314 4293916 4279599 4245236 4283795 4275085 4236700
15705 4236700 4260197 4263703 4321816 4303061 4221017 4200356 4120995 4097744 4124508 4145625 4168792
15694 4168792 4277700 4290847 4242579 4239908 4191742 4212070 4289801 4247964 4220457 4218329 4206093
15683 4206093 4282128 4251750 4230801 4196963 4259158 4221848 4156430 4184162 4187648 4238222 4156900
15672 4156900 4216493 4296953 4272276 4216075 4193541 4255433 4317795 4276210 4259144 4275754 4244606
15661 4244606 4284043 4341114 4225406 4251144 4267732 4285897 4430004 4440486 4352811 4252824 4304598
15650 4304598 4252947 4282926 4355635 4277680 4275836 4264345 4271295 4328098 4266582 4220770 4243755 4189373
15638 4189373 4365324 4350592 4265434 4245213 4273347 4333945 4303831 4249407 4278821 4395776 4297694
15627 4297694 4224164 4325363 4280288 4322816 4331530 4227262 4261656 4236016 4313510 4238974 4242900
15616 4242900 4335328 4388223 4391958 4347236 4350111 4305049 4219243 4262107 4345983 4342564 4259114 4138034
15604 4138034 4264107 4211882 4147324 4240356 4260908 4248641 4204961 4242247 4206296 4160387 4242906
15593 4242906 4273371 4224504 4208948 4269301 4282720 4339340 4268904 4254395 4350142 4249616 4221249
15582 4221249 4273064 4262989 4342329 4338297 4408535 4455060 4434230 4420958 4444599 4376992 4338573
15571 4338573 4317587 4346394 4289949 4270917 4345874 4254538 4222724 4196391 4273229 4241671 4262908
15560 4262908 4252990 4215121 4231516 4329165 4298354 4248384 4178954 4235378 4318323 4395850 4309457
15549 4309457 4236383 4167704 4248958 4320587 4288044 4250778 4294518 4335355 4283540 4397412 4374228
15538 4374228 4351013 4367136 4362832 4439165 4423382 4461460 4466215 4391734 4397065 4388847 4299012 4254879
15526 4254879 4203808 4245911 4320302 4313522 4232704 4229327 4236601 4227940 4309936 4351987 4346215 4310216
15514 4310216 4334055 4275170 4300581 4399600 4407517 4270045 4295247 4208667 4187949 4299669 4318354
15503 4318354 4304458 4311457 4287993 4247656 4229277 4301067 4237289 4144189 4169045 4283809 4303152
15492 4303152 4394835 4452160 4305059 4245870 4300710 4381097 4335618 4285608 4339233 4250413 4206254
15481 4206254 4236135 4349657 4430374 4403334 4339494 4346440 4456423 4365714 4413975 4385254 4366019
15470 4366019 4326337 4320535 4394559 4336420 4382390 4349853 4310269 4303040 4259811 4224613 4205698 4250715
15458 4250715 4291807 4383483 4389105 4253678 4249508 4318452 4259304 4322324 4464742 4434464 4387908
15447 4387908 4308378 4317268 4368064 4368117 4382955 4344109 4317853 4379103 4344738 4331472 4306216 4385903
15435 4385903 4333393 4344526 4302725 4354005 4378479 4377658 4364162 4219410 4329079 4420897 4301155
15424 4301155 4261579 4382019 4416104 4414503 4388347 4389253 4417538 4420111 4374757 4338970 4380383 4354126
15412 4354126 4438533 4425967 4327333 4332038 4443290 4500116 4322659 4282759 4354830 4305693 4245008
15401 4245008 4414563 4405224 4375263 4326239 4369611 4316922 4347565 4373743 4425536 4443186 4373914
15390 4373914 4321526 4371527 4399166 4363961 4429603 4401298 4419191 4403432 4389722 4468467 4398025
15379 4398025 4392285 4363980 4443197 4395136 4351943 4345307 4356763 4375891 4438491 4365038 4375310 4375182
15367 4375182 4282532 4313828 4328099 4323163 4332853 4338240 4418414 4526743 4476888 4403830 4467182 4437638
15355 4437638 4452463 4364081 4389510 4419615 4450843 4434548 4430766 4457262 4348201 4254672 4313542
15344 4313542 4364966 4363049 4392014 4377847 4423002 4290428 4396487 4393353 4466122 4410096 4391079
15333 4391079 4462049 4400466 4366471 4419763 4431651 4477529 4465751 4418967 4388891 4293912 4265043
15322 4265043 4368607 4303096 4377667 4378885 4444424 4309248 4313194 4321497 4311148 4346737 4430502
15311 4430502 4380369 4357840 4363721 4271076 4279880 4325627 4352028 4375100 4270431 4335003 4417847
15300 4417847 4428925 4509121 4500908 4561468 4536676 4470515 4519182 4413293 4393983 4482143 4409930
15289 4409930 4401622 4476652 4427679 4386466 4495814 4483067 4555317 4509655 4477834 4394682 4394416 4451205
15277 4451205 4450058 4418992 4349541 4313222 4283653 4233645 4295554 4308111 4374731 4389994 4511143
15266 4511143 4467404 4472865 4458231 4376965 4409305 4341890 4354737 4368838 4370349 4367392 4388254 4467216
15254 4467216 4384298 4337142 4334760 4270582 4442843 4455582 4383103 4433939 4402371 4365022 4336072
15243 4336072 4409215 4391787 4400610 4434469 4564614 4629145 4534266 4515541 4549548 4424424 4314247
15232 4314247 4352863 4373336 4346671 4455400 4486039 4557328 4655267 4587405 4488427 4435219 4363869
15221 4363869 4437485 4483138 4534755 4554828 4546315 4511490 4403829 4383620 4448534 4446265 4410778
15210 4410778 4461192 4437826 4406887 4485847 4480105 4500477 4520306 4537862 4553717 4463971 4460267 4360795
15198 4360795 4431560 4460506 4499034 4461036 4515768 4461597 4545264 4573068 4613504 4625536 4581897
15187 4581897 4633599 4615887 4554403 4494453 4521535 4447480 4450214 4406024 4577950 4604792 4507305
15176 4507305 4507888 4432015 4569170 4442719 4473084 4484344 4522016 4505813 4507588 4502713 4493378 4523601
15164 4523601 4500530 4528043 4509055 4461954 4397937 4413534 4481433 4494192 4370997 4410884 4463105
15153 4463105 4511827 4495462 4597268 4530105 4443853 4439456 4485132 4487459 4509496 4518046 4417151
15142 4417151 4491468 4624119 4555936 4513002 4448372 4408399 4460032 4624648 4596044 4487809 4515830
15131 4515830 4447601 4405554 4574778 4443119 4464532 4523624 4495741 4498249 4523196 4518788 4514234
15120 4514234 4608225 4590403 4533600 4477259 4466627 4471974 4493134 4449643 4469233 4552137 4534320
15109 4534320 4486018 4572908 4549848 4548144 4501420 4491647 4445881 4632163 4642942 4529921 4574459
15098 4574459 4575252 4624077 4539893 4520239 4482370 4554502 4613721 4563633 4564696 4553178 4523111 4590314
15086 4590314 4659048 4516298 4522601 4405280 4380861 4447609 4503051 4465959 4495579 4437147 4450608
15075 4450608 4421998 4456033 4447979 4524915 4504660 4470292 4501547 4492850 4491621 4420085 4417126 4350863
15063 4350863 4400946 4445164 4463204 4464728 4488527 4520323 4547601 4499760 4587117 4594299 4495316 4622837
15051 4622837 4612847 4595092 4458212 4395119 4429692 4448888 4543045 4525838 4598931 4710001 4702883
15040 4702883 4555723 4641568 4654910 4625494 4588173 4567007 4583594 4532891 4544118 4702938 4611211
15029 4611211 4549858 4610437 4671080 4610649 4596496 4515578 4458929 4486093 4567434 4561197 4540318
15018 4540318 4552058 4561233 4547540 4605124 4647771 4644471 4467004 4436182 4471375 4478947 4422950 4459135
15006 4459135 4601968 4512815 4449498 4431472 4488302 4489800 4517298 4630245 4571043 4526180 4697633
14995 4697633 4689263 4623983 4545920 4542391 4478903 4502789 4498263 4443530 4430802 4446587 4564880 4566660
14983 4566660 4507697 4553127 4510110 4505103 4486587 4537096 4577344 4663198 4633232 4710965 4679076
14972 4679076 4588075 4577132 4476711 4528808 4543450 4505952 4546449 4628353 4514260 4485880 4546526
14961 4546526 4540944 4583159 4655368 4518755 4501066 4596227 4575328 4526828 4598445 4597670 4518382 4478278
14949 4478278 4431617 4481204 4536593 4558727 4568776 4544630 4601112 4588797 4508734 4566891 4563868
14938 4563868 4605212 4618799 4623981 4597929 4576145 4610516 4545844 4528450 4586733 4635466 4605714
14927 4605714 4513656 4571383 4614436 4532579 4525484 4493890 4558132 4568035 4612383 4663425 4651447 4640152
14915 4640152 4734132 4641544 4604289 4661302 4616630 4634078 4593298 4653924 4663346 4592359 4541179
14904 4541179 4531858 4572329 4632123 4655196 4624641 4572486 4630243 4586283 4565288 4558604 4499768 4580620
14892 4580620 4597486 4674673 4663636 4614446 4623479 4554605 4655845 4596153 4684488 4735556 4650367
14881 4650367 4634765 4615518 4620077 4561562 4564685 4627222 4704102 4710794 4734171 4702588 4632146 4633264
14869 4633264 4449527 4546496 4645027 4632197 4558900 4593880 4529228 4533532 4700060 4692056 4617805
14858 4617805 4561789 4604239 4663400 4745825 4658084 4610651 4676563 4683347 4598488 4631601 4645830
14847 4645830 4632148 4696468 4724757 4746196 4708747 4692413 4673707 4599242 4582357 4584234 4661508
14836 4661508 4583614 4524441 4627753 4622363 4569057 4586781 4628368 4635104 4628055 4550964 4548528 4634921
14824 4634921 4581178 4581515 4577567 4658500 4641425 4569243 4623737 4608102 4618333 4492704 4461788 4547362
14812 4547362 4604508 4652030 4560390 4609324 4681016 4657993 4562900 4663474 4691612 4584402 4575041
14801 4575041 4544467 4582077 4628537 4594762 4637673 4672216 4690431 4658382 4682938 4737544 4708292
14790 4708292 4671362 4625324 4638083 4595606 4585908 4624454 4619885 4556305 4610721 4658565 4634952 4671467
14778 4671467 4655654 4748806 4744204 4742239 4668702 4734050 4696615 4567931 4518961 4653573 4648581
14767 4648581 4665648 4715459 4588453 4605515 4626800 4562376 4576217 4606786 4658422 4593545 4553405
14756 4553405 4540915 4712467 4746947 4692269 4770520 4623996 4671865 4642425 4661672 4699810 4671566
14745 4671566 4641022 4625254 4644830 4707500 4573125 4562437 4559106 4646421 4604453 4653519 4761125
14734 4761125 4754492 4698614 4608751 4689324 4722805 4726895 4743056 4836360 4763134 4667610 4767919
14723 4767919 4760058 4784684 4713160 4709628 4706168 4698686 4693643 4719628 4618918 4667960 4703052 4716382
14711 4716382 4689282 4714402 4723471 4757936 4734206 4663366 4678642 4623619 4662168 4653120 4698521 4652630
14699 4652630 4640449 4638613 4695204 4677768 4718392 4669932 4641597 4573303 4448155 4524561 4602163
14688 4602163 4605041 4586980 4642585 4723747 4581301 4573343 4709890 4733136 4754743 4746860 4713867
14677 4713867 4764918 4738029 4663546 4606121 4636663 4622099 4655338 4706369 4719870 4680553 4579723
14666 4579723 4676127 4685703 4677613 4570540 4628919 4650593 4676669 4731128 4689708 4752007 4821819
14655 4821819 4783104 4671578 4770422 4712420 4703053 4766186 4612812 4618835 4622961 4652238 4699668
14644 4699668 4785361 4786812 4736188 4733168 4677355 4694946 4782088 4822948 4778384 4715399 4744408 4794902
14632 4794902 4794241 4861115 4817830 4794516 4720095 4765524 4804488 4731733 4795416 4830823 4725519
14621 4725519 4684525 4727841 4752044 4729988 4720842 4635840 4647050 4646785 4641956 4687423 4609202 4671517
14609 4671517 4824975 4819761 4670413 4679070 4775124 4734559 4643969 4765762 4804623 4714807 4686097
14598 4686097 4626680 4675691 4690797 4665245 4722342 4778266 4725891 4709714 4776030 4862840 4809634
14587 4809634 4751602 4774866 4767448 4741010 4799116 4854815 4802210 4747052 4766985 4815146 4797835
14576 4797835 4769446 4751632 4800943 4773678 4743057 4848882 4841225 4864366 4862489 4838631 4756353
14565 4756353 4830413 4747592 4725430 4776755 4809121 4731877 4767928 4905827 4820672 4738626 4723934
14554 4723934 4787063 4737467 4749381 4818158 4762545 4879371 4884594 4766645 4765187 4746618 4823113
14543 4823113 4740936 4695303 4728955 4769699 4795782 4811908 4756637 4694467 4757011 4813611 4812530
14532 4812530 4724422 4711827 4741895 4738269 4774554 4715996 4745293 4836538 4915418 4879479 4786418
14521 4786418 4692688 4689761 4681503 4742022 4729873 4808014 4794217 4800558 4811489 4744269 4633301 4718138
14509 4718138 4866303 4839741 4779063 4826377 4884367 4816183 4810535 4794405 4715239 4789043 4763473
14498 4763473 4737736 4723724 4783557 4849069 4790687 4662668 4609445 4694408 4849757 4846625 4841458
14487 4841458 4802153 4758108 4709316 4767720 4866721 4858091 4808050 4816722 4768172 4684865 4848712
14476 4848712 4766745 4804208 4772077 4828619 4926171 4806321 4786474 4775524 4787863 4852485 4768406
14465 4768406 4788103 4876452 4920107 4829349 4828396 4873035 4915860 4847833 4887023 4921907 4956147 4892918
14453 4892918 4869124 5004976 4994081 4964013 4935772 4969785 4974939 4916465 4842870 4850217 4875786
14442 4875786 4890956 4856026 4888502 4951933 4852219 4909091 4903052 4873949 4813652 4764736 4831423
14431 4831423 4839583 4811273 4801953 4770471 4774172 4738167 4715836 4765764 4748963 4743820 4808447 4835972
14419 4835972 4836320 4964865 4920162 4888627 4798461 4700856 4749206 4851747 4838511 4803933 4885423
14408 4885423 4834242 4894588 4898667 4885291 4843130 4960924 4900582 4742926 4905128 4862590 4903847
14397 4903847 4881292 4837170 4811243 4775701 4723536 4662210 4674156 4765188 4953977 4849452 4831598
14386 4831598 4983015 4944222 4840317 4908359 4966852 4941428 4966468 4942698 4878950 4797201 4809600
14375 4809600 4789144 4814909 4818851 4961410 4906789 4880650 4876049 4741303 4794193 4860677 4903752
14364 4903752 4822034 4773697 4743874 4866581 4857298 4750120 4862535 4875215 4881565 4863482 4881590
14353 4881590 4852285 4878524 4886575 4812678 4887827 4838986 4852331 4909232 4877637 4861267 4925433
14342 4925433 4948614 4914841 4908299 4875875 4811195 4839500 4812754 4805860 4901008 4899663 4925753 4903768
14330 4903768 4866662 4942486 4838600 4888889 4918563 4939871 5018557 5053661 4958178 4939198 4893155
14319 4893155 4979117 4986286 4954961 4973496 4902521 4861075 4797688 4902963 4877336 4916893 4972414
14308 4972414 4995333 5051146 4991583 5003649 4983579 4911602 4962909 4923051 4968391 4943868 4941710
14297 4941710 4807804 4838833 4898101 4891450 4925941 4931356 4940125 4935868 4968427 4959294 4936197 4949272
14285 4949272 5048387 5064811 4925195 4819442 4894392 4872132 4954494 5004076 5006894 5103316 4948563
14274 4948563 4863584 4832251 4966822 5006919 4981226 4986702 4973431 4885222 4799320 4910370 4918746
14263 4918746 4866128 4923988 4877649 4837129 4877382 4880432 4885232 4831439 4884335 4924949 4942953 4891760
14251 4891760 4845073 4852263 4924494 5001505 4976708 5054192 5063355 5055677 4994381 4886700 4947085 4891797
14239 4891797 4913628 4880015 4950462 4964367 4889678 4931165 4912425 4910377 4898963 5000459 4978296
14228 4978296 5003103 5053335 5038649 4944818 4950931 4913989 4879833 4931974 4897391 4932488 5023438
14217 5023438 5106753 5106910 5027097 4895692 4863808 4954894 4930604 4940117 4936387 4916180 4948585 5051958
14205 5051958 5021792 4992246 5017992 4939177 5000167 5016438 5071178 5078631 5029320 4960424 5006570
14194 5006570 5053984 5045241 5009065 5081628 5049531 5072716 5075528 5051124 5105809 5072945 5068731 5073383
14182 5073383 5030652 5095244 5049619 4965726 5052914 4969602 4947444 4967301 4973815 4934204 4911221
14171 4911221 4919137 4913905 4974181 4982920 4954455 4895513 4981599 5059677 5014701 4944408 4943966 4986505
14159 4986505 4985265 4928631 5022996 5052255 5020322 5027243 4988647 4975899 5012349 5051510 5010175 5041386
14147 5041386 5127089 4992377 4899417 4950093 4992043 5141746 5035745 5000395 5088933 5050728 5029628
14136 5029628 4937002 5025863 5111328 5034445 4983302 5065244 5101713 5000444 5063464 4952966 4995017
14125 4995017 5151384 5166924 5094943 5012017 5012765 5008977 5033294 5037477 5075344 5050491 4906633 4922896
14113 4922896 4887934 4911813 5005942 4980499 5048283 4991970 5013972 5048248 4925467 4897103 5021645
14102 5021645 5052858 5059910 5060836 5022449 4959855 5062243 5067945 5027840 4995950 4991841 4935147 4952593
14090 4952593 4926290 4894510 4935412 4976657 5019399 4998458 5040015 5042706 4987084 5012540 5015953 4956406
14078 4956406 5032307 5016828 5051314 5072571 5060384 4971707 5025315 5057170 5112608 5051787 5134321
14067 5134321 5149404 5025128 4916302 4924698 5002943 5060500 5113748 5141330 5099958 5059942 5123375
14056 5123375 5030227 4974861 5089724 5055646 5022951 5060949 4989903 5138392 5165537 5107781 5072212
14045 5072212 5073556 5072750 5051314 4952675 4969246 5012872 5056826 5080122 4961692 5043609 5107714 5140092
14033 5140092 5096626 5025904 5000045 4994249 4933358 4949116 4968535 5032844 5091950 5063693 4968592
14022 4968592 5011506 5090891 5087464 5124414 5120883 5075056 5146404 5146052 5098844 5026986 5028599 5075035
14010 5075035 5136249 5039116 5094087 5199842 5082715 5052722 5022502 4987646 4920309 4954248 5022739
13999 5022739 5012967 5004838 5069305 5102385 5095762 5169792 5116356 5107434 5137203 5081324 5012414 5021481
13987 5021481 5184818 5095801 5129771 5076239 5050184 5039515 5094812 5075976 4997073 5039317 5055529
13976 5055529 4979232 4984181 5076085 5098355 5125458 5148864 5062852 5070831 5116147 5045029 4984459 5085053
13964 5085053 4989369 5013973 5098970 5076712 5141818 5115414 5102060 5129432 5055679 4991196 5023715
13953 5023715 5045047 5023155 5094982 5061246 4920847 5046835 5112622 5149172 5177094 5190714 5121224
$$ [...]
##END NTUPLES=NMR SPECTRUM
##END=
