##TITLE=1H_CA-9375
 200.13MHz, CDCl3,
 8 sc
 
 29.8.2025
##JCAMPDX= 6.0         $$ Bruker NMR JCAMP-DX V2.0
##DATA TYPE= NMR SPECTRUM
##DATA CLASS= NTUPLES
##ORIGIN= UXNMR, Bruker Analytische Messtechnik GmbH
##OWNER= pz
$$ XWIN-NMR		Version 3.5
$$ Fri Aug 29 13:41:26 2025 Russian Standard Time (UT+4h)  she@DPX200
##.OBSERVE FREQUENCY= 200.1313
##.OBSERVE NUCLEUS= ^1H
##.ACQUISITION MODE= SIMULTANEOUS
##.ACQUISITION SCHEME= undefined
##.AVERAGES= 8
##.DIGITISER RES= 18
##SPECTROMETER/DATA SYSTEM= spect
##.PULSE SEQUENCE= zg30
##.SOLVENT NAME= CDCl3
##.SHIFT REFERENCE= (INTERNAL, CDCl3, 0, 15.5331)
##AUDIT TRAIL= $$ (NUMBER, WHEN, WHO, WHERE, WHAT)
$$ ##TITLE= Audit trail, XWIN-NMR		Version 3.5
$$ ##JCAMPDX= 5.01
$$ ##ORIGIN= Bruker BioSpin GmbH
$$ ##OWNER= she
$$ F:/spectra/data/she/nmr/H-C/1/pdata/1/auditp.txt
$$ ##AUDIT TRAIL=  $$ (NUMBER, WHEN, WHO, WHERE, WHAT)
(   1,<2025-08-29 13:40:05.09 +0400>,<she>,<DPX200>,
      <created by zg, POWCHK disabled, PULCHK disabled
       configuration hash MD5:
       00 E9 B6 7A A2 85 ED C7 34 08 36 98 17 FE 4E 26
       data hash MD5: 16K
       E7 11 51 E4 EE C9 7E AE 6D 85 B9 ED C5 27 38 5D>)
(   2,<2025-08-29 13:40:07.31 +0400>,<she>,<DPX200>,
      <Start of raw data processing
       efp BC_mod = 2 LB = 0.25 FT_mod = 6 PKNL = 1 PHC0 = -1569.154 PHC1 = 26.99228 SI = 16K 
       data hash MD5: 16K
       BF D9 51 0C E8 32 E0 8A 85 B4 31 85 85 11 D0 DE>)
(   3,<2025-08-29 13:40:30.62 +0400>,<she>,<DPX200>,
      <pk PHC0 = -157.2645 PHC1 = -2.8 
       data hash MD5: 16K
       F5 29 BC 6C 49 E5 4D 7F 19 7A F3 1C 29 00 04 41>)
(   4,<2025-08-29 13:40:35.07 +0400>,<she>,<DPX200>,
      <abs ABSG = 5 
       data hash MD5: 16K
       C1 2B CA 44 15 B4 2E BD 23 B5 ED 14 83 C7 7A 0A>)
$$ ##END=
$$ 
$$ hash MD5
$$ A0 7B DB D4 23 DC 99 3B A4 3E 7C BB 08 0C 7F 6C
##$RELAX= 
##$RELAX= 
##$RELAX= 
##$RELAX= 
##$RELAX= 
##$RELAX= 
$$ Bruker specific parameters
$$ --------------------------
##$DU= <F:/spectra>
##$EXPNO= 1
##$NAME= <H-C>
##$PROCNO= 1
##$TYPE= <nmr>
##$USER= <she>
##$AMP= (0..31)
100 100 100 100 100 100 100 100 100 100 100 100 100 100 100 100 100 100 
100 100 100 100 100 100 100 100 100 100 100 100 100 100 
##$AQSEQ= 0
##$AQ_mod= 1
##$AUNM= <au_zg>
##$AUTOPOS= <>
##$BF1= 200.13
##$BF2= 200.13
##$BF3= 200.13
##$BF4= 200.13
##$BF5= 200.13
##$BF6= 200.13
##$BF7= 200.13
##$BF8= 200.13
##$BYTORDA= 1
##$CFDGTYP= 0
##$CFRGTYP= 5
##$CHEMSTR= <none>
##$CNST= (0..31)
1 1 145 1 1 1 1 1 1 1 1 1 1 1 1 1 1 1 1 1 1 1 1 1 1 1 1 1 1 1 1 1 
##$CPDPRG= <>
##$CPDPRG1= <>
##$CPDPRG2= <>
##$CPDPRG3= <>
##$CPDPRG4= <mlev>
##$CPDPRG5= <mlev>
##$CPDPRG6= <mlev>
##$CPDPRG7= <mlev>
##$CPDPRG8= <mlev>
##$CPDPRGB= <>
##$CPDPRGT= <>
##$D= (0..31)
0 0.7 0 0 0 0 0 0 0 0 0 0.03 0 0 0 0 0 0 0 0 0 0 0 0 0 0 0 0 0 0 0 0 
##$DATE= 1756460404
##$DBL= (0..7)
120 120 120 120 120 120 120 120 
##$DBP= (0..7)
150 150 150 150 150 150 150 150 
##$DBP07= 0
##$DBPNAM0= <>
##$DBPNAM1= <>
##$DBPNAM2= <>
##$DBPNAM3= <>
##$DBPNAM4= <>
$$ [...]
##$SUBNAM3= <"">
##$SUBNAM4= <"">
##$SUBNAM5= <"">
##$SUBNAM6= <"">
##$SUBNAM7= <"">
##$SUBNAM8= <"">
##$SUBNAM9= <"">
##$SW= 18.0517328524113
##$SWIBOX= (0..15)
0 0 2 0 0 0 0 0 0 0 0 0 0 0 0 0 
##$SW_h= 3612.71676300578
##$TD= 16384
##$TD0= 1
##$TE= 0
##$TE2= 300
##$TE3= 300
##$TEG= 300
##$TL= (0..7)
0 120 120 120 120 120 120 120 
##$TP= (0..7)
150 150 150 150 150 150 150 150 
##$TP07= 0
##$TPNAME0= <>
##$TPNAME1= <>
##$TPNAME2= <>
##$TPNAME3= <>
##$TPNAME4= <>
##$TPNAME5= <>
##$TPNAME6= <>
##$TPNAME7= <>
##$TPOAL= (0..7)
0.5 0.5 0.5 0.5 0.5 0.5 0.5 0.5 
##$TPOFFS= (0..7)
0 0 0 0 0 0 0 0 
##$TUNHIN= 0
##$TUNHOUT= 0
##$TUNXOUT= 0
##$USERA1= <user>
##$USERA2= <user>
##$USERA3= <user>
##$USERA4= <user>
##$USERA5= <user>
##$V9= 5
##$VALIST= <valist>
##$VCLIST= <CCCCCCCCCCCCCCC>
##$VD= 0
##$VDLIST= <DDDDDDDDDDDDDDD>
##$VPLIST= <PPPPPPPPPPPPPPP>
##$VTLIST= <TTTTTTTTTTTTTTT>
##$WBST= 1024
##$WBSW= 4
##$XGAIN= (0..3)
0 0 0 0 
##$XL= 0
##$YL= 0
##$YMAX_a= 523213
##$YMIN_a= -490889
##$ZGOPTNS= <>
##$ZL1= 120
##$ZL2= 120
##$ZL3= 120
##$ZL4= 120
##$ABSF1= 15.42185
##$ABSF2= -2.629997
##$ABSG= 5
##$ABSL= 3
##$ALPHA= 0
##$AQORDER= 0
##$ASSFAC= 0
##$ASSFACI= 0
##$ASSFACX= 0
##$ASSWID= 0
##$AUNMP= <proc_1d>
##$AZFE= 0.1
##$AZFW= 0.1
##$BCFW= 0
##$BC_mod= 2
##$BYTORDP= 0
##$COROFFS= 0
##$CY= -3
##$DATMOD= 1
##$DC= 0
##$DFILT= <>
##$DTYPP= 0
##$F1P= 0
##$F2P= 0
##$FCOR= 1
##$FTSIZE= 16384
##$FT_mod= 6
##$GAMMA= 0
##$GB= 0
##$INTBC= 1
##$INTSCL= 3.241238e-09
##$ISEN= 128
##$LB= 0.25
##$LEV0= 0
##$LPBIN= 0
##$MAXI= 10000
##$MC2= 0
##$MEAN= 0
##$ME_mod= 0
##$MI= 1.114404
##$NCOEF= 0
##$NC_proc= -6
##$NLEV= 6
##$NOISF1= 3.799351
##$NOISF2= 2.8
##$NSP= 0
##$NTH_PI= 0
##$NZP= 0
##$OFFSET= 15.53314
##$PC= 1
##$PHC0= -1726.419
##$PHC1= 24.19228
##$PH_mod= 1
##$PKNL= yes
##$PPARMOD= 0
##$PSCAL= 0
##$PSIGN= 0
##$REVERSE= no
##$SF= 200.129997710207
##$SI= 16384
##$SIGF1= 3
##$SIGF2= 2
##$SINO= 0.751879
##$SIOLD= 32768
##$SREGLST= <19F.Aceton>
##$SSB= 0
##$STSI= 16384
##$STSR= 0
##$SW_p= 3612.71676300578
##$SYMM= 0
##$S_DEV= 0
##$TDeff= 16384
##$TDoff= 0
##$TI= <>
##$TILT= no
##$TM1= 0
##$TM2= 0
##$TOPLEV= 0
##$USERP1= <user>
##$USERP2= <user>
##$USERP3= <user>
##$USERP4= <user>
##$USERP5= <user>
##$WDW= 1
##$XDIM= 16384
##$YMAX_p= 469335611
##$YMIN_p= -171785
$$ End of Bruker specific parameters
$$ ---------------------------------
##NTUPLES= NMR SPECTRUM
##VAR_NAME=  FREQUENCY,     SPECTRUM/REAL,   SPECTRUM/IMAG
##SYMBOL=    X,             R,               I
##VAR_TYPE=  INDEPENDENT,   DEPENDENT,       DEPENDENT
##VAR_FORM=  AFFN,          ASDF,            ASDF
##VAR_DIM=   16384,         16384,           16384
##UNITS=     HZ,            ARBITRARY UNITS, ARBITRARY UNITS
##FACTOR=    0.220516191357247, 1,           1
##FIRST=     3108.64730915507, 0,            0
##LAST=      -504.069453850708, 0,           0
##MIN=       -504.069453850708, -171785,     0
##MAX=       3108.64730915507, 469335611,    0
$$ Real data points
##PAGE= N=1
##DATA TABLE= (X++(R..R)), XYDATA
$$ [...]
5911C297364j0311o982R6999Q2420Q5809J61115J65666K12940J61525J61420K19357
$$ 3297364 3287053 3280071 3377070 3459490 3545299 3706414 3872080 4085020 4246545 4407965 4627322
5900D627322J56841O7590m5448j35023k58332k73081k75595k14747j93652j66513
$$ 4627322 4784163 4851753 4806305 4671282 4412950 4139869 3864274 3649527 3455875 3289362
5890C289362j38548j19276p6008r7179q3187m9533o7585m1024n6692j9990K5690
$$ 3289362 3150814 3031538 2955530 2858351 2775164 2725631 2658046 2617022 2560330 2540340 2566030
5879B566030J7636M9414M8878R7765N4626M3924O7427N6500O1l5660j12729r4236
$$ 2566030 2583666 2633080 2681958 2779723 2834349 2878273 2945700 3002200 3002261 2966601 2853872 2759636
5867B759636o0761r8331j12421q3499q5536o1542m9976k1255m2450n7530k3773
$$ 2759636 2698875 2600544 2488123 2404624 2319088 2257546 2207570 2186315 2143865 2086335 2062562
5856B062562j6584k0208k4956n705J9378J8054m204K9535K3587j381J2925L2569
$$ 2062562 2045978 2025770 2000814 1995109 2014487 2032541 2028337 2057872 2081459 2080078 2093003 2125572
5844B125572M7631M7699J5936p617j8668l6425k104L3640J8712j383Q31n785J4549
$$ 2125572 2173203 2220902 2236838 2229221 2210553 2174128 2172024 2205664 2224376 2222993 2223824 2218039 2232588
5831B232588K5108Q534J0130K2596K8503K3528j9203J6991K9132O1389M3512K5591
$$ 2232588 2257696 2266230 2276360 2298956 2327459 2350987 2331784 2348775 2377907 2439296 2482808 2508399
5819B508399N1178J9997M0485L6573N8306M5440O2499M5372P8115J4127K6845
$$ 2508399 2559577 2579574 2620059 2656632 2714938 2760378 2822877 2868249 2946364 2960491 2987336
5808B987336R4309M7419O4418O4386O2017M9423N9124Q2375J11371J23327Q1269
$$ 2987336 3081645 3129064 3193482 3257868 3319885 3369308 3428432 3510807 3622178 3745505 3826774
5797C826774J49471J38477J66699J64942J68470K36976K48318K08033K82832L56538
$$ 3826774 3976245 4114722 4281421 4446363 4614833 4851809 5100127 5308160 5590992 5947530
5787E947530L29298L50364L49471L56602L58084L35207L01788K80753J64583J54199
$$ 5947530 6276828 6627192 6976663 7333265 7691349 8026556 8328344 8609097 8773680 8927879
5777H927879J67778J40807J83798K57593J95394K92082L73175M44476M90834M90098
$$ 8927879 9095657 9236464 9420262 9677855 9873249 10165331 10538506 10982982 11473816 11963914
5767A1963914N45023N51936N78454O28907N84108O05612N77632N55775N80604
$$ 11963914 12508937 13060873 13639327 14268234 14852342 15457954 16035586 16591361 17171965
5758A7171965N50237N15409M31683L76564K86454K18846J20357J23181J38295
$$ 17171965 17722202 18237611 18669294 19045858 19332312 19551158 19671515 19794696 19932991
5749A9932991J69618K81290L53223M12720M56667M93465M81801M40700M19982
$$ 19932991 20102609 20383899 20737122 21149842 21606509 22099974 22581775 23022475 23442457
5740B3442457L83313L37344L10742K24499J78145J36104N4000J7073N6865Q8338
$$ 23442457 23825770 24163114 24473856 24698355 24876500 25012604 25066604 25083677 25140542 25228880
5730B5228880J09642J00048M1058L6826M3798O7420O7943J16420J13714J20975
$$ 25228880 25338522 25438570 25479628 25516454 25560252 25627672 25695615 25812035 25925749 26046724
5720B6046724J28249J31430M0148n6231j83118l18172m09465m11988m09397m30961
$$ 26046724 26174973 26306403 26346551 26290320 26107202 25789030 25379565 24967577 24558180 24127219
5710B4127219m37201l71045l52358k54823j79777r8978o7533j03847q4177j62631
$$ 24127219 23690018 23318973 22966615 22711792 22532015 22433037 22365504 22261657 22177480 22014849
5700B2014849j95087k95508l99205m39436n02530n11239n29071n74449o32512
$$ 22014849 21819762 21524254 21125049 20685613 20183083 19671844 19142773 18568324 17935812
5691A7935812o85070p26355p00778o24834n69264n15466l96498l41106l12885
$$ 17935812 17250742 16524387 15823609 15198775 14629511 14114045 13717547 13376441 13063556
5682A3063556k30587j65905j69802j19625j23862j62135j82292l21325m13182
$$ 13063556 12832969 12667064 12497262 12377637 12253775 12091640 11909348 11588023 11174841
5673A1174841m81944n25622n46145n14288m73327m34072m40339l88212l50138
$$ 11174841 10692897 10167275 9621130 9106842 8633515 8199443 7759104 7370892 7020754
5664G020754l56554k91188k52185k53020k79850k26500j87202j68742j47458j51061
$$ 7020754 6664200 6373012 6120827 5867807 5587957 5361457 5174255 5005513 4858055 4706994
5654D706994j22631j11613q0932m1169q6427j28951k345q573k5193k5302M295
$$ 4706994 4584363 4472750 4391818 4350649 4264222 4135271 4132926 4124353 4099160 4073858 4078153
5643D078153j4113R326J3172O0475L0957K6881P5527N5536M1900Q6816N7584L307
$$ 4078153 4064040 4073366 4086538 4147013 4177970 4204851 4280378 4335914 4377814 4464630 4522214 4525521
5631D525521J5226j2508l5117q0414j15261q9007q2602p3156l8311m5000m5623
$$ 4525521 4540747 4528239 4493122 4412708 4297447 4208440 4125838 4052682 4014371 3969371 3923748
5620C923748k2688l486L8087j3628J5615M4288M7017M9951P1255O7860P3843M0487
$$ 3923748 3901060 3897574 3935661 3922033 3937648 3981936 4028953 4078904 4150159 4218019 4291862 4332349
5608D332349M9289L3157o948l0033m4566o7958j02549n1738m6525m7850n5933
$$ 4332349 4381638 4414795 4407847 4377814 4333248 4265290 4162741 4111003 4064478 4016628 3960695
5597C960695l6231j6654j7658k3908j6728K9042J3042O988M5286K4014M2228M2253
$$ 3960695 3924464 3907810 3890152 3866244 3849516 3878558 3891600 3898588 3943874 3967888 4010116 4052369
5585D052369O2840J8958P0074N1713O2235O5312N4491P9994J23430O1400P6928
$$ 4052369 4115209 4134167 4204241 4255954 4318189 4383501 4437992 4517986 4641416 4702816 4779744
5574D779744J09798J01548J46308J45373J62715J69740J69310J95621J90309K45118
$$ 4779744 4889542 4991090 5137398 5282771 5445486 5615226 5784536 5980157 6170466 6415584
5564F415584K93298L16271L29010L70261M16627M40946M47130N73557O61602O76311
$$ 6415584 6708882 7025153 7354163 7724424 8141051 8581997 9029127 9602684 10264286 10940597
5554A0940597O89888P31238P08705O56038N72225L94763K07063O8366j17508k51545
$$ 10940597 11630485 12361723 13070428 13726466 14298691 14693454 14900517 14968883 14851375 14599830
5544A4599830l46973l23908k72135j50976q9200k1159O8456J45137K50927L15439
$$ 14599830 14252857 13928949 13656814 13505838 13416638 13395479 13463935 13609072 13859999 14175438
5534A4175438M01615N06523O27026O96943Q27250Q65690R22122R28329Q99998
$$ 14175438 14577053 15083576 15710602 16407545 17234795 18100485 19022607 19950936 20850934
5525B0850934Q90593P97989O21551N10952L79489L58269L92611N27920P86494
$$ 20850934 21741527 22539516 23161067 23672019 24051508 24409777 24802388 25330308 26116802
5516B6116802R84035J182066J421187J729148J962607K318706K682273L054973
$$ 26116802 27100837 28282903 29704090 31433238 33395845 35714551 38396824 41451797
5508D1451797L459965L755589L976864M201405M362590M378841M220982L646829
$$ 41451797 44911762 48667351 52644215 56845620 61208210 65587051 69808033 73454862
5500G3454862K714298J587735P35216K60045j63508p21895j481798k304103k820300
$$ 73454862 76169160 77756895 78492111 78752156 78588648 77866753 76384955 74080852 71260552
5491G1260552k953229k687661k335506j876319j362408q38089l31606J70782N81041
$$ 71260552 68307323 65619662 63284156 61407837 60045429 59207340 58875734 59046516 59627557
5482E9627557Q76323J048482J158744J229345J132639P75127K85382k81319n47703
$$ 59627557 60503880 61552362 62711106 63940451 65073090 65848217 66133599 65852280 65304577
5473F5304577n50595m60356m11630m04984n86235j041532j735844k638500l321232
$$ 65304577 64753982 64293626 63881996 63477012 62890777 61849245 60113401 57474901 54153669
5464E4153669l638601l597020l374303l074071k786642k489540k206156j977624
$$ 54153669 50515068 46918048 43543745 40469674 37683032 35193492 32987336 31009712
5456C1009712j794537j629442j452249j246630j044325q34686o64858n67703m60982
$$ 31009712 29215175 27585733 26133484 24886854 23842529 23007843 22342985 21775282 21314300
5447B1314300l29650k87571k90737l69644m42346n27845o16898o29158o03078
$$ 21314300 20984650 20697079 20406342 20036698 19594352 19066507 18449609 17820451 17217373
5438A7217373o20573o04306n85035n51198n17538m55261m25148m16938l84216
$$ 17217373 16596800 15992494 15407459 14856261 14338723 13883462 13458314 13041376 12657160
5429A2657160l58122l48680l28156k72235k47332k47655k00343j83321j76609
$$ 12657160 12299038 11950358 11622202 11349967 11102635 10854980 10654637 10471316 10294707
5420A0294707j49910j51808j76834k47466k54428l00574l02130k82678k57233
$$ 10294707 10144797 9992989 9816155 9568689 9314261 9013687 8711557 8428879 8171646
5411H171646k69453k16866j92418j89735j51726j78366j26889j22712j23996p9047
$$ 8171646 7902193 7685327 7492909 7303174 7151448 6973082 6846193 6723481 6599485 6520438
5401F520438j66516j58799j07537j45146j45397j68823j79872j59128j66235j70493
$$ 6520438 6353922 6195123 6087586 5942440 5797043 5628220 5448348 5289220 5122985 4952492
5391D952492j38342j25453j24331p0810j10741j18509r4999n2718o0365p7231
$$ 4952492 4814150 4688697 4564366 4493556 4382815 4264306 4169307 4116589 4056224 3978993
5381C978993n3452m4975p6317n3440m1552r0404p7172m8974J102m4601k4641m7028
$$ 3978993 3925541 3880566 3804249 3750809 3709257 3618853 3541681 3492707 3493809 3449208 3424567 3377539
5369C377539n7852l0602r86n9544m0883k9120L737j8615k9563m7763j8622m6181
$$ 3377539 3319687 3289085 3288099 3228555 3187672 3158552 3162289 3143674 3114111 3066348 3047726 3001545
5357C001545k7415o352j5065k6586j5185j8215k9168K425J328M13j779j7039j8375
$$ 3001545 2974130 2967778 2952713 2926127 2910942 2892727 2863559 2865984 2867312 2867725 2865946 2848907 2830532
5344B830532j1991k227j7231J5465j3898k8214j8096l983l2886j1214J1117j6120
$$ 2830532 2818541 2816314 2799083 2814548 2800650 2772436 2754340 2750357 2717471 2706257 2717374 2701254
5332B701254L060l5003j047P775Q07k2923L2266J3815m001K7935J0563Q85P929
$$ 2701254 2704314 2669311 2668264 2676039 2676846 2653923 2686189 2700004 2696003 2723938 2734501 2735386 2743315
5319B743315R209K1717J4527L4607k1213n0549L5666R779l5807K5068M0462M199
$$ 2743315 2752524 2774241 2788768 2823375 2802162 2751613 2787279 2797058 2761251 2786319 2826781 2830980
5307B830980q952L8628n15q304o526K1958l529K3624J3637k900L5355J8262N6014
$$ 2830980 2822028 2860656 2860141 2851837 2845311 2867269 2863740 2887364 2901001 2898101 2933456 2951718 3007732
5294C007732M8419K7136L5606K4370L4138M189M2874J2592K3307L9036K7304P4274
$$ 3007732 3056151 3083287 3118893 3143263 3177401 3181590 3224464 3237056 3260363 3299399 3326703 3400977
5282C400977Q6741L9268P5913L0755O8073R9251P3816M0297P3333Q2504K9560
$$ 3400977 3487718 3526986 3602899 3633654 3701727 3800978 3874794 3915091 3988424 4070928 4100488
5271D100488j4352M2670Q9182M5492P3165J22232J16321P8578O8963P1225O5101
$$ 4100488 4086136 4128806 4217988 4263480 4336645 4458877 4575198 4653776 4722739 4793964 4859065
5260D859065L8026R5399R8201P3320P8504J07863M4300N4316Q6523R2838J17144
$$ 4859065 4897091 4992490 5090691 5164011 5242515 5350378 5394678 5448994 5535517 5628355 5745499
5249E745499P1502M3504j133L0421Q4592M9510O0520R773O0485O7098O1775Q7597
$$ 5745499 5817001 5860505 5859372 5889793 5974385 6023895 6084415 6094188 6154673 6221771 6283546 6371143
5237F371143L5597J8986O933M0791N1125J3996M1505j5322j2827L4146O808M5296
$$ 6371143 6406740 6425726 6432659 6473450 6524575 6538571 6580076 6564754 6551927 6586073 6592881 6638177
5225F638177N9601L0644P9403P0879M9516L970l2419m3376k506k1487M6522M2110
$$ 6638177 6697778 6728422 6807825 6878704 6928220 6932190 6899771 6856395 6853889 6832402 6878924 6921034
5213F921034r509J1037L4707J9003N6055P6376O6034J3556L6726M5868R3125Q1075
$$ 6921034 6911525 6922562 6957269 6976272 7032327 7108703 7174737 7188293 7225019 7270887 7364012 7445087
5201G445087R0915J23242J37313J48679J27656J22919J30960J40065J03991J49154
$$ 7445087 7536002 7659244 7796557 7945236 8072892 8195811 8326771 8466836 8570827 8719981
5191H719981J33335J38287J34653J22683J25275J63662J48425J79370J47712J33491
$$ 8719981 8853316 8991603 9126256 9248939 9374214 9537876 9686301 9865671 10013383 10146874
5181A0146874J80509J83808J17541J21206R3507R9385R0830J25238R8859M0726
$$ 10146874 10327383 10511191 10628732 10749938 10843445 10942830 11033660 11158898 11257757 11298483
5171A1298483P2448R7659N2105P7287R0327J10093J50251R5436J85125K19610
$$ 11298483 11370931 11468590 11520695 11597982 11688309 11798402 11948653 12044089 12229214 12448824
5161A2448824K06372J83929J96750K47940K69407K25090K04012K24478J93662
$$ 12448824 12655196 12839125 13035875 13283815 13553222 13778312 13982324 14206802 14400464
5152A4400464J87949J52495J91847J84288J48575K05703J91479J32004J74025
$$ 14400464 14588413 14740908 14932755 15117043 15265618 15471321 15662800 15794804 15968829
5143A5968829K05264J65906J55105J55407J81144J68811J84103K03883K46811
$$ 15968829 16174093 16339999 16495104 16650511 16831655 17000466 17184569 17388452 17635263
5134A7635263K72010K93454L01884L20090L33640L27120L55612L73508L56554
$$ 17635263 17907273 18200727 18502611 18822701 19156341 19483461 19839073 20212581 20569135
5125B0569135L65469L54440L70697L46186L36905L49631L26878L25438L21770
$$ 20569135 20934604 21289044 21659741 22005927 22342832 22692463 23019341 23344779 23666549
5116B3666549L49170K95626L05261L23297L20979L28004L44665L44079L78154
$$ 23666549 24015719 24311345 24616606 24939903 25260882 25588886 25933551 26277630 26655784
5107B6655784L75039L46687L04345L96187L84585L37660L51289M08217L55088
$$ 26655784 27030823 27377510 27681855 28078042 28462627 28800287 29151576 29559793 29914881
5098B9914881L76308M08476L84637L65334M09338M08079L89369L76562L75884
$$ 29914881 30291189 30699665 31084302 31449636 31858974 32267053 32656422 33032984 33408868
5089C3408868L91051L81384M10117L76006L50929L47610L58812L03336L15597
$$ 33408868 33799919 34181303 34591420 34967426 35318355 35665965 36024777 36328113 36643710
5080C6643710K93187K70364K56635K40667K00512J81800J58485J57942J10982
$$ 36643710 36936897 37207261 37463896 37704563 37905075 38086875 38245360 38403302 38514284
5071C8514284R4501M0998K1032k910n608n5578j18569l7337r6149j52057j70409
$$ 38514284 38608785 38649783 38670815 38667905 38662297 38606719 38488150 38450813 38354664 38202607 38032198
5060C8032198k18361k06860k84989k35688l01924l50815l17966k68565l67342
$$ 38032198 37813837 37606977 37321988 37086300 36784376 36433561 36115595 35847030 35479688
5051C5479688l95843l85153m10309m06964m05820m41142m42664m39297m49547
$$ 35479688 35083845 34698692 34288383 33881419 33475599 33034457 32591793 32152496 31702949
5042C1702949m45769m53182m47574m30934m41666m66944m65852m77163m33147
$$ 31702949 31257180 30803998 30356424 29925490 29483824 29016880 28551028 28073865 27640718
5033B7640718m76873m57779m69569m48174m23760m18870m41225m36495m27212
$$ 27640718 27163845 26706066 26236497 25788323 25364563 24945693 24504468 24067973 23640761
5024B3640761m27949l80400l92865m02760l88047m03504l76354l91522l70871
$$ 23640761 23212812 22832412 22439547 22036787 21648740 21245236 20868882 20477360 20106489
5015B0106489l30825l30483l74528l33887k91561l39896l27237l11922k82947
$$ 20106489 19775664 19445181 19070653 18736766 18445205 18105309 17778072 17466150 17183203
5006A7183203k90771l12856k95008k25874k74050k57241k41596k84587k01282
$$ 17183203 16892432 16579576 16284568 16058694 15784644 15527403 15285807 15001220 14799938
4997A4799938k75972k43771k15831k15721k39446k27923j86014k31361j98544
$$ 14799938 14523966 14280195 14064364 13848643 13609197 13381274 13195260 12963899 12765355
4988A2765355j86591j56895j83304k26069j63851j90669k20597j16754j31482
$$ 12765355 12578764 12421869 12238565 12012496 11848645 11657976 11437379 11320625 11189143
4979A1189143j65128j51634j44974j20676j63448j01125j43768j48523j14676
$$ 11189143 11024015 10872381 10727407 10606731 10443283 10342158 10198390 10049867 9935191
4970I935191j57580q7781j16266q8231j22324r9036o2426j07939o7906q2357p0585
$$ 9935191 9777611 9689830 9573564 9485333 9363009 9263973 9201547 9093608 9025702 8943345 8872760
4959H872760r3220r0231p6241m0746l6114p2909n1427k7837m0498q708M881M1640
$$ 8872760 8779540 8689309 8613068 8572322 8536208 8463299 8411872 8384035 8343537 8334829 8339710 8381350
4947H381350L8172Q2293J22229R0372R0418N0897O5402K8362j1831o9455r1129
$$ 8381350 8419522 8501815 8624044 8714416 8804834 8855731 8921133 8949495 8937664 8868209 8777080
4936H777080j41322j29425o2735k0598k5842k6133O3110M0492J20915J65186J34986
$$ 8777080 8635758 8506333 8443598 8423000 8397158 8371025 8434135 8474627 8595542 8760728 8895714
4925H895714J84168J96511J97154J47068Q6548N6243O443l508j12370j69797j75148
$$ 8895714 9079882 9276393 9473547 9620615 9707163 9763406 9769849 9766341 9653971 9484174 9309026
4914I309026j49738j32668r4310r0107q1074j0544O0865N4100K2538O2858L7174
$$ 9309026 9159288 9026620 8932310 8842203 8761129 8750585 8811450 8865550 8888088 8950946 8988120
4903H988120O1847M6839M7218L6644l6333q1285j15649p9239p7609p3245k1037
$$ 8988120 9049967 9096806 9144024 9180668 9144335 9063050 8947401 8868162 8790553 8717308 8696271
4892H696271m2495l6415K5913N0848p192O0828J16561J35333J63528K07451K84837
$$ 8696271 8653776 8617361 8643274 8694122 8686930 8747758 8864319 8999652 9163180 9370631 9655468
4881I655468L08299L62309M11413M89116N66782O81386P61045Q24828R31185R54503
$$ 9655468 9963767 10326076 10737489 11226605 11793387 12474773 13235818 14060646 14991831 15946334
4871A5946334R61871Q78736Q41923O64580M21894J39056j38460l55108l77749
$$ 15946334 16908205 17786941 18628864 19293444 19715338 19854394 19715934 19360826 18983077
4862A8983077l11730k37652r2861O782J51178K68477L78608M48001M81073M81715
$$ 18983077 18671347 18433695 18340834 18347616 18498794 18767271 19145879 19593880 20074953 20556668
4852B0556668M39510L32312R4237j65657m99881o89747q00727p88625p77693o57686
$$ 20556668 20996178 21328490 21422727 21257070 20757189 20067442 19266715 18478090 17700397 17042711
4842A7042711o05655n28802m50071l76888l35853l07262j94736q9684k8114K7756
$$ 17042711 16437056 15908254 15458183 15081295 14745442 14438180 14243444 14153760 14125646 14153402
4832A4153402J12002J77939L09383L02430M19759M84282N48749O73598Q28303
$$ 14153402 14265404 14443343 14752726 15055156 15474915 15959197 16507946 17181544 18009847
4823A8009847R44272J135676J291834J513365J547926J648178J657096J529917
$$ 18009847 18954119 20089795 21381629 22894994 24442920 26091098 27748194 29278111
4815B9278111J351933J036252N47990j5312n00313q32652q92667p71819n88454
$$ 29278111 30630044 31666296 32214286 32198974 31698661 30866009 29973342 29201523 28613069
4806B8613069m23188k45707m3058J95096L74662M53637M54077M66611L33439J49083
$$ 28613069 28189881 27944174 27901116 28096212 28470874 28924511 29378588 29845199 30178638 30327721
4796C0327721j86557o95967j137999j543426j727244j659710j597277j515147
$$ 30327721 30141164 29445197 28307198 26763772 25036528 23376818 21779541 20264394
4788B0264394j365351j258871j175245j048112r71552q93063q26272p81675p25943
$$ 20264394 18899043 17640172 16464927 15416815 14445263 13552200 12725928 11944253 11218310
4779A1218310o47605n45208m56222m07562m03466l79869l11154k44521k36653
$$ 11218310 10570705 10025497 9569275 9161713 8758247 8378378 8067224 7822703 7586050
4770G586050k38424k06492j91309j50700j62642j14975j09212q5566n3951o3676
$$ 7586050 7347626 7141134 6949825 6799125 6636483 6521508 6412296 6326730 6272779 6209103
4760F209103K400m218J7843K6111P9421J00634J19610J45470J26245J38164J34492
$$ 6209103 6211503 6207285 6225128 6251239 6330660 6431294 6550904 6696374 6822619 6960783 7095275
4749G095275P0716k2473o0997l5046n801J5958L5317L6341P1531J05908J15447
$$ 7095275 7165991 7143518 7082521 7047475 7041674 7057632 7092949 7129290 7200821 7306729 7422176
4738G422176N2041r616o3856p2007l9180j4252P7307R0422P0189R8389J03873
$$ 7422176 7474217 7464601 7400745 7328738 7289558 7275306 7352613 7443035 7513224 7611613 7715486
4727G715486P6784K0022J843Q123K9055J31075J57940K43362K62334K67992L15754
$$ 7715486 7792270 7812292 7814135 7822258 7851313 7982388 8140328 8383690 8646024 8914016 9229770
4716I229770K46246K36602K54643L27346L44324M54254N54370O29819O85672Q12832
$$ 9229770 9476016 9712618 9967261 10294607 10638931 11093185 11647555 12277374 12963046 13775878
4706A3775878R56139J083070J237382J350172J426721J497553J473073J409205
$$ 13775878 14732017 15815087 17052469 18402641 19829362 21326915 22799988 24209193
4698B4209193J147991Q01303L89755k39199p54621j106996j259856j276679j211128
$$ 24209193 25357184 26158487 26548242 26309043 25554422 24447426 23187570 21910891 20699763
4689B0699763j166940j020072q77223q39484p42891o38125o23926m97285m03100
$$ 20699763 19532823 18512751 17635528 16796044 16053153 15415028 14791102 14293817 13890717
4680A3890717l10157j52463p1543M929J16707K16218K84500L66649M75863N82061
$$ 13890717 13580560 13428097 13356554 13361483 13478190 13694408 13978908 14345557 14821420 15403481
4670A5403481P45721R12427J033094J183953J285269J364180J384867J384471
$$ 15403481 16149202 17061629 18094723 19278676 20563945 21928125 23312992 24697463
4662B4697463J300293J138449Q22843K79572j77868o38775r08446r53907r48246
$$ 24697463 25997756 27136205 27959048 28238620 28060752 27421977 26513531 25559624 24611378
4653B4611378q45821p12259n40450l63134j87112j04489n1473k7286M7367l2361
$$ 24611378 23765557 23053298 22512848 22149714 21962602 21858113 21806640 21779354 21826721 21794360
4643B1794360j70814l32593o34044q84600j048035j113421j011012r17444q75110
$$ 21794360 21623546 21290953 20656909 19772309 18724274 17610853 16599841 15682397 14807287
4634A4807287p82935o96897o26793n38312n19325m69610m03820k82384k38105
$$ 14807287 14024352 13327455 12700662 12162350 11643025 11173415 10769595 10487211 10249106
4625A0249106k51084j53132q9426M3221K0132P5416J67729K03833K84833L11314
$$ 10249106 9998022 9844890 9755464 9798685 9818817 9894233 10061962 10265795 10550628 10861942
4615A0861942L64475M64140N10687N65617O38619O01381N88138N29252M45974
$$ 10861942 11226417 11690557 12201244 12766861 13405480 14006861 14594999 15124251 15570225
4606A5570225K61366q8320l70539o65623q05956q73473q50509p51674p11108o37223
$$ 15570225 15831591 15743271 15372732 14707109 13901153 13027680 12177171 11425497 10714389 10077166
4596A0077166n89176n75856n31032m59199n04274m27627m01523l65238l43304
$$ 10077166 9487990 8912134 8381102 7921903 7417629 6990002 6588479 6223241 5879937
4587E879937l07460k51533k67832k34440k46702j80286j69436j43253j81442j48707
$$ 5879937 5572477 5320944 5053112 4818672 4571970 4391684 4222248 4078995 3897553 3748846
4577C748846j32532j25166r8750j02478o4148n9535j01929q6625o7669k5032n7915
$$ 3748846 3616314 3491148 3392398 3289920 3225772 3166237 3064308 2977683 2910014 2884982 2827067
4566B827067p0020k921j3404j8197k7029l7841k9406J5515R61Q736M926k9408
$$ 2827067 2757047 2754126 2740722 2722525 2695496 2657655 2628249 2643764 2644725 2653461 2658387 2628979
4554B628979L2522k8707j6005o933k2440O224j8377n2853m1308j3720n6535m2571
$$ 2628979 2661501 2632794 2616789 2609856 2587416 2593640 2575263 2522410 2481102 2467382 2410847 2368276
4542B368276l6820j2114m1474m0894l7056k3910m5661n2201K0992n539l3430J3125
$$ 2368276 2331456 2319342 2277868 2236974 2199918 2176008 2130347 2078146 2099138 2093599 2060169 2073294
4530B073294K7321J7365L7066J2413L2054M4004K2936M0909L7706Q2774J1506
$$ 2073294 2100615 2117980 2155046 2167459 2199513 2243517 2266453 2307362 2345068 2427842 2439348
4519B439348j0605l4688K0355o334n1577o2930r005k6047p1011p4176l3695j747
$$ 2439348 2428743 2394055 2414410 2408076 2356499 2293569 2284564 2258517 2187506 2113330 2079635 2077888
4507B077888n4460m0014l6942o6323l9114l7814j0172n4278k7533M6260m2980
$$ 2077888 2023428 1983414 1946472 1880149 1841035 1803221 1793049 1738771 1711238 1757498 1714518
4496A714518j7140K0837q63j3034j3424J2804M6070j5821K2472L3209L7693N4703
$$ 1714518 1697378 1718215 1717352 1704318 1690894 1703698 1749768 1733947 1756419 1789628 1827321 1882024
4484A882024J8264K3390M9680J3097R040j6128L163n619j7307q880o4657k7059
$$ 1882024 1900288 1923678 1973358 1986455 1995495 1979367 1982530 1976911 1959604 1950724 1886067 1859008
4472A859008k5836m4497m9895m0522K4442j3903l8694k7232m4219j8566L2135
$$ 1859008 1833172 1788675 1738780 1698258 1722700 1708797 1670103 1642871 1598652 1580086 1612221
4461A612221O638R420M9200J8903J1059j0060L6554L8930J3539j5666k1844q883
$$ 1612221 1618859 1628279 1677479 1696382 1707441 1697381 1733935 1772865 1786404 1770738 1748894 1740011
4449A740011n1641o9733k7522o7408l2614k1181p2166k582m5730n4003m4224k0683
$$ 1740011 1688370 1618637 1591115 1523707 1491093 1469912 1397746 1395164 1349434 1295431 1251207 1230524
4437A230524j1387j6258l0866l552k501p585K240l0957l0198J6290K0960J9553
$$ 1230524 1219137 1202879 1172013 1168461 1165960 1158375 1160615 1129658 1099460 1115750 1136710 1156263
4425A156263K6890L3918o854p031K8410N0183L4849l107O9446O9245l902K3052
$$ 1156263 1183153 1217071 1210217 1203186 1231596 1281779 1316628 1313521 1382967 1452212 1448310 1471362
4413A471362L2109M7167j2743k8251k4130J5094m5685n2473J85p9506J0801m7057
$$ 1471362 1503471 1550638 1537895 1509644 1485514 1500608 1454923 1402450 1402635 1323129 1333930 1286873
4401A286873m8963j8606j0553l2117l9702m4950l8789K5267k5732K7451k9756
$$ 1286873 1237910 1219304 1208751 1176634 1136932 1091982 1053193 1078460 1052728 1080179 1050423
4390A050423r790M083k5382J1048k5550l7792k750j7849M374R146k8768j3521
$$ 1050423 1040633 1044716 1019334 1030382 1004832 967040 964290 946441 950815 959961 931193 917672
4378I17672K5231K447j9542n13J5506j9l7570K9435j3017J0618j2199Q284K5395
$$ 917672 942903 945350 925808 925295 940801 940782 903212 932647 919630 930248 918049 926333 951728
4365I51728K9146K6013j0075K645j7204K9651K3182K061L829K8724m793j4136
$$ 951728 980874 1006887 996812 999457 982253 1011904 1035086 1037147 1040976 1069700 1064907 1050771
4353A050771L8246N4964l96O844J5170R772j3079K321L6433O015n375K4189N0989
$$ 1050771 1089017 1143981 1143585 1150429 1165599 1175371 1162292 1164613 1201046 1207061 1201686 1225875 1276864
4340A276864N174L7875L38m459k3065l8019J3229P677J0341K4640l223K3407J6067
$$ 1276864 1282038 1319913 1320251 1315792 1292727 1254708 1267937 1275614 1285955 1310595 1307372 1330779 1346846
4327A346846J5990J7144K926n117K8907L0514J8283K3355J9735J2087N404K3200
$$ 1346846 1362836 1379980 1382906 1377789 1406696 1437210 1455493 1478848 1498583 1510670 1516074 1539274
4315A539274R7951L1494J9284K2731N6769M2245N9475O3223J3831N2369M1219
$$ 1539274 1637225 1668719 1688003 1710734 1767503 1809748 1869223 1932446 1946277 1998646 2039865
4304B039865N8909O5277Q2636Q3792J9813M9879R2690O8491N7789J10169J22564
$$ 2039865 2098774 2164051 2246687 2330479 2350292 2400171 2492861 2561352 2619141 2729310 2851874
4293B851874R9024Q0481R1790J28926J25184J20700J22118J66579J91622J85947
$$ 2851874 2950898 3031379 3123169 3252095 3377279 3497979 3620097 3786676 3978298 4164245
4283D164245J94895K08348K19506K63841K57445K87280L18351L23728L38091L93369
$$ 4164245 4359140 4567488 4786994 5050835 5308280 5595560 5913911 6237639 6575730 6969099
4273F969099M07868L83106M41794M83210M88478N09636N45241O30877O71032O88112
$$ 6969099 7376967 7760073 8201867 8685077 9173555 9683191 10228432 10859309 11530341 12218453
4263A2218453P54205Q20278Q11431Q42154P90183P95702P99505P79867P84710
$$ 12218453 12972658 13792936 14604367 15446521 16236704 17032406 17831911 18611778 19396488
4254A9396488Q20948Q83370R26501R96789J011891J076704J125247J091188J087400
$$ 19396488 20217436 21100806 22027307 23024096 24035987 25112691 26237938 27329126 28416526
4245B8416526J002417R15778Q04247P00916O23300N59424N39197N51834N99228
$$ 28416526 29418943 30334721 31138968 31839884 32463184 33022608 33561805 34113639 34712867
4236C4712867P20718P17721P04015P22155O47058M96242M04503K11161j4692j95362
$$ 34712867 35433585 36151306 36855321 37577476 38224534 38720776 39125279 39336440 39321748 39126386
4226C9126386k81092l44802l95081l72252l72307l29972k18699k45634k91379
$$ 39126386 38845294 38500492 38105411 37733159 37360852 37030880 36812181 36566547 36275168
4217C6275168l07940m20249n29654o65632q00217r33885r83030r74091j009889
$$ 36275168 35967228 35546979 35017325 34351693 33551476 32617591 31634561 30660470 29650581
4208B9650581j002673r69020r40989q70900q12014p69550p61557q13800q08702
$$ 29650581 28647908 27678888 26737899 25866999 25054985 24285435 23523878 22710078 21901376
4199B1901376p77871q25052q81240q63947q80778q86605q61028p94644p59450
$$ 21901376 21123505 20298453 19417213 18553266 17672488 16785883 15924855 15130211 14370761
4190A4370761p33982o59631o27013n73887n53246n39990n24561m08628m19602
$$ 14370761 13636779 12977148 12350135 11776248 11223002 10683012 10158451 9749823 9330221
4181I330221m86706m53140m55268m39453l86605l78820l10271l08499k99643k82512
$$ 9330221 8843515 8390375 7935107 7495654 7109049 6730229 6419958 6111459 5811816 5529304
4171E529304k45699k03006k24011k30476j93251j63873k03515j82199j34434j66791
$$ 5529304 5283605 5080599 4856588 4626112 4432861 4268988 4065473 3883274 3748840 3582049
4161C582049j06101j47332j47911j15030q8722q2580r0291p1284q6951j01716
$$ 3582049 3475948 3328616 3180705 3065675 2976953 2894373 2804082 2732798 2645847 2544131
4151B544131n9519q7122p6483l6458m4936k2282o2059r3400o2937l5651l3634
$$ 2544131 2484612 2397490 2321007 2284549 2239613 2217331 2155272 2061872 1998935 1963284 1929650
4140A929650l7573l2662j6315m7675k8710k8857m5243K954m6851m1547l9502l7665
$$ 1929650 1892077 1859415 1843100 1795425 1766715 1737858 1692615 1695569 1648718 1607171 1567669 1530004
4128A530004q786L945l657o7241j9258r688o0140m0209K9793j0987j3802r435
$$ 1530004 1521218 1525163 1521506 1454265 1435007 1425319 1365179 1324970 1354763 1343776 1329974 1320539
4116A320539m4113k1052k4975m2908n044j7141m1258Q069k503k8273l4835j4891
$$ 1320539 1276426 1255374 1230399 1187491 1182447 1165306 1124048 1132117 1129614 1101341 1066506 1051615
4104A051615J4322j2320m0005q301j4643l0172j9845M980J0353j8358m2885J4393
$$ 1051615 1065937 1053617 1013612 1005311 990668 960496 940651 945631 955984 937626 894741 909134
4092I09134k0883K3334l4788J2078r504m8955j5622j9174n154L472J1624m2520
$$ 909134 888251 911585 876797 888875 879371 830416 814794 795620 790466 793938 805562 763042
4080G63042p875l0732J5523q21j0687k2915k0770K4071K0676l0587l6604K9461
$$ 763042 755167 724435 739958 739137 728450 705535 684765 708836 729512 698925 662321 691782
4068F91782Q972j9812j3980o403o208L844J0527o346j6722q95j9156m9064J1450
$$ 691782 700754 680942 666962 660559 654351 658195 668722 662376 645654 644759 625603 576539 587989
4055E87989L2842l0132l0914k259n651k148J5084L1865k4441k507l3248k8316
$$ 587989 620831 590699 559785 557526 551875 549727 564811 596676 572235 569728 536480 508164
4043E08164L6467P527j7667K4140l7204j6522L250L1802j2978j3005O379n535
$$ 508164 544631 552158 534491 558631 521427 504905 508155 539957 526979 513974 520353 514818
4031E14818j4998M205j1790J0829J7350k554k7333n912j380L5210J6623J2656
$$ 514818 499820 504025 492235 503064 520414 517860 490527 484615 483235 518445 535068 547724
4019E47724r136j8058o181K4117l0263o640k782M356k4766j7036K6421j849j5133
$$ 547724 538588 520530 514349 538466 508203 501563 498781 503137 478371 461335 487756 485907 470774
4006D70774J2256M2634j9140n18l8697J22J3623j488r580j6854o722J1780K0849
$$ 470774 483030 525664 506524 506006 467309 467431 481054 479566 469986 453132 446410 458190 479039
3993D79039L4693n707l6348l6176L0490M0547K6552k622O033j0783L83m7248M264
$$ 479039 513732 508025 471677 435501 465991 506538 533090 530468 536501 525718 526101 478853 483117
3980D83117J6713J781J141M706J3899j799p736p209k2675N43L6504K8115j0016
$$ 483117 499830 501611 502752 507458 521357 519558 511822 504613 481938 482481 518985 547100 537084
3967E37084m133j6426j245L03J3151K7151k4045j7850N7158K1105p619K6590L5580
$$ 537084 532951 516525 515280 515583 528734 555885 531840 513990 571148 592253 584634 611224 646804
3954F46804K3388r724K393K6096j3571j3582K9801o475J7680L0029J81N646k3332
$$ 646804 670192 660468 662861 688957 675386 661804 691605 685130 702810 732839 733020 738666 715334
3941G15334j4940K7585J0191P126M3559J0076k4755N133R393n321K4105R318j69
$$ 715334 700394 727979 738170 745296 788855 798931 774176 779309 788702 783381 807486 816804 816635
3928H16635j464O338R390J1554j5697r486J5571L2740K5394l937L2030P944P285
$$ 816635 815171 821509 830899 842453 826756 817270 832841 865581 890975 887038 919068 927012 934297
3915I34297L7088j7635L6356M0779K6145l199M046J7021j2131L8279R9j935o522
$$ 934297 971385 953750 990106 1030885 1057030 1053831 1057877 1074898 1062767 1101046 1101145 1099210 1092688
3902A092688L7344J2148p365L536k7720K7301K2142P791k0864k1749k4692l3837
$$ 1092688 1130032 1142180 1134815 1138351 1110631 1137932 1160074 1167865 1147001 1125252 1100560 1066723
3890A066723k7878K344N831N843j189l4067j5324K6423m2491m0888K5996l3903
$$ 1066723 1038845 1041189 1047020 1052863 1051674 1017607 1002283 1028706 986215 945327 971323 937420
3878I37420j2742j2880R49p586J2913K7054M1916l0077k2575M629k0493k1435
$$ 937420 924678 911798 912747 905161 918074 945128 987044 956967 934392 939021 918528 897093
3866H97093K4067j6699n241J8372N346J1550J4593j8228j2309k6854k7760K7264
$$ 897093 921160 904461 899220 917592 922938 934488 949081 930853 918544 891690 863930 891194
3854H91194K1734K5688K054L1977j4522j1687K6766k2537J664j1747J0918L7251
$$ 891194 912928 938616 940670 972647 958125 946438 973204 950667 952331 940584 951502 988753
3842I88753j3539j9440L477L7890R878j9490M3058M2069m747J5141L4576l711
$$ 988753 975214 955774 959251 997141 1007019 987529 1030587 1072656 1067909 1083050 1117626 1113915
3830A113915k0739J0087K1904r427j2851L9244k117k948Q699j97J507n571m600
$$ 1113915 1093176 1103263 1125167 1115740 1102889 1142133 1140016 1137068 1145767 1145570 1147077 1141506 1136906
3817A136906j406m0850J1064L9135J5498K8091j837J8764L1872j5083K0316N5406
$$ 1136906 1135500 1094650 1105714 1144849 1160347 1188438 1186601 1205365 1237237 1222154 1242470 1297876
3805A297876j7939O577L5043L5263m489O1112M78j0573M2938J6737K9412K6083
$$ 1297876 1279937 1286514 1321557 1356820 1352331 1413443 1413921 1403348 1446286 1463023 1492435 1518518
3793A518518K0076L398K7627M5620M9044K1434M2262M7337K5528j1951K9483P1371
$$ 1518518 1538594 1541992 1569619 1615239 1664283 1685717 1727979 1775316 1800844 1788893 1818376 1889747
3781A889747M5554J5314K4737M8759K2764P0515K0797L3952P3118K2212N3238
$$ 1889747 1935301 1950615 1975352 2024111 2046875 2117390 2138187 2172139 2245257 2267469 2320707
3770B320707L9496K4384O3626N8080J2956K8709L2390N3806N5738N8293P9562
$$ 2320707 2360203 2384587 2448213 2506293 2519249 2547958 2580348 2634154 2689892 2748185 2827747
3759B827747M1702M0016Q3683O9061O8771M9388L6949L7267O0437Q9629M3802
$$ 2827747 2869449 2909465 2993148 3062209 3130980 3180368 3217317 3254584 3315021 3404650 3448452
3748C448452N0728N9288K1752N0310O4391O5292O7569K4307O1149P9663N4376
$$ 3448452 3499180 3558468 3580220 3630530 3694921 3760213 3827782 3852089 3913238 3992901 4047277
3737D047277M1922N4831P8121M4380N5584L2358N6795M1202M9721N4635M1289
$$ 4047277 4089199 4144030 4222151 4266531 4322115 4354473 4411268 4452470 4502191 4556826 4598115
3726D598115J6129M9216M4887K5377J02568Q6585L9760L5178O5835R0780O4090
$$ 4598115 4614244 4663460 4708347 4733724 4836292 4922877 4962637 4997815 5063650 5154430 5218520
3715E218520N2774N9664J911M6753R7645N5701N1474O9740N1925K9769M2860M2801
$$ 5218520 5271294 5330958 5332869 5379622 5477267 5532968 5584442 5654182 5706107 5735876 5778736 5821537
3703E821537K8304R9724O7963Q9215J01840O4513J12825J39266J15139J30737
$$ 5821537 5849841 5949565 6017528 6106743 6208583 6273096 6385921 6525187 6640326 6771063
3693F771063J45319J58357K11146J89234K36876K27054K12328K58731L09850K96644
$$ 6771063 6916382 7074739 7285885 7475119 7711995 7939049 8151377 8410108 8719958 9016602
3683I016602K83975K81059K86716K33576K11450K85040K66582J98710K46462K19528
$$ 9016602 9300577 9581636 9868352 10101928 10313378 10598418 10865000 11063710 11310172 11529700
3673A1529700K04034K04020J86895J68671J68954J45133J29677J35857J30054
$$ 11529700 11733734 11937754 12124649 12293320 12462274 12607407 12737084 12872941 13002995
3664A3002995J25978J56201J78898J16651J40872J91818J85743K06727K48746
$$ 13002995 13128973 13285174 13464072 13580723 13721595 13913413 14099156 14305883 14554629
3655A4554629K12946L35413M22569M17781M88995N43991O40661P30917P82392
$$ 14554629 14767575 15102988 15525557 15943338 16432333 16976324 17616985 18347902 19130294
3646A9130294R09539R91585J135038J297543J382900J530693J715187J916201
$$ 19130294 20039833 21031418 22166456 23463999 24846899 26377592 28092779 30008980
3638C0008980K131388K260542K472045K707435K855651L002234L111756L227713
$$ 30008980 32140368 34400910 36872955 39580390 42436041 45438275 48550031 51777744
3630E1777744L257413L202636L200237L136511L024704K943031K813468K575143
$$ 51777744 55035157 58237793 61438030 64574541 67599245 70542276 73355744 75930887
3622G5930887K301190K031759J720783J374552J093689P66916M13987J39607p5358
$$ 75930887 78232077 80263836 81984619 83359171 84452860 85219776 85633763 85773370 85698012
3613H5698012l09265n24997o62510q43626r65443j173070j376849j539980j820317
$$ 85698012 85388747 84863750 84201240 83357614 82392171 81219101 79842252 78302272 76481955
3604G6481955k020464k182714k320195k347312k410256k411500k314422k173706
$$ 76481955 74461491 72278777 69958582 67611270 65201014 62789514 60475092 58301386
3596E8301386k014901j886000j721571j590089j451159j384938j347035j257124
$$ 58301386 56286485 54400485 52678914 51088825 49637666 48252728 46905693 45648569
3588D5648569j211980j196394j115312j047500r12473q25381p30666p20812n94557
$$ 45648569 44436589 43240195 42124883 41077383 40164910 39339529 38608863 37888051 37293494
3579C7293494n77927n51840n46553n98114o24534p13145p21977p83888q17732
$$ 37293494 36715567 36163727 35617174 35019060 34394526 33681381 32959404 32175516 31357784
3570C1357784q43694q53510p88514p27353p24652o35852n53988n33630m75488
$$ 31357784 30514090 29660580 28872066 28144713 27420061 26784209 26230221 25696591 25221103
3561B5221103m31680m54579l50962l00890k89076k50963k68236k32967k07252
$$ 25221103 24789423 24334844 23983882 23682992 23393916 23142953 22874717 22641750 22434498
3552B2434498k15123j90149j80900j55428k07310j62564j12596j71691j49930
$$ 22434498 22219375 22029226 21848326 21692898 21485588 21323024 21210428 21038737 20888807
3543B0888807j47406j45615j42476j18832j04096r5503q7496m2143k9315k5931
$$ 20888807 20741401 20595786 20453310 20334478 20230382 20134879 20047383 20005240 19975925 19949994
3533A9949994J6839O5575Q7508R3342J25920J81603K04538K62488K35496K60562
$$ 19949994 19966833 20032408 20119916 20213258 20339178 20520781 20725319 20987807 21223303 21483865
3523B1483865L03755K80290L58600L65816L82706L87514M52749N07902N38808
$$ 21483865 21787620 22067910 22426510 22792326 23175032 23562546 24015295 24523197 25062005
3514B5062005N59834N93684O61304P82533P92487Q45450Q55165R57043J012352
$$ 25062005 25621839 26215523 26876827 27659360 28451847 29297297 30152462 31109505 32121857
3505C2121857J127635J185210J237286J316613J334232J378546J436880J496023
$$ 32121857 33249492 34434702 35671988 36988601 38322833 39701379 41138259 42634282
3497D2634282J530522J553475J572852J618182J638152J752894J816725J952374
$$ 42634282 44164804 45718279 47291131 48909313 50547465 52300359 54117084 56069458
3489E6069458K123717K351667K587169K896161L226833L556118M001945M426896
$$ 56069458 58193175 60544842 63132011 66028172 69255005 72811123 76813068 81239964
3481H1239964M956747N538898O030439O628314P323442P899338Q466276Q932783
$$ 81239964 86196711 91735609 97766048 104394362 111717804 119617142 128083418 137016201
3473A37016201R288747R448883R418065R156291Q637731P969654P245948O400450
$$ 137016201 146304948 155753831 165171896 174328187 182965918 190935572 198181520 204581970
3465B04581970N593442M969262M475611M123389L976831M005558M001171M057343
$$ 204581970 210175412 215144674 219620285 223743674 227720505 231726063 235727234 239784577
3457B39784577L933157L614994L146893K414620J517206N63342m34280j350624
$$ 239784577 243717734 247332728 250479621 252894241 254411447 254974789 254540509 253189885
3449B53189885k155152k707243l023177l130214l030869k764099k457083k060847
$$ 253189885 251034733 248327490 245304313 242174099 239143230 236379131 233922048 231861201
3441B31861201j678520j369866r96289p11452n16357k59283j49389j1650Q1585
$$ 231861201 230182681 228812815 227816526 227105074 226588717 226329434 226180045 226168395 226249980
3432B26249980Q8607n1998k98529o34493j090739j638359k260694k928308l565460
$$ 226249980 226338587 226286589 225988060 225353567 224262828 222624469 220363775 217435467 213870007
3423B13870007m052807m556893m834183n019022n077356n012270m842422m582427
$$ 213870007 209817200 205260307 200426124 195407102 190329746 185317476 180475054 175892627
3415A75892627m300429m096625l845899l653022l515694l427005l374798l340163
$$ 175892627 171592198 167495573 163649674 159996652 156480958 153053953 149679155 146338992
3407A46338992l372705l314636l277460l222759l127616l040262k912593k701412
$$ 146338992 142966287 139651651 136374191 133151432 130023816 126983554 124070961 121369549
3399A21369549k475261k151248j658599j052736m71422l6796M31269N89247M70117
$$ 121369549 118894288 116743040 115084441 114031705 113560283 113523487 113954756 114544003 115014120
3390A15014120O69275O66257m56799k129939m130184n732018n637526m970519
$$ 115014120 115683395 116349652 115892853 113762914 109632730 103900712 98263186 93292667
3382I3292667m450231l980802l555978l075701k587379k187870j827283j517455
$$ 93292667 88842436 84861634 81305656 78229955 75642576 73454706 71627423 70109968
3374G0109968j256400r05153l93061M0555N72854J188887J817917K311004K723238
$$ 70109968 68853568 67948415 67555354 67595909 68168763 69357650 71175567 73486571 76209809
3365G6209809L081029L137170K992838L183286K818565J356726l93923k624499
$$ 76209809 79290838 82428008 85420846 88604132 91422697 92779423 92385500 89761001
3357H9761001m127850l961676l574583l277672l094344k913182k675664k532582
$$ 89761001 85633151 81671475 78096892 74819220 71724876 68811694 66136030 63603448
3349F3603448k397735k323265k251100k197331k025047j788339j552842j412061
$$ 63603448 61205713 58882448 56631348 54434017 52408970 50620631 49067789 47655728
3341D7655728j273702j151555j059464r39865q34922p23641o15536o07021m92314
$$ 47655728 46382026 45230471 44171007 43231142 42396220 41672579 41057043 40450022 39957708
3332C9957708m68589m30883l46204k66185j63099l7953Q3992K53500L65843N46025
$$ 39957708 39489119 39058236 38712032 38445847 38282748 38244795 38328787 38582287 38948130 39494155
3322C9494155P36050R39497J183204J332004J623744J932135K230997K468050
$$ 39494155 40230205 41169702 42352906 43684910 45308654 47240789 49471786 51939836
3314E1939836K817731L121796L366618L596259L790535L939405L965298L946806
$$ 51939836 54757567 57879363 61245981 64842240 68632775 72572180 76537478 80484284
3306H0484284L821212L664266L431324L175668K839182K520232K179536J790772
$$ 80484284 84305496 87969762 91401086 94576754 97415936 99936168 102115704 103906476
3298A03906476J482189J161262Q25799N04759J81776j78373n20482r01166j345698
$$ 103906476 105388665 106549927 107375726 107880485 108062261 107883888 107363406 106462240 105116542
3289A05116542j783537k168646k464252k751760k965713l081992l092334l157621
$$ 105116542 103333005 101164359 98700107 95948347 92982634 89900642 86808308 83650687
3281H3650687l123851l143871l101434l061135l067033l016354k980103k963245
$$ 83650687 80526836 77382965 74281531 71220396 68153363 65137009 62156906 59193661
3273E9193661k927290k857930k763246k689023k580601k419341k321093k158222
$$ 59193661 56266371 53408441 50645195 47956172 45375571 42956230 40635137 38476915
3265C8476915k039962j921022j740936j605725j509819j367183j269106j146882
$$ 38476915 36436953 34515931 32774995 31169270 29659451 28292268 27023162 25876280
3257B5876280j066483r52185q21922p59364p59836o85879n85822n11546m62296
$$ 25876280 24809797 23857612 23035690 22276326 21516490 20830611 20244789 19733243 19270947
3248A9270947m11893l44815l01546k55057k45510j73785j26390j33509j23316
$$ 19270947 18859054 18514239 18212693 17957636 17712126 17538341 17411951 17278442 17155126
3239A7155126q8794j36820p8741q3319j50782j73485k44369k08920k02209k71458
$$ 17155126 17066332 16929512 16850771 16767452 16616670 16443185 16198816 15989896 15787687 15516229
3229A5516229k71879k85299l18180l75284k52863k40660k89934k73154k80176
$$ 15516229 15244350 14959051 14640871 14265587 14012724 13772064 13482130 13208976 12928800
3220A2928800k54999k58716k81152l04569k79313k68126k49049k27822k41276
$$ 12928800 12673801 12415085 12133933 11829364 11550051 11281925 11032876 10805054 10563778
3211A0563778k68526j74088j72091j60852j80401j56149j63181j15193j25139
$$ 10563778 10295252 10121164 9949073 9788221 9607820 9451671 9288490 9173297 9048158
3202I048158q8314q5018j13279q3147j35817q0097m3797k7007k0375n0450n2582
$$ 9048158 8959844 8874826 8761547 8678400 8542583 8462486 8418689 8391682 8371307 8320857 8268275
3191H268275L6748Q627k1104p794M5235M7774K8685M4171M2947P0393L5939l3839
$$ 8268275 8305023 8313650 8292546 8284752 8329987 8377761 8406446 8450617 8493564 8563957 8599896 8566057
3179H566057k9969N345J3243N859k9340j1120l851j6414J2335j325l0997r640
$$ 8566057 8536088 8541433 8554676 8560535 8531195 8520075 8516224 8499810 8512145 8510820 8479823 8470183
3167H470183r569K4171K1890J4911k9386k0470k1742K7862N441j502J9608n804
$$ 8470183 8460614 8484785 8506675 8521586 8492200 8471730 8449988 8477850 8483291 8481789 8501397 8495593
3155H495593L5218O6331N2774P6259J24279P7463J11164J37535J08701J79885
$$ 8495593 8530811 8597142 8649916 8726175 8850454 8927917 9039081 9176616 9285317 9465202
3145I465202J55846J44544J58673J09037J37547J10972R9141J10046J33261J16336
$$ 9465202 9621048 9765592 9924265 10033302 10170849 10281821 10380962 10491008 10624269 10740605
3135A0740605J42142J43700J01623J33525J69806J60734J45811J80640J73171
$$ 10740605 10882747 11026447 11128070 11261595 11431401 11592135 11737946 11918586 12091757
3126A2091757J82443K06782K39836J64615K45439K73680K68579K77602L05219
$$ 12091757 12274200 12480982 12720818 12885433 13130872 13404552 13673131 13950733 14255952
3117A4255952L55420L36409L64877L72046M08358M16066M51805M66988M42712
$$ 14255952 14611372 14947781 15312658 15684704 16093062 16509128 16960933 17427921 17870633
3108A7870633M91082N22753N53691N69611N68005O65373O46475P08756P31631
$$ 17870633 18361715 18884468 19438159 20007770 20575775 21241148 21887623 22596379 23328010
3099B3328010P19240Q13998Q72406Q65966R52351J011005J089450J218563J330259
$$ 23328010 24047250 24861248 25733654 26599620 27551971 28562976 29652426 30870989 32201248
3090C2201248J438228J581109J731679J917983K077250K297173K460610K729790
$$ 32201248 33639476 35220585 36952264 38870247 40947497 43244670 45705280 48435070
3082D8435070L013968L325851L694413M133409M592302N090656N649163O160530
$$ 48435070 51449038 54774889 58469302 62602711 67195013 72285669 77934832 84095362
3074H4095362O912868P748570Q667818R673338J0817554J2002669J3237147J4528715
$$ 84095362 91008230 98756800 107424618 117097956 127915510 139918179 153155326 167684041
3066A67684041J5939407J7676392J9547676K1690947K4030739K6073496K7516761
$$ 167684041 183623448 201299840 220847516 242538463 266569202 292642698 320159459
3059C20159459K8098052K7721993K6473453K4390021K0967020J5008802O516811
$$ 320159459 348257511 375979504 402452957 426842978 447809998 462818800 469335611
3052D69335611l235363j2025885j7714384k0048731k0617165k1043674k1989064
$$ 469335611 466100248 454074363 436359979 416311248 395694083 374650409 352661345
3045C52661345k3135780k3741535k3323601k1999403k0576362j9240560j7764720
$$ 352661345 329525565 305784030 282460429 260461026 239884664 220644104 202879384
3038B02879384j6095232j4445361j2937197j1693833j0638919r742533q856049
$$ 202879384 186784152 172338791 159401594 147707761 137068842 127326309 118470260
3031A18470260p948611p152381o429744n762185n185446m725687m356838l992245
$$ 118470260 110521649 103369268 96939524 91177339 85991893 81266206 76909368 72917123
3023G2917123l707833l499243l260177l066787k864812k673546k475612k306525
$$ 72917123 69209290 65710047 62449870 59383083 56518271 53844725 51369113 49062588
3015D9062588k215361k076066j956663j851398j738917j586048j496650j423730
$$ 49062588 46847227 44771161 42814498 40963100 39224183 37638135 36141485 34717755
3007C4717755j319709j221512j186052j126381j074819r75164r37736q89720q31070
$$ 34717755 33398046 32176534 30990482 29864101 28789282 27814118 26876382 25986662 25155592
2998B5155592p76434p24628p04784o83226o07152o15454n48961n37529n28399
$$ 25155592 24379158 23654530 22949746 22266520 21659368 21043914 20494953 19957424 19429025
2989A9429025m54840n10333m45127m42648m09852m08525l76304m02304l50135
$$ 19429025 18974185 18463852 18018725 17576077 17166225 16757700 16381396 15979092 15628957
2980A5628957l51185l38408l31702l25399k92669k87097l03994k69846k81821
$$ 15628957 15277772 14939364 14607662 14282263 13989594 13702497 13398503 13128657 12846836
2971A2846836k66746k34076k78514k08092k24261k43936j48693j57219j95905
$$ 12846836 12580090 12346014 12067500 11859408 11635147 11391211 11242518 11085299 10889394
2962A0889394j31211j35283j20683j17923o8314p5842j58912j22709j15500j27328
$$ 10889394 10758183 10622900 10502217 10384294 10315980 10240138 10081226 9958517 9843017 9715689
2952I715689q0442j54208j23922j84291j62720j48005j59472j20942j32398j68257
$$ 9715689 9635247 9481039 9357117 9172826 9010106 8862101 8702629 8581687 8449289 8281032
2942H281032j50117j60513j03024p2705j65180r0015j01976j38693j50071j46784
$$ 8281032 8130915 7970402 7867378 7794673 7629493 7539478 7437502 7298809 7148738 7001954
2932G001954j30790p6098j04926j33077j17435j41037j22358j05566m7395o2092
$$ 7001954 6871164 6795066 6690140 6557063 6439628 6298591 6176233 6070667 6023272 5961180
2922E961180j09913p1960j02558j00956o0176k3859p2813m4093n4058j6452l9844
$$ 5961180 5851267 5779307 5676749 5575793 5515617 5491758 5418945 5374852 5320794 5304342 5264498
2911E264498p0352p9465m8418n5887q8397n4338p0742n7262l7295m2033n9614
$$ 5264498 5194146 5114681 5066263 5010376 4921979 4867641 4796899 4739637 4702342 4660309 4600695
2900D600695n1302o1757m8943n7559p6598q7574o1936p1337p8621r2835q9204
$$ 4600695 4549393 4487636 4438693 4381134 4304536 4216962 4155026 4083689 4005068 3912233 3823029
2889C823029q9708p5085m3007p3370l6371n2801n9690m5747k757J1513k6287Q089
$$ 3823029 3733321 3658236 3615229 3541859 3505488 3452687 3392997 3347250 3344493 3356006 3329719 3337808
2877C337808j811j9859L6991K9807k9388k7531Q019Q234j9710l4644j8732k5849
$$ 3337808 3335997 3316138 3353129 3382936 3353548 3326017 3334036 3342270 3322560 3287916 3269184 3243335
2865C243335m8495n8339o3931k7939p0413m0112m0457n3461n7987k53o7594p1853
$$ 3243335 3194840 3136501 3072570 3044631 2974218 2934106 2893649 2840188 2782201 2781948 2714354 2642501
2853B642501l8750m9019j4559K050j840l0279k8539n758l7417m1695j5431K014
$$ 2642501 2603751 2554732 2540173 2542223 2540383 2510104 2481565 2475807 2438390 2396695 2381264 2383278
2841B383278j5456l8266K0857j5945n2852q803l6286N791k2620j2367k2232r283
$$ 2383278 2367822 2329556 2350413 2334468 2281616 2272813 2236527 2242318 2219698 2207331 2185099 2175816
2829B175816j0597l3084k302M543K3880J2313o182m1793Q368k4795L555r710l0916
$$ 2175816 2165219 2132135 2129833 2134376 2158256 2170569 2164387 2122594 2130962 2106167 2109722 2100012 2069096
2816B069096l6957L378M201k8808J2240k658l7935m960j2063k2103O130l18m3057
$$ 2069096 2032139 2035517 2039718 2010910 2023150 2020492 1982557 1977597 1965534 1943431 1949561 1949243 1906186
2803A906186k1196J2342K2602m5506R47Q309J7062k2900K4131J4792N578r09j4924
$$ 1906186 1884990 1897332 1919934 1874428 1875375 1883684 1900746 1877846 1901977 1916769 1922347 1921438 1906514
2790A906514N9648O5791J5561J4308L9087K5938L9896M2749J02594J36534J00763
$$ 1906514 1966162 2031953 2047514 2061822 2100909 2126847 2166743 2209492 2312086 2448620 2549383
2779B549383P9526J10369J90157J42849J05336J32766J06630P9262J12057N3843
$$ 2549383 2628909 2739278 2929435 3072284 3177620 3310386 3417016 3496278 3608335 3662178
2769C662178M554l2300q2983l0126q2835j53404j08826q2240j36894j07763j40811
$$ 3662178 3666732 3634432 3551449 3521323 3438488 3285084 3176258 3094018 2957124 2849361 2708550
2758B708550j32123j06765n9382j15965o8620o1769q0188o6015n6319o8971n0904
$$ 2708550 2576427 2469662 2410280 2294315 2225695 2163926 2083738 2017723 1961404 1892433 1841529
2747A841529n3315j3939o3526l4916l3698n6299N93l2582j0276M344p8508q5633
$$ 1841529 1788214 1774275 1710749 1675833 1642135 1585836 1586429 1553847 1543571 1547915 1469407 1383774
2735A383774K7498m8807n3637k7206r140k4857l0848M308j7812l1252k3014k0367
$$ 1383774 1411272 1362465 1308828 1281622 1272482 1247625 1216777 1221085 1203273 1172021 1149007 1128640
2723A128640k3331j6060j7337M458m4625Q021J384k5541q617J8781J7209K860
$$ 1128640 1105309 1089249 1071912 1076370 1031745 1039766 1041150 1015609 1006992 1025773 1042982 1045842
2711A045842j3764j6531J2542k7656m641j0713r193j1567n455k9735j5589J141
$$ 1045842 1032078 1015547 1028089 1000433 995792 985079 975886 964319 958864 929129 913540 914681
2699I14681n7181j6661L0645J9198N622Q017l177j2738j1120r324j2245j1136
$$ 914681 857500 840839 871484 890682 896304 904321 901144 888406 877286 867962 855717 844581
2687H44581O634j1660m0205l3701L9833J5496k2494o1997m152k3503j9286n337
$$ 844581 851215 839555 799350 765649 805482 820978 798484 736487 732335 708832 689546 684209
2675F84209P78m185j5955K1899k400j4041j0398M743M679j083J8766n640P587
$$ 684209 684987 680802 664847 686746 684346 670305 659907 664650 669329 668246 687012 681372 688959
2662F88959m8037l2524J7947q974L6469J1002P121R993J2865J3666J675J5212
$$ 688959 640922 608398 626345 617371 653840 664842 671963 681956 694821 708487 710162 725374
2650G25374J2313K2954l523l6303L1843l0774j9820k5731K5516m521n3669l866
$$ 725374 737687 760641 757118 720815 752658 721884 702064 676333 701849 697328 643659 639793
2638F39793J36O299j7669j016m5738j9650m997j1324J974L829j0199j7538l4854
$$ 639793 639929 646228 628559 627543 581805 562155 557158 545834 547808 551637 541438 523900 489046
2625D89046m123N988m5629q958J4533l3378J6183J883m1594r746Q278M2322J1688
$$ 489046 484923 490911 445282 436324 450857 417479 433662 435545 393951 384205 392483 434805 446493
2612D46493m9779J8260L8286K5554K1938l4548j0672J7698L6387K428K7306M319
$$ 446493 396714 414974 453260 478814 500752 466204 455532 473230 509617 512045 539351 543670
2600E43670P492l429L0825M314L949k866l6614J3504p556k0201j3771N024N980
$$ 543670 551162 547733 578558 582872 586821 583955 547341 560845 553289 533088 519317 524341 530321
2587E30321J4908k1390m0946J5988J2166l8518m1272p308J0083q471J3019l817
$$ 530321 545229 523839 482893 498881 511047 472529 431257 423949 434032 425561 438580 434763
2575D34763J0087k5189M3737N269k7237l2432L649J7221l2413K1783j4817Q792
$$ 434763 444850 419661 463398 468667 441430 408998 412647 429868 397455 419238 404421 413213
2563D13213K122K5083K9900K4537l585n2411m255J1096l019J1910J1149k6040
$$ 413213 415335 440418 470318 494855 491270 438859 434604 445700 442681 454591 465740 439700
2551D39700P445L2889k3133k2552K9399r493M888k5969l2151k6876M2928L2636
$$ 439700 447145 480034 456901 434349 463748 454255 459143 433174 401023 374147 417075 449711
2539D49711k086L188j4249m475m421j7346n645J3518L11J0504o30O006l0496O852
$$ 449711 447625 450813 436564 432089 427668 410322 404677 418195 418506 429010 428380 434386 403890 410742
2525D10742O827j1353k3518k3711j9567O853M3371L4728j1034k0186k0417L364
$$ 410742 417569 406216 382698 358987 339420 346273 389644 424372 413338 393152 372735 376099
2513C76099j08Q590l3520R531L7618R915J1588l1986m600N65k5610m371l235L402
$$ 376099 375991 384581 351061 360592 398210 408125 419713 387727 383127 383692 358082 353711 350476 353878
2499C53878j6987j130N551M4435n5750k5041R266n429K9300J3594o2955l1162
$$ 353878 336891 335761 341312 385747 329997 304956 314222 308793 338093 351687 288732 257570
2487B57570K0248P252K4628K2455M4992j1840j6686n198J8936L0418j9767m0120
$$ 257570 277818 285070 309698 332153 377145 365305 348619 343421 362357 392775 373008 332888
2475C32888J1576J977K3570j7703k928j9441K554J0700j4156j2772L2444n516
$$ 332888 344464 346441 370011 352308 349380 329939 332493 343193 329037 316265 348709 343193
2463C43193k1963K9585J0440l2830j2215M9753P600j973J7923m2402l5910j693
$$ 343193 321230 350815 361255 328425 316210 365963 373563 371590 389513 347111 311201 309508
2451C09508K2601k710J2526r664k4545J267J938N300j2145l100P660J7483k6590
$$ 309508 332109 329399 341925 332261 307716 308983 310921 316221 304076 300976 308636 326119 299529
2438B99529j3563j1412j996M1532l88l3987J938K0001L310k3535K9344N843k4337
$$ 299529 285966 274554 272558 314090 313702 279715 281653 301654 304964 281429 310773 316616 292279
2425B92279J241k5806J5776L547P917Q961k798m274K753l5270j5600L2533O992
$$ 292279 293520 267714 283490 287037 294954 303915 301117 296843 299596 264326 248726 281259 288251
2412B88251r758k125K0474j5213j7970J4484j7359j4103P394k2307R010J210m5333
$$ 288251 278493 276368 296842 281629 263659 278143 260784 246681 254075 231768 240778 241988 196655
2399A96655n883P718J1683R003k971P925k648n319k5637O807K7055j8877O876
$$ 196655 190772 198490 210173 219176 216205 224130 221482 216163 190526 197333 224388 205511 212387
2386B12387j4749j9385k5407j5168J4238L7247J3226j3906K7106n240l155q043
$$ 212387 197638 178253 152846 137678 151916 189163 202389 188483 215589 210349 207194 199151
2374A99151o11m757M3887r634K3781O967j0572k196N787j0394k2932J8J0627j9707
$$ 199151 198540 193783 237670 228036 251817 258784 248212 246016 251803 241409 218477 218495 229122 209415
2360B09415P669J5002k5850p179j496j3782N8231J2342j6365q41n0378j8544j169
$$ 209415 217084 232086 206236 199057 197561 183779 242010 254352 237987 237146 186768 168224 167055
2347A67055M5339M852o24k3453J1853M4891L896k2368m474m376j0302N894N854
$$ 167055 212394 217246 216622 193169 205022 249913 253809 231441 226967 222591 212289 218183 224037
2334B24037L5136j9127l929L763k0068J5870O3377K4939l8523o624J117K2622
$$ 224037 259173 240046 236117 239880 219812 235682 299059 323998 285475 278851 279968 302590
2322C02590J2862O991j1574J0948k0343Q540L298m371N849K5552R228J4690J2829
$$ 302590 315452 322443 310869 321817 301474 310014 313312 308941 314790 340342 349570 364260 377089
2309C77089M1200L0108J2345N3652K2374M8513M5819L7901L6504L0398N6960P5295
$$ 377089 418289 448397 460742 514394 536768 585281 631100 669001 705505 735903 792863 868158
2297H68158N0193N9679J23118J27877J37099J79697J30661J46113J57895J74978
$$ 868158 918351 978030 1101148 1229025 1366124 1545821 1676482 1822595 1980490 2155468
2287B155468J30170L9880m5862j97331k30261j26506j34935j63084q4974r4844
$$ 2155468 2285638 2325518 2279656 2082325 1852064 1725558 1590623 1427539 1342565 1247721
2277A247721j16714p8954l9309o2936r9505m7043k8251l9640r964p1657l9881
$$ 1247721 1131007 1052053 1012744 949808 850303 803260 775009 735369 725405 653748 613867
2266F13867l5804k7253r012k4416j4983k6583k9384j7491l6605k4042N760j4554
$$ 613867 578063 550810 541798 517382 502399 475816 446432 428941 392336 368294 374054 359500
2254C59500J5425J1165n0321J5231q11K995j8632n930M3161o4945k3813k0400
$$ 359500 374925 386090 335769 351000 350189 353184 334552 328622 371783 306838 283025 262625
2242B62625J7050J3045L782m682j3894j9662l8062J2695K1096p284n328R127q538
$$ 262625 279675 292720 296502 291820 277926 258264 220202 232897 253993 246709 241381 250508 241970
2229B41970j8500j2508J5866J6278m4500J2599L5107J7821j1024o465j2744j0481
$$ 241970 223470 210962 226828 243106 198606 211205 246312 264133 253109 246644 233900 223419
2217B23419Q221j0276j0879k8139j1879K0483J8582n765q5J2017l930k045L264
$$ 223419 231640 221364 210485 182346 170467 190950 209532 203767 203682 215699 211769 209724 212988
2204B12988J257j8315k9493J7724r445k3828K8550K1704L114l390j5919J3300
$$ 212988 214245 195930 166437 184161 174716 150888 179438 201142 204256 200866 184947 198247
2192A98247q914k1435j7124L8014j106k7611J815m954p525j8974L0169L258r359
$$ 198247 189333 167898 150774 188788 187682 160071 161886 156932 149407 130433 160602 163860 154501
2179A54501K0289K2432K085k3374o605j7466K5737j4390j0903R2j953K0083q710
$$ 154501 174790 197222 199307 175933 169328 151862 177599 163209 152306 152398 150445 170528 161818
2166A61818j9201K3125J8685j6314L8476M132m5871l5752J0910N5J1956J6408
$$ 161818 142617 165742 184427 168113 206589 210721 164850 129098 140008 140063 152019 168427
2154A68427R034l9204J2652M121k8323o006P2349j1410l2064K7195l936M2925
$$ 168427 177461 138257 150909 155030 126707 120701 193050 181640 149576 176771 172835 215760
2142B15760k1840j7046J2416j9081m2429m261J3792J2959J5024q054j6570k2776
$$ 215760 193920 176874 189290 170209 127780 123519 137311 150270 165294 157240 140670 117894
2130A17894j765M0507l1J1832k484Q407j718j9146J6160r087q684j6100J992J196
$$ 117894 116129 156636 156605 168437 165953 174360 172642 153496 169656 160569 151885 135785 137777 138973
2116A38973K6353J9503q147k3782J067J3697j4476O391q51o692L353n5109K4090
$$ 138973 165326 184829 176682 152900 153967 167664 153188 159579 158728 152036 155389 100280 124370
2103A24370K6806k8393K6914K4607k156k239j4855O294n396r818o390n164r252
$$ 124370 151176 122783 149697 174304 172148 169909 155054 161348 155952 146134 139744 134580 125328
2090A25328r139o993J1432R686j4829J7128J2410J5289l1108m0885J4938N1228
$$ 125328 116189 109196 120628 130314 115485 132613 145023 160312 129204 88319 103257 154485
2078A54485k1046j007J6122l9548K7612K0811j4966M202j7397q188N978o643j8976
$$ 154485 133439 132432 148554 109006 136618 157429 142463 146665 129268 121080 127058 120415 101439
2065A01439K7935n074r486o351P29m809J8542M723Q43O701J7134p736j7233j0560
$$ 101439 129374 124300 114814 108463 109192 104383 122925 127648 128491 135192 152326 144590 127357 116797
2051A16797K2892j6658j2914R190M4477l5079j9495k2321L249L6523M973K837
$$ 116797 139689 123031 110117 119307 163784 128705 109210 86889 90138 126661 131634 134471
2039A34471j9896K8996k4180J4046M2755m4987p123M448k2570R866o69n721R942
$$ 134471 114575 143571 119391 133437 176192 131205 124082 128530 105960 115826 115157 109436 119378
2026A19378j5562j0924J5240k2112K5136j0477l110o396J4981J4293R434R733
$$ 119378 103816 92892 108132 86020 111156 100679 97569 91173 106154 120447 129881 139614
2014A39614J822k4801j2118j1605R773q998K352j8946J8931K1080k0510J1406
$$ 139614 141436 116635 104517 92912 102685 93687 96039 77093 96024 117104 96594 108000
2002A08000J027J663j021r119j0449N103l6253L0015O3339k120n280l4912P706
$$ 108000 109027 110690 109669 100550 90101 95204 58951 88966 152305 150185 144905 109993 117699
1989A17699R330J2061k6849j845k5244J7635J3362k0826O8O124m977n3028K0637
$$ 117699 127029 139090 112241 110396 85152 102787 116149 95323 95391 101515 96538 43510 64147
1976F4147K4499P833K6881k5797l4326M7523M547k9164O418k7929k13n415j6679
$$ 64147 88646 96479 123360 97563 63237 110760 115307 86143 92561 64632 64419 59004 42325
1963D2325L0714j752P028L1375j6663J6765K470J9945j2715m5802L8678J6373
$$ 42325 73039 71287 78315 109690 93027 109792 112262 132207 119492 73690 112368 128741
1951A28741k4617J7289j2011O32k3920j5565N3015l6790o508J5155L6023r538
$$ 128741 104124 121413 109402 110034 86114 70549 123564 86774 80266 95421 131444 121906
1939A21906n516k6350r786J9209M789j7951l627K9593J4283j3235j7746p745L6631
$$ 121906 116390 90040 80254 99463 104252 86301 82674 112267 126550 113315 95569 87824 124455
1926A24455p780J5080j6074j6632l3297K8135N6519m9973m1681J9042M5366j1223
$$ 124455 116675 131755 115681 99049 65752 93887 150406 100433 58752 77794 123160 111937
1914A11937j237J1866O02k2333k6956j5155K2321P764K879J4914K994m5308p539
$$ 111937 110700 122566 123168 100835 73879 58724 81045 88809 91688 106602 109596 64288 56749
1901E6749J2809M809J827J6128L6857k1900k9317j9003j3955K2438K6002P657
$$ 56749 69558 74367 76194 92322 129179 107279 77962 58959 45004 67442 93444 101101
1889A01101j0096O70l0480J3177J9669j5171L5633j672k7208m253K2975k5512
$$ 101101 91005 91675 61195 74372 94041 78870 114503 112831 85623 81370 104345 78833
1877G8833L3905j8618R971l1977k65R442o548L3269l4266O109R212j2887m692
$$ 78833 112738 94120 104091 72114 71849 81291 74743 108012 73746 79855 89067 76180 71488
1864G1488L5019m5872J201N224K0849j0582K2545J0783k2709P14q632K7076J1975
$$ 71488 106507 60635 61836 67060 87909 77327 99872 110655 87946 88660 80028 107104 119079
1851A19079j1209p331r680J4939J1656k2296k0134O765M774M3497k4230J5281
$$ 119079 107870 100539 90859 105798 117454 95158 75024 81789 86563 130060 105830 121111
1839A21111J2175k6208j2424k0935K131O511L6849j5213k4071k4362Q1J5815J684
$$ 121111 133286 107078 94654 73719 75850 82361 119210 103997 79926 55564 55645 71460 73144
1826G3144J8964j0920j9100J813L324M3810R36l3623l466j0355j0509k3483P939
$$ 73144 92108 81188 62088 63901 67225 111035 111971 78348 74882 64527 54018 30535 38474
1813C8474K8119L2124J3682r725J823q51l7641j3237K6751l90J4830o992L2751
$$ 38474 66593 98717 112399 102674 104497 103646 66005 52768 79519 79129 93959 86967 119718
1800A19718k7977l1751j45J9863k8646J6259K2709l1899L084J9498j4659k2267
$$ 119718 91741 59990 59845 79708 51062 67321 90030 58131 61215 80713 66054 43787
1788D3787K9289M0644j2203k3518p337l573R184Q152j8225M761J0541J1484J8375
$$ 43787 73076 113720 101517 77999 70662 67089 76273 84425 66200 70961 81502 92986 111361
1775A11361k2585K660j7203k2747r47k0219L0627L0377j1564J8718k2346L0870
$$ 111361 88776 91436 74233 51486 50539 30320 60947 91324 79760 98478 76132 107002
1763A07002n048l154r972l9660K3847M599j138R066l387J3945j0426j4724o47
$$ 107002 101954 98800 88828 49168 73015 77614 76476 85542 82155 96100 85674 70950 70303
1750G0303P278K2945r642j5361k2183K1014L2812k8715m39j8230J171j7100J5574
$$ 70303 77581 100526 90884 75523 53340 74354 107166 78451 78012 59782 60953 43853 59427
1737E9427J0625j6249K0622K82J0609K5440k7029k9606L7447J1989m4159J0133
$$ 59427 70052 53803 74425 74707 85316 110756 83727 54121 91568 103557 59398 69531
1725F9531P08P032J0115j170K345n418l109j0146N810j9136K3416k907k3574o449
$$ 69531 70239 77271 87386 86216 88561 83143 80034 69888 75698 56562 79978 77071 53497 47048
1711D7048L4475l801q102M679J0072j0463j1070O366N648M770k7620K871K9492
$$ 47048 81523 77722 69620 74299 84371 73908 62838 69204 74852 79622 52002 54873 84365
1698H4365p033J1088M482J0874j241k5638m9676k744L3127K6536J610K141N650
$$ 84365 77332 88420 92902 103776 102535 76897 27221 24477 57604 84140 85750 87891 93541
1685I3541k3613J1375j3448k5439J6557L174l849l235L2082k1116k6170K811Q305
$$ 93541 69928 81303 67855 42416 58973 62147 58298 55063 87145 66029 39859 42670 50975
1672E0975J3425M379L3015j8295j5409l0216J9423m26K3230K402K0953k5421P562
$$ 50975 64400 68779 101794 83499 68090 37874 57297 56871 80101 82503 103456 78035 85597
1659H5597l493J5883j9814j3269j3630j8594N1k2203L4145J048J0464J812l047
$$ 85597 82104 97987 78173 64904 51274 32680 32731 10528 44673 45721 56185 57997 54950
1646E4950l3579K4715r34J3041M6261n29p876k8289m2488j8615K1517J9986q8
$$ 54950 21371 46086 45152 58193 104454 103925 96049 67760 25272 6657 28174 48160 48072
1633D8072J1233K1809p297j9183j1715o485L5023k2304j0874K5243J4283j4725
$$ 48072 59305 81114 73817 54634 42919 36434 71457 49153 38279 63522 77805 63080
1621F3080l4992M255Q385K2585O458m227j9397M6526k6468m0463M5783P31K955
$$ 63080 28088 32343 40728 63313 69771 65544 46147 92673 66205 25742 71525 72256 75211
1608G5211Q405k1083j6038m876k378L1665k317J327j2353J783o838O503k1478
$$ 75211 83616 62533 46495 41619 39241 70906 68589 69916 57563 59346 52508 59011 37533
1595C7533K6133J9554O734l146k7060O4j453l710J2261M450Q088N068j0872k8857
$$ 37533 63666 83220 89954 86808 59748 59812 58359 54649 66910 71360 79448 84516 73644 44787
1581D4787J5282J8651j6454Pq343k6309K2175J7387J5224L9605l1710k1035j7209
$$ 44787 60069 78720 62266 62273 53930 27621 49796 67183 82407 122012 90302 69267 52058
1568E2058K1946k0507j5447L417q905m120o526K5240p949P652J7986N352M553
$$ 52058 74004 53497 38050 41467 32562 28442 21916 47156 39207 46859 64845 70197 74750
1555G4750J4991k5340K2862O264j4613p90L2127R257k4139j3676p547K553l0103
$$ 74750 89741 64401 87263 93527 78914 78124 110251 119508 95369 81693 74146 76699 46596
1542D6596J025j2240O798o865R427L3447K7057r498k8104o109P440Q644J3780
$$ 46596 47621 35381 42179 35314 44741 78188 105245 95747 67643 61534 68974 77618 91398
1529I1398m8269j8367J2297q742l51n559k489L4579K9902M0j4498p806k0014J7505
$$ 91398 43129 24762 37059 28317 27966 22407 19918 54497 84399 84439 69941 62135 42121 59626
1515E9626Q310J3687J6559k8993L565J2513m096k3965j8815j6187l3500L0052
$$ 59626 67936 81623 98182 69189 72754 85267 81171 57206 38391 22204 -11296 18756
1503A8756J1251K7596k489j2623J5935k8165J2266J4144L586o614j866q325J9722
$$ 18756 30007 57603 55114 42491 58426 30261 42527 56671 60257 53643 51777 43452 63174
1490F3174j7634L54p548q943L25j6749P383r942l3310n7q004J8077K8422j1031
$$ 63174 45540 45894 38346 29403 29728 12979 20362 10420 -22890 -22947 -30951 -12874 15548 4517
1476D517K8755M8742J2442m7036j0073L436K5043k1305l9208M275M0380J0559
$$ 4517 33272 82014 94456 47420 37347 40783 65826 44521 5313 9588 49968 60527
1464F0527j386J1420l9839j0732N2240J1007K367q674j7865l455n01o566K7475
$$ 60527 59141 70561 30722 19990 72230 83237 85604 76930 59065 55610 55109 48543 76018
1451G6018J5585j7552j1934L309K8466j7413o910M468k1823k3379J1198K5146
$$ 76018 91603 74051 62117 65426 93892 76479 69569 74037 52214 28835 40033 65179
1439F5179m1499m609K5783m923o733j6502J0111l666M6337q256o5113o540K285
$$ 65179 23680 19071 44854 39931 33198 16696 26807 23141 69478 61222 -3891 -10431 -8146
1426h146N3323o089j8834L4838j1666J0958O271p181j2158J1186r275j403M439
$$ -8146 45177 39088 20254 55092 43426 54384 60655 53474 41316 52502 43227 41824 46263
1413D6263l1705N907J4672R021L9634J9567k2164k3171k5978K4544L0168j9436
$$ 46263 14558 20465 35137 44158 83792 103359 81195 58024 32046 56590 86758 67322
1401F7322l3086L6759J2338l8378k595J7981k1555j8633j381J1460n000n242P096
$$ 67322 34236 70995 83333 44955 42360 60341 38786 20153 18772 30232 25232 19990 27086
1388B7086K7656J6595n115R556r471J1833J8749L618k8318j4327J2742J549m3822
$$ 27086 54742 71337 66222 75778 66307 78140 96889 100507 72189 57862 70604 72153 28331
1375B8331k512M53M8248j7363K868k598J1838k866p124Q978r898l4416L087k2678
$$ 28331 25819 26272 74520 57157 60025 57427 69265 66399 59275 68253 58355 23939 27026 4348
1361D348M0981K4847n036K7299r695j7278n2474j010J2306J3327K615k7132N810
$$ 4348 45329 70176 65140 92439 82744 65466 12992 11982 24288 37615 40230 13098 18908
1348A8908J0780K7788j8365r947p943M6137J1461p003L6598k4337j2460m2123
$$ 18908 29688 57476 39111 29164 21221 67358 78819 71816 108414 84077 71617 29494
1336B9494K8065l6703K0032J4079k747l046m7932n632j3532J2672O4462j0137
$$ 29494 57559 20856 40888 54967 52220 49174 1242 -4390 -17922 -5250 59212 49075
1324D9075j0830L2894N440l2141l9888K2280K2544J5830p941l3205R86P766K9292
$$ 49075 38245 71139 76579 44438 4550 26830 49374 65204 57263 24058 25044 32810 62102
1311F2102l4167j7703k03L1658N452j1287k4843J1201J4781j4551R035j114J542
$$ 62102 27935 10232 10029 41687 47139 35852 11009 22210 36991 22440 31475 30361 31903
1298C1903L2748J1126k0591j7444K696K225r452R173p051j6180j4924K4869N862
$$ 31903 64651 75777 55186 37742 40438 42663 33211 42384 35333 19153 4229 29098 34960
1285C4960l219O884j9229J4939P499j1831k7204m679k102J4009P751N573k6636
$$ 34960 31741 38625 19396 34335 41834 30003 2799 -1880 -3982 10027 17778 23351 -3285
1272c285Q120J8932P702j4129J1271J0694j0657L783J494L719J2504m409L10L502
$$ -3285 4835 23767 31469 17340 28611 39305 28648 32431 33925 37644 50148 45739 46049 49551
1258D9551j9674K482J0605o135J2458O087j2506L5771k9465k1906J9087l091K6711
$$ 49551 29877 32359 42964 36829 49287 55374 42868 78639 49174 27268 46355 43264 69975
1245F9975m748j3806n110k2104j1994Q824p04L5380J1228k975R381j8635J3030
$$ 69975 65227 51421 46311 24207 12213 21037 20333 55713 66941 63966 73347 54712 67742
1232F7742l4280r527J1025L1110k1247k2910O262n682o827R578M403q715j7287
$$ 67742 33462 23935 34960 66070 44823 21913 28175 22493 15666 25244 29647 20932 3645
1219C645K1725M541j6223m0192K8271J4381M474R756O273k576r958k427j578K5429
$$ 3645 25370 29911 13688 -26504 1767 16148 20622 30378 36651 34075 24117 21690 20112 45541
1205D5541q105j8188K5951l6536j1762Q544L3716l376k0391P116j0351M6821L946
$$ 45541 37436 19248 45199 8663 -3099 5445 39161 35785 15394 22510 12159 58980 62926
1192F2926j3235k6743Q196O649j9697J5448K2196m841j3129j9794m8K7698P301
$$ 62926 49691 22948 31144 37793 18096 33544 55740 50899 37770 17976 17928 45626 52927
1179E2927K2270p1626k8163L2702K9438j0967j9440j8040L2445J2699l6822R868
$$ 52927 75197 3571 -24592 8110 37548 26581 7141 -10899 21546 34245 -2577 7291
1167G291P588J0938j2078P471p172Q441J5697N862m7411j7732K2792Q931K3314
$$ 7291 14879 25817 13739 21210 14038 22479 38176 44038 -3373 -21105 1687 10618 33932
1154C3932J4246J1230l0957n4546M5577l026j3323k3506j3551L2791K1097K4085
$$ 33932 48178 59408 28451 -26095 19482 16456 3133 -20373 -33924 -1133 19964 44049
1142D4049k7Q263q536j863m876k0356J8554j611k0740O362k384K2971K8681k6514
$$ 44049 44022 52285 43749 41886 37010 16654 35208 33597 12857 19219 16835 39806 68487 41973
1128D1973N195N002j8671P039j2332k2432K1620l540K4535k6183J5217N93l0607
$$ 41973 47168 52170 33499 40538 28206 5774 27394 23854 48389 22206 37423 38016 7409
1115G409K0322p314l811r008m1138N364M8431K1132N601j7876j1845n781m476
$$ 7409 27731 20417 16606 7598 -33540 -28176 20255 41387 46988 29112 17267 11486 7010
1102G010K5530J1157Q790m028k0742P344p971n411m387M1993P951n9387L0905
$$ 7010 32540 43697 52487 48459 27717 35061 27090 21679 17292 59285 67236 7849 38754
1089C8754p933l1477k8626p186K3771K5541J0158j4690j0311K4564J0389k2013
$$ 38754 30821 -656 -29282 -36468 -12697 12844 23002 8312 -1999 22565 32954 10941
1077A0941j331R669K7823k9779n146n225r973J4683K2060j0059m902j8643j625
$$ 10941 9610 19279 47102 17323 12177 6952 -3021 11662 33722 23663 18761 118 -1507
1064a507j678J090K03j2746o688K8890K6706N90j2535j0068o01L654J3464O476
$$ -1507 -3185 -2095 -1892 -14638 -21326 7564 34270 34860 22325 12257 11656 15310 28774 35250
1050C5250k0874L2191m242k1310p751L211l3479J5560j8131r793L3331k91O956
$$ 35250 14376 46567 42325 21015 13264 16475 -17004 -1444 -19575 -29368 3963 3672 10628
1037A0628J0421m962m3994K4413K4446O0317l5054m1405j8985K1659q866L1660
$$ 10628 21049 16087 -27907 -3494 20952 81269 46215 4810 -14175 7484 -1382 30278
1025C0278Q387l424L0141j3894n2443j6694L1148n61K2125k151n058K0719k4482
$$ 30278 38665 35241 65382 51488 -955 -17649 13499 12938 35063 32912 27854 48573 24091
1012B4091m3450K3593L3939m5925K4013r266n632Q047K692k7275J2629J6022k0038
$$ 24091 -19359 4234 38173 -7752 16261 6995 1363 9410 12102 -15173 -2544 13478 -6560
999f560j5599j6630K2623j6873M9386m630k4213K059J8970J8508J7314r574m5318
$$ -6560 -22159 -38789 -16166 -33039 16347 11717 -12496 -10437 8533 27041 44355 34781 -10537
986a0537j1896J2666O65J9843K6823r559O20P607l1511k1065k1041R418J7350
$$ -10537 -22433 -9767 -9102 10741 37564 28005 28625 36232 4721 -16344 -37385 -27967 -10617
973a0617M3074j7044n088j2739K9386J573J194j986k3353o0604P098K6740k4020
$$ -10617 32457 15413 10325 -2414 26972 28545 29739 27753 4400 -56204 -49106 -22366 -46386
960d6386j671L2835K2205l3328J4104K2614J7263j3758j6759O97K2430P127K2494
$$ -46386 -48057 -15222 6983 -26345 -12241 10373 27636 13878 -2881 -2184 20246 27373 49867
947D9867n020J4337n467n4167K2613K0452J1373M285l0303J8436k5874N918k5839
$$ 49867 44847 59184 53717 -450 22163 42615 53988 58273 27970 46406 20532 26450 611
934F11n6663J2810L2747q623J1837l8065L1937K2614Q789N11j1091O13R44J0018
$$ 611 -56052 -43242 -10495 -19118 -7281 -45346 -13409 9205 17994 18505 7414 8027 8971 18989
920A8989J38J064j1176l125K1290P001m6326J0633J5455n515N666J2475J4091
$$ 18989 19127 20191 9015 5890 27180 34181 -12145 -1512 13943 8428 14094 26569 40660
907D0660O864m1428K5508j1769P835K033O697m1015P688k413k5993J7757m770
$$ 40660 47524 6096 31604 19835 27670 29703 36400 -4615 3073 660 -25333 -7576 -12346
894a2346l1436k310M1111K250q272j9303J0128L7565P539k3301Q69L318j3386
$$ -12346 -43782 -46092 -4981 -2731 -11003 -30306 -20178 17387 24926 1625 2494 5812 -7574
881g574K5275j783j5485K0372k4512j3662j2220Q75k8000J8508J2752K4992l6336
$$ -7574 17701 15918 433 20805 -3707 -17369 -29589 -28714 -56714 -38206 -25454 -462 -36798
868c6798K7874L9668P621p624m6932Q06k2412L3306k6076r856K6144K5406L064
$$ -36798 -8924 30744 38365 30741 -16191 -15385 -37797 -4491 -30567 -40423 -14279 11127 14191
855A4191k2784J4268J6795j0311p318j5978J6511L3120l268j5591l5584J3267
$$ 14191 -8593 5675 22470 12159 4841 -11137 5374 38494 35226 19635 -15949 -2682
843b682R574j361K1719k7446m348j3720L960L0021k9637N618K3468j3701l0396
$$ -2682 6892 5531 27250 -196 -4544 -18264 -14304 15717 -13920 -8302 15166 1465 -28931
830b8931l023J9900J7864j8961Q377o724J2467J671k0239J2866j8568j5667L0413
$$ -28931 -31954 -12054 5810 -13151 -4774 -11498 969 2640 -17599 -4733 -23301 -38968 -8555
817h555R064K561j4370L136p212J0251P169q363R560j0955j1787O797K8472M71
$$ -8555 509 3070 -11300 -8164 -15376 -5125 2044 -6319 3241 -7714 -19501 -12704 15768 16239
803A6239j0697l9233j1076K2674j0698J1939p779J569J4838J3364j6009k6385
$$ 16239 5542 -33691 -44767 -22093 -32791 -20852 -28631 -27062 -12224 1140 -14869 -41254
791d1254o08j4863L9022K891J2486l1271R286K1775Q422j28L0040k8012k6505
$$ -41254 -41862 -56725 -17703 -14812 -2326 -33597 -24311 -2536 5886 5758 35798 7786 -18719
778a8719L8889l701k8771k8193J5069p278K7982q640K121J3556L6348j4617l5716
$$ -18719 20170 16469 -12302 -40495 -25426 -32704 -4722 -13362 -11241 2315 38663 24046 -11670
765a1670K647j5827L767L4557J4899k4462O783L1456j6462l1834m2044P493l891
$$ -11670 -9023 -24850 -21083 13474 28373 3911 10694 42150 25688 -6146 -48190 -40697 -44588
752d4588p685K7403K049K0529K3431N284o628l4834k2872N257J768J0902k3572
$$ -44588 -52273 -24870 -22821 -2292 21139 26423 19795 -15039 -37911 -32654 -30886 -19984 -43556
739d3556J5388r599L6108J6200l8194p049J5981J5592M661j7541k446j2799k6975
$$ -43556 -28168 -37767 -1659 14541 -23653 -30702 -14721 871 5532 -12009 -14455 -27254 -54229
726e4229K5833L0454L914k4521j5172k1355J5039K6489P53l1215J6818M812l193
$$ -54229 -28396 2058 5972 -18549 -33721 -55076 -40037 -13548 -12795 -44010 -27192 -22380 -25573
713b5573K0001O959j0281j5545k991J8432Q497j4771L946J5461j0222p850M22
$$ -25573 -5572 1387 -8894 -24439 -27430 -8998 -501 -15272 -11326 4135 -6087 -13937 -13515
700a3515o509K2959O792k892l1192O63J8392o848p824O85k2204K8126K6973j5785
$$ -13515 -20024 2935 9727 6835 -24357 -23694 -5302 -12150 -19974 -19289 -41493 -13367 13606 -2179
686b179l7459p597J1454J2647J8547k0569j7658K504l311n947J0375O424o350
$$ -2179 -39638 -47235 -35781 -23134 -4587 -25156 -42814 -40310 -43621 -49568 -39193 -32769 -39119
673c9119K1077K2628m266L771n327j490J1828l3571L794l2528K6979J8140J2751
$$ -39119 -18042 4586 320 4091 -1236 -2726 9102 -24469 -20675 -53203 -26224 -8084 4667
660D667N175l2014m970r110j5123K2958n0873L132N2537j2059K9045k0350J4O070
$$ 4667 9842 -22172 -27142 -36252 -51375 -28417 -79290 -76158 -23621 -35680 -6635 -26985 -26971 -20901
646b0901k7872J102K7841J1126Q563O442Q518j7232r233J0760k1731j9763K4330
$$ -20901 -48773 -47671 -19830 -8704 -141 6301 14819 -2413 -11646 -886 -22617 -42380 -18050
633a8050M164N679j5831J379K69k467k1166J0676k1859k9929N987K4588n65N360
$$ -18050 -13886 -8207 -24038 -22659 -22390 -24857 -46023 -35347 -57206 -87135 -81148 -56560 -57125 -51765
619e1765l772L108J9882j1712R2M0120J7336j0152j8067L2202J4001l7182j6462
$$ -51765 -55537 -52429 -32547 -44259 -44167 -4047 13289 3137 -14930 17272 31273 -5909 -22371
606b2371N928J8287Q245J205L426k410p809R792m1812k8578J5729j6197R151L55
$$ -22371 -16443 1844 10089 11294 14720 12310 4501 14293 -27519 -56097 -40368 -56565 -47414 -47059
592d7059N314J2721L5082K1331j2648o1918q953M369J0613K7203j4727j036K3085
$$ -47059 -41745 -29024 6058 27389 14741 -47177 -56130 -51761 -41148 -13945 -28672 -29708 -6623
579f623j4705j0256L071O054k7940j2017J2701K911j7403j0278J5280q306j4593
$$ -6623 -21328 -31584 -28513 -22459 -50399 -62416 -49715 -46804 -64207 -74485 -59205 -67511 -82104
566h2104K5879j019K0001Q12k15O734j2298K3108k351m5922k0216R891K9988J7216
$$ -82104 -56225 -57244 -37243 -36431 -36646 -29912 -42210 -19102 -21453 -67375 -87591 -77700 -47712 -30496
552c0496m4795J1309M9555J1374k3133L863j8138J9278J332q315q930j3109J2243
$$ -30496 -75291 -63982 -14427 -3053 -26186 -22323 -40461 -21183 -19851 -28166 -37096 -50205 -37962
539c7962J6907k4015j9757j0837M6588j920n26k0484J7326l750O732M8141j6192
$$ -37962 -21055 -45070 -64827 -75664 -29076 -30996 -31522 -52006 -34680 -38430 -31698 16443 251
526B51n8747J7993J0302n835k980L780p305K7262k7869N61J9479j7904L8938Q360
$$ 251 -58496 -40503 -30201 -36036 -39016 -35236 -42541 -15279 -43148 -42587 -23108 -41012 -2074 6286
512F286k8221j0671j7467j343L0246j2q148k1157R623O526J5061m792j4173j631
$$ 6286 -21935 -32606 -50073 -51416 -21170 -21182 -29330 -50487 -40864 -34338 -19277 -24069 -38242 -39873
498c9873j3189J8375M697O569j5596j6665n34J3180K2559M543m354M284l9744
$$ -39873 -53062 -34687 -29990 -23421 -39017 -55682 -56216 -43036 -20477 -15934 -20288 -16004 -55748
485e5748j782K7271j2476j6029L0138r067k1878K17Q532j820l521L4586l2876
$$ -55748 -57530 -30259 -42735 -58764 -28626 -37693 -59571 -59354 -50822 -52642 -56163 -21577 -54453
472e4453J4529J5306k2502k25M5982k5238l0021j1681L4927j0438k2180j6515
$$ -54453 -39924 -24618 -47120 -47345 -1363 -26601 -56622 -68303 -33376 -43814 -65994 -82509
460h2509R349p884L285L3493k480J0579q223j2868o588k4853J8038J845J7984
$$ -82509 -73160 -81044 -77759 -44266 -46746 -36167 -44390 -57258 -63846 -88699 -70661 -68816 -50832
447e0832P475j2747J4290J0346j7886l675K6324J4748K779R115l2452j6808J4100
$$ -50832 -43357 -56104 -41814 -31468 -49354 -53029 -26705 -11957 -9178 -63 -32515 -49323 -35223
434c5223j8271k3299J3692K6996l4742k0471K0562M17j6233K0340N9738j3950
$$ -35223 -53494 -76793 -63101 -36105 -70847 -91318 -70756 -70339 -86572 -66232 -6494 -20444
422b0444O167m713j912j871j8353k6434J1967M8377m0782j8580J8082J5679j1635
$$ -20444 -14277 -18990 -20902 -22773 -41126 -67560 -55593 -7216 -47998 -66578 -48496 -32817 -44452
409d4452K6724O201m658r08o725o732k0348L2616K5686m5377O26L0158k9596q455
$$ -44452 -17728 -11527 -16185 -17093 -23818 -30550 -50898 -18282 7404 -37973 -37347 -7189 -36785 -45240
395d5240M5338j5566l9484K1430M3301l2015P445K4141k8203Q108p397j696K799
$$ -45240 98 -15468 -54952 -33522 9779 -22236 -14791 9350 -18853 -10745 -18142 -19838 -17039
382a7039j5230m55M3858p582n207j4316K928j6318J9645q016j5588J9074k0036
$$ -17039 -32269 -32724 11134 3552 -1655 -15971 -13043 -29361 -9716 -17732 -33320 -14246 -34282
369c4282K5670j6638K2047j9523j3326L3442j3145l5415M191J0909L8025o619
$$ -34282 -8612 -25250 -3203 -22726 -36052 -2610 -15755 -51170 -46979 -36070 1955 -4664
357d664l6739j5018m624J6347J6371J3776P174q619j4768j0265o341K1031j5607
$$ -4664 -41403 -56421 -61045 -44698 -28327 -14551 -7377 -15996 -30764 -41029 -47370 -26339 -41946
344d1946P598M0928k205m2342J3987l875J3059l027k5659L509j9623P728P901
$$ -41946 -34348 6580 4375 -37967 -23980 -27855 -14796 -17823 -43482 -39973 -59596 -51868 -43967
331d3967o658J3112j3481l063J4537k4148K9431j6187L111K4073k225r236j01
$$ -43967 -50625 -37513 -50994 -54057 -39520 -63668 -34237 -50424 -47313 -23240 -25465 -34701 -34802
318c4802l297J407K7985p780J4075N008j3721J2179l6219j994J0590n260O719
$$ -34802 -38099 -36692 -8707 -16487 -2412 2596 -11125 1054 -35165 -37159 -26569 -31829 -25110
305b5110J2091j3274r962K5787R894j4260j5669L717L3722m2188q53N2121K868
$$ -25110 -13019 -26293 -36255 -10468 -574 -14834 -30503 -26786 6936 -35252 -36105 16016 18884
292A8884l0869j0851j1370J413J1826P410J0245q440J5454k731j5696L4K0673
$$ 18884 -11985 -22836 -34206 -32793 -20967 -13557 -3312 -11752 3702 971 -14725 -14691 5982
279E982j0146q544j6302k0066J7565j6134J8688j1695n358J5328j9939J927j1973
$$ 5982 -4164 -12708 -29010 -49076 -31511 -47645 -28957 -40652 -46010 -30682 -50621 -48694 -60667
266f0667J4114k172L8280k1545k7569R075J8278P903j2344p688J3741O26J788
$$ -60667 -46553 -48725 -10445 -31990 -59559 -50484 -32206 -24303 -36647 -44335 -30594 -29968 -28180
253b8180j5744l2223K2186K8930q878k1722l0338l844R48k636K4757R953r07J2240
$$ -28180 -43924 -76147 -53961 -25031 -33909 -55631 -85969 -89813 -88865 -91501 -66744 -56791 -57698 -45458
239d5458n465J2242J8570q840l3934j0446Q741Q264j0447J5911j411k2304M7715
$$ -45458 -50923 -38681 -20111 -28951 -62885 -73331 -64590 -56326 -66773 -50862 -52273 -74577 -26862
226b6862J6754k2153K2923q490j106k7324l5830K8622N367M1443k4774k8501J5160
$$ -26862 -10108 -32261 -9338 -17828 -18934 -46258 -82088 -53466 -48099 -6656 -31430 -59931 -44771
213d4771K217J3128J2073M506J593k8733o790p238N462j9796K4602K4078J0774
$$ -44771 -42554 -29426 -17353 -12847 -11254 -39987 -46777 -54015 -48553 -68349 -43747 -19669 -8895
200h895k6500J3741K1382j4371j7714K5569j2711j5006m794J548M567k1868J0293
$$ -8895 -35395 -21654 -272 -14643 -32357 -6788 -19499 -34505 -39299 -37751 -33184 -55052 -44759
187d4759O526m1539m1279N3938K0355J6526k6652L547K3012n131L18J4452k0644
$$ -44759 -38233 -79772 -121051 -67113 -46758 -30232 -56884 -53337 -30325 -35456 -35138 -20686 -41330
174d1330j6568R83k2738K4802L3513m9833J8533r377K5851K7913n076k5640k2257
$$ -41330 -57898 -56915 -79653 -54851 -21338 -71171 -52638 -62015 -36164 -8251 -13327 -38967 -61224
161f1224P465j873O740K2886n40j4762O079r255j0207k1921J4912L0403p045O731
$$ -61224 -53759 -55632 -48892 -26006 -26546 -41308 -35229 -44484 -54691 -76612 -61700 -31297 -38342 -31611
147c1611k168j3583p305P230l684j6709K6697N4061k3693k9006j793N663P255
$$ -31611 -33779 -47362 -54667 -47437 -51121 -67830 -41133 12928 -10765 -39771 -41564 -35901 -28646
134b8646k245Q668j8080k6100r61K3615p671l9831K2344j1827K4140M9466l9259
$$ -28646 -30891 -22223 -40303 -66403 -67364 -43749 -51420 -91251 -68907 -80734 -56594 -7128 -46387
121d6387j541r795n192K510J3492K2070J2904k3226j5756j1775M016J8231j8257
$$ -46387 -47928 -57723 -62915 -60405 -46913 -24843 -11939 -35165 -50921 -62696 -58680 -40449 -58706
108e8706q115M787j7345N532R617J1073p77Q311J1671J0457q211k1799k010m058
$$ -58706 -66821 -62034 -79379 -73847 -64230 -53157 -53934 -45623 -33952 -23495 -31706 -53505 -55515 -59573
94e9573k8674J8077O583j081L3166J5827k8046j8038J2305Q224j8956j3179K7804
$$ -59573 -88247 -70170 -63587 -64668 -31502 -15675 -43721 -61759 -49454 -41230 -60186 -73365 -45561
81d5561J1960j7141J518L824j5926J3690K0394J0457j944k6086o908R564j0526
$$ -45561 -33601 -50742 -49224 -45400 -61326 -47636 -27242 -16785 -18729 -44815 -51723 -42159 -52685
68e2685j2242M709k2373K4677j1162r790p075N773j0392K1131J1958l477L40l109
$$ -52685 -64927 -60218 -82591 -57914 -69076 -78866 -85941 -80168 -90560 -69429 -57471 -60948 -60608 -63717
54f3717Q154J2282l2694r89J5162P920J6948l0943Q685J0695j8668j2687R540
$$ -63717 -55563 -43281 -75975 -76964 -61802 -53882 -36934 -67877 -59192 -48497 -67165 -79852 -70312
41g0312k233R400j8703K0320j886J0090J3155M968l1022R441K523m057j7589J6058
$$ -70312 -72545 -63145 -81848 -61528 -63414 -53324 -40169 -35201 -66223 -56782 -54259 -58316 -75905 -59847
27e9847J2058j021m481n683K2979m209k4521m168J8376j47q081J3270p387j2095
$$ -59847 -47789 -48810 -53291 -58974 -35995 -40204 -64725 -68893 -50517 -50664 -58745 -45475 -52862 -64957
13f4957O827P502k1173K9K3101L916k6297m356K2547k1130L017N534O041
$$ -64957 -58130 -50628 -71801 -71772 -48671 -44755 -71052 -75408 -52861 -73991 -70974 -65440 -59399
0e9399
$$ -59399
$$ Imaginary data points
##PAGE= N=2
##DATA TABLE= (X++(I..I)), XYDATA
16383a937535L5997K3259M0778M8948J2737L0756L3417p347J8899L0790L2837
$$ -1937535 -1901538 -1878279 -1837501 -1788553 -1775816 -1745060 -1711643 -1718990 -1700091 -1669301 -1636464
16372a636464K6204M3550K2311L9269J6311o064K4409N3427N183J4678J8362L0822
$$ -1636464 -1610260 -1566710 -1544399 -1505130 -1488819 -1494883 -1470474 -1417047 -1411864 -1397186 -1378824 -1348002
16360a348002K2560J9815M8152K3214M0744N0295L964J8369J7613J7647J9914
$$ -1348002 -1325442 -1305627 -1257475 -1234261 -1193517 -1143222 -1139258 -1120889 -1103276 -1085629 -1065715
16349a065715J4812K4222M979N2279P911J9031M6246L4K2132K8440M0354Q645
$$ -1065715 -1050903 -1026681 -1021702 -969423 -961512 -942481 -896235 -896201 -874069 -845629 -805275 -796630
16337g96630L0037M2822J1025L6112L7071K658J0758N197L3768L3993J3474K4518
$$ -796630 -766593 -723771 -712746 -676634 -639563 -636905 -626147 -620950 -587182 -553189 -539715 -515197
16325e15197J0447M3311K7230K221J7684N1021J6373Q473J6881L1126M5418R966
$$ -515197 -504750 -461439 -434209 -431988 -414304 -363283 -346910 -338437 -321556 -290430 -245012 -235046
16313b35046J2889J7488P684M734M3074L7599K6987M6771r468J7783J2214L2989
$$ -235046 -222157 -204669 -196985 -192251 -149177 -111578 -84591 -37820 -47288 -29505 -17291 15698
16301A5698J8544J4000L107j1311K8529N6047J4110O86R372L7035L8622J6714
$$ 15698 34242 48242 51349 40038 68567 124614 138724 139410 148782 185817 224439 241153
16289B41153J8366L667J2034K7946K8521R691R461K1571M7104K6069L449K9012
$$ 241153 259519 263186 275220 303166 331687 341378 350839 372410 419514 445583 449032 478044
16277D78044L863p46K1690J0268K5035J4581O241J6894J1161J3160K0832M888
$$ 478044 481907 481161 502851 513119 538154 552735 558976 575870 587031 600191 621023 625911
16265F25911R774M2041L8733K3257N98L2860p322J9256M8048K6250l636k0984
$$ 625911 635685 677726 716459 739716 740314 773174 765852 785108 833156 859406 855770 834786
16253H34786M3737L9123q744j6979P485J3259R115K6511L893j0321L0081J4359
$$ 834786 878523 917646 908902 891923 899408 912667 921782 948293 952186 941865 971946 986305
16241I86305L0641L5864J294J4571K9779J2806R354k5052Q955K3804L4209n38
$$ 986305 1016946 1052810 1054104 1068675 1098454 1111260 1120614 1095562 1104517 1128321 1162530 1161992
16229A161992K3093R172K8045j9316n168K7601J0238J5849J0528r084J3083J8988
$$ 1161992 1185085 1194257 1222302 1202986 1197818 1225419 1235657 1251506 1262034 1252950 1266033 1285021
16217A285021L4989l301L4445J4240j1966J4552M184L6058R598J0590N642K5725
$$ 1285021 1320010 1316709 1351154 1365394 1353428 1367980 1372164 1408222 1417820 1428410 1434052 1459777
16205A459777l781O511L144k8316J8266O646P923N1051j3473K8051J984K186M240
$$ 1459777 1455996 1462507 1465651 1437335 1455601 1462247 1470170 1521221 1507748 1535799 1537783 1539969 1544209
16192A544209L3038K3318P3l2695M841L5394K6355J3758n754J6848l4709k6795
$$ 1544209 1577247 1600565 1600638 1567943 1572784 1608178 1634533 1648291 1642537 1659385 1624676 1597881
16180A597881K7487L5012j1419Q913K3204O437l2683j0669M0547K1038O796J0647
$$ 1597881 1625368 1660380 1648961 1657874 1681078 1687515 1654832 1644163 1684710 1705748 1712544 1723191
16168A723191J2767j7377K1655J2879j4963j0233M0131K04J1791O99k502r433
$$ 1723191 1735958 1718581 1740236 1753115 1738152 1727919 1768050 1768254 1780045 1780744 1778242 1768809
16156A768809J1357Q41j1855K8980l0254L35J9477J3888q555M4450q750k4245
$$ 1768809 1780166 1781007 1769152 1798132 1767878 1768213 1787690 1801578 1793023 1837473 1828723 1804478
16144A804478K6990K5150J042p652K6561n722k081K5652o677L746J1000r633j2058
$$ 1804478 1831468 1856618 1857660 1850008 1876569 1870847 1868766 1894418 1887741 1891487 1902487 1892854 1880796
16131A880796O95J3395l97J9231K36l0454O486J7793J407k736Q63j2035j5704
$$ 1880796 1881491 1894886 1894489 1913720 1913956 1883502 1889988 1907781 1909188 1906452 1907315 1895280 1879576
16118A879576o362L6173r619M415P132P558j349P331L263j0585K9208L2520N813
$$ 1879576 1873214 1909387 1899768 1904183 1911315 1918873 1917524 1924855 1928118 1917533 1946741 1979261 1985074
16105A985074j4529o650j653k1601j459J1892K919K0084p722j3916L557k9354
$$ 1985074 1970545 1963895 1962242 1940641 1939182 1951074 1953993 1974077 1966355 1952439 1955996 1926642
16093A926642L3235L7518j4956k3853r719J1735L96J7094J7702j775Q816j9065
$$ 1926642 1959877 1997395 1982439 1958586 1948867 1960602 1960998 1978092 1995794 1994019 2002835 1983770
16081A983770j2224K0660L1495p758j6017j879R635N991Q19J7561n5892j1723
$$ 1983770 1971546 1992206 2023701 2015943 1999926 1998047 2007682 2013673 2014492 2032053 1976161 1964438
16069A964438K2327L0827k8910M016J8270K5869m0409J3178p591l0172J5474j9235
$$ 1964438 1986765 2017592 1988682 1992698 2010968 2036837 1996428 2009606 2002015 1971843 1987317 1968082
16057A968082J4777M3664k7962j2508J5404k849K1957N188l7673j3565P842K6471
$$ 1968082 1982859 2026523 1998561 1986053 2001457 1998608 2020565 2025753 1988080 1974515 1982357 2008828
16045B008828J5947l142J8449K3649P517l7995r552l5468K6237j3478M6109K0210
$$ 2008828 2024775 2021633 2040082 2063731 2071248 2033253 2023701 1988233 2014470 2000992 2047101 2067311
16033B067311j0662l0675J0130M692j2273J3865K604j2468l8036M9825L9561j6596
$$ 2067311 2056649 2025974 2036104 2040796 2028523 2042388 2044992 2032524 1994488 2044313 2083874 2067278
16021B067278m8507n656J7251M628j8635J4455j8793J3198K783j3661J4698l5349
$$ 2067278 2018771 2013115 2030366 2034994 2016359 2030814 2012021 2025219 2028002 2014341 2029039 1993690
16009A993690L6138l345J9255L6397o9846j8513K8365j0443K5863J8945n943j8881
$$ 1993690 2029828 2026483 2045738 2082135 2012289 1993776 2022141 2011698 2037561 2056506 2050563 2031682
15997B031682l766K9957k777p475n976K7010k3488j8997K1124J2125Q938O807
$$ 2031682 2027916 2057873 2055096 2047621 2041645 2068655 2045167 2026170 2047294 2059419 2068357 2075164
15985B075164r515n7916q25L785j6074K5140j928J4012K6218j5633q021J9150
$$ 2075164 2065649 2007733 2006908 2010693 1994619 2019759 2017831 2031843 2058061 2042428 2034407 2053557
15973B053557k2149M57j3903J1957J8847N7N393r528K5119j23l0697J6820j175
$$ 2053557 2031408 2031865 2017962 2029919 2048766 2048823 2054216 2044688 2069807 2069684 2038987 2055807 2054632
15960B054632M44l5879K6302L8961N387n6532k2913L7180j8793J1708P875m597
$$ 2054632 2055076 2019197 2045499 2084460 2089847 2033315 2010402 2047582 2028789 2040497 2048372 2043775
$$ [...]
##END NTUPLES=NMR SPECTRUM
##END=
