##TITLE=1H_CA-9374-2
 200.13MHz,CDCl3,
 8 sc
 
 27.8.2025
##JCAMPDX= 6.0         $$ Bruker NMR JCAMP-DX V2.0
##DATA TYPE= NMR SPECTRUM
##DATA CLASS= NTUPLES
##ORIGIN= UXNMR, Bruker Analytische Messtechnik GmbH
##OWNER= pz
$$ XWIN-NMR		Version 3.5
$$ Wed Aug 27 14:43:51 2025 Russian Standard Time (UT+4h)  she@DPX200
##.OBSERVE FREQUENCY= 200.1313
##.OBSERVE NUCLEUS= ^1H
##.ACQUISITION MODE= SIMULTANEOUS
##.ACQUISITION SCHEME= undefined
##.AVERAGES= 8
##.DIGITISER RES= 18
##SPECTROMETER/DATA SYSTEM= spect
##.PULSE SEQUENCE= zg30
##.SOLVENT NAME= CDCl3
##.SHIFT REFERENCE= (INTERNAL, CDCl3, 0, 15.521)
##AUDIT TRAIL= $$ (NUMBER, WHEN, WHO, WHERE, WHAT)
$$ ##TITLE= Audit trail, XWIN-NMR		Version 3.5
$$ ##JCAMPDX= 5.01
$$ ##ORIGIN= Bruker BioSpin GmbH
$$ ##OWNER= she
$$ F:/spectra/data/she/nmr/H-C/1/pdata/1/auditp.txt
$$ ##AUDIT TRAIL=  $$ (NUMBER, WHEN, WHO, WHERE, WHAT)
(   1,<2025-08-27 14:42:23.00 +0400>,<she>,<DPX200>,
      <created by zg, POWCHK disabled, PULCHK disabled
       configuration hash MD5:
       00 E9 B6 7A A2 85 ED C7 34 08 36 98 17 FE 4E 26
       data hash MD5: 16K
       4E D0 A7 35 25 10 E5 B3 BB 86 15 D6 92 5D 44 FB>)
(   2,<2025-08-27 14:42:26.59 +0400>,<she>,<DPX200>,
      <Start of raw data processing
       efp BC_mod = 2 LB = 0.25 FT_mod = 6 PKNL = 1 PHC0 = -1717.484 PHC1 = 9.792278 SI = 16K 
       data hash MD5: 16K
       75 EF 5A 8F F6 24 BA 7E 7C 3A 22 0A 9E 34 2B D4>)
(   3,<2025-08-27 14:42:45.78 +0400>,<she>,<DPX200>,
      <pk PHC0 = 0.3601837 PHC1 = 0 
       data hash MD5: 16K
       C1 34 53 51 86 A2 A8 6E 37 02 AF 00 3B A4 75 FF>)
(   4,<2025-08-27 14:42:49.39 +0400>,<she>,<DPX200>,
      <abs ABSG = 5 
       data hash MD5: 16K
       BA 7E A2 F1 A8 EB 77 A8 FB E9 1F 7B 9C E3 09 48>)
$$ ##END=
$$ 
$$ hash MD5
$$ 94 52 9B B8 B6 10 E8 1D 9B EB 21 A2 B7 6E 60 DF
##$RELAX= 
##$RELAX= 
##$RELAX= 
##$RELAX= 
##$RELAX= 
##$RELAX= 
$$ Bruker specific parameters
$$ --------------------------
##$DU= <F:/spectra>
##$EXPNO= 1
##$NAME= <H-C>
##$PROCNO= 1
##$TYPE= <nmr>
##$USER= <she>
##$AMP= (0..31)
100 100 100 100 100 100 100 100 100 100 100 100 100 100 100 100 100 100 
100 100 100 100 100 100 100 100 100 100 100 100 100 100 
##$AQSEQ= 0
##$AQ_mod= 1
##$AUNM= <au_zg>
##$AUTOPOS= <>
##$BF1= 200.13
##$BF2= 200.13
##$BF3= 200.13
##$BF4= 200.13
##$BF5= 200.13
##$BF6= 200.13
##$BF7= 200.13
##$BF8= 200.13
##$BYTORDA= 1
##$CFDGTYP= 0
##$CFRGTYP= 5
##$CHEMSTR= <none>
##$CNST= (0..31)
1 1 145 1 1 1 1 1 1 1 1 1 1 1 1 1 1 1 1 1 1 1 1 1 1 1 1 1 1 1 1 1 
##$CPDPRG= <>
##$CPDPRG1= <>
##$CPDPRG2= <>
##$CPDPRG3= <>
##$CPDPRG4= <mlev>
##$CPDPRG5= <mlev>
##$CPDPRG6= <mlev>
##$CPDPRG7= <mlev>
##$CPDPRG8= <mlev>
##$CPDPRGB= <>
##$CPDPRGT= <>
##$D= (0..31)
0 0.7 0 0 0 0 0 0 0 0 0 0.03 0 0 0 0 0 0 0 0 0 0 0 0 0 0 0 0 0 0 0 0 
##$DATE= 1756291342
##$DBL= (0..7)
120 120 120 120 120 120 120 120 
##$DBP= (0..7)
150 150 150 150 150 150 150 150 
##$DBP07= 0
##$DBPNAM0= <>
##$DBPNAM1= <>
##$DBPNAM2= <>
##$DBPNAM3= <>
##$DBPNAM4= <>
##$DBPNAM5= <>
$$ [...]
##$SUBNAM3= <"">
##$SUBNAM4= <"">
##$SUBNAM5= <"">
##$SUBNAM6= <"">
##$SUBNAM7= <"">
##$SUBNAM8= <"">
##$SUBNAM9= <"">
##$SW= 18.0517328524113
##$SWIBOX= (0..15)
0 0 2 0 0 0 0 0 0 0 0 0 0 0 0 0 
##$SW_h= 3612.71676300578
##$TD= 16384
##$TD0= 1
##$TE= 0
##$TE2= 300
##$TE3= 300
##$TEG= 300
##$TL= (0..7)
0 120 120 120 120 120 120 120 
##$TP= (0..7)
150 150 150 150 150 150 150 150 
##$TP07= 0
##$TPNAME0= <>
##$TPNAME1= <>
##$TPNAME2= <>
##$TPNAME3= <>
##$TPNAME4= <>
##$TPNAME5= <>
##$TPNAME6= <>
##$TPNAME7= <>
##$TPOAL= (0..7)
0.5 0.5 0.5 0.5 0.5 0.5 0.5 0.5 
##$TPOFFS= (0..7)
0 0 0 0 0 0 0 0 
##$TUNHIN= 0
##$TUNHOUT= 0
##$TUNXOUT= 0
##$USERA1= <user>
##$USERA2= <user>
##$USERA3= <user>
##$USERA4= <user>
##$USERA5= <user>
##$V9= 5
##$VALIST= <valist>
##$VCLIST= <CCCCCCCCCCCCCCC>
##$VD= 0
##$VDLIST= <DDDDDDDDDDDDDDD>
##$VPLIST= <PPPPPPPPPPPPPPP>
##$VTLIST= <TTTTTTTTTTTTTTT>
##$WBST= 1024
##$WBSW= 4
##$XGAIN= (0..3)
0 0 0 0 
##$XL= 0
##$YL= 0
##$YMAX_a= 119389
##$YMIN_a= -59491
##$ZGOPTNS= <>
##$ZL1= 120
##$ZL2= 120
##$ZL3= 120
##$ZL4= 120
##$ABSF1= 15.52984
##$ABSF2= -2.522009
##$ABSG= 5
##$ABSL= 3
##$ALPHA= 0
##$AQORDER= 0
##$ASSFAC= 0
##$ASSFACI= 0
##$ASSFACX= 0
##$ASSWID= 0
##$AUNMP= <proc_1d>
##$AZFE= 0.1
##$AZFW= 0.1
##$BCFW= 0
##$BC_mod= 2
##$BYTORDP= 0
##$COROFFS= 0
##$CY= -3
##$DATMOD= 1
##$DC= 0
##$DFILT= <>
##$DTYPP= 0
##$F1P= 0
##$F2P= 0
##$FCOR= 1
##$FTSIZE= 16384
##$FT_mod= 6
##$GAMMA= 0
##$GB= 0
##$INTBC= 1
##$INTSCL= 3.241238e-09
##$ISEN= 128
##$LB= 0.25
##$LEV0= 0
##$LPBIN= 0
##$MAXI= 10000
##$MC2= 0
##$MEAN= 0
##$ME_mod= 0
##$MI= 1.114404
##$NCOEF= 0
##$NC_proc= -8
##$NLEV= 6
##$NOISF1= 3.799351
##$NOISF2= 2.8
##$NSP= 0
##$NTH_PI= 0
##$NZP= 0
##$OFFSET= 15.52102
##$PC= 1
##$PHC0= -1717.124
##$PHC1= 9.792278
##$PH_mod= 1
##$PKNL= yes
##$PPARMOD= 0
##$PSCAL= 0
##$PSIGN= 0
##$REVERSE= no
##$SF= 200.130000136452
##$SI= 16384
##$SIGF1= 3
##$SIGF2= 2
##$SINO= 0.751879
##$SIOLD= 32768
##$SREGLST= <19F.Aceton>
##$SSB= 0
##$STSI= 16384
##$STSR= 0
##$SW_p= 3612.71676300578
##$SYMM= 0
##$S_DEV= 0
##$TDeff= 16384
##$TDoff= 0
##$TI= <>
##$TILT= no
##$TM1= 0
##$TM2= 0
##$TOPLEV= 0
##$USERP1= <user>
##$USERP2= <user>
##$USERP3= <user>
##$USERP4= <user>
##$USERP5= <user>
##$WDW= 1
##$XDIM= 16384
##$YMAX_p= 312843014
##$YMIN_p= -384539
$$ End of Bruker specific parameters
$$ ---------------------------------
##NTUPLES= NMR SPECTRUM
##VAR_NAME=  FREQUENCY,     SPECTRUM/REAL,   SPECTRUM/IMAG
##SYMBOL=    X,             R,               I
##VAR_TYPE=  INDEPENDENT,   DEPENDENT,       DEPENDENT
##VAR_FORM=  AFFN,          ASDF,            ASDF
##VAR_DIM=   16384,         16384,           16384
##UNITS=     HZ,            ARBITRARY UNITS, ARBITRARY UNITS
##FACTOR=    0.220516191357247, 1,           1
##FIRST=     3106.22172183109, 0,            0
##LAST=      -506.495041174695, 0,           0
##MIN=       -506.495041174695, -384539,     0
##MAX=       3106.22172183109, 312843014,    0
$$ Real data points
##PAGE= N=1
##DATA TABLE= (X++(R..R)), XYDATA
$$ [...]
$$ plain form
10066 799217 797306 647726 815688 938972 806108 799069 805757 923108 988756 1021563 1000566
10055 1000566 991191 1211600 1119036 1224579 1231785 1402646 1572480 1719247 1861135 1869470 2041299
10044 2041299 2275068 2381113 2373902 2320969 2325091 2333503 2167668 2088890 2131290 2062277 2102225
10033 2102225 2097453 2120854 2138400 2067304 2049011 2050860 1934669 1987235 2143071 2182013 2124907
10022 2124907 1965079 1807783 1806268 1911647 1795915 1654921 1446367 1439360 1405592 1389300
10012 1389300 1421989 1361016 1340133 1174372 1168346 1247312 1192801 1181483 1102340 1117782 1085249
10001 1085249 952215 918052 960756 869753 949414 970914 1003891 948843 842967 898031 854055
9990 854055 879680 943081 908125 908179 820096 788913 739494 833046 971262 952126 905394 819577
$$ packed form
10066G99217j911j49580J67962J23284j32864p039O688J17351O5648L2807k0997
10055A000566r375K20409r2564J05543P206J70861J69834J46767J41888Q335J71829
10044B041299K33769J06045p211n2933M122Q412j65835p8778M2400o9013L9948
10033B102225m772K3401J7546p1096j8293J849j16191N2566J55836L8942n7106
10022B124907j59828j57296j515J05379j15732j40994k08554p007l3768j6292
10012A389300L2689o0973k0883j65761o026P8966n4511j1318p9143J5442l2533
10001A085249j33034l4163M2704r1003P9661K1500L2977n5048j05876N5064m3976
9990H54055K5625O3401l4956N4q8083l1183m9419R3552J38216j9136m6732q5817
$$ plain form
9978 819577 782586 734850 772144 681848 786757 798648 658978 770260 854263 733128 667348
9967 667348 527951 592930 631534 660203 557419 524803 648599 642755 704810 765379 645920
9956 645920 602244 572485 535213 624443 649534 572864 647640 678117 620903 731611 644217
9945 644217 592853 617136 591586 534402 509937 515650 672367 677702 667364 744986 660834 724055
9933 724055 807337 804160 828417 938452 838976 709383 687385 707783 746890 757848 815657
9922 815657 782962 775143 709519 729543 710918 734895 830308 846001 946082 860999 755418
9911 755418 790457 845711 737895 822057 845078 720698 821658 664658 667060 623494 684317
9900 684317 675576 725376 793683 670207 697140 651917 850367 983138 870168 769246 726989
$$ packed form
9978H19577l6991m7736L7294r0296J04909J1891j39670J11282Q4003j21135o5780
9967F67348j39397O4979L8604K8669j02784l2616J23796n844O2055O0569j19459
9956F45920m3676k9759l7272Q9230K5091p6670P4776L0477n7214J10708q7394
9945F44217n1364K4283k5550n7184k4465N713J56717N335j0338P7622q4152O3221
9933G24055Q3282l177K4257J10035r9476j29593k1998K0398L9107J0958N7809
9922H15657l2695p819o5624K0024j8625K3977R5413J5693J00081q5083j05581
9911G55418L5039N5254j07816Q4162K3021j24380J00960j57000K402m3566O0823
9900F84317q741M9800O8307j23476K6933m5223J98450J32771j12970j00922m2257
$$ plain form
9889 726989 776784 664810 721169 835728 824332 766749 777457 952712 1045843 871318 871655
9878 871655 1046069 1019145 917433 889655 1023834 957941 936753 813507 752164 757444 763224
9867 763224 939703 981271 964241 957476 1019265 868907 716847 976928 1103319 1122191 1183915
9856 1183915 1028774 1067202 1074159 1023159 1073768 1137073 1202195 1210459 1087096 1091942 1035191 1013335
9844 1013335 1072378 963362 973860 915675 965472 1098371 1110201 1072336 1035242 1034433 974019
9833 974019 918983 834577 982484 1121550 1080859 927060 833548 839703 998499 1025578 1017578
9822 1017578 1059611 859524 927089 1082397 987038 1062386 929664 893500 927309 858260 1061981
9811 1061981 1125629 1132254 1035700 1037945 985912 996091 899982 809023 893701 883787 904704 913340
$$ packed form
9889G26989M9795j11974N6359J14559j1396n7583J0708J75255R3131j74525L37
9878H71655J74414k6924j01712k7778J34179o5893k1188j23246o1343N280N780
9867G63224J76479M1568j7030o765O1789j50358j52060K60081J26391J8872O1724
9856A183915j55141L8428O957n1000N0609O3305O5122Q264j23363M846n6751k1856
9844A013335N9043j09016J0498n8185M9797J32899J1830l7865l7094q09o0414
9833I74019n5036q4406J47907J39066m0691j53799r3512O155J58796K7079q000
9822A017578M2033k00087O7565J55308r5359P5348j32722l6164L3809o9049K03721
9811A061981O3648O625r6554K245n2033J0179r6109r0959Q4678r914K0917Q636
$$ plain form
9799 913340 842592 904774 966164 1030736 1010021 938428 852408 886242 933643 899175 818206 775274
9787 775274 877074 1002704 1091781 1211476 952819 879481 938494 905245 940102 1021202 985617
9776 985617 1110483 1152600 1128208 1159337 1190762 1095786 1120482 950026 953550 851126 905613
9765 905613 1053063 873403 947508 919814 869342 863432 981375 1024188 939894 798039 741481
9754 741481 764424 1013697 917205 765326 732644 756234 811231 762633 576441 747681 707638
9743 707638 680304 650533 657383 867459 767425 680764 715557 740506 640308 710022 694544
9732 694544 648342 675707 553990 678793 760893 779268 576185 415930 458450 584159 783977
9721 783977 815884 746177 793493 709411 787589 735555 567770 450113 559810 708454 621952
$$ packed form
9799I13340p0748O2182O1390O4572k0715p1593q6020L3834M7401l4468q0969m2932
9787G75274J01800J25630Q9077J19695k58657p3338N9013l3249L4857Q1100l5585
9776I85617J24866M2117k4392L1129L1425r4976K4696j70456L524j02424N4487
9765I05613J47450j79660P4105k7694n0472n910J17943M2813q4294j41855n6558
9754G41481K2943K49273r6492j51879l2682K3590N4997m8598j86192J71240m0043
9743G07638k7334k9771O850K10076j00034q6661L4793K4949j00198O9714j5478
9732F94544m6202K7365j21717J24803Q2100J8375k03083j60255M2520J25709J99818
9721G83977L1907o9707M7316q4082P8178n2034j67785j17657J09697J48644q6502
$$ plain form
9710 621952 526156 548339 529009 500978 700592 710942 760440 832970 859531 950791 780446
9699 780446 688065 720132 685434 743335 703572 785923 720910 522360 703243 759269 655455
9688 655455 637208 622749 550542 549403 623294 660046 602992 661316 827098 742766 638988
9677 638988 632425 679262 667972 771544 652627 503047 569181 687824 626294 543236 515502
9666 515502 658305 742157 637183 621242 703699 730694 773901 748817 731540 743616 749563
9655 749563 786960 770585 730768 789309 770563 621861 736509 847224 879700 786345 693666
9644 693666 831171 922084 816036 622972 695529 901801 873327 761109 945023 869145
9634 869145 841849 843967 705235 711551 788534 972241 918960 804994 843098 780517 700262
$$ packed form
9710F21952r5796K2183j9330k8031J99614J0350M9498P2530K6561R1260j70345
9699G80446r2381L2067l4698N7901l9763Q2351o5013j98550J80883N6026j03814
9688F55455j8247j4459p2207j139P3891L6752n7054N8324J65782q4332j03778
9677F38988o563M6837j1290J03572j18917j49580O6134J18643o1530q3058k7734
9666E15502J42803Q3852j04974j5941Q2457K6995M3207k5084j7277J2076N947
9655G49563L7397j6375l9817N8541j8746j48702J14648J10715L2476r3355r2679
9644F93666J37505R0913j06048j93064P2557K06272k8474j12218J83914p5878
9634H69145k7296K118j38732O316P6983J83707n3281j13966L8104o2581q0255
$$ plain form
9623 700262 820572 906900 890796 868554 912030 844109 702285 681202 814602 772213 755843
9612 755843 680799 733413 714517 661717 676927 671222 829534 819211 817966 852160 849292 736320
9600 736320 649497 668567 629352 614079 751708 842108 831908 742873 721088 819367 886545
9589 886545 920241 763348 694841 663136 741046 739124 804266 849983 814478 669155 728184
9578 728184 936172 885450 769120 827677 904923 736185 605052 654407 676944 774563 938375
9567 938375 1007321 1087886 1055987 1120785 1196673 1136619 980434 907321 834643 827731 773005 881456
9555 881456 830598 742512 782863 788196 840199 841225 751591 949953 927638 792893 870783 976518
9543 976518 829560 794771 843209 900922 977566 1071713 1074530 1020607 981466 1030121 994116 879833
$$ packed form
9623G00262J20310Q6328j6104k2242M3476o7921j41824k1083J33400m2389j6370
9612G55843p5044N2614j8896n2800J5210n705J58312j0323j245L4194k868j12972
9600G36320q6823J9070l9215j5273J37629R0400j0200q9035k1785R8279O7178
9589H86545L3696j56893o8507l1705P7910j922O5142M5717l5505j45323N9029
9578G28184K07988n0722j16330N8557P7246j68738j31133M9355K2537R7619J63812
9567I38375O8946Q0565l1899O4798P5888o0054j56185p3113p2678o912n4726J08451
9555H81456n0858q8086M0351N333N2003J026q9634J98362k2315j34745P7890J05735
9543I76518j46958l4789M8438N7713P6644R4147K817n3923l9141M8655l6005j14283
$$ plain form
9531 879833 994271 1005324 1083540 1065311 1099568 973742 1020741 1142143 1094284 1121321 1170942
9520 1170942 1066629 1165209 1194785 1171101 1264722 1141585 1148981 1040204 1063347 1189633 1093874
9509 1093874 1066100 1081871 1117219 1159834 1058713 972296 1148820 1147519 1248529 1254227 1191582
9498 1191582 1137804 1204099 1263812 1268305 1368535 1283428 1270935 1239772 1167193 1109842 1320842
9487 1320842 1384670 1283733 1260900 1385430 1647595 1672922 1474895 1359181 1278858 1319661
9477 1319661 1438847 1420955 1469173 1517706 1524786 1419736 1593939 1706465 1702153 1714654 1722505
9466 1722505 1644512 1695621 1895606 1866095 1812623 1848205 1846863 1866882 1806991 1820105 1945050
9455 1945050 1973762 2050867 2076180 1957047 1967187 2052117 2035377 2127437 2149026 2192302 2155235
$$ packed form
9531H79833J14438J1053P8216j8229L4257j25826M6999J21402m7859K7037M9621
9520A170942j04313R8580K9576k3684R3621j23137P396j08777K3143J26286r5759
9509A093874k7774J5771L5348M2615j01121q6417J76524j301J01010N698o2645
9498A191582n3778O6295N9713M493J00230q5107j2493l1163p2579n7351K11000
9487A320842O3828j00937k2833J24530K62165K5327j98027j15714q0323M0803
9477A319661J19186j7892M8218M8533P080j05050J74203J12526m312J2501P851
9466A722505p7993N1109J99985k9511n3472L5582j342K0019n9891J3114J24945
9455A945050K8712P7105K5313j19133J0140Q4930j6740R2060K1589M3276l7067
$$ plain form
9444 2155235 2253220 2299035 2380969 2347367 2243521 2225476 2182397 2150274 2143223 2290519 2289886 2349453
9432 2349453 2203052 2274745 2278123 2308447 2292716 2189676 2248987 2412445 2423335 2325449 2349890
9421 2349890 2365867 2394351 2456387 2571132 2633558 2677208 2778519 2831172 2808219 2866592 2746201
9410 2746201 2719880 2725174 2590898 2557394 2703971 2791420 2862910 2795789 2896539 2788315 2880175
9399 2880175 2953351 3056259 3071935 3154743 3214516 3080910 3129181 3072708 3273988 3369933 3503952
9388 3503952 3742081 3973359 4235957 4447056 4592583 4712496 4853320 4840570 4680928 4551260
9378 4551260 4397377 4378929 4282100 4187291 4098269 4176707 4249782 4109007 3894240 3902019 3885874
9367 3885874 3843579 3796594 3720710 3728155 3654811 3734999 3699387 3552345 3480579 3430887 3481018
$$ packed form
9444B155235R7985M5815Q1934l3602j03846j8045m3079l2123p051J47296o33N9567
9432B349453j46401P1693L378L0324j5731j03040N9311J63458J0890r7886K4441
9421B349890J5977K8484O2036J14745O2426M3650J01311N2653k2953N8373j20391
9410B746201k6321N294j34276l3504J46577Q7449P1490o7121J00750j08224R1860
9399B880175P3176J02908J5676Q2808N9773j33606M8271n6473K01280R5945J34019
9388C503952K38129K31278K62598K11099J45527J19913J40824j2750j59642j29668
9378D551260j53883j8448r6829r4809q9022P8438P3075j40775k14767P779j6145
9367C885874m2295m6985p5884P445p3344Q0188l5612j47042p1766m9692N0131
$$ plain form
9356 3481018 3609087 3686516 3770754 3741911 3841262 3906360 4181259 4421375 4366673 4646609 4859253
9345 4859253 5195711 5400400 5506280 5734114 5694161 5653930 5414104 5351964 5311925 5144833
9335 5144833 5077693 5044058 4974036 4825536 4834920 4814487 4827738 4779223 4866298 5090319 5079136
9324 5079136 5247631 5456943 5561868 5771289 5974599 6223411 6488461 6833369 7076036 7442788
9314 7442788 7496599 7207078 7051171 6846092 6525623 6218640 5968425 5752339 5639157 5547893
9304 5547893 5482662 5367319 5096931 4807276 4844678 4905732 4835776 4654646 4749732 4800614 4828759
9293 4828759 4917158 4978193 4964186 5070733 5156791 5185951 5239530 5334061 5515577 5715908 5908343
9282 5908343 6083784 6352368 6662337 6932776 7359845 7930079 8444756 8735954 9015000 9221848
$$ packed form
9356C481018J28069P7429Q4238k8843R9351O5098K74899K40116n4702K79936K12644
9345D859253L36458K04689J05880K27834l9953m0231k39826o2140m0039j67092
9335E144833o7140l3635p0022j48500R384k0433J3251m8515Q7075K24021j1183
9324E079136J68495K09312J04925K09421K03310K48812K65050L44908K42667L66752
9314G442788N3811k89521j55907k05079l20469l06983k50215k16086j13182r1264
9304E547893o5231j15343k70388k89655L7402O1054o9956j81130R5086N0882K8145
9293D828759Q8399O1035j4007J06547Q6058K9160N3579R4531J81516K00331J92435
9282E908343J75441K68584L09969K70439M27069N70234N14677K91198K79046K06848
$$ plain form
9272 9221848 9070764 9029033 8932872 8668163 8554805 8373188 8313852 8416761 8456065 8345405
9262 8345405 8480115 8687137 8930425 9292799 9602470 10193953 10771388 11441361 12087826 12831788
9252 12831788 13128763 13229363 12957386 12416172 11947701 11347081 10787012 10382455 10008040
9243 10008040 9406429 9021950 8818132 8457708 8167865 7906494 7601720 7416382 7438260 7371054
9233 7371054 7280288 7246918 7341035 7335599 7383855 7489692 7610104 7666679 7795771 7974298 8121437
9222 8121437 8461497 8836631 9047027 9485852 9867922 10274790 10866763 11546937 12346163 13213896
9212 13213896 14025552 14535317 14899349 14961230 14566684 13993951 13422606 12801673 12109904 11544672
9202 11544672 11171259 10739975 10300275 9938638 9802891 9566975 9244548 9169225 9181728 9100453
$$ packed form
9272I221848j51084m1731r6161k64709j13358j81617n9336J02909L9304j10660
9262H345405J34710K07022K43288L62374L09671N91483N77435O69973O46465P43962
9252A2831788K96975J00600k71977n41214m68471o00620n60069m04557l74415
9243A0008040o01611l84479k03818l60424k89843k61371l04774j85338K1878o7206
9233G371054r0766l3370R4117n436M8256J05837J20412N6575J29092J78527J47139
9222H121437L40060L75134K10396M38825L82070M06868N91973O80174P99226Q67733
9212A3213896Q11656N09765L64032O1881l94546n72733n71345o20933o91769n65232
9202A1544672l73413m31284m39700l61637j35747k35916l22427p5323J2503q1275
$$ plain form
9192 9100453 9198752 9338987 9438525 9602885 9931072 10217643 10407803 10358994 10311394 10252916
9182 10252916 10236914 10309900 10248381 10327335 10276807 10282263 10328070 10348605 10619150 11055394 11126822
9171 11126822 11392609 11850683 12239361 12705866 12759492 12692443 12620335 12650365 12453677 12145579
9161 12145579 12004211 11977070 11847169 11723626 11680239 11723290 11798619 11875901 12036680 12270104
9151 12270104 12473959 12852961 13437483 13899572 14545228 15394364 16291278 17338281 18512391
9142 18512391 19622005 20335650 20808954 20639175 20162291 19382053 18778366 18136390 17591428
9133 17591428 17156316 16878333 16480411 16115094 16153791 16169086 16195944 16368888 16531360 16894575
9123 16894575 16928759 16643660 16445752 15992439 15634339 15252451 14861868 14593980 14245071 14071920
$$ packed form
9192I100453R8299J40235R9538J64360L28187K86571J90160m8809m7600n8478
9182A0252916j6002P2986o1519P8954n0528N456M5807K0535K70545M36244P1428
9171A1126822K65787M58074L88678M66505N3626o7049p2108L0030j96688l08098
9161A2145579j41368k7141j29901j23543m3387M3051P5329P7282J60779K33424
9151A2270104K03855L79002N84522M62089O45656Q49136Q96914J047003J174110
9142A8512391J109614P13645M73304j69779m76884p80238o03687o41976n44962
9133A7591428m35112k77983l97922l65317L8697J5295K6858J72944J62472L63215
9123A6894575L4184k85099j97908m53313l58100l81888l90583k67888l48909j73151
$$ plain form
9113 14071920 13918876 13695223 13621033 13404419 13472179 13448713 13601577 13878399 14289604 14669058
9103 14669058 15055582 15527931 15981712 16791663 17683259 18537018 19336640 19528701 19440599 18844131
9093 18844131 18089860 17350829 16500142 15768215 15209551 14614169 14212338 13727130 13268947
9084 13268947 12987627 12667264 12249855 11965570 11625322 11441818 11232819 10961629 10875245 10607980
9074 10607980 10573618 10572245 10693188 10711627 10642424 10481854 10400110 10303171 10046286 9997946 9813393
9063 9813393 9699478 9505479 9416422 9308873 9061323 8965227 8976523 8925000 8814099 8725935
9053 8725935 8627088 8374445 8242984 8115349 7958005 7811221 7745418 7666398 7527643 7475106
9043 7475106 7359922 7491446 7418702 7318392 7226924 7145176 7066320 7138127 7081772 7086853 7123844
$$ packed form
9113A4071920j53044k23653p4190k16614O7760k3466J52864K76822M11205L79454
9103A4669058L86524M72349M53781Q09951Q91596Q53759P99622J92061q8102n96468
9093A8844131p54271p39031q50687p31927n58664n95382m01831m85208m58183
9084A3268947k81320l20363m17409k84285l40248j83504k08999k71190q6384k67265
9074A0607980l4362j373J20943J8439o9203j60570q1744r6939k56885m8340j84553
9063I813393j13915j93999q9057j07549k47550r6096J1296n1523j10901q8164
9053H725935r8847k52643j31461j27635j57344j46784o5803p9020j38755n2537
9043G475106j15184J31524p2744j00310r1468q1748p8856P1807n6355N081L6991
$$ plain form
9032 7123844 7213875 7201068 7026655 7161220 7253813 7270385 7258975 7465633 7450272 7523448 7622942
9021 7622942 7767130 7769108 7756726 7651899 7530840 7505702 7538706 7421307 7171360 7202125 7100879
9010 7100879 7060224 6915121 7066346 7101367 7109276 7004404 6986056 6976393 6897923 6777937 6720144
8999 6720144 6808837 6778722 6649286 6695456 6672889 6596897 6685189 6749940 6682328 6687917 6661131
8988 6661131 6626107 6765454 6792159 6815929 6862197 6859913 7104125 7124254 7182190 7209611 7186462
8977 7186462 7396336 7377430 7325008 7470591 7585791 7423121 7333960 7319234 7269098 7355299 7378528
8966 7378528 7439925 7448056 7462953 7370082 7317781 7525920 7669035 7656454 7616040 7666867 7740676
8955 7740676 7925940 8055022 8073086 8076636 8197590 8338625 8474660 8716963 8925820 9033782
$$ packed form
9032G123844R0031j2807j74413J34565R2593J6572j1410K06658j5361P3176R9494
9021G622942J44188J978j2382j04827j21059k5138L3004j17399k49947L0765j01246
9010G100879m0655j45103J51225L5021P909j04872j8348r663p8470j19986n7793
8999F720144Q8693l0115j29436M6170k2567p5992Q8292O4751o7612N589k6786
8988F661131l5024J39347K6705K3770M6268k284K44212K0129N7936K7421k3149
8977G186462K09874j8906n2422J45583J15200j62670q9161j4726n0136Q6201K3229
8966G378528O1397Q131J4897r2871n2301K08139J43115j2581m0414N0827P3809
8955G740676J85264J29082J8064L550J20954J41035J36035K42303K08857J07962
$$ plain form
8945 9033782 9216637 9398323 9773278 10041732 10506784 10798885 11273246 11738934 12378194 13189372
8935 13189372 13855981 14978782 16374968 18148228 19898034 22030303 24439760 27132073
8927 27132073 29247091 29829748 29302474 27572508 25558367 23583033 21783189 20390697
8919 20390697 19166863 18006656 17050058 16110747 15286105 14375397 13616708 12798840 12126235
8910 12126235 11686201 11090944 10758166 10452879 10140358 9859341 9557809 9338282 9181217
8901 9181217 9069152 8910795 8780154 8604608 8463950 8418768 8199049 8111295 8136723 7885238
8891 7885238 7965659 8052146 7932917 7918809 7973641 7821870 7833988 7959562 7753398 7799514 7638456
8880 7638456 7635162 7571095 7518770 7645381 7644956 7569621 7449971 7307808 7320590 7299635 7237030
$$ packed form
8945I033782J82855J81686L74955K68454M65052K92101M74361M65688O39260Q11178
8935A3189372O66609J122801J396186J773260J749806K132269K409457K692313
8927B7132073K115018N82657n27274j729966k014141j975334j799844j392492
8919B0390697j223834j160207r56598r39311q24642r10708p58689q17868o72605
8910A2126235m40034n95257l32778l05287l12521k81017l01532k19527j57065
8901I181217j12065j58357j30641j75546j40658m5182k19719q7754K5428k51485
8891G885238Q0421Q6487j19229j4108N4832j51771J2118J25574k06164M6116j61058
8880G638456l294o4067n2325J26611m25p5335j19650j42163J2782k0955o2605
$$ plain form
8869 7237030 7267817 7337615 7378679 7435116 7207709 7211013 7267963 7185040 7350762 7427184 7323918
8858 7323918 7216152 7318963 7410903 7335686 7280682 7191427 7114411 7190965 7181808 7114772 7234143
8847 7234143 7312995 7220946 7243140 7251566 7260021 7260896 7244838 7339640 7305210 7257300 7265757 7051814
8835 7051814 7010450 6968561 6936586 7175673 7261893 7232158 7214847 7150681 7211290 7257159 7276471
8824 7276471 7281629 7441294 7413777 7235091 7257811 7235082 7103810 7196770 7338502 7332739 7380642
8813 7380642 7317716 7241880 7242169 7221648 7157467 7327252 7234910 7232983 7148498 7131836 7229373 7362654
8801 7362654 7400867 7241498 7160633 7115060 7146855 7201043 7232190 7342682 7455613 7232134 7166029
8790 7166029 7243806 7275131 7379692 7289145 7118509 7255944 7305131 7246892 7080803 7203703
$$ packed form
8869G237030L0787O9798M1064N6437k27407L304N6950q2923J65722P6422j03266
8858G323918j07766J02811R1940p5217n5004q9255p7016P6554r157o7036J19371
8847G234143P8852r2049K2194Q426Q455Q75j6058R4802l4430m7910Q457k13943
8835G051814m1364m1889l1975K39087Q6220k9735j7311o4166O0609M5869J9312
8824G276471N158J59665k7517j78686K2720k2729j31272R2960J41732n763M7903
8813G380642o2926p5836K89k0521o4181J69785r2342j927q4485j6662R7537J33281
8801G362654L8213j59369q0865m5573L1795N4188L1147J10492J12931k23479o6105
8790G166029P7777L1325J04561r0547j70636J37435M9187n8239j66089J22900
$$ plain form
8780 7203703 7286461 7278848 7309995 7244963 7101465 7031751 7062602 7179500 7256545 7209691 7136372
8769 7136372 7127264 7194733 7355079 7347543 7342551 7260886 7286086 7457774 7527129 7605546 7558375 7569014
8757 7569014 7488474 7457112 7306339 7353904 7403237 7428239 7359163 7450223 7528184 7578411 7587426
8746 7587426 7571717 7580416 7638248 7826966 7893817 7883108 7994796 7972051 8035328 8209023 8310867
8735 8310867 8422409 8330315 8252586 8174102 8260967 8329271 8552378 8617376 8656637 8593248 8672472
8724 8672472 8706266 8752825 8821561 8880862 8938469 8858439 8917980 8953998 9011523 8887792 8938351
8713 8938351 8992805 9070873 9216963 9244820 9263355 9482077 9486429 9515299 9446253 9543947 9847587
8702 9847587 10005361 10152317 10375074 10608601 10948793 11166455 11453599 11671315 11976532 12238326
$$ packed form
8780G203703Q2758p613L1147o5032j43498o9714L0851J16898P7045m6854p3319
8769G136372r108O7469J60346p536m992q1665K5200J71688O9355P8417m7171J0639
8757G569014q0540l1362j50773M7565M9333K5002o9076R1060P7961N0227R015
8746G587426j5709Q699N7832J88718O6851j0709J11688k2745O3277J73695J01844
8735H310867J11542r2094p7729p8484Q6865O8304K23107O4998L9261o3389P9224
8724H672472L3794M6559O8736N9301N7607q0030N9541L6018N7525j23731N0559
8713H938351N4454P8068J46090K7857J8535K18722M352K8870o9046R7694L03640
8702I847587J57774J46956K22757K33527L40192K17662K87144K17716L05217K61794
$$ plain form
8692 12238326 12108243 12341023 12586404 12953896 13067501 13299974 13560858 13871129 14085787
8683 14085787 14254275 14197496 14224389 14236309 14155808 13958288 13838678 13720769 13794666 13862964
8673 13862964 13723994 13891324 13935760 13655846 13500434 13254385 13003905 12827228 12703464 12498081
8663 12498081 12492683 12482363 12285689 12104080 12083853 12276292 12179436 12248597 12403848 12364275 12326871
8652 12326871 12224578 12369319 12539001 12534217 12574064 12570739 12774961 12880844 13100719 13362008
8642 13362008 13428108 13341657 13266009 13061698 13056897 12769337 12575817 12505353 12496441 12418171 12491366
8631 12491366 12383441 12239825 12298294 12188300 12111633 11736399 11581604 11573852 11257582 11027465
8621 11027465 10936427 10921421 10729119 10563570 10515692 10493897 10230559 10064159 10035103 10081702
$$ packed form
8692A2238326j30083K32780K45381L67492J13605K32473K60884L10271K14658
8683A4085787J68488n6779K6893J1920q0501j97520j19610j17909P3897O8298
8673A3862964j38970J67330M4436k79914j55412k46049k50480j76677j23764k05383
8663A2498081n398j0320j96674j81609k0227J92439r6856O9161J55251l9573l7404
8652A2326871j02293J44741J69682m784L9847l325K04222J05883K19875K61289
8642A3362008O6100q6451p5648k04311m801k87560j93520p0464q912p8270P3195
8631A2491366j07925j43616N8469j09994p6667l75234j54795p752l16270k30117
8621A1027465r1038j5006j92302j65549m7878k1795k63338j66400k9056M6599
$$ plain form
8611 10081702 9943835 9945323 10011373 10040246 10021505 10032984 9990799 9899729 10039997 10067443 9974743
8600 9974743 9892653 10004459 10024082 10069396 10060382 10107567 10159311 10037904 10119452 10198740 10152848
8589 10152848 10197691 10195870 10304309 10400333 10129262 10276066 11063278 11104935 10863510 10971716
8579 10971716 11002535 11125939 11267281 11296850 11348863 11468789 11762328 11949495 12084436 12290775
8569 12290775 12583169 12860005 13141179 13516713 14037219 14399918 14622804 14869358 15172302
8560 15172302 15465656 15656327 15721466 15763329 15986416 16122290 16061940 16138286 16258736 16390949
8550 16390949 16438460 16354056 16330904 16128151 15784667 15452241 15247510 14980464 14733435 14642629
8540 14642629 14385566 14323232 14221897 14092532 13887255 13739477 13787448 13823003 13811366 13858138
$$ packed form
8611A0081702j37867J488O6050K8873j8741J1479m2185r1070J40268K7446r2700
8600I974743q2090J11806J9623M5314r014M7185N1744j21407Q1548P9288m5892
8589A0152848M4843j821J08439R6024k71071J46804P87212M1657k41425J08206
8579A0971716L0819J23404J41342K9569N2013J19926K93539J87167J34941K06339
8569A2290775K92394K76836K81174L75534N20506L62699K22886K46554L02944
8560A5172302K93354J90671O5139M1863K23087J35874o0350P6346J20450J32213
8550A6390949M7511q4404k3152k02753l43484l32426k04731k67046k47029r0806
8540A4642629k57063o2334j01335j29365k05277j47778M7971L5555j1637M6772
$$ plain form
8530 13858138 14025150 14240615 14381061 14519779 14761513 14722078 15016479 15512581 15925402 16177293
8520 16177293 16520371 17125116 17850449 18344009 18710781 19136076 19512406 19756159 20096773
8511 20096773 20536865 21129605 21769165 22209388 22835073 23157054 23469300 23561154 23599556 23589005
8501 23589005 23363046 23141628 23042072 22864942 23004576 23202019 23308260 23555818 23790081 24031502
8491 24031502 24275474 24322095 24387396 24467023 24669706 24798043 24812900 24785005 24798666 24727232 24494932
8480 24494932 24370986 24540375 24770145 25083572 25297611 25289260 25350287 25226281 24857234 24506603
8470 24506603 24052544 23963029 24056680 24086243 24234750 24399394 24701600 24750912 24723980 24669601
8460 24669601 24528120 24264213 24136271 23973312 23979438 24166542 24595993 24889982 25392429 26122426
$$ packed form
8530A3858138J67012K15465J40446J38718K41734l9435K94401M96102M12821K51891
8520A6177293L43078O04745P25333M93560L66772M25295L76330K43753L40614
8511B0096773M40092N92740O39560M40223O25685L21981L12246R1854L8402j0551
8501B3589005k25959k21418r9556j77130J39634J97443J06241K47558K34263K41421
8491B4031502K43972M6621O5301P9627K02683J28337J4857k7895J3661p1434k32300
8480B4494932j23946J69389K29770L13427K14039q351O1027j24006l69047l50631
8470B4506603m54059q9515R3651K9563J48507J64644L02206M9312k6932n4379
8460B4669601j41481k63907j27942j62959O126J87104M29451K93989N02447P29997
$$ plain form
8450 26122426 26565035 26916339 27208432 27012540 26932693 26772764 26710445 26769674 26865223 26920090
8440 26920090 26810991 26696671 26423497 26164713 26017123 25756447 25362803 24941739 24666270
8431 24666270 24295908 23455950 22903213 22136416 21307048 20524487 19868737 19239953 18665306
8422 18665306 18398518 17902202 17452572 16982295 16576652 16248949 16036521 15755912 15650941
8413 15650941 15518829 15239032 15084154 15083168 14908380 14740332 14548574 14598419 14595209 14480800
8403 14480800 14499728 14490246 14453878 14441855 14564085 14666888 14684708 14725477 14651199 14670107 14830276
8392 14830276 14889055 14850525 14882603 15086282 15158325 15182437 15280853 15435694 15364816 15309800 15433720
8381 15433720 15589870 15600854 15793076 16051297 16149822 16393681 16769448 17183582 17496573 17711959
$$ packed form
8450B6122426M42609L51304K92093j95892p9847j59929o2319N9229R5549N4867
8440B6920090j09099j14320k73174k58784j47590k60676l93644m21064k75469
8431B4666270l70362q39958n52737p66797q29368p82561o55750o28784n74647
8422A8665306k66788m96316m49630m70277m05643l27703k12428k80609j04971
8413A5650941j32112k79797j54878r86j74788j68048j91758M9845l210j14409
8403A4480800J8928r482l6368j2023J22230J02803J7820M0769p4278J8908J60169
8392A4830276N8779l8530L2078K03679P2043K4112R8416J54841p0878n5016J23920
8381A5433720J56150J0984J92222K58221R8525K43859L75767M14134L12991K15386
$$ plain form
8371 17711959 18119862 18709269 19189684 19445347 19717469 19838943 20023720 20215385 20150108 20167712
8361 20167712 20426711 20651574 20930778 20997254 20914865 20684900 20394116 20099752 19869555 19695193
8351 19695193 19603250 19513361 19542554 19582128 19534169 19606450 19636903 19813239 20117652 20480744 20965055
8340 20965055 21395757 21753301 22195894 22546928 22841820 23138288 23189085 23264606 23304178 23414338
8330 23414338 23541848 23853544 24147969 24186383 24127227 23784845 23452007 22975570 22443977 21915139
8320 21915139 21658715 21472988 21256412 21143032 20903836 20637700 20563062 20356972 20326198 20447007
8310 20447007 20416089 20320625 20426997 20758272 20924980 21226816 21654403 22217400 22847003 23568482
8300 23568482 24323261 25353039 26382366 27547531 28621069 29252831 29518415 29488958 29300932
$$ packed form
8371A7711959M07903N89407M80415K55663K72122J21474J84777J91665o5277J7604
8361B0167712K58999K24863K79204O6476q2389k29965k90784k94364k30197j74362
8351A9695193r1943q9889K9193L9574m7959P2281L0453J76336L04413L63092M84311
8340B0965055M30702L57544M42593L51034K94892K96468N0797P5521L9572J10160
8330B3414338J27510L11696K94425L8414n9156l42382l32838m76437n31593n28838
8320B1915139k56424j85727k16576j13380k39196k66136p4638k06090l0774J20809
8310B0447007l0918r5464J06372L31275J66708L01836M27587N62997O29603P21479
8300B3568482P54779J029778J029327J165165J073538O31762K65584k9457j88026
$$ plain form
8291 29300932 29053678 29017891 29156624 29210309 29331878 29445754 29290372 28880218 28194737 27217830
8281 27217830 26201466 25190089 24311116 23646347 22930151 22139817 21513743 21086539 20672083
8272 20672083 20222585 19779179 19590092 19324483 19110519 19088485 18984918 18807203 18618421 18575775
8262 18575775 18455038 18556324 18738693 18768823 18880072 18937091 19103805 19474187 19748567 19878686
8252 19878686 20346449 20903989 21503830 22153627 22989951 23838436 24477198 24961025 25318191
8243 25318191 25375306 25164941 24975329 24777705 24763754 24672373 24639732 24859635 24988511 24993493
8233 24993493 24888960 24782139 24377687 23708408 22927060 22212595 21266090 20286518 19584720
8224 19584720 18886798 18136272 17662430 17142368 16572738 15898604 15529834 15243779 14902879
$$ packed form
8291B9300932k47254l5787J38733N3685J21569J13876j55382m10154o85481r76907
8281B7217830j016364j011377q78973o64769p16196p90334o26074m27204m14456
8272B0672083m49498m43406j89087k65609k13964k2034j03567j77715j88782m2646
8262A8575775j20737J01286J82369L0130J11249N7019J66714L70382K74380J30119
8252A9878686M67763N57540N99841O49797Q36324Q48485O38762M83827L57166
8243B5318191N7115k10365j89612j97624j3951r1381l2641K19903J28876M982
8233B4993493j04533j06821m04452o69279p81348p14465r46505r79572p01798
8224A9584720o97922p50526m73842n20062n69630o74134l68770k86055l40900
$$ plain form
8215 14902879 14575062 14160399 13912666 13550747 13318391 13218954 13180394 12908242 12611562 12459889
8205 12459889 12240047 12069733 12008326 11929328 11717088 11557172 11317726 11121284 11029817 11076181
8195 11076181 10909668 10913606 10629512 10819293 10947398 10556089 10780009 10646780 10477708 10225875
8185 10225875 10110202 9847273 9665238 9753057 9807851 9686926 9741075 9698659 9670628 9560229
8175 9560229 9556584 9610053 9496284 9301913 9228668 9170556 9239062 9209455 9078752 8979499 8887752
8164 8887752 8783598 8684475 8589119 8552777 8556734 8391947 8353419 8324102 8142890 8114899 8160281
8153 8160281 8026849 7959798 7862798 8017107 7943189 7855210 7797006 7837217 7832423 7660233 7542927
8142 7542927 7685096 7692333 7661516 7643394 7708253 7695856 7769595 7944051 7942391 7919942 7867126
$$ packed form
8215A4902879l27817m14663k47733l61919k32356r9437l8560k72152k96680j51673
8205A2459889k19842j70314o1407p8998k12240j59916k39446j96442r1467M6364
8195A1076181j66513L938k84094J89781J28105l91309K23920j33229j69072k51833
8185A0225875j15673k62929j82035Q7819N4794j20925N4149m2416k8031j10399
8175I560229l645N3469j13769j94371p3245n8112O8506k9607j30703r9253r1747
8164H887752j04154r9123r5356l6342L957j64787l8528k9317j81212k7991M5382
8153H160281j33432o7051r7000J54309p3918q7979n8204M0211m794j72190j17306
8142G542927J42169P237l0817j8122O4859j2397P3739J74456j660k2449n2816
$$ plain form
8131 7867126 7833344 7892940 7801367 7805075 7861392 7877600 7805962 7920085 8083846 8047467 8055823
8120 8055823 7918589 7843084 7761197 7744572 7631009 7634597 7655903 7746525 7644719 7463204 7514895
8109 7514895 7474652 7351626 7139253 6988707 6888455 6842154 6814647 6818570 6766690 6819166 6658953
8098 6658953 6411273 6479919 6351356 6360471 6335210 6308075 6287163 6290131 6251258 6276539 6322678
8087 6322678 6249109 6260770 6286982 6400715 6346604 6375307 6358538 6269997 6185282 6137331 6210237
8076 6210237 6049244 6033661 6030016 6043144 6052862 6102484 6145457 6174442 6083678 6188548 6106839
8065 6106839 6069641 5857100 5687779 5848765 5894740 5824648 5750319 5660336 5569337 5653619 5596377
8054 5596377 5655441 5634994 5557171 5647679 5574906 5531024 5440606 5376867 5363289 5294998 5306244
$$ packed form
8131G867126l3782N9596r1573L708N6317J6208p1638J14123J63761l6379Q356
8120H055823j37234p5505q1887j6625j13563L588K1306R0622j01806j81515N1691
8109G514895m0243j23026k12373j50546j00252m6301k7507L923n1880N2476j60213
8098F658953k47680O8646j28563R115k5261k7135k0912K968l8873K5281M6139
8087F322678p3569J1661K6212J13733n4111K8703j6769q8541q4715m7951P2906
8076F210237j60993j5583l645J3128R718M9622M2973K8985r0764J04870q1709
8065F106839l7198k12541j69321J60986M5975p0092p4329q9983r0999Q4282n7242
8054E596377N9064k0447p7823R0508p2773m3882r0418o3739j3578o8291J1246
$$ plain form
8043 5306244 5202485 5133615 5103319 5086184 4995564 4990681 5022185 4822274 4646683 4608937 4654990
8032 4654990 4738632 4670063 4552448 4462290 4589098 4471937 4380071 4411448 4403758 4327400 4359949
8021 4359949 4342423 4293753 4211595 4179885 4252595 4266527 4215109 4326764 4234072 4127230 4125818
8010 4125818 4074070 4066657 4103060 4094770 3982689 3987953 3978571 4063003 3885587 3743784 3793020 3701697
7998 3701697 3768184 3770546 3628070 3681680 3801298 3806119 3585827 3607420 3758297 3671834 3685685
7987 3685685 3665679 3650869 3656314 3551218 3489235 3396102 3432656 3510143 3471109 3475661 3410622 3368424
7975 3368424 3407774 3328689 3336514 3276997 3388072 3350111 3274775 3334109 3255836 3300066 3284523
7964 3284523 3247164 3240461 3274869 3339721 3209975 3151166 3197243 3149708 3141522 3085176 3043451 3085930
$$ packed form
8043E306244j03759o8870l0296j7135r0620m883L1504j99911j75591l7746M6053
8032D654990Q3642o8569j17615r0158J26808j17161r1866L1377p690p6358L2549
8021D359949j7526m8670q2158l1710P2710J3932n1418J11655r2692j06842j412
8010D125818n1748p413L6403q290j12081N264r382Q4432j77416j41803M9236r1323
7998C701697O6487K362j42476N3610J19618M821k20292K1593J50877q6463J3851
7987C685685k0006j4810N445j05096o1983r3133L6554P7487l9034M552o5039m2198
7975C368424L9350p9085P825n9517J11075l7961p5336N9334p8273M4230j5543
7964C284523l7359o703L4408O4852j29746n8809M6077m7535q186n6346m1725M2479
$$ plain form
7952 3085930 3116255 3088216 3143406 3106755 2938212 3004408 3055622 3127900 2938423 2854766 2819039
7941 2819039 2586413 2710609 2779965 2721473 2838078 3068700 2995079 2871872 2788396 2781910 2752778
7930 2752778 2722373 2740022 2751378 2885745 2923159 2851983 2736800 2703702 2773487 2775621 2693370
7919 2693370 2721280 2769226 2772733 2696251 2735125 2832626 2696199 2754631 2725153 2547017 2471104
7908 2471104 2635340 2712685 2652000 2644198 2626837 2537738 2532190 2465312 2452832 2424892 2409825 2441507
7896 2441507 2313759 2211290 2230091 2243249 2348273 2489115 2385237 2222630 2180033 2230288
7886 2230288 2285879 2160180 2163232 2210268 2227819 2271211 2149037 2044485 2005883 1968423 2163262
7875 2163262 2137464 2083680 2019937 2131508 2288799 2113659 2143390 2210838 2159008 2156141 2088326
$$ packed form
7952C085930L0325k8039N5190l6651j68543O6196N1214P2278j89477q3657l5727
7941B819039k32626J24196O9356n8492J16605K30622p3621j23207q3476o486k9132
7930B752778l0405J7649J1356J34367L7414p1176j15183l3098O9785K134q2251
7919B693370K7910M7946L507p6482L8874R7501j36427N8432k9478j78136p5913
7908B471104J64236P7345o0685p802j7361q9099n548o6878j2480k7940j5067L1682
7896B441507j27748j02469J8801J3158J05024J40842j03878j62607m2597N0255
7886B230288N5591j25699L052M7036J7551M3392j22174j04552l8602l7460J94839
7875B163262k5798n3784o3743J11571J57291j75140K9731O7448n1830k867o7815
$$ plain form
7864 2088326 1979694 2008416 2070100 2163130 2073895 2123889 2021934 2098914 2082998 2118141 2217334
7853 2217334 2198960 2196113 2129858 1992450 2024379 2117030 2037668 2058638 2066316 1999093 2029737 1857262
7841 1857262 1938244 2061539 2142586 2209741 2317849 2392222 2376875 2351682 2405234 2359483 2204930
7830 2204930 2200011 2161032 2057302 2172734 2082909 2034720 2055542 2109534 2157656 2214501 2121803
7819 2121803 2067013 1988997 1745644 1819328 1872109 1779927 1900676 1862577 1805099 1741447 1710491
7808 1710491 1778979 1693324 1672549 1688908 1614042 1632966 1524571 159585 590955 1309658
7798 1309658 1294621 1401814 1411129 1531456 1500645 1494652 1427165 1561975 1515742 1485621 1426425
7787 1426425 1418519 1419890 1407121 1333044 1392448 1352669 1478345 1433360 1364176 1261904 1232163
$$ packed form
7864B088326j08632K8722O1684R3030q9235M9994j01955P6980j5916L5143R9193
7853B217334j8374k847o6255j37408L1929R2651p9362K0970P678o7223L0644j72475
7841A857262Q0982J23295Q1047O7155J08108P4373j5347k5193N3552m5751j54553
7830B204930m919l8979j03730J15432q9825m8189K0822N3992M8122N6845r2698
7819B121803n4790p8016k43353P3684N2781r2182J20749l8099n7478o3652l0956
7808A710491O8488q5655k0775J6359p4866J8924j08395j364986M31370P18703
7798A309658j5037J07193R315J20327l0811n993o7487J34810m6233l0121n9196
7787A426425p906J371j2769p4077N9404l9779J25676m4985o9184j02272k9741
$$ plain form
7776 1232163 1539425 1550086 1478824 1434953 1417492 1391952 1575927 1534094 1581379 1464840 1414736
7765 1414736 1302268 1296898 1328361 1462822 1437216 1425168 1391627 1356104 1377145 1319612 1458165
7754 1458165 1440814 1372078 1499774 1346119 1211679 1198889 1263781 1296880 1333208 1398229 1387999
7743 1387999 1372387 1351764 1457826 1453909 1475879 1342865 1367237 1478291 1435721 1302146 1264849
7732 1264849 1480478 1655863 1551287 1563648 1356716 1347424 1475266 1486160 1456098 1353579
7722 1353579 1360541 1327235 1366100 1402929 1321616 1413877 1346101 1356266 1321073 1221775 1151551 1159988
7710 1159988 1163640 1217036 1246460 1096363 1085155 1102019 1052540 1074873 1090701 1095588 1071524 1131256
7698 1131256 1116991 1089915 1169811 1142243 1159611 1159786 1131630 1283680 1250515 1177631 1282293
$$ packed form
7776A232163L07262J0661p1262m3871j7461k5540J83975m1833M7285j16539n0104
7765A414736j12468n370L1463J34461k5606j2048l3541l5523K1041n7533J38553
7754A458165j7351o8736J27696j53655j34440j2790O4892L3099L6328O5021j0230
7743A387999j5612k0623J06062l917K1970j33014K4372J11054m2570j33575l7297
7732A264849K15629J75385j04576J2361k06932r292J27842J0894l0062j02519
7722A353579O962l3306L8865L6829q1313R2261o7776J0165l5193r9298p0224Q437
7710A159988L652N3396K9424j50097j1208J6864m9479K2333J5828M887k4064N9732
7698A131256j4265k7076P9896k7568J7368J75k8156J52050l3165p2884J04662
$$ plain form
7687 1282293 1263972 1152461 1226382 1300063 1295883 1236002 1310198 1289170 1329336 1312084 1257537
7676 1257537 1177965 1088893 1107414 1082479 1105052 1178219 1180496 1080419 1029016 926167 1124134
7665 1124134 1121153 1024665 1017181 920544 947789 948346 796232 827991 823450 875094 924798 908069
7653 908069 935514 1082695 979201 947198 882245 901766 1039426 1015403 865147 1002860 931552
7642 931552 880972 907864 871517 783763 600428 691919 903226 802559 748621 817272 804886
7631 804886 881113 955591 931401 785371 725911 920813 880210 787700 712197 592567 737818
7620 737818 726998 857891 854164 797849 809626 850006 782855 603840 714536 875594 822877
7609 822877 843433 790657 919829 888668 836603 845406 753559 749215 782247 723955 689773 693776
$$ packed form
7687A282293j8321j11511P3921P3681m180n9881P4196k1028M0166j7252n4547
7676A257537p9572q9072J8521k4935K2573P3167K277j00077n1403j02849J97967
7665A124134k981r6488p484r6637K7245N57j52114L1759m541N1644M9704j6729
7653I08069K7445J47181j03494l2003o4953J9521J37660k4023j50256J37713p1308
7642I31552n0580K6892l6347q7754j83335R1491K11307j00667n3938O8651j2386
7631H04886P6227P4478k4190j46030n9460J94902m0603r2510p5503j19630J45251
7620G37818j0820J30893l727n6315J1777M0380o7151j79015J10696J61058n2717
7609H22877K0556n2776J29172l1161n2065Q803r1847m344L3032n8292l4182M003
$$ plain form
7597 693776 765699 704763 777122 806527 804148 869580 880104 769704 683704 556502 583225
7586 583225 687082 752954 793914 760158 777024 846693 878169 782786 789879 735319 753264 625005
7574 625005 682374 648932 478261 487188 531308 568771 568094 533828 592080 685879 602567 618206
7562 618206 621969 817122 789697 677287 592117 611938 616915 439018 507012 651773 727532
7551 727532 679151 513615 509560 564396 681193 722911 589106 453468 516790 614617 787772
7540 787772 826839 811820 788687 668576 772972 799025 768183 853162 994999 960609 1018830
7529 1018830 1013953 1008870 1121504 1124000 1267820 1340002 1507314 1631129 1799277 2108794 2171176
7518 2171176 2368061 2343605 2196479 2031586 1926984 1760378 1431489 1578263 1651032 1486625
$$ packed form
7597F93776P1923o0936P2359K9405k379O5432J0524j10400q6000j27202K6723
7586E83225J03857O5872M0960l3756J6866O9669L1476r5383P093n4560J7945j28259
7574F25005N7369l3442j70671Q927M4120L7463o77l4266N8252R3799q3312J5639
7562F18206L763J95153k7425j12410q5170J9821M977j77897O7994J44761P5759
7551G27532m8381j65536m055N4836J16797M1718j33805j35638O3322R7827J73155
7540G87772L9067j5019k3133j20111J04396K6053l0842Q4979J41837l4390N8221
7529A018830m877n083J12634K496J43820P2182J67312J23815J68148L09517O2382
7518B171176J96885k4456j47126j64893j04602j66606l28889J46774P2769j64407
$$ plain form
7508 1486625 1302356 1254918 1213994 1118625 1324621 1179377 1121283 981787 935524 888480 865851
7497 865851 766353 768112 724639 715921 716442 567919 514241 516267 585385 592169 647653 754945
7485 754945 693885 779556 709593 708209 766934 757419 790412 750046 729934 653101 557244 621111
7473 621111 660477 590932 482189 520347 489143 472581 523838 479583 566520 621257 562647
7462 562647 489184 463374 503116 669361 662083 626577 598084 697371 607258 798792 836498
7451 836498 678280 560357 667675 666502 536202 498678 584975 537634 453467 558625 523309
7440 523309 562273 573084 640412 627540 716025 725220 749755 719860 610335 618552 637392 647930
7428 647930 569007 701929 670389 490448 564590 703607 568780 408641 531885 507629
$$ packed form
7508A486625j84269m7438m0924r5369K05996j45244n8094j39496m6263m7044k2629
7497H65851r9498J759m3473q718N21j48523n3678K026O9118O784N5484J07292
7485G54945o1060Q5671o9963j384N8725r515L2993m0366k0112p6833r5857O3867
7473F21111L9366o9545j08743L8158l1204j6562N1257m4255Q6937N4737n8610
7462E62647p3463k5810L9742J66245p278l5506k8493R9287r0113J91534L7706
7451H36498j58218j17923J07318j173j30300l7524Q6297m7341q4167J05158l5316
7440E23309L8964J0811O7328j2872Q8485R195K4535k9895j09525Q217J8840J0538
7428F47930p8923J32922l1540j79941P4142J39017j34827j60139J23244k4256
$$ plain form
7418 507629 548677 687426 654101 631448 651370 608525 597234 569539 565246 713641 616760
7407 616760 596733 580915 719054 841325 672303 592816 610645 634117 691358 798451 738623
7396 738623 716448 809002 857986 729843 757654 756019 616675 700601 749832 796899 726100
7385 726100 621010 760865 787082 738324 696085 613448 672975 766840 792411 780120 847672
7374 847672 891605 871603 764894 961107 890853 873400 834152 893801 951887 916451 991867
7363 991867 883731 891882 868866 910038 862971 1010805 1004053 1084907 986658 881440 823352
7352 823352 865383 1071835 1131411 1078374 1087899 1069312 1075885 1109246 1218395 1309567 1193717
7341 1193717 1155049 1169548 1262604 1249025 1298008 1149063 1254236 1236769 1224359 1274478 1354091
$$ packed form
7418E07629M1048J38749l3325k2653J9922m2845j1291k7695m293J48395r6881
7407F16760k0027j5818J38139J22271j69022p9487J7829K3472N7241J07093n9828
7396G38623k2175R2554M8984j28143K7811j635j39344Q3926M9231M7067p0799
7385G26100j05090J39855K6217m8758m2239q2637N9527R3865K5571j2291O7552
7374H47672M3933k0002j06709J96213p0254j7453l9248N9649N8086l5436P5416
7363I91867j08136Q151k3016M1172m7067J47834o752Q0854r8249j05218n8088
7352H23352M2031K06452N9576n3037R525j8587O573L3361J09149R1172j15850
7341A193717l8668J4499R3056j3579M8983j48945J05173j7467j2410N0119P9613
$$ plain form
7330 1354091 1481871 1524803 1506188 1443401 1506274 1546799 1405241 1367501 1364133 1308601 1399098
7319 1399098 1475115 1454321 1453237 1462681 1461764 1608154 1720644 1759670 1654708 1661751 1612921 1625736
7307 1625736 1716394 1747522 1674687 1790688 1884299 1742395 1826370 1930467 1985819 1912543 1805735
7296 1805735 1736412 1699865 1741822 1772958 1783451 1836666 1835378 1951210 2031916 2096911 1906764
7285 1906764 1868948 1870725 1772390 1786488 1750188 1773539 2025108 2117538 2064459 2027273 2024473 2103665
7273 2103665 2080191 2088264 2014497 2064140 2111745 2299786 2434970 2260690 2324480 2423035 2362735
7262 2362735 2478486 2639440 2655946 2758402 2850593 2870478 2903075 3094421 3298317 3286221
7252 3286221 3365357 3435021 3760564 3942229 3975438 3911959 3980502 3919903 3966884 3963994 3917139
$$ packed form
7330A354091J27780M2932j8615o2787O2873M0525j41558l7740l368n5532R0497
7319A399098P6017k0794j084R444r17J46390J12490L9026j04962P043m8830J2815
7307A625736R0658L1128p2835J16001R3611j41904Q3975J04097N5352p3276j06808
7296A805735o9323l6547M1957L1136J0493N3215j288J15832Q0706O4995j90147
7285A906764l7816J777r8335J4098l6300K3351K51569R2430n3079l7186k800P9192
7273B103665k3474Q073p3767M9643M7605J88041J35184j74280O3790R8555o0300
7262B362735J15751J60954J6506J02456R2191J9885L2597J91346K03896j2096
7252C286221P9136O9664L25543J81665L3209o3479O8543o0599M6981k890m6855
$$ plain form
7241 3917139 3960248 3892031 3768750 3773821 3746617 3825756 3629857 3667059 3670171 3645379 3627089
7230 3627089 3657041 3601358 3770642 3764707 3799765 3765614 3696316 3756478 3652851 3621256 3764513
7219 3764513 3829852 3832230 3857059 3812570 3764279 3750136 3796479 3872218 4056709 4075509 4114147
7208 4114147 4050615 4192656 4311220 4321635 4198343 4183289 4147648 4216680 4425388 4520636 4511997
7197 4511997 4613881 4766084 4668073 4711914 4716652 4916846 4895351 4977975 5148902 5203384 5244746
7186 5244746 5258603 5478443 5707296 5877159 5845088 6076637 6193387 6244223 6308129 6491928
7176 6491928 6604126 6828405 7074052 7373042 7576353 7690632 7911141 8225611 8456965 8674878
7166 8674878 9123376 9558597 9774272 10173183 10440937 10862511 11269363 11624727 12213844 12781178
$$ packed form
7241C917139M3109o8217j23281N071k7204P9139j95899L7202L112k4792j8290
7230C627089K9952n5683J69284n935L5058l4151o9298O0162j03627l1595J43257
7219C764513O5339K378K4829m4489m8291j4143M6343P5739J84491J8800L8638
7208D114147o3532J42041J18564J0415j23292j5054l5641O9032K08708R5248q639
7197D511997J01884J52203r8011M3841M738K00194k1495Q2624J70927N4482M1362
7186E244746J3857K19840K28853J69863l2071K31549J16750N0836O3906J83799
7176F491928J12198K24279K45647K98990K03311J14279K20509L14470K31354K17913
7166H674878M48498M35221K15675L98911K67754M21574M06852L55364N89117N67334
$$ plain form
7156 12781178 13257788 13929068 14685455 15471934 16086896 16973443 17897802 18838603 19818436
7147 19818436 21153700 22185518 23296169 24475101 25990916 27643825 29641911 31477064
7139 31477064 33476160 35615803 38352063 41379942 44918775 48880492 53234828 57788162
7131 57788162 62948534 69017557 76031357 83858103 93372502 104624724 119002020 137907264
7123 137907264 160804183 185006349 212999316 246090578 284095301 309715774 312843014
7116 312843014 301894633 278333198 249643745 221952515 201098094 183450881 167787582
7109 167787582 153701432 140464762 127574203 115732620 104291940 94063150 85446464
7102 85446464 78144221 71643519 66051844 60975115 56465124 52492251 48860024 45802840
$$ packed form
7156A2781178M76610O71280P56387P86479O14962Q86547R24359R40801R79833
7147A9818436J335264J031818J110651J178932J515815J652909J998086J835153
7139C1477064J999096K139643K736260L027879L538833L961717M354336M553334
7131E7788162N160372O069023P013800P826746R514399J1252222J4377296J8905244
7123A37907264K2896919K4202166K7992967L3091262L8004723K5620473L127240
7116C12843014j0948381k3561435k8689453k7691230k0854421j7647213j5663299
7109A67787582j4086150j3236670j2890559j1841583j1440680j0228790q616686
7102H5446464p302243o500702n591675n076729m509991l972873l632227l057184
$$ plain form
7094 45802840 43058890 40595799 38440931 36385092 34530031 32909676 31509313 30137620
7086 30137620 28701097 27350035 26291467 25353376 24465373 23584346 22653314 21734094 20999979
7077 20999979 20178011 19302903 18547068 17850443 17152769 16426557 15835619 15386470 14897621
7068 14897621 14376831 13858439 13488699 13200061 12833992 12422863 12090527 11761997 11451667
7059 11451667 11221816 11136918 11144590 10858860 10609689 10379437 10239766 10003978 9802679 9645251
7049 9645251 9446923 9138283 8866141 8610053 8568716 8426908 8247684 7992218 7775431 7816257
7039 7816257 7826187 7647448 7453975 7296627 7222803 7171460 7122973 6835290 6694125 6651244 6558784
7028 6558784 6566498 6499657 6429082 6387361 6184321 6125754 5995585 5846722 5810377 5787128 5588443
$$ packed form
7094D5802840k743950k463091k154868k055839j855061j620355j400363j371693
7086C0137620j436523j351062j058568r38091q88003q81027r31032r19220p34115
7077B0999979q21968q75108p55835o96625o97674p26212n90938m49149m88849
7068A4897621n20790n18392l69740k88638l66069m11129l32336l28530l10330
7059A1451667k29851q4898P672k85730k49171k30252j39671k35788k01299j57428
7049I645251j98328l08640k72142k56088m1337j41808j79224k55466k16787M0826
7039G816257R930j78739j93473j57348p3824n1343m8487k87683j41165m2881r2460
7028F558784P714o6841p0575m1721k03040n8567j30169j48863l6345k3249j98685
$$ plain form
7017 5588443 5510229 5609152 5616384 5518589 5410682 5397079 5372836 5311766 5317426 5258820 5197096 5019642
7005 5019642 4996015 4957908 5024019 4876168 5006975 4950459 4832725 4786304 4743509 4867377 4853684
6994 4853684 4917617 4878593 4893216 4957196 4877386 4827417 4717285 4547732 4535628 4458217 4457489
6983 4457489 4438292 4367876 4272831 4169695 4162095 4162106 4313101 4325338 4159813 4221629 4228986 4216052
6971 4216052 4127343 4264018 4255499 4228734 4236902 4148066 4101315 4067878 4164284 4160908 4217764 4091513
6959 4091513 4163797 4235167 4266449 4201405 4082202 4049707 4074615 3967731 3858445 3893640 3874957
6948 3874957 3849907 3755543 3745525 3676343 3612525 3643254 3692203 3710325 3749545 3755756 3696551 3431836
6936 3431836 3536092 3668312 3483344 3328164 3350126 3474108 3498314 3319774 3320234 3351404 3429368
$$ packed form
7017E588443p8214R8923P232r7795j07907j3603k4243o1070N660n8606o1724j77454
7005E019642k3627l8107O6111j47851J30807n6516j17734m6421m2795J23868j3693
6994D853684O3933l9024J4623O3980p9810m9969j10132j69553j2104p7411p28
6983D457489j9197p0416r5045j03136p600J1J50995J2237j65525O1816P357j2934
6971D216052q8709J36675q519k6765Q168q8836m6751l3437R6406l376N6856j26251
6959D091513P2284P1370L1282o5044j19203l2495K4908j06884j09286L5195j8683
6948C874957k5050r4364j0018o9182o3818L0729M8949J8122L9220O211n9205k64715
6936C431836J04256J32220j84968j55180K1962J23982K4206j78540M60L1170P7964
$$ plain form
6925 3429368 3502079 3438883 3483440 3396532 3231171 3082236 3144443 3158735 3144533 3027893 3074860
6914 3074860 3167053 3077297 3112249 3115406 3023954 3040759 3130800 3035187 2990646 3022198 3097005 3083833
6902 3083833 2978191 3158681 3166898 3197854 3199411 3121001 3004273 3085950 3198986 3093214 3078373
6891 3078373 3120190 3267912 3156247 3103275 3181192 3182703 3184559 3255279 3301563 3324514 3371983
6880 3371983 3473101 3418233 3308676 3232371 3230889 3229943 3362236 3519261 3351476 3311774 3394917
6869 3394917 3408138 3317235 3360513 3399620 3424490 3481470 3484550 3571949 3545803 3533957 3486816 3419744
6857 3419744 3484659 3443350 3353612 3315511 3304678 3348120 3445146 3512193 3495835 3349940 3302898
6846 3302898 3338963 3246213 3328711 3283100 3291917 3336261 3477586 3458412 3369614 3471496 3506526
$$ packed form
6925C429368P2711o3196M4557q6908j65361j48935O2207J4292j4202j16640M6967
6914C074860R2193q9756L4952L157r1452J6805R0041r5613m4541L1552P4807j3172
6902C083833j05642J80490Q217L0956J557p8410j16728Q1677J13036j05772j4841
6891C078373M1817J47722j11665n2972P7917J511J856P0720M6284K2951M7469
6880C371983J01118n4868j09557p6305j482r46J32293J57025j67785l9702Q3143
6869C394917J3221r0903M3278L9107K4870N6980L080Q7399k6146j1846m7141o7072
6857C419744O4915m1309q9738l8101j0833M3442R7026O7047j6358j45895m7042
6846C302898L6065r2750Q2498m5611Q817M4344J41325j9174q8798J01882L5030
$$ plain form
6835 3506526 3446381 3514489 3552514 3569248 3539400 3542419 3540706 3528702 3578174 3579777 3763961 3840173
6823 3840173 3751540 3841033 3713121 3701626 3723291 3796627 3712422 3767466 3851293 3973400 3874001
6812 3874001 3895703 3890265 3778949 3859088 3926265 3918557 3831573 3715042 3927440 4030814 4079710
6801 4079710 4079716 4201998 4136668 4051112 4138065 4091032 4063509 4095091 4140285 4091889 4006977 3962391
6789 3962391 4054639 4167305 4338353 4213629 4339894 4437663 4488716 4435415 4652755 4569320
6779 4569320 4650768 4679474 4703323 4679684 4787275 4715664 4650045 4666636 4739390 4880981 4920510
6768 4920510 4918837 4980672 5067415 5118018 5005069 5074504 5169416 5199973 5257537 5438428 5419276
6757 5419276 5418695 5346991 5397639 5432680 5367944 5309191 5333233 5418617 5479237 5465662 5286524 5356605
$$ packed form
6835C506526o0145O8108L8025J6734k9848L019j713j2004M9472J603J84184P6212
6823C840173q8633Q9493j27912j1495K1665P3336q4205N5044Q3827J22107r9399
6812C874001K1702n438j11316Q0139O7177p708q6984j16531K12398J03374M8896
6801D079710OJ22282o5330q5556Q6953m7033k7523L1582M5194m8396q4912m4586
6789C962391R2248J12666J71048j24724J26265R7769N1053n3301K17340q3435
6779D569320Q1448K8706K3849k3639J07591p1611o5619J6591P2754J41591L9529
6768D920510j673O1835Q6743N0603j12949O9435R4912L0557N7564J80891j9152
6757E419276n81p1704N0648L5041o4736n8753K4042Q5384O0620j3575j79138P0081
$$ plain form
6745 5356605 5319798 5399914 5504761 5545145 5573421 5578710 5796653 5810331 5801332 5929186 5962000
6734 5962000 6134600 6235573 6350313 6525426 6720630 6776564 7057219 7320003 7524485 7737136
6724 7737136 7968530 8296269 8849948 9238132 9642783 10141636 10666824 11414287 12082354 13023064
6714 13023064 14217270 15418928 16360096 17382710 18386871 19099697 19703150 19875552 19739829
6705 19739829 19192562 18467894 17637213 16788266 16040011 15223102 14490174 13757448 13117069
6696 13117069 12569996 11923819 11335593 10883961 10303223 9905188 9614092 9289866 9067550
6687 9067550 8844376 8572748 8426948 8265481 8087540 8006626 7855473 7758851 7699281 7772463
6677 7772463 7631496 7481949 7493620 7374141 7373958 7378506 7417719 7520410 7356461 7343682 7564319
$$ packed form
6745E356605l6807Q0116J04847M0384K8276N289K17943J3678q999J27854L2814
6734E962000J72600J00973J14740J75113J95204N5934K80655K62784K04482K12651
6724G737136K31394L27739N53679L88184M04651M98853N25188P47463O68067R40710
6714A3023064J194206J201658R41168J022614J004161P12826O03453J72402j35723
6705A9739829n47267p24668q30681q48947p48255q16909p32928p32726o40379
6696A3117069n47073o46177n88226m51632n80738l98035k91096l24226k22316
6687I067550k23174k71628j45800j61467j77941q0914j51153r6622n9570P3182
6677G772463j40967j49547J1671j19479j83M548L9213J02691j63949j2779K20637
$$ plain form
6666 7564319 7568014 7623863 7791591 8026067 8147275 8226958 8276530 8099443 7908633 7790603
6656 7790603 7644883 7344039 7211152 7208177 7021459 6779136 6792610 6710806 6661818 6640377 6444548
6645 6444548 6233981 6261963 6040669 5926521 5937514 5962395 5854647 5813802 5785718 5865241 5811933
6634 5811933 5725748 5654106 5664838 5706461 5635262 5646212 5714298 5678881 5669497 5907593 5982513
6623 5982513 6071435 6053329 6174404 6392314 6378800 6636730 6681860 6664158 6700039 6830813 7018554
6612 7018554 7214730 7184803 6936360 6826600 6588910 6356640 6315669 6295366 6014733 5965380
6602 5965380 6023215 5896207 5831354 5763141 5533118 5601922 5559490 5525035 5449542 5356799 5348311
6591 5348311 5221314 5211377 5280415 5219977 5088400 4977197 4999062 5093007 5084073 5143453 5074273
$$ packed form
6666G564319L695N5849J67728K34476J21208P9683M9572j77087j90810j18030
6656G790603j45720l00844j32887k975j86718k42323J3474q1804m8988k1441j95829
6645F444548k10567K7982k21294j14148J0993K4881j07748m0845k8084P9523n3308
6634E811933q6185p1642J0732M1623p1199J0950O8086l5417r384K38096P4920
6623E982513Q8922j8106J21075K17910j3514K57930M5130j7702L5881J30774J87741
6612G018554J96176k9927k48443j09760k37690k32270m0971k0303k80633m9353
6602E965380N7835j27008o4853o8213k30023O8804m2432l4455p5493r2743q488
6591E348311j26997r937O9038o0438j31577j11203K1865R3945q934N9380o9180
$$ plain form
6580 5074273 4994207 5157025 5199745 5269892 5133897 5064518 5105219 5131640 5129688 5192291 5058068
6569 5058068 5091128 5226681 5168481 5019792 5001377 4900082 4771093 4733673 4673772 4732767 4786150
6558 4786150 4754861 4698762 4803798 4616667 4652075 4618848 4575558 4660535 4509591 4519893 4565556
6547 4565556 4342413 4362621 4462579 4486295 4457540 4293749 4520985 4523123 4317491 4380249 4468659
6536 4468659 4417443 4467293 4580441 4599473 4494825 4435574 4503450 4516346 4496018 4520364 4449149
6525 4449149 4493245 4446099 4495888 4470552 4408428 4363071 4337776 4268007 4332680 4507129 4361335
6514 4361335 4397125 4457321 4435805 4465003 4440772 4376139 4287843 4239081 4270270 4236938 4202200
6503 4202200 4250688 4342114 4446223 4329622 4240196 4242827 4349092 4505640 4513248 4423121 4370055
$$ packed form
6580E074273q0066J62818M2720P0147j35995o9379M0701K6421j952O2603j34223
6569E058068L3060J35553n8200j48689j8415j01295j28989l7420n9901N8995N3383
6558D786150l1289n6099J05036j87131L5408l3227m3290Q4977j50944J0302M5663
6547D565556k23143K0208R9958K3716k8755j63791K27236K138k05632O2758Q8410
6536D468659n1216M9850J13148J9032j04648n9251O7876J2896k0328K4346p1215
6525D449149M4096m7146M9789k5336o2124m5357k5295o9769O4673J74449j45794
6514D361335L5790O0196k1516K9198k4231o4633q8296m8762L1189l3332l4738
6503D202200M8488R1426J04109j16601q9426K631J06265J56548P608r0127n3066
$$ plain form
6492 4370055 4285373 4269209 4309977 4528452 4509152 4316134 4377965 4365939 4438927 4358405 4112521
6481 4112521 4133814 4291176 4205975 4186585 4117245 4240902 4358303 4344207 4393057 4399646 4313260
6470 4313260 4382068 4322588 4338851 4488904 4423532 4306004 4417413 4381568 4345888 4326335 4262907
6459 4262907 4238194 4316037 4322352 4276443 4354748 4490682 4396044 4284396 4326458 4474572 4519646
6448 4519646 4428684 4462533 4442199 4450198 4479305 4476771 4487383 4526918 4385599 4388464 4466793 4526724
6436 4526724 4570809 4625858 4613564 4484040 4514784 4474658 4558127 4657237 4596579 4567643 4480426
6425 4480426 4516532 4592539 4571965 4557356 4653261 4628642 4653156 4659026 4615598 4622907 4553475 4586079
6413 4586079 4548749 4674232 4830519 4838832 4875798 4813840 4950687 4981157 4963232 5014908 4980740
$$ packed form
6492D370055q4682j6164M0768K18475j9300j93018O1831j2026P2988q0522k45884
6481D112521K1293J57362q5201j9390o9340J23657J17401j4096M8850O589q6386
6470D313260O8808n9480J6263J50053o5372j17528J11409l5845l5680j9553o3428
6459D262907k4713P7843O315m5909P8305J35934r4638j11648M2062J48114M5074
6448D519646r0962L3849k0334P999K9107k534J0612L9535j41319K865P8329N9931
6436D526724M4085N5049j2294j29524L0744m0126Q3469R9110o0658k8936q7217
6425D480426L6106P6007k0574j4609R5905k4619K4514N870m3428P309o9432L2604
6413D586079l7330J25483J56287Q313L6966o1958J36847L0470j7925N1676l4168
$$ plain form
6402 4980740 4947067 4957435 4871401 4731061 4833961 4868028 4851011 4916386 4871441 4884731 4864302
6391 4864302 4837056 4938081 5041657 5041594 5006246 4964255 4977926 4981059 4982205 4992772 5043549 4995100
6379 4995100 5076790 5121127 5072243 5004777 5015185 5199477 5071406 5019064 5048047 5024401 4997721
6368 4997721 4975899 4946460 4852053 5057820 5249609 5182291 5117481 5092789 5080190 5197224 5268785
6357 5268785 5145488 5130687 5262618 5263797 5141784 5136328 5194775 5215472 5136183 5235674 5250798
6346 5250798 5094861 5186536 5396957 5337095 5298187 5185709 5179057 5117962 5131623 5233094 5292501
6335 5292501 5367975 5387205 5232466 5290688 5445258 5424880 5354891 5360874 5417322 5389762 5524803
6324 5524803 5443503 5466269 5480317 5554937 5454034 5412005 5379024 5292606 5388538 5518922 5547100
$$ packed form
6402D980740l3673J0368q6034j40340J02900L4067j7017O5375m4945J3290k0429
6391D864302k7246J01025J03576o3l5348m1991J3671L133J146J0567N0777m8449
6379D995100Q1690M4337m8884o7466J0408J84292j28071n2342K8983k3646k6680
6368D997721k1822k9439r4407K05767J91789o7318o4810k4692j2599J17034P1561
6357E268785j23297j4801J31931J179j22013n456N8447K0697p9289R9491J5124
6346E250798j55937R1675K10421n9862l8908j12478o652o1095J3661J01471N9407
6335E292501P5474J9230j54739N8222J54570k0378o9989N983N6448k7560J35041
6324E524803q1300K2766J4048P4620j00903m2029l2981q6418R5932J30384K8178
$$ plain form
6313 5547100 5518862 5417911 5430101 5448003 5262857 5269153 5398171 5553963 5600703 5674401 5659217
6302 5659217 5638474 5639652 5554932 5527607 5652359 5667684 5706425 5735325 5760906 5800988 5708823
6291 5708823 5771997 5914675 5934021 5996276 6095096 6129117 6178668 6175504 6099307 6164443 6255458
6280 6255458 6169670 6135190 6206844 6292563 6259275 6249120 6230238 6216830 6303811 6326845 6418981
6269 6418981 6505175 6492268 6368317 6331373 6531802 6570737 6706256 6785772 6850017 6797232 6852903
6258 6852903 7001202 6864489 6868094 7036055 7141422 7152349 7138267 7097227 6984999 6964824 7031692
6247 7031692 7120144 7187741 7122043 7059630 7097129 7341429 7314860 7212322 7189184 7201409 7298479
6236 7298479 7407040 7527189 7420702 7382973 7461386 7560777 7582279 7519382 7607181 7689727 7714749
$$ packed form
6313E547100k8238j00951J2190J7902j85146O296J29018J55792M6740P3698j5184
6302E659217k0743J178q4720k7325J24752J5325L8741K8900K5581M0082r2165
6291E708823O3174J42678J9346O2255R8820L4021M9551l164p6197O5136R1015
6280F255458q5788l4480P1654Q5719l3288j0155j8882j3408Q6981K3034R2136
6269F418981Q6194j2907j23951l6944K00429L8935J35519P9516O4245n2785N5671
6258F852903J48299j36713L605J67961J05367J0927j4082m1040j12228k0175O6868
6247G031692Q8452O7597o5698o2413L7499K44300k6569j02538k3138J2225R7070
6236G298479J08561J20149j06487l7729P8413R9391K1502o2897Q7799Q2546K5022
$$ plain form
6225 7714749 7835255 7751672 7852384 7953652 8083065 8215342 8069026 8014993 8044555 8278314
6215 8278314 8237715 8223280 8259918 8340352 8564843 8443237 8478105 8600319 8774935 8824380 8840186
6204 8840186 8846100 8856538 9005597 8989984 9131982 9123688 9157662 9231541 9256470 9309607 9256708
6193 9256708 9444736 9397119 9327748 9332100 9399219 9567579 9667216 9781685 9939677 10091556 10040761
6182 10040761 9969163 10056917 10120141 10215430 10378642 10520065 10546499 10631719 10759416 10893040
6172 10893040 10903511 10953396 10991560 10986473 11122480 11197723 11247571 11348486 11562158 11573775 11652992
6161 11652992 11721901 11814223 11859372 11852411 11860172 11957803 11951034 11916427 11787536 11804259 11881586 11935697
6149 11935697 11998382 11903007 11986682 12017973 12039317 12156934 12251123 12301495 12397066 12692418 12866098
$$ packed form
6225G714749J20506q3583J00712J01268J29413J32277j46316n4033K9562K33759
6215H278314m0599j4435L6638Q0434K24491j21606L4868J22214J74616M9445J5806
6204H840186N914J0438J49059j5613J41998q294L3974P3879K4929N3137n2899
6193I256708J88028m7617o9371M352O7119J68360R9637J14469J57992J51879n0795
6182A0040761p1598Q7754O3224R5289J63212J41423K6434Q5220J27697J33624
6172A0893040J0471M9885L8164n087J36007P5243M9848J00915K13672J1617P9217
6161A1652992O8909R2322M5149o961P761R7631o769l4607j28891J6723P7327N4111
6149A1935697O2685r5375Q3675L1291K1344J17617R4189N0372R5571K95352J73680
$$ plain form
6138 12866098 13060972 13185300 13099219 13233395 13344570 13182590 13088495 12953276 12759006 12672554
6128 12672554 12567886 12391846 12411694 12222215 12233567 12149599 12019456 11992069 11884264 11887164
6118 11887164 11936883 12201394 12396082 12408260 12521362 12469758 12332585 12423693 12420621 12642754
6108 12642754 12801900 12756673 12917856 13090541 13187097 13399530 13485025 13568359 13654224 13606552
6098 13606552 13506977 13600135 13727514 13621954 13704435 13768205 13757298 13738905 13708628 13632523 13572063
6087 13572063 13641776 13630910 13561645 13650193 13643070 13678921 13736727 13779989 13978683 14100233 14081284
6076 14081284 14093430 14391335 14634971 14867534 14979725 15246402 15485736 15595915 15741921 16018918
6066 16018918 16201017 16278198 16417007 16445428 16425195 16319847 16095242 15866948 15547800 15388804
$$ packed form
6138A2866098J94874J24328q6081J34176J11175j61980r4095j35219j94270q6452
6128A2672554j04668j76040J9848j89479J1352q3968j30143k7387j07805K900
6118A1887164M9719K64511J94688J2178J13102n1604j37173R1108l072K22133
6108A2642754J59146m5227J61183J72685R6556K12433Q5495Q3334Q5865m7672
6098A3606552r9575R3158J27379j05560Q2481O3770j0907j8393l0277p6105o0460
6087A3572063O9713j0866o9265Q8548p123L5851N7806M3262J98694J21550j8949
6076A4081284J2146K97905K43636K32563J12191K66677K39334J10179J46006K76997
6066A6018918J82099P7181J38809K8421k0233j05348k24605k28294l19148j58996
$$ plain form
6056 15388804 15149011 15088705 15112403 14898405 14731859 14749346 14702195 14673554 14618297 14655014 14635516
6045 14635516 14635681 14671424 14652092 14611675 14945105 15210968 15246955 15329048 15491698 15759113 16008423
6034 16008423 16146462 16269860 16289144 16280039 16205946 16044430 15748866 15490671 15358270 15184771
6024 15184771 15052279 14718613 14504688 14236892 14046975 13997776 14130022 13975372 13845515 13723154
6014 13723154 13658787 13549446 13500330 13626020 13560586 13323717 13282968 13283058 13327433 13398943 13543332
6003 13543332 13643568 13500449 13540028 13444898 13367568 13265895 13302377 13237149 13080033 13027502
5993 13027502 12874267 12784871 12638963 12544449 12533259 12392359 12182407 12028525 11897045 11728850
5983 11728850 11891895 11917488 11757008 11722844 11761516 11776712 11716204 11633446 11520296 11639177
$$ packed form
6056A5388804k39793o0306K3698k13998j66546J7487m7151k8641n5257L6717j9498
6045A4635516J65L5743j9332m0417L33430K65863L5987Q2093J62650K67415K49310
6034A6008423J38039J23398J9284r105p4093j61516k95564k58195j32401j73499
6024A5184771j32492l33666k13925k67796j89917m9199J32246j54650j29857j22361
6014A3723154o4367j09341m9116J25690o5434k36869m0749R0M4375P1510J44389
6003A3543332J00236j43119L9579r5130p7330j01673L6482o5228j57116n2531
5993A3027502j53235q9396j45908r4514j1190j40900k09952j53882j31480j68195
5983A1728850J63045K5593j60480l4164L8672J5196o0508q2758j13150J18881
$$ plain form
5973 11639177 11722154 11664925 11578340 11569753 11518159 11529991 11498425 11534695 11549945 11568885 11564498 11521693
5961 11521693 11534824 11532051 11495413 11486082 11430961 11437466 11361469 11361263 11473509 11517258 11503183 11619754
5949 11619754 11535525 11572189 11625491 11674754 11537445 11621179 11593837 11490474 11543039 11545609 11541617
5938 11541617 11455039 11467009 11354523 11459723 11463121 11452846 11438869 11384262 11226433 11179590 11312256
5927 11312256 11447403 11464655 11504959 11541215 11572561 11619531 11613365 11546785 11615398 11636143 11639704
5916 11639704 11543244 11483527 11588914 11671453 11595016 11518003 11497826 11519938 11606463 11572943 11423064
5905 11423064 11410104 11496816 11410601 11382038 11424537 11509420 11557359 11388559 11372118 11389865 11402138
5894 11402138 11381971 11431655 11483173 11546006 11621233 11633487 11565678 11509883 11536304 11644048 11574111
$$ packed form
5973A1639177Q2977n7229q6585q587n1594J1832l1566L6270J5250J8940m387m2805
5961A1521693J3131k773l6638r331n5121O505p5997k06J12246M3749j4075J16571
5949A1619754q4229L6664N3302M9263j37309Q3734k7342j03363N2565K570l992
5938A1541617q6578J1970j12486J05200L398j0275j3977n4607j57829m6843J32666
5927A1312256J35147J7252M0304L6256L1346M6970o166o6580O8613K0745L561
5916A1639704r6460n9717J05387Q2539p6437p7013k0177K2112Q6525l3520j49879
5905A1423064j2960Q6712q6215k8563M2499Q4883M7939j68800j6441J7747J2273
5894A1402138k0167M9684N1518O2833P5227J2254o7809n5795K6421J07744o9937
$$ plain form
5883 11574111 11593384 11658520 11687888 11683018 11676743 11798460 11832621 11757566 11686598 11781729 11843283
5872 11843283 11861255 11843545 11695367 11806689 11740231 11870179 12017789 11876219 11849486 11862600
5862 11862600 11993740 11975110 11950806 11830856 11907450 11934098 11958022 11957701 12054961 12062617 12045708
5851 12045708 12048449 12135973 12056944 12077411 12205878 12337732 12364152 12464920 12532180 12548173 12621710
5840 12621710 12812570 12918851 12885183 13033006 13234227 13365686 13434880 13549717 13716690 13842466
5830 13842466 14112922 14270190 14218888 14331729 14485955 14635805 14857369 14825423 14822092 14827539
5820 14827539 14821379 15003781 15058430 15137710 15140336 15024139 14907394 15076404 15131391 15322601 15469575
5809 15469575 15558487 15665992 15693913 15729490 15832107 15925700 16065408 16246789 16359389 16438819
$$ packed form
5883A1574111J9273O5136K9368m870o275J21717L4161p5055p0968R5131O1554
5872A1843283J7972j7710j48178J11322o6458J29948J47610j41570k6733J3114
5862A1862600J31140j8630k4304j19950P6594K6648K3924l21R7260P656j6909
5851A2045708K741Q7524p9029K0467J28467J31854K6420J00768O7260J5993P3537
5840A2621710J90860J06281l3668J47823K01221J31459O9194J14837J66973J25776
5830A3842466K70456J57268n1302J12841J54226J49850K21564l1946l331N447
5820A4827539o160J82402N4649P9280K626j16197j16745J69010N4987J91210J46974
5809A5469575Q8912J07505K7921L5577J02617R3593J39708J81381J12600P9430
$$ plain form
5799 16438819 16318359 16326540 16348601 16320776 16215449 15947418 15990421 15982677 15913034 15868979 15764737
5788 15764737 15685840 15745497 15730671 15763895 15730433 15727135 15745728 15795638 15926596 15989915 15887703
5777 15887703 15918714 15995928 16030415 16018553 16063518 16103100 16184272 16309325 16291883 16291411 16432075
5766 16432075 16517954 16555547 16545281 16736871 16882094 16861319 16893074 16975391 17206788 17303213 17434812
5755 17434812 17746540 17912831 18107866 18276809 18564363 18717192 18735956 18990050 19215391 19304642
5745 19304642 19378226 19474721 19481419 19470446 19470700 19478742 19456801 19583175 19669082 19760487 19986735 20209998
5733 20209998 20336079 20517955 20832282 21134096 21482778 21976587 22340476 22767327 23392971
5724 23392971 23962695 24656512 25570752 26461882 27298887 28291653 29392054 30181690 30636367
$$ packed form
5799A6438819j20460Q181K2061k7825j05327k68031M3003p744o9643m4055j04242
5788A5764737p8897N9657j4826L3224l3462l298J8593M9910J30958O3319j02212
5777A5887703L1011P7214L4487j1862M4965L9582Q1172J25053j7442m72J40664
5766A6432075Q5879L7593j0266J91590J45223k0775L1755Q2317K31397R6425J31599
5755A7434812L11728J66291J95035J68943K87554J52829J8764K54094K25341Q9251
5745A9304642P3584R6495O698j0973K54Q042k1941J26374Q5907R1405K26248K23263
5733B0209998J26081J81876L14327L01814L48682M93809L63889M26851O25644
5724B3392971N69724O93817R14240Q91130Q37005R92766J100401P89636M54677
$$ plain form
5715 30636367 30651515 30512470 30037257 29497721 28915982 28568613 28040933 27670677 27491499 27471140
5705 27471140 27267530 27160898 27283287 27386869 27687738 28076727 28596269 29018945 29559421
5696 29559421 30284244 30923606 31704618 32640367 33843691 35459217 37299446 39475443 41791038
5687 41791038 44298155 46758698 49069126 50569015 50717761 49803635 48053705 46051979
5679 46051979 44183705 42635907 41256679 39982368 38913585 38115124 37326870 36594384 36020686
5670 36020686 35515759 35075615 34926972 34796061 34816282 34987226 35357190 35843209 36398603 37378190
5660 37378190 38673861 40236872 42141962 44093449 46448041 49111091 51788760 54112698
5652 54112698 55164344 55002814 53629981 51761585 49537271 47536514 45769647 44137131
$$ packed form
5715C0636367J5148j39045m75213n39536n81739l47369n27680l70256j79178k0359
5705B7471140k03610j06632J22389J03582L00869L88989N19542M22676N40476
5696B9559421P24823O39362P81012R35749J203324J615526J840229K175997K315595
5687D1791038K507117K460543K310428J499889J48746r14126j749930k001726
5679D6051979j868274j547798j379228j274311j068783p98461p88254p32486n73698
5670C6020686n04927m40144j48643j30911K0221J70944L69964M86019N55394R79587
5660C7378190J295671J563011J905090J951487K354592K663050K677669K323938
5652E4112698J051646j61530j372833j868396k224314k000757j766867j632516
$$ plain form
5644 44137131 42657492 41180797 39791407 38780166 37854783 36957998 36026497 35444874 34951860
5635 34951860 34640499 34288708 34129923 34196107 34333776 34402773 34648201 35074047 35641679 36401119
5625 36401119 37163671 37954457 38799038 39801234 40617206 41063770 40938892 40666291 40216812
5616 40216812 39648894 39048031 38490589 37973535 37681363 37459373 37126601 36716740 36427650
5607 36427650 36061175 35724348 35454101 35414365 35344917 35229533 35111769 34869537 34882948 34837305
5597 34837305 34681966 34678331 34633049 34595567 34565313 34447358 34556089 34694447 34825859 34995534
5587 34995534 35278390 35603150 35835778 35933971 36145059 36312128 36558366 36784139 36874577 36883572
5577 36883572 36932087 36965552 36969427 37041299 37084381 37106989 37039271 37166800 37080911 37015588 36971472
$$ packed form
5644D4137131j479639j476695j389390j011241r25383q96785r31501n81623m93014
5635C4951860l11361l51791j58785O6184J37669O8997K45428M25846N67632P59440
5625C6401119P62552P90786Q44581J002196Q15972M46564j24878k72601m49479
5616D0216812n67918o00863n57442n17054k92172k21990l32772m09861k89090
5607C6427650l66475l36827k70247l9736o9448j15384j17764k42232J3411m5643
5597C4837305j55339l635m5282l7482l0254j17955J08731J38358J31412J69675
5587C4995534K82856L24760K32628R8193K11088J67069K46238K25773R0438Q995
5577C6883572M8515L3465L875P1872M3082K2608o7718J27529q5889o5323m4116
$$ plain form
5566 36971472 37057961 37303480 37531704 37747966 38010439 38187002 38146176 38228381 38202623 38220803
5556 38220803 38174515 38167931 38118567 38053265 38076834 38091188 38154144 38158539 38046935 37916243 37825340
5545 37825340 37870376 37941096 37769976 37797219 37920445 38156744 38461959 38727462 39091863 39632866
5535 39632866 40313401 41198222 42112569 43061346 43984092 44727829 45279293 45678984 45761313 45359341
5525 45359341 44861239 44299427 43542525 42967549 42261260 41818794 41505008 41147795 40937139
5516 40937139 40764843 40813613 41032511 41334218 41772442 42470863 43258304 44165714 44766665 45140387
5506 45140387 45332653 45386313 45133909 45098739 45293431 45636127 46149931 46467724 46563580 46582777
5496 46582777 46260888 45779370 45133598 44371901 43567924 42978222 42254454 41785228 41378175
$$ packed form
5566C6971472Q6489K45519K28224K16262K62473J76563m0826Q2205k5758J8180
5556C8220803m6288o584m9364o5302K3569J4354O2956M395j11604j30692r0903
5545C7825340M5036P0720j71120K7243J23226K36299L05215K65503L64401N41003
5535C9632866O80535Q84821R14347R48777R22746P43737N51464L99691Q2329m01972
5525D5359341m98102n61812p56902n74976p06289m42466l13786l57213k10656
5516D0937139j72296M8770K18898L01707M38224O98421P87441R07410O00951L73722
5506D5140387J92266N3660k52404l5170J94692L42696N13804L17793R5856J9197
5496D6582777l21889m81518o45772p61697q03977n89702p23768m69226m07053
$$ plain form
5487 41378175 41128396 40835551 40349015 39847783 39377575 38785138 38011638 37360799 36526469
5478 36526469 35932739 35411628 34892179 34419177 34233679 33865612 33548946 33498058 33495312 33599698
5468 33599698 33589064 33716760 34054429 34162983 34163162 34140703 34029913 33957270 33952569 33918896 34019350
5457 34019350 34277394 34557345 34777166 35222896 35795990 36742154 37679569 38910767 40335539
5448 40335539 41976849 43647783 45385127 46357014 46153221 45173776 43730299 41983866 40362583
5439 40362583 39152842 38083544 36925825 35858528 35011748 34210278 33314305 32505812 31896798
5430 31896798 31459062 30920545 30444231 30093656 29803344 29746647 29541118 29351940 29358837 29243247
5420 29243247 29379724 29580555 29616320 29923866 30179822 30495481 31004297 31662746 32354303 33089652
$$ packed form
5487D1378175k49779k92845m86536n01232m70208n92437p73500o50839q34330
5478C6526469n93730n21111n19449m73002j85498l68067l16666n0888k746J04386
5468C3599698j0634J27696L37669J08554J79k2459j10790p2643m701l3673J00454
5457C4019350K58044K79951K19821M45730N73094R46164R37415J231198J424772
5448D0335539J641310J670934J737344R71887k03793r79445j443477j746433j621283
5439D0362583j209741j069298j157719j067297q46780q01470q95973q08493o09014
5430C1896798m37736n38517m76314l50575k90312n6697k05529j89178O897j15590
5420B9243247J36477K00831L5765L07546K55956L15659N08816O58449O91557P35349
$$ plain form
5410 33089652 33766956 34770627 35754278 36632740 37515892 38456459 39375058 40094619 40503770
5401 40503770 40605768 40827544 40535110 40122776 39567630 38994585 38430649 37956795 37565789
5392 37565789 37007249 36632231 36349213 36234114 36110967 36146728 36161984 36234582 36427754 36679292
5382 36679292 36817468 36740140 36604352 36551354 36568809 36511814 36336769 36063792 35582005 35023283
5372 35023283 34260188 33473677 32876440 32190112 31291179 30684541 30067898 29552605 29041210
5363 29041210 28617686 28197668 27806957 27360400 27074562 26844559 26758984 26548894 26371096 26150243
5353 26150243 26019811 26078498 25950076 25847287 25749788 25645889 25556280 25447235 25600373 25659696
5343 25659696 25617888 25440409 25595776 25650945 25816929 25867188 25918463 26097342 26164159 26362823
$$ packed form
5410C3089652O77304J003671R83651Q78462Q83152R40567R18599P19561M09151
5401D0503770J01998K21776k92434m12334n55146n73045n63936m73854l91006
5392C7565789n58540l75018k83018j15099j23147L5761J5256P2598J93172K51538
5382C6679292J38176p7328j35788n2998J7455n6995j75045k72977m81787n58722
5372C5023283p63095p86511n97237o86328q98933o06638o16643n15293n11395
5363B9041210m23524m20018l90711m46557k85838k30003q5575k10090j77798k20853
5353B6150243j30432N8687j28422j02789r7499j03899q9609j09045J53138N9323
5343B5659696m1808j77479J55367N5169J65984N0259N1275J78879O6817J98664
$$ plain form
5333 26362823 26590208 26856582 26902392 27059844 27105529 27014971 26753421 26537552 26299654 26292863
5323 26292863 26059310 25934322 25764809 25744729 25673599 25759334 25797668 25711884 25692055 25843266
5313 25843266 25817885 25775754 25981959 26254807 26582919 26785513 27171255 27568140 27824194 28010030
5303 28010030 28275042 28421995 28510365 28670182 29023940 29252321 29188364 29126181 29126727 29097196 29003171
5292 29003171 28867802 28729910 28569258 28448642 28360568 28175378 28025777 27998428 27885981 27795850
5282 27795850 27914816 28108355 28233425 28386420 28502701 28662083 29080921 29572330 30014467
5273 30014467 30391962 30842454 31266404 31604997 31986148 32237245 32303194 32378151 32390386 32444378
5263 32444378 32397300 32248733 31979824 31592366 31613053 31654072 31774885 32023224 32285863 32674829
$$ packed form
5333B6362823K27385K66374M5810J57452M5685r0558k61550k15869k37898o791
5323B6292863k33553j24988j69513k0080p1130Q5735L8334q5784j9829J51211
5313B5843266k5381m2131K06205K72848L28112K02594L85742L96885K56054J85836
5303B8010030K65012J46953Q8370J59817L53758K28381o3957o2183N46k9531r4025
5292B9003171j35369j37892j60652j20616q8074j85190j49601k7349j12447r0131
5282B7795850J18966J93539J25070J52995J16281J59382M18838M91409M42137
5273C0014467L77495M50492M23950L38593L81151K51097O5949P4957J2235N3992
5263C2444378m7078j48567k68909l87458K0687M1019J20813K48339K62639L88966
$$ plain form
5253 32674829 33069516 33411338 33548901 33890344 34081064 34172017 34392889 34679764 35054109 35708834
5243 35708834 36348915 37293694 38138937 38698630 38973590 39037766 39126451 39299557 39686205 39824916
5233 39824916 39876230 39658408 39313959 39199504 39101365 39290054 39514750 39890916 40572492 41334811
5223 41334811 42080017 42848454 43941726 45142422 46612366 48281568 50021561 51262779
5215 51262779 51651232 51150861 49949482 48312681 46357648 44700291 43098301 41667538
5207 41667538 40218278 38920853 37636986 36351270 35166631 34091357 33250818 32505511
5199 32505511 31885883 31338480 30802772 30104055 29442551 29152321 28829702 28435023 28016799
5190 28016799 27764128 27689651 27623289 27538103 27438511 27555854 27746986 27796407 27873818 28018560
$$ packed form
5253C2674829L94687L41822J37563L41443J90720R0953K20872K86875L74345O54725
5243C5708834O40081R44779Q45243N59693K74960O4176Q8685J73106L86648J38711
5233C9824916N1314k17822l44449j14455r8139J88689K24696L76166O81576P62319
5223D1334811P45206P68437J093272J200696J469944J669202J739993J241218
5215E1262779L88453n00371j201379j636801j955033j657357j601990j430763
5207D1667538j449260j297425j283867j285716j184639j075274q40539p45307
5199C2505511o19628n47403n35708o98717o61504k90230l22619l94679m18224
5190B8016799k52671p4477o6362q5186r9592J17343J91132M9421P7411J44742
$$ plain form
5180 28018560 28244530 28583544 29068840 29556290 29828618 30384169 31044500 31482639 32043978
5171 32043978 32843749 33469107 34111088 35146813 36044370 36932279 37947264 39068078 40405342
5162 40405342 41562617 42966884 44384745 46021647 47760111 49719590 51858367 54273478
5154 54273478 57126185 60434284 64022897 68226878 73307845 79257165 86083380 93623342
5146 93623342 101737409 110428299 118801970 125681775 129475178 129688959 126477148 121180105
5138 121180105 114928378 108495932 102396113 96769458 91577513 86601417 81816300 77066546
5130 77066546 72574454 67928986 63811895 60293877 56981236 54154754 51493877 49043389
5122 49043389 46903119 45161316 43447337 42059686 40619854 39408956 38360344 37422107
$$ packed form
5180B8018560K25970L39014M85296M87450K72328N55551O60331M38139N61339
5171C2043978P99771O25358O41981J035725Q97557Q87909J014985J120814J337264
5162D0405342J157275J404267J417861J636902J738464J959479K138777K415111
5154E4273478K852707L308099L588613M203981N080967N949320O826215P539962
5146I3623342Q114067Q690890Q373671O879805L793403K13781l211811n297043
5138A21180105o251727o432446o099819n626655n191945m976096m785117m749754
5130G7066546m492092m645468m117091l518018l312641k826482k660877k450488
5122D9043389k140270j741803j713979j387651j439832j210898j048612r38237
$$ plain form
5114 37422107 36521883 35808309 35139482 34402853 33716370 33098326 32685697 32178296 31816600
5105 31816600 31563439 31242732 31043343 30986961 30745955 30745390 30626849 30618209 30681977 30967379 31397623
5094 31397623 31755490 32079482 32056334 31625345 31306334 30877244 30505085 30258725 30081851 30005138
5084 30005138 30060147 30240262 30375089 30501274 30698820 31023693 31200317 31000222 30546520 29874140
5074 29874140 29316458 28682923 28207938 27726530 27266762 26803960 26421228 26150131 25834801
5065 25834801 25554840 25304204 25160780 24871428 24860344 25000368 25113359 25293921 25334505 25517355
5055 25517355 25683844 25825795 26080968 26382841 26531764 26753345 26771701 26874169 27115484 27283841
5045 27283841 27489245 27645028 27886794 28170166 28526579 28805515 28962011 29328540 29667842
$$ packed form
5114C7422107r00224p13574o68827p36629o86483o18044m12629n07401l61696
5105C1816600k53161l20707j99389n6382k41006n65j18541q640O3768K85402M30244
5094C1397623L57867L23992k3148m30989l19011m29090l72159k46360j76874p6713
5084C0005138N5009J80115J34827J26185J97546L24873J76624k00095m53702o72380
5074B9874140n57682o33535m74985m81408m59768m62802l82732k71097l15330
5065B5834801k79961k50636j43424k89352j1084J40024J12991J80562M0584J82850
5055B5517355J66489J41951K55173L01873J48923K21581J8356J02468K41315J68357
5045B7283841K05404J55783K41766K83372L56413K78936J56496L66529L39302
$$ plain form
5036 29667842 29916201 30153495 30441143 30922479 31394480 31899799 32499448 33190717 33641996
5027 33641996 34154754 34613111 34957081 35262627 35509239 35603763 35622639 35653253 35663751 35641452
5017 35641452 35490409 35648157 35904449 36209224 36530950 36884653 37184643 37466833 37677456
5008 37677456 37898822 38256323 38436938 38376113 38098929 37838813 37614610 37249687 36903576 36656744
4998 36656744 36231855 35778433 35618624 35335464 35028714 34922749 35006089 35042762 35090859 35235959
4988 35235959 35485202 35603927 35818613 36001770 36072394 35896338 35917780 35756244 35848894 36178131
4978 36178131 36519919 37001610 37627549 38473728 39198080 40034520 40834261 41617700 42102961
4969 42102961 42711536 43008244 42880749 42888155 42734972 42372866 42194301 42077143 41997747 41918874
$$ packed form
5036B9667842K48359K37294K87648M81336M72001N05319N99649O91269M51279
5027C3641996N12758M58357L43970L05546K46612R4524J8876L0614J0498k2299
5017C5641452j51043J57748K56292L04775L21726L53703K99990K82190K10623
5008C7677456K21366L57501J80615o0825k77184k60116k24203l64923l46111k46832
4998C6656744m24889m53422j59809k83160l06750j05965Q3340L6673M8097J45100
4988C5235959K49243J18725K14686J83157P0624j76056K1442j61536R2650L29237
4978C6178131L41788M81691O25939Q46179P24352Q36440P99741P83439M85261
4969D2102961O08575K96708j27495P406j53183l62106j78565j17158p9396p8873
$$ plain form
4959 41918874 41879753 41932181 42097922 41992462 41916662 41809081 41627064 41012905 40467630 39800495
4949 39800495 39190373 38404286 37470741 36610898 35937716 35202319 34367703 33649309 32924338
4940 32924338 32301813 31830163 31302441 30786934 30345937 29789795 29423281 29181255 28821951
4931 28821951 28578273 28137066 27769579 27526282 27332523 27056450 26781048 26569430 26407887
4922 26407887 26315708 26139569 26001260 26006006 26079948 26176013 26186818 26134765 26141671 26162158 26239597
4911 26239597 26295133 26298174 26172503 26089930 25865745 25661957 25585018 25578734 25399354 25174229 25066081
4900 25066081 24986436 24743396 24554126 24473717 24371374 24316559 24229536 24123446 24034270 23987389
4890 23987389 23810314 23556922 23485575 23341682 23223730 23150072 23235852 23099308 23062610 22903488
$$ packed form
4959D1918874l9121N2428J65741j05460p5800j07581j82017o14159n45275o67135
4949C9800495o10122p86087r33545q59843o73182p35397q34616p18394p24971
4940C2924338o22525m71650n27722n15507m40997n56142l66514k42026l59304
4931B8821951k43678m41207l67487k43297j93759k76073k75402k11618j61543
4922B6407887r2179j76139j38309M746P3942R6065J0805n2053O906K0487P7439
4911B6239597N5536L041j25671q2573k24185k03788p6939o284j79380k25125j08148
4900B5066081p9645k43040j89270q0409j02343n4815q7023j06090q9176m6881
4890B3987389j77075k53392p1347j43893j17952p3658Q5780j36544l6698j59122
$$ plain form
4880 22903488 22659704 22527990 22430471 22407817 22472704 22378423 22379327 22378765 22338664 22169026 21961030
4869 21961030 21859040 21713021 21667063 21625644 21484511 21409233 21515150 21361682 21319845 21277410
4859 21277410 21305610 21240440 21329249 21325426 21233513 21400937 21523309 21482832 21541899 21807997 22048189
4848 22048189 22134242 22316481 22463081 22496957 22558235 22583185 22634716 22638407 22848478 23091225 23180891
4837 23180891 23262700 23291940 23353596 23284534 23282998 23302108 23250619 23141991 23309217 23238115 23060389
4826 23060389 22822682 22543368 22293891 22126146 21935516 21623281 21423966 21222475 20986248
4817 20986248 20796659 20677563 20208935 19759931 19488780 19375648 18951331 18758106 18655711
4808 18655711 18388038 18057195 17726928 17500438 17350018 17112574 16840265 16543131 16415565
$$ packed form
4880B2903488k43784j31714r7519k2654O4887r4281R04n62m0101j69638k07996
4869B1961030j01990j46019m5958m1419j41133p5278J05917j53468m1837m2435
4859B1277410K8200o5170Q8809l823r1913J67424J22372m0477N9067K66098K40192
4848B2048189Q6053J82239J46600L3876O1278K4950N1531L691K10071K42747Q9666
4837B3180891Q1809K9240O1656o9062j536J9110n1489j08628J67226p1102j77726
4826B3060389k37707k79314k49477j67745j90630l12235j99315k01491k36227
4817B0986248j89589j19096m68628m49004k71151j13132m24317j93225j02395
4808A8655711k67673l30843l30267k26490j50420k37444k72309k97134j27566
$$ plain form
4799 16415565 16151856 15993987 15707511 15472213 15305206 15156899 14929078 14543550 14309259
4790 14309259 14163947 13902695 13839608 13620772 13468849 13440855 13291096 13044437 12824523 12751491
4780 12751491 12684386 12617142 12493712 12262225 12174204 12008096 11953951 11846557 11679964 11526431
4770 11526431 11516919 11481997 11375675 11240926 11181766 11149078 11010393 10817087 10678718 10664765
4760 10664765 10607194 10583720 10584781 10653407 10653272 10602843 10395800 10384296 10436065 10339682 10186241
4749 10186241 10176770 10056413 10097523 10206481 10166167 10065577 10000856 9911118 10014900 9831644
4739 9831644 9862867 9693679 9515464 9513643 9610009 9686786 9782598 9700344 9510339 9437286 9443148
4728 9443148 9386561 9457920 9548320 9529309 9509866 9461101 9445321 9474721 9458397 9495578 9537604
$$ packed form
4799A6415565k63709j57869k86476k35298j67007j48307k27821l85528k34291
4790A4309259j45312k61252o3087k18836j51923k7994j49759k46659k19914p3032
4780A2751491o7105o7244j23430k31487q8021j66108n4145j07394j66593j53533
4770A1526431r512l4922j06322j34749n9160l2688j38685j93306j38369j3953
4760A0664765n7571k3474J061O8626j35n0429k07043j1504N1769r6383j53441
4749A0186241r471j20357M1110J08958m0314j00590o4721q9738J03782j83256
4739I831644L1223j69188j78215j821R6366P6777R5812q2254j90005p3053N862
4728I443148n6587P1359R0400j9011j9443m8765j5780K9400j6324L7181M2026
$$ plain form
4717 9537604 9606198 9655163 9665626 9600178 9840200 10043172 10221470 10420222 10750460 10874776
4707 10874776 11246513 11667078 12195881 12675862 13171694 13919400 14478998 14868683 14932207 15012368
4697 15012368 14855903 14815143 15009696 15249481 15558365 15973383 16197532 16074851 15921871 15635296
4687 15635296 15062241 14827593 14689323 14665067 14730153 14906113 15100189 15299992 15317659 15373122
4677 15373122 15462688 15218465 15049889 15042638 15018942 15008488 15014794 15113283 15013203 14725182 14370687
4666 14370687 14019195 13419303 12926641 12449271 12004858 11616873 11255037 11114436 10893733
4657 10893733 10738966 10585197 10353461 10117526 9803955 9671075 9612684 9454192 9410328 9338869
4647 9338869 9246864 9176476 9240407 9314897 9195791 9121163 9012473 9082098 8959474 8948554 8978445
$$ packed form
4717I537604O8594M8965J0463o5448K40022K02972J78298J98752L30238J24316
4707A0874776L71737M20565N28803M79981M95832P47706N59598L89685O3524Q0161
4697A5012368j56465m0760J94553K39785L08884M15018K24149j22681j52980k86575
4687A5635296n73055k34648j38270k4256O5086J75960J94076J99803J7667N5463
4677A5373122Q9566k44223j68576p251k3696j0454O306R8489j00080k88021l54495
4666A4370687l51492n99892m92662m77370m44413l87985l61836j40601k20703
4657A0893733j54767j53769k31736k35935l13571j32880n8391j58492m3864p1459
4647I338869r2005p0388O3931P4490j19106p4628j08690O9625j22624j0920K9891
$$ plain form
4636 8978445 9023975 8992825 8843859 8799047 8878218 8976897 9038042 9034336 9081463 9162713 9180027
4625 9180027 9122301 9209148 9276564 9441630 9547500 9619163 9481380 9394870 9481701 9536450 9590726
4614 9590726 9610797 9505958 9521425 9401858 9369636 9488274 9528669 9506092 9428690 9532446 9511168
4603 9511168 9599147 9564439 9572188 9453403 9417325 9293650 9330033 9374181 9250279 9194449 9142779
4592 9142779 8942359 8876671 8880184 8848190 8715226 8712804 8764954 8587292 8353528 8299911 8271382
4581 8271382 8289391 8185091 8093711 7993531 7817481 7681431 7603987 7589398 7533191 7618610 7620911
4570 7620911 7450171 7367211 7356428 7265343 7268758 7169557 7012570 7030705 7031262 6930144 6883980
4559 6883980 7009369 7034609 6923040 6747903 6739244 6720482 6661780 6798810 6757943 6574931 6495243
$$ packed form
4636H978445M5530l1150j48966m4812P9171R8679O1145l706M7127Q1250J7314
4625I180027n7726Q6847O7416J65066J05870P1663j37783q6510Q6831N4749N4276
4614I590726K0071j04839J5467j19567l2222J18638M0395k2577p7402J03756k1278
4603I511168Q7979l4708P749j18785l6078j23675L6383M4148j23902n5830n1670
4592I142779k00420o5688L513l1994j32964k422N2150j77662k33764n3617k8529
4581H271382J8009j04300r1380j00180j76050j36050p7444j4589n6207Q5419K301
4570G620911j70740q2960j0783r1085L415r9201j56987J8135N57j01118m6164
4559F883980J25389K5240j11569j75137q659j8762n8702J37030m0867j83012p9688
$$ plain form
4548 6495243 6539224 6615619 6660627 6569065 6493304 6445473 6447600 6464059 6450628 6369673 6256273
4537 6256273 6228559 6376827 6454550 6492960 6461002 6353844 6335880 6320632 6362838 6473803 6542401
4526 6542401 6439148 6317331 6412893 6405921 6343777 6235893 6195112 6254151 6159273 5993643 5979682
4515 5979682 5946036 5951261 6013245 5890974 5817846 5719316 5725242 5712281 5840871 5818709 5676740
4504 5676740 5663349 5644349 5718972 5613000 5582600 5550001 5551214 5589223 5451472 5489517 5633274
4493 5633274 5789084 5649348 5616633 5562585 5506882 5553542 5459752 5455758 5569832 5517418 5556962
4482 5556962 5603127 5432062 5599875 5692034 5614652 5660913 5671104 5529285 5478578 5487642 5454155
4471 5454155 5443758 5531534 5523077 5458508 5466384 5496579 5506878 5507631 5459656 5396632 5356113 5487694
$$ packed form
4548F495243M3981P6395M5008r1562p5761m7831K127J6459j3431q0955j13400
4537F256273k7714J48268P7723L8410l1958j07158j7964j5248M2206J10965O8598
4526F542401j03253j21817R5562o972o2144j07884m0781N9039r4878j65630j3961
4515E979682l3646N225O1984j22271p3128r8530N926j2961J28590k2162j41969
4504E676740j3391j9000P4623j05972l0400l2599J213L8009j37751L8045J43757
4493E633274J55810j39736l2715n4048n5703M6660r3790l994J14074n2414L9544
4482E556962M6165j71065J67813R2159p7382M6261J0191j41819n0707R064l3487
4471E454155j0397Q7776q457o4569P876L0195J0299P53m7975o3024m0519J31581
$$ plain form
4459 5487694 5522995 5525536 5466460 5514070 5507956 5540687 5639832 5669331 5662548 5715328 5711923 5709646
4447 5709646 5842483 5810909 5945641 6014796 6080757 6087496 6057759 6057135 6102503 6213481 6099094
4436 6099094 6102468 6227201 6319940 6531837 6518100 6613939 6612999 6630119 6661188 6773713 6894235
4425 6894235 6910073 6835139 6861924 6664267 6588640 6609807 6593327 6618058 6529441 6342498 6361214
4414 6361214 6301227 6146500 6118694 6075704 5953648 5869844 5742393 5705171 5672563 5504942 5494306
4403 5494306 5399298 5240699 5189623 5238951 5154458 5199738 5096181 5050404 5020552 5201172 5143034
4392 5143034 5061365 5101663 5138167 5186974 5197531 5136652 5150525 5188444 5330879 5499741 5453692
4381 5453692 5321159 5372430 5397224 5148272 5170464 5025179 5079218 5160672 5035735 5012046 4964929
$$ packed form
4459E487694L5301K541n9076M7610o114L2731R9145K9499o783N2780l405k277
4447E709646J32837l1574J34732O9155O5961O739k9737o24M5368J10978j14387
4436F099094L374J24733R2739K11897j3737R5839r40J7120L1069J12525J20522
4425F894235J5838p4934K6785j97657p5627K1167j6480K4731q8617j86943J8716
4414F361214n9987j54727k7806m2990j22056q3804j27451l7222l2608j67621j0636
4403E494306r5008j58599n1076M9328q4493M5280j03557m5777k9852J80620n8138
4392E143034q1669M0298L6504M8807J0557o0879J3873L7919J42435J68862m6049
4381E453692j32533N1271K4794k48952K2192j45285N4039Q1454j24937k3689m7117
$$ plain form
4370 4964929 4842719 4771190 4829037 4846965 4937367 4920858 4955246 4856569 4828387 4882972 4924425
4359 4924425 4848591 4832399 4794279 4882264 4956871 4925669 4871492 4806999 4911362 4915121 4939320
4348 4939320 5190842 5188648 5062505 5038682 4911703 5000006 5097898 4968051 4874688 4849433 4937824
4337 4937824 5060658 4968477 4896519 4820349 4787656 4829409 4805613 4745422 4922321 5033476 4950360
4326 4950360 4886139 4905047 4939828 4921692 4813953 4936110 5029882 4824568 4740873 4839982 4862064
4315 4862064 4874286 5021970 5055860 5092084 4952712 4986699 5074944 5099312 5095704 5097321 5001697
4304 5001697 4960329 5012886 4976658 4917508 4941690 4930585 4963906 4980768 4960744 4933473 4841970
4293 4841970 4873623 4862381 4784882 4717014 4691566 4611203 4719178 4718710 4777616 4967242 4954738
$$ packed form
4370D964929j22210p1529N7847J7928R0402j6509L4388r8677k8182N4585M1453
4359D924425p5834j6192l8120Q7985P4607l1202n4177o4493J04363L759K4199
4348D939320K51522k194j26143k3823j26979Q8303R7892j29847r3363k5255Q8391
4337D937824J22834r2181p1958p6170l2693M1753k3796o0191J76899J11155q3116
4326D950360o4221J8908L4781j8136j07739J22157R3772k05314q3695R9109K2082
4315D862064J2222J47684L3890L6224j39372L3987Q8245K4368l608J617r5624
4304E001697m1368N2557l6228n9150K4182j1105L3321J6862k0024k7271r1503
4293D841970L1653j1242p7499o7868k5448q0363J07975m68N8906J89626j2504
$$ plain form
4282 4954738 4834097 4897324 4955123 4945210 4886582 4816592 4804288 4811920 4934958 4989154 5071114
4271 5071114 5184005 5054681 4928438 4937148 5097265 5065676 5173507 5156490 5180639 5276839 5146540
4260 5146540 5065731 5216788 5248851 5248584 5240016 5195010 5264916 5309658 5368554 5354566 5291221 5383511
$$ packed form
4282D954738j20641O3227N7799r913n8628o9990j2304P632J23038N4196Q1960
4271E071114J12891j29324j26243Q710J60117l1589J07831j7017K4149R6200j30299
4260E146540q0809J51057L2063k67q568m5006O9906M4742N8896j3988o3345R2290
$$ [...]
##END NTUPLES=NMR SPECTRUM
##END=
