##TITLE=1H_CA-9371-2
 200.13MHz, CDCl3,
 8 sc
 
 20.8.2025
##JCAMPDX= 6.0         $$ Bruker NMR JCAMP-DX V2.0
##DATA TYPE= NMR SPECTRUM
##DATA CLASS= NTUPLES
##ORIGIN= UXNMR, Bruker Analytische Messtechnik GmbH
##OWNER= pz
$$ XWIN-NMR		Version 3.5
$$ Wed Aug 20 15:23:50 2025 Russian Standard Time (UT+4h)  she@DPX200
##.OBSERVE FREQUENCY= 200.1308
##.OBSERVE NUCLEUS= ^1H
##.ACQUISITION MODE= SIMULTANEOUS
##.ACQUISITION SCHEME= undefined
##.AVERAGES= 8
##.DIGITISER RES= 18
##SPECTROMETER/DATA SYSTEM= spect
##.PULSE SEQUENCE= zg30
##.SOLVENT NAME= CDCl3
##.SHIFT REFERENCE= (INTERNAL, CDCl3, 0, 15.4219)
##AUDIT TRAIL= $$ (NUMBER, WHEN, WHO, WHERE, WHAT)
$$ ##TITLE= Audit trail, XWIN-NMR		Version 3.5
$$ ##JCAMPDX= 5.01
$$ ##ORIGIN= Bruker BioSpin GmbH
$$ ##OWNER= she
$$ F:/spectra/data/she/nmr/H-C/1/pdata/1/auditp.txt
$$ ##AUDIT TRAIL=  $$ (NUMBER, WHEN, WHO, WHERE, WHAT)
(   1,<2025-08-20 15:21:37.29 +0400>,<she>,<DPX200>,
      <created by zg, POWCHK disabled, PULCHK disabled
       configuration hash MD5:
       00 E9 B6 7A A2 85 ED C7 34 08 36 98 17 FE 4E 26
       data hash MD5: 16K
       55 DC 7B 69 27 67 D9 7A 51 67 D7 63 1C 03 DF D9>)
(   2,<2025-08-20 15:21:57.84 +0400>,<she>,<DPX200>,
      <Start of raw data processing
       efp BC_mod = 2 LB = 0.25 FT_mod = 6 PKNL = 1 PHC0 = -1566.574 PHC1 = 19.59229 SI = 16K 
       data hash MD5: 16K
       37 E7 6A 41 E2 55 29 C2 83 B2 EF 26 23 18 83 1B>)
(   3,<2025-08-20 15:22:14.84 +0400>,<she>,<DPX200>,
      <pk PHC0 = -7.074815 PHC1 = 10.2 
       data hash MD5: 16K
       5B 9D D9 AB 19 15 77 D0 A1 75 CD C1 E5 54 9E 81>)
(   4,<2025-08-20 15:22:19.10 +0400>,<she>,<DPX200>,
      <abs ABSG = 5 
       data hash MD5: 16K
       7D B7 30 84 9E 63 94 24 39 02 54 75 3B 35 7A 7E>)
$$ ##END=
$$ 
$$ hash MD5
$$ E6 35 1F 28 7E B8 A6 8B 37 AD B9 DE D3 1D E2 A3
##$RELAX= 
##$RELAX= 
##$RELAX= 
##$RELAX= 
##$RELAX= 
##$RELAX= 
$$ Bruker specific parameters
$$ --------------------------
##$DU= <F:/spectra>
##$EXPNO= 1
##$NAME= <H-C>
##$PROCNO= 1
##$TYPE= <nmr>
##$USER= <she>
##$AMP= (0..31)
100 100 100 100 100 100 100 100 100 100 100 100 100 100 100 100 100 100 
100 100 100 100 100 100 100 100 100 100 100 100 100 100 
##$AQSEQ= 0
##$AQ_mod= 1
##$AUNM= <au_zg>
##$AUTOPOS= <>
##$BF1= 200.13
##$BF2= 200.13
##$BF3= 200.13
##$BF4= 200.13
##$BF5= 200.13
##$BF6= 200.13
##$BF7= 200.13
##$BF8= 200.13
##$BYTORDA= 1
##$CFDGTYP= 0
##$CFRGTYP= 5
##$CHEMSTR= <none>
##$CNST= (0..31)
1 1 145 1 1 1 1 1 1 1 1 1 1 1 1 1 1 1 1 1 1 1 1 1 1 1 1 1 1 1 1 1 
##$CPDPRG= <>
##$CPDPRG1= <>
##$CPDPRG2= <>
##$CPDPRG3= <>
##$CPDPRG4= <mlev>
##$CPDPRG5= <mlev>
##$CPDPRG6= <mlev>
##$CPDPRG7= <mlev>
##$CPDPRG8= <mlev>
##$CPDPRGB= <>
##$CPDPRGT= <>
##$D= (0..31)
0 0.7 0 0 0 0 0 0 0 0 0 0.03 0 0 0 0 0 0 0 0 0 0 0 0 0 0 0 0 0 0 0 0 
##$DATE= 1755688896
##$DBL= (0..7)
120 120 120 120 120 120 120 120 
##$DBP= (0..7)
150 150 150 150 150 150 150 150 
##$DBP07= 0
##$DBPNAM0= <>
##$DBPNAM1= <>
##$DBPNAM2= <>
##$DBPNAM3= <>
##$DBPNAM4= <>
$$ [...]
##$SUBNAM3= <"">
##$SUBNAM4= <"">
##$SUBNAM5= <"">
##$SUBNAM6= <"">
##$SUBNAM7= <"">
##$SUBNAM8= <"">
##$SUBNAM9= <"">
##$SW= 18.0517779522481
##$SWIBOX= (0..15)
0 0 2 0 0 0 0 0 0 0 0 0 0 0 0 0 
##$SW_h= 3612.71676300578
##$TD= 16384
##$TD0= 1
##$TE= 0
##$TE2= 300
##$TE3= 300
##$TEG= 300
##$TL= (0..7)
0 120 120 120 120 120 120 120 
##$TP= (0..7)
150 150 150 150 150 150 150 150 
##$TP07= 0
##$TPNAME0= <>
##$TPNAME1= <>
##$TPNAME2= <>
##$TPNAME3= <>
##$TPNAME4= <>
##$TPNAME5= <>
##$TPNAME6= <>
##$TPNAME7= <>
##$TPOAL= (0..7)
0.5 0.5 0.5 0.5 0.5 0.5 0.5 0.5 
##$TPOFFS= (0..7)
0 0 0 0 0 0 0 0 
##$TUNHIN= 0
##$TUNHOUT= 0
##$TUNXOUT= 0
##$USERA1= <user>
##$USERA2= <user>
##$USERA3= <user>
##$USERA4= <user>
##$USERA5= <user>
##$V9= 5
##$VALIST= <valist>
##$VCLIST= <CCCCCCCCCCCCCCC>
##$VD= 0
##$VDLIST= <DDDDDDDDDDDDDDD>
##$VPLIST= <PPPPPPPPPPPPPPP>
##$VTLIST= <TTTTTTTTTTTTTTT>
##$WBST= 1024
##$WBSW= 4
##$XGAIN= (0..3)
0 0 0 0 
##$XL= 0
##$YL= 0
##$YMAX_a= 615195
##$YMIN_a= -879943
##$ZGOPTNS= <>
##$ZL1= 120
##$ZL2= 120
##$ZL3= 120
##$ZL4= 120
##$ABSF1= 15.32274
##$ABSF2= -2.729152
##$ABSG= 5
##$ABSL= 3
##$ALPHA= 0
##$AQORDER= 0
##$ASSFAC= 0
##$ASSFACI= 0
##$ASSFACX= 0
##$ASSWID= 0
##$AUNMP= <proc_1d>
##$AZFE= 0.1
##$AZFW= 0.1
##$BCFW= 0
##$BC_mod= 2
##$BYTORDP= 0
##$COROFFS= 0
##$CY= -3
##$DATMOD= 1
##$DC= 0
##$DFILT= <>
##$DTYPP= 0
##$F1P= 0
##$F2P= 0
##$FCOR= 1
##$FTSIZE= 16384
##$FT_mod= 6
##$GAMMA= 0
##$GB= 0
##$INTBC= 1
##$INTSCL= 3.241238e-09
##$ISEN= 128
##$LB= 0.25
##$LEV0= 0
##$LPBIN= 0
##$MAXI= 10000
##$MC2= 0
##$MEAN= 0
##$ME_mod= 0
##$MI= 1.114404
##$NCOEF= 0
##$NC_proc= -5
##$NLEV= 6
##$NOISF1= 3.799351
##$NOISF2= 2.8
##$NSP= 0
##$NTH_PI= 0
##$NZP= 0
##$OFFSET= 15.4219
##$PC= 1
##$PHC0= -1573.649
##$PHC1= 29.79229
##$PH_mod= 1
##$PKNL= yes
##$PPARMOD= 0
##$PSCAL= 0
##$PSIGN= 0
##$REVERSE= no
##$SF= 200.129519982401
##$SI= 16384
##$SIGF1= 3
##$SIGF2= 2
##$SINO= 0.751879
##$SIOLD= 32768
##$SREGLST= <19F.Aceton>
##$SSB= 0
##$STSI= 16384
##$STSR= 0
##$SW_p= 3612.71676300577
##$SYMM= 0
##$S_DEV= 0
##$TDeff= 16384
##$TDoff= 0
##$TI= <>
##$TILT= no
##$TM1= 0
##$TM2= 0
##$TOPLEV= 0
##$USERP1= <user>
##$USERP2= <user>
##$USERP3= <user>
##$USERP4= <user>
##$USERP5= <user>
##$WDW= 1
##$XDIM= 16384
##$YMAX_p= 406976782
##$YMIN_p= -182558
$$ End of Bruker specific parameters
$$ ---------------------------------
##NTUPLES= NMR SPECTRUM
##VAR_NAME=  FREQUENCY,     SPECTRUM/REAL,   SPECTRUM/IMAG
##SYMBOL=    X,             R,               I
##VAR_TYPE=  INDEPENDENT,   DEPENDENT,       DEPENDENT
##VAR_FORM=  AFFN,          ASDF,            ASDF
##VAR_DIM=   16384,         16384,           16384
##UNITS=     HZ,            ARBITRARY UNITS, ARBITRARY UNITS
##FACTOR=    0.220516191357247, 1,           1
##FIRST=     3086.37740329655, 0,            0
##LAST=      -526.339359709218, 0,           0
##MIN=       -526.339359709218, -182558,     0
##MAX=       3086.37740329655, 406976782,    0
$$ Real data points
##PAGE= N=1
##DATA TABLE= (X++(R..R)), XYDATA
$$ [...]
8113C506484J5200N0457Q6307R0280N6504Q0445J25793O2264J26218J96397Q7571
8102D483920J71015J11616J31735K14090J63580O9707R2116J3530L3873k1885
8092E463297Q9009J43067k5152J3929J4777o9488j13887j46026j52826j48914
8082E067786q9758n86K8614p4038j24612j64350q4018k19289j78474q2561r8282
8071C980432j07052r7226o6041m5358n4257j45178j49379j59785o5471o1535l5840
8060B993310m3294o1922j33990j09449j13805l5140r4550r7387j08120p3407q0565
8049B041681J4072m4511n4867m6798m4331m1261j268r1847j01372n0044k3751
8038A555703j9786n5058Q119q4263l908L1543l5973r3139o9112O56k6890R5102
$$ y = [3506484, 3521684, 3572141, 3658448, 3748728, 3805232, 3885677, 4011470, 4073734, 4199952, 4396349, 4483920, 4654935, 4766551, 4898286, 5112376, 5275956, 5345663, 5437779, 5451309, 5485182, 5463297, 5552306, 5695373, 5670221, 5684150, 5698927, 5629439, 5515552, 5369526, 5216700, 5067786, 4978028, 4977442, 5006056, 4932018, 4807406, 4643056, 4559038, 4339749, 4161275, 4078714, 3980432, 3873380, 3776154, 3710113, 3664755, 3610498, 3465320, 3315941, 3156156, 3090685, 3029150, 2993310, 2950016, 2888094, 2754104, 2644655, 2530850, 2495710, 2401160, 2303773, 2195653, 2122246, 2041681, 2055753, 2011242, 1956375, 1909577, 1865246, 1823985, 1822717, 1730870, 1629498, 1579454, 1555703, 1535917, 1480859, 1488978, 1404715, 1400807, 1432350, 1396377, 1303238, 1234126, 1234782, 1207892, 1302994]
8026A302994l1113l1285o5775n7984L5226K8080n5287J6868J5222m6822J6860
8015A126984N7576J6206j7153r8145j14922Q7615L8220j1411k976J4594q5766
8004A010822j9678P074O8036N038n5481o9109j6621k2478K4519l867n1001P1953
7992I49207m392n8458L1008K6436K5403q1372k73l4174N5947k3978o1456L9009
7980H62907l8948M3406n3603L097m1150M9K5609k2063K0338j2204q1188N9871
7968G66121O3310q2753l2718k6880m1120j3314N6139J2198l020l1231N3167k5595
7956F94304j01445O2569j3611j5342R8152K5085m8707Q995m374p2005p754k91
7944F25576R239j0882J835L5973O573j0712k7655q4361j5872M8047J2789M2871
$$ y = [1302994, 1271881, 1240596, 1174821, 1116837, 1152063, 1180143, 1124856, 1141724, 1156946, 1110124, 1126984, 1184560, 1200766, 1183613, 1085468, 970546, 1058161, 1096381, 1084970, 1081994, 1096588, 1010822, 991144, 998218, 1066254, 1071292, 1015811, 946702, 930081, 907603, 932122, 928255, 877254, 949207, 944815, 886357, 917365, 943801, 969204, 887832, 887559, 853385, 909332, 885354, 823898, 862907, 823959, 867365, 813762, 816859, 775709, 775758, 801367, 779304, 799642, 787438, 706250, 766121, 829431, 746678, 713960, 687080, 645960, 632646, 688785, 700983, 697963, 666732, 719899, 694304, 592859, 655428, 641817, 626475, 724627, 749712, 701005, 710000, 705626, 633621, 625867, 625576, 634815, 623933, 625768, 661741, 668314, 657602, 629947, 545586, 529714, 577761, 590550, 633421]
7932F33421J9939R591k2024k2243n9470Q6135m3633J7444O353P051m5854l0092
7920E56618K3007k287m2083j6671q630J4021N8516m6422N4123l1041K6544K2157
7908F07852n014l3054R0j7797J29k9099o092J1650l6230J9144M0894K1771l7541
7895E36703N3889M2462j9350k3798l2627L0759n2214K1049J2825R376K691L6356
7883F18121j7049M5480L7070k5655l0710k2470j7031K1198M2689l5188j2813M5543
7871F49185l1510j2617K0756m4519l4554J2764P684K0892K2883k3739j3343K8973
7859F02855k5951k7638J00525k136K403J770o6021p4401N2606N5278K9155O9199
7847G17644k1592k7982m185K015L8804J1771q8793N637L303j4937P7121j8838
$$ y = [633421, 653360, 662951, 640927, 618684, 559214, 645349, 601716, 619160, 625513, 632564, 586710, 556618, 579625, 577338, 535255, 518584, 509954, 523975, 582491, 536069, 590192, 559151, 585695, 607852, 602838, 569784, 569874, 552077, 552206, 523107, 517015, 528665, 492435, 511579, 552473, 574244, 536703, 590592, 633054, 613704, 589906, 557279, 588038, 535824, 556873, 569698, 579074, 581765, 618121, 601072, 646552, 683622, 657967, 627257, 604787, 587756, 608954, 651643, 616455, 603642, 649185, 617675, 605058, 625814, 581295, 546741, 559505, 567189, 588081, 610964, 587225, 573882, 602855, 576904, 549266, 649791, 647655, 650058, 651828, 585807, 511406, 564012, 619290, 648445, 717644, 696052, 668070, 663885, 665900, 704704, 716475, 627682, 633319, 636622, 621685, 698806, 679968]
7835F79968J7134j9675N009O123m7349o010J6028L0657K3571P9796M6568j1872
7823H19948o5154N9644P5910k2009L9906l7304m4467k7769J2642o4684L1829J5841
7811G94333l1413o9182k200K6621K2745K0677l6120j6462O5832j1800J1284M5278
7799H19593l4220R4951O3893q5750o8554N7151L8682o3541n6717m421l5771O7990
7787G93286O0382l5740l2999K4802n276k4335P5580k003p321q91K644M8469L9778
7774I36376J9233R552Q7433q6665n1661k0879l5024L8920J9283o3581j9377m2935
7762G90675l8500L0652n3896J9096N183L3392j9086J53875L2824n4620l281M9492
7750I45806j7718J7105q493p0783j6284Q6676K7222J255J3657l609J9820p3886
$$ y = [679968, 697102, 677427, 682436, 688559, 641210, 635200, 651228, 681885, 705456, 785252, 831820, 819948, 754794, 814438, 890348, 868339, 908245, 870941, 826474, 798705, 811347, 746663, 778492, 794333, 762920, 693738, 691538, 718159, 740904, 761581, 725461, 708999, 774831, 763031, 774315, 819593, 785373, 880324, 944217, 858467, 789913, 847064, 885746, 822205, 765488, 761067, 725296, 793286, 853668, 817928, 784929, 809731, 804455, 780120, 855700, 853697, 846376, 845485, 848129, 896598, 936376, 955609, 965161, 1052594, 965929, 914268, 893389, 858365, 897285, 916568, 852987, 833610, 790675, 752175, 782827, 728931, 748027, 753210, 786602, 767516, 921391, 954215, 899595, 896314, 945806, 928088, 945193, 936700, 865917, 849633, 936309, 963531, 964786, 978443, 974834, 994654, 920768]
7738I20768l5208j6074q0571K7128O518o0902J3216L3293m9730m8220O3899j676
7726G72441k9661m3674P2155M1991N9287k3099J4739o3408K1340J7191K5491p4171
7714G90622k1002K0648p7219j8056q995l7538L8069j4895j1261k3140K207R893
7702F49333R5388K0608o573M260k8914J2129N0730N3883l5779n9086K8801l3409
7690G51371r0338J5003N888o075q5057J644J1334o988k0146l9076j3985m8969
7678D74606l0999N9336M2685K2148L0385O2397j3163q54n9740n400P577k3531
7666E65447K6793o048m6527q4899J7533L184M370l2055j7142p1334l224k3689
7654C32409k2380J41j5800P3397j8270K5935N1637j25593o4527N9898M6697M8804
$$ y = [920768, 885560, 869486, 788915, 816043, 822561, 761659, 774875, 808168, 758438, 710218, 774117, 772441, 742780, 699106, 771261, 813252, 872539, 849440, 864179, 800771, 822111, 839302, 864793, 790622, 769620, 790268, 713049, 694993, 685998, 648460, 686529, 671634, 660373, 637233, 639440, 649333, 744721, 765329, 758756, 763016, 734102, 746231, 796961, 850844, 815065, 755979, 784780, 751371, 661033, 676036, 681924, 675849, 590792, 592436, 603770, 596782, 576636, 537560, 523575, 474606, 443607, 502943, 545628, 567776, 598161, 660558, 647395, 646541, 586801, 581401, 588978, 565447, 592240, 586192, 539665, 454766, 472299, 475483, 479853, 447798, 430656, 359322, 356098, 332409, 310029, 310170, 294370, 367767, 349497, 375432, 427069, 301476, 236949, 296847, 343544, 392348]
7642C92348m8862k222P4763j3076o3555m1779j7331L4888K77J3883N6M913J2264
7629C46567J27o0933K4422l9299m08L9116K3690N968o7476k6397r97K175M2352
7616B88907J1338n7283K2702j5151m8057J2566P8987J4540m0937m4292L3051L160
7604B59531j6424N7441p0111j1604L2149j6092n4620O2335L1454J7248J4668k7842
7592B78133k6774k3123O652O4406r059L8167n9278j9507M0299K2546k6280k6574
7580B59608J1017m4388l3657j9082j712l056L2484L387K5197Q4325M2197p0130
7568B86190o5122L617J3135j3828N2586M5085m9233n1359L2120J8154Q618k4605
7556B55358J2342K7158J6510j5387j5880L6183l7566l4439N8948P424J9583l0258
$$ y = [392348, 343486, 341264, 416027, 402951, 339396, 297617, 280286, 315174, 315451, 329334, 329390, 334303, 346567, 346694, 285761, 310183, 270884, 270476, 309592, 333282, 339250, 271774, 245377, 244380, 246555, 288907, 300245, 242962, 265664, 250513, 202456, 215022, 294009, 308549, 267612, 223320, 256371, 259531, 243107, 300548, 230437, 218833, 250982, 234890, 180270, 242605, 274059, 291307, 305975, 278133, 251359, 228236, 234888, 299294, 290235, 328402, 269124, 249617, 289916, 312462, 286182, 259608, 270625, 226237, 192580, 173498, 171786, 168730, 201214, 204601, 229798, 314123, 356320, 286190, 221068, 224685, 237820, 223992, 276578, 321663, 272430, 221071, 253191, 271345, 279963, 255358, 267700, 294858, 311368, 295981, 280101, 316284, 278718, 244279, 303227, 310651, 330234, 299976]
7544B99976J8254L2705n4180J9980J8928o8831P260N1285j4016j4961J6212l5264
7532B77348N9005K8801l3555k6045o0634k8263K7738j1481l30j2392Q355K2296
7520B50843k8327m5114O5167K3351l2747N6002j6381l712l0443L245p9938N9255
7508B21201N2389j6871j0352L1823j219q762P6725j3725l8229K7992L5217m6340
7496C09849k8380J9722j012l8683j3108M6901M2075J2713N1429k303Q372k9577
7484C77998J5344l8526j4989L6683n3882k0676M9148Q0907l1207o2976K6129l5647
7472C28306O651o487j0999m0836j2742K7792L7560j2137J3750o745m2282M7026
7460C28857K8124o992O5868k909K1180j8314k8213L5120Q007J2036K412N575m5668
$$ y = [299976, 318230, 350935, 296755, 316735, 335663, 266832, 274092, 325377, 311361, 296400, 312612, 277348, 336353, 365154, 331599, 305554, 244920, 216657, 244395, 232914, 232584, 220192, 228547, 250843, 222516, 177402, 242569, 265920, 233173, 289175, 272794, 269082, 238639, 241884, 161946, 221201, 273590, 256719, 246367, 278190, 276971, 268209, 344934, 331209, 292980, 320972, 356189, 309849, 281469, 301191, 300179, 261496, 248388, 295289, 337364, 350077, 401506, 399203, 407575, 377998, 393342, 354816, 339827, 376510, 322628, 301952, 351100, 432007, 400800, 337824, 363953, 328306, 334957, 328470, 317471, 276635, 263893, 291685, 329245, 317108, 330858, 324113, 281831, 328857, 356981, 349989, 415857, 412948, 434128, 415814, 387601, 422721, 430728, 442764, 445176, 450751, 405083]
7447D05083l9961m130j5582N1109J1213o4679l8211Q700O8592n91N2602m5009
7435C89136p4197o7754P3325Q3582n3316n400l60L6363L4648j9731L99j6306O1131
7422D41520M7300p6517o2014m0433m0223J4470P334M173K7926O3279K5915j2044
7410D00686j045L1852o2073k9010J6594l9557L2322N755m7295j5721J3257M3010
7398C48775N5202p287n4772j3181L3481L4825l4288k9326M5936L2852O1730J2804
7386D86751J1954j3559l9135o696R8018O607J3710k4634m9905Q1620l9554N2147
7374E77324J9908k8051K8926K4929k2990l0599k3365J1721m0810k8399M0849k3275
7362E06168k0059j6457j6573M8881n2094l466k304k379j2474N911k1372K2809
$$ y = [405083, 365122, 360992, 345410, 396519, 407732, 343053, 304842, 313542, 382134, 381543, 434145, 389136, 314939, 247185, 320510, 404092, 350776, 345376, 345016, 381379, 416027, 396296, 396695, 380389, 441520, 488820, 412303, 350289, 309856, 269633, 284103, 291437, 295610, 323536, 386815, 412730, 400686, 399641, 431493, 369420, 340410, 357004, 317447, 349769, 355524, 308229, 292508, 305765, 348775, 403977, 396690, 341918, 328737, 362218, 397043, 362755, 333429, 379365, 412217, 473947, 486751, 498705, 485146, 446011, 439315, 537333, 543940, 557650, 533016, 483111, 564731, 525177, 577324, 597232, 569181, 598107, 623036, 600046, 569447, 546082, 557803, 516993, 488594, 529443, 506168, 486109, 469652, 453079, 501960, 449866, 446400, 444096, 441717, 429243, 435154, 413782, 436591]
7350D36591m6129p0182J5725O7730j3265l7041k478l9793j1102K9602M4805K3633
7338C98096J9987r9352L6822L093N0412R190J2696k7037j1121O2768n711m0104
7326D09739n1q856K466j6823K529N2817j2596k2803K6150l6763m882K7831O1590
7313D80348O828k8419J8236J23k7155L0058p618k7422J2301J5180Q3463J8981
7301E74904L7690k9296k742J7544k1955p051N4325J3438M7152K6289J9140L3896
7289G63334K86K0034P3959K2492K3662J0651O3273N6593J8458J00506O7184L6349
7277A256781N9076N4850J00196j0339P6948m3863r102L7082n7521L8298p5215
7266A427191o7874o1233j2779K2348o206K9267L2839j12541R98k890n672m7094
$$ y = [436591, 390462, 320280, 336005, 403735, 390470, 353429, 350951, 311158, 300056, 329658, 374463, 398096, 418083, 318731, 355553, 358646, 409058, 418248, 430944, 403907, 392786, 455554, 449843, 409739, 409688, 400832, 403298, 386475, 389004, 441821, 429225, 406422, 432572, 395809, 390927, 418758, 480348, 487176, 458757, 476993, 477116, 449961, 480019, 472401, 444979, 457280, 472460, 555923, 574904, 612594, 583298, 580556, 598100, 576145, 569094, 623419, 636857, 684009, 710298, 729438, 763334, 763620, 783654, 857613, 880105, 903767, 914418, 977691, 1034284, 1052742, 1153248, 1220432, 1256781, 1315857, 1370707, 1470903, 1460564, 1537512, 1493649, 1484547, 1521629, 1464108, 1502406, 1427191, 1359317, 1298084, 1285305, 1307653, 1301447, 1330714, 1363553, 1251012, 1252010, 1249120, 1243448, 1196354]
7254A196354p1221k2375K6071K1918k3720j0947N2155L8251J5622O2576P1858
7243A356542p5875o1291P8311L8225O8155Q9485L3825L0571K5806P4905M827O093
7231A669579L6858j0601M9189R185M914P7818m5403j6565Q7779o2446m8843J19441
7219A870905q557K875m031n3460r8617p6988N9929L7096m6271k8554k413m2305
7207A609609k1097o5842q1581K92K1435l3110n0950Q619j1076n2026Q16k3693
7195A301396q7521k1268M728K2584R728j0176q7969p3865O3698N1975J0791K2162
7183A206263n600N841j9391J920l2272j8151j6508j4648J01350M7485O0208M2084
7171A358581k9800p6005k0402P6708P705M7735J1074M7194J29592p632o433N0488
$$ y = [1196354, 1125133, 1102758, 1128829, 1150747, 1127027, 1116080, 1168235, 1206486, 1222108, 1284684, 1356542, 1280667, 1219376, 1297687, 1335912, 1404067, 1493552, 1527377, 1557948, 1583754, 1658659, 1663486, 1669579, 1706437, 1695836, 1745025, 1754210, 1759124, 1836942, 1791539, 1774974, 1862753, 1800307, 1751464, 1870905, 1862348, 1865223, 1861192, 1807732, 1709115, 1632127, 1692056, 1729152, 1682881, 1654327, 1651914, 1609609, 1588512, 1522670, 1441089, 1441381, 1462816, 1429706, 1378756, 1387375, 1376299, 1324273, 1325089, 1301396, 1213875, 1192607, 1197335, 1219919, 1229647, 1219471, 1131502, 1057637, 1121335, 1173310, 1184101, 1206263, 1200663, 1206504, 1187113, 1189033, 1156761, 1138610, 1122102, 1107454, 1208804, 1256289, 1316497, 1358581, 1328781, 1252776, 1232374, 1309082, 1316787, 1364522, 1375596, 1422790, 1552382, 1544750, 1538317, 1588805]
7159A588805M4485K5078O0475M994l158K9342O6179N5300j0573J5215Q7566N501
7147A969209L0747M718K5748j3884M4171N6560L1769P7601L1610l4201Q8493R0359
7135B402900J0258r132L5149N4308l9465J961j3451n2006k1290J8278Q53o2472
7123B325891m0939K5982q6013r2600j2038q4684k1079K9243L6737j04597o3763
7112A912140m8006m4601L3112J34m5478q9716o3546j1730q2066K1544m2098n1610
7100A488079J7824j517n4942Q421K442J5347J1600P1254L1972q616M0005K8866
7088A650735N4448k9161P1268O803m9693K6204j1948P519N5799k3667m1044o939
7076A710324k1372K8652J2083o1097j755l7349L6125j30660o5521L1247p219j9543
$$ y = [1588805, 1633290, 1658368, 1718843, 1723837, 1720679, 1750021, 1816200, 1871500, 1860927, 1876142, 1963708, 1969209, 1999956, 2004674, 2030422, 2016538, 2060709, 2117269, 2149038, 2226639, 2258249, 2224048, 2312541, 2402900, 2413158, 2404026, 2439175, 2493483, 2454018, 2455979, 2442528, 2390522, 2369232, 2387510, 2388363, 2325891, 2284952, 2310934, 2224921, 2132321, 2120283, 2035599, 2014520, 2043763, 2080500, 1975903, 1912140, 1864134, 1819533, 1852645, 1852779, 1807301, 1717585, 1654039, 1642309, 1560243, 1581787, 1539689, 1488079, 1505903, 1504386, 1449444, 1457865, 1460307, 1475654, 1487254, 1558508, 1590480, 1581864, 1621869, 1650735, 1705183, 1676022, 1747290, 1754093, 1704400, 1730604, 1718656, 1726175, 1781974, 1758307, 1717263, 1710324, 1688952, 1717604, 1729687, 1668590, 1666835, 1629486, 1665611, 1534951, 1469430, 1500677, 1493458, 1473915]
7064A473915j3794k4480o9561r414k9662n6904r3948m1398L6689m5460J9164L8060
7052A183207q8958m8710o6458q88K0060m3625k3924j457k6524k1517J5897q0650
7040H16453K4939j0742l6875k15M3091r073r945L782M4133m861m3232L4408n4880
7027G96983k2136o3509o0862O9400K4021J2267l5101L196p180N4666j468j02015
7015F68262J3891P8986j2608k5375N6224P0804j09202Q212j633Q899j863j5108
7003G39489r3541R6064J9184k1896m805m0903L8711K7755n3319k0092L4888N4249
6991G75784L5051o017R916P1511L0740o3769O5712K8958k487N9517L4810L853
6979A043579J12793L9530Q3034j3890m9450O0122J4823p9205j5243p0222q5011
$$ y = [1473915, 1460121, 1435641, 1366080, 1356666, 1327004, 1270100, 1176152, 1134754, 1171443, 1125983, 1145147, 1183207, 1094249, 1045539, 979081, 978193, 998253, 954628, 930704, 929247, 902723, 881206, 897103, 816453, 841392, 830650, 793775, 793560, 836651, 827578, 817633, 821415, 865548, 860687, 817455, 851863, 796983, 774847, 711338, 650476, 719876, 743897, 756164, 721063, 724259, 717079, 771745, 770277, 668262, 682153, 761139, 748531, 723156, 779380, 850184, 740982, 749194, 747561, 756460, 754597, 739489, 645948, 742012, 761196, 739300, 734495, 693592, 732303, 760058, 706739, 686647, 721535, 775784, 810835, 804818, 814734, 886245, 916985, 853216, 918928, 947886, 945399, 1004916, 1039726, 1043579, 1156372, 1195902, 1278936, 1265046, 1215596, 1275718, 1290541, 1211336, 1196093, 1125871, 1040860]
6968A040860n7968j3466n0998l7676r017K2114r0408J4901L5529l5083j40750
6957F78038N836K4045l7298M863M5320k7685m6756p2578L8597n72N174j1577k9798
6944E75609Q094o1853m592M9562n3231N4315k2924Q887K1809N0391L698q3615
6932E46150K7094m1162K9946k563k8927l6870K8133N1118K7090L8100J660k1438
6920F18331R712l6199p074k3119J339O9498k8884k1240j3016m7332M2070K5180
6908E89266J0898j6886m3658J3408R040J5014J6003p004R70N5655o1720l2843
6896E48143J4619k1561M6676k6038J8689j326J4377m9194N5968Q934k3540Q909
6884E94656K6051k595n4287M0364J7247m4473L875K5188P692n2111N096k3851
$$ y = [1040860, 982892, 969426, 918428, 880752, 871735, 893849, 803441, 818342, 853871, 818788, 678038, 683874, 707919, 670621, 675484, 720804, 693119, 646363, 573785, 612382, 611810, 616984, 605407, 575609, 583703, 521850, 517258, 566820, 513589, 567904, 544980, 553867, 575676, 626067, 629765, 546150, 573244, 532082, 562028, 559465, 530538, 493668, 521801, 572919, 600009, 638109, 639769, 618331, 628043, 591844, 584770, 561651, 562990, 632488, 603604, 582364, 569348, 522016, 564086, 589266, 600164, 583278, 539620, 553028, 562068, 577082, 593085, 586081, 587051, 642706, 580986, 548143, 562762, 541201, 587877, 561839, 580528, 579202, 593579, 544385, 600353, 609287, 585747, 594656, 620707, 618112, 563825, 604189, 621436, 576963, 580838, 606026, 613718, 561607, 566703, 542852]
6872E42852j3667L7134K1081K3557m7665M2661R808K5074r967M879q0560J1594
6860E66781O9353j1727k5281k9877l889J3788j5005L2164N6592k6801L5600M9446
6848G11144j00557o6711J1895j7795Q0805M222Q582J8090l1275j1287j7341k5981
6836E63791J3818q988P2105K3115J9745M03m3422j0138L193l8119M3280j997k8895
6823F07891j6215O1146Q2635j125m3781j214P247k4880n54J0010r409K1582k2154
6810F71179l9544J2776K4657J2801l8171p093K8681K7909j3551j3316L562J2K7097
6797F96999O6156m357r513O662k1129M5581L1521M650m5416J9473j6806J0153
6785G83974P398m5702k5445L1364L7334J5391m6581l201K8871J1388M4997l2473
$$ y = [542852, 529185, 566319, 587400, 610957, 563292, 605953, 615761, 640835, 630868, 635747, 555187, 566781, 636134, 624407, 599126, 569249, 565360, 579148, 564143, 596307, 652899, 626098, 661698, 711144, 610587, 543876, 555771, 537976, 618781, 623003, 631585, 649675, 618400, 607113, 589772, 563791, 577609, 568621, 640726, 663841, 683586, 683989, 640567, 630429, 633622, 595503, 638783, 636786, 607891, 591676, 652822, 735457, 734332, 690551, 689337, 696584, 671704, 671150, 681160, 671751, 693333, 671179, 631635, 644411, 669068, 681869, 643698, 636605, 665286, 693195, 679644, 666328, 669890, 669902, 696999, 763155, 758798, 749285, 755947, 734818, 780399, 811920, 816570, 771154, 790627, 773821, 783974, 791372, 745670, 720225, 751589, 788923, 804314, 757733, 754532, 783403, 794791, 839788, 807315]
6773H07315K9370j1786k9327J283Q542K4285j1046k6336O1537p6651M3281K9364
6761H49831j03317m698P0737L5293M0870M9613o0542k194J4416o557M9210k3464
6749I09198R793l4495M2419N5863L291M6834R115p8340L0581L7883j8589K0007
6737A033560n275K982J1355Q665Q685N2067n048N0602j3207k7903j0161K9325
6725A135647j1264M9455L5101P1759J029k2953l3352R946N1918j853R8474M8340
6713A432247N5927n0162p618m306N7122P7509m2960R298N1135K2906K2760Q8015
6701A711873j7938j5361O9975N078L0632K7423j0509m8237R3001L3700l1868n7656
6689A790113l9730k3209L3840m0307N3813k7570r1662O532J7237K038L651k4016
$$ y = [807315, 836685, 824899, 795572, 796855, 805397, 829682, 818636, 792300, 853837, 777186, 820467, 849831, 746514, 741816, 812553, 847846, 888716, 938329, 877787, 875593, 890009, 883452, 932662, 909198, 918991, 884496, 926915, 982778, 986069, 1032903, 1042018, 963678, 994259, 1032142, 1013553, 1033560, 1028285, 1031267, 1042622, 1051287, 1059972, 1112039, 1106991, 1157593, 1144386, 1116483, 1106322, 1135647, 1124383, 1173838, 1208939, 1280698, 1281727, 1258774, 1225422, 1235368, 1287286, 1285433, 1383907, 1432247, 1488174, 1438012, 1430394, 1426088, 1483210, 1560719, 1517759, 1527057, 1578192, 1601098, 1623858, 1711873, 1693935, 1678574, 1748549, 1753627, 1784259, 1811682, 1801173, 1752936, 1845937, 1879637, 1847769, 1790113, 1750383, 1727174, 1761014, 1720707, 1774520, 1746950, 1655288, 1661820, 1679057, 1681095, 1684746, 1660730]
6677A660730j5483j0914P0015K2442j5511o794j5525j7869m1503l6771N8878K6897
6665A678592K5320J2105o320k705k6642P3455K3375m4154M1702o43j08957P4634
6653A739762Q6505m1773j5583o416K0059k3238m2618j2265L0145J5690k5614J0781
6641A735435J9745P8960P1950L844o4M3703j997O8295l0294L001N4875j4898L365
6628B035920L3356M5127K8791o0058O0429o800k8391L1356Q183n335J1595k7960
6616B126213K1844O6160J9179K7563N9828l0928N069P497O7568P2099O3869O874
6604B512835k3820P3821R1295m4337L0792N025M9329L1095j1460Q832m5512j4599
6592B663296j7810p0645J0750J7129p892m1985K4048m1068j5948j3943K1279M5302
$$ y = [1660730, 1645247, 1634333, 1704348, 1726790, 1711279, 1704485, 1688960, 1671091, 1629588, 1592817, 1651695, 1678592, 1703912, 1716017, 1709697, 1706992, 1680350, 1753805, 1777180, 1733026, 1774728, 1774085, 1665128, 1739762, 1826267, 1784494, 1768911, 1762495, 1782554, 1759316, 1716698, 1704433, 1734578, 1750268, 1724654, 1735435, 1755180, 1834140, 1906090, 1909934, 1909870, 1953573, 1951576, 2019871, 1989577, 1992578, 2047453, 2032555, 2035920, 2069276, 2114403, 2143194, 2083136, 2143565, 2136765, 2108374, 2139730, 2147913, 2142578, 2154173, 2126213, 2148057, 2214217, 2233396, 2260959, 2320787, 2289859, 2294928, 2302425, 2369993, 2442092, 2505961, 2512835, 2489015, 2562836, 2654131, 2609794, 2640586, 2645611, 2694940, 2726035, 2714575, 2723407, 2677895, 2663296, 2645486, 2574841, 2585591, 2602720, 2594828, 2552843, 2576891, 2535823, 2519875, 2505932, 2527211, 2572513]
6580B572513l7485n4062o5959o0470L0504K4737n1681l2960J1719o402l5348l2983
6568B262123J953p2358k3639P5460j7504k0818p4016L8688j4951L4646l8165o110
6556B145309L9525L575k3857j5765p2889k7560J5891J2287q7844K5009J206j6648
6544A998239N1388m4066O4903L9087p950k2115r6171k9187j6742j325J17849N8189
6532B112099j23200P6608K483j8005J466J4561J8342m146N1820l9178j018p4173
6520B017659K4847N9226K8844R6910o8127j69N6966K8439J4418K9272P8462O7043
6508B433790n505L9883O0334J12641P0018R3898J06782J14635N1206N3969O9455
6497C201106M257J9906l2078j1420L4351L6474m0530N1258K3289J08495J39509
$$ y = [2572513, 2535028, 2480966, 2415007, 2354537, 2385041, 2409778, 2358097, 2325137, 2336856, 2330454, 2295106, 2262123, 2264076, 2191718, 2168079, 2243539, 2226035, 2205217, 2131201, 2169889, 2154938, 2189584, 2151419, 2145309, 2184834, 2188409, 2164552, 2148787, 2075898, 2048338, 2064229, 2076516, 1988672, 2013681, 2014887, 1998239, 2049627, 2005561, 2070464, 2109551, 2101601, 2079486, 1983315, 1954128, 1937386, 1936061, 2053910, 2112099, 1988899, 2065507, 2067990, 2049985, 2051451, 2066012, 2084354, 2080208, 2132028, 2092850, 2091832, 2017659, 2042506, 2101732, 2130576, 2227486, 2159359, 2159190, 2216156, 2244595, 2259013, 2288285, 2366747, 2433790, 2428285, 2468168, 2528502, 2641143, 2711161, 2805059, 2911841, 3026476, 3077682, 3131651, 3201106, 3205363, 3225269, 3193191, 3181771, 3216122, 3252596, 3212066, 3263324, 3286613, 3395108, 3534617]
6486C534617J17776P5414L5875O8840L4605k6719o0823q9486r0586p4960j74293
6475C350260j58974q0113n0313j05363m1460j37253j4229o9929n9469K0488j08545
6464B545100l2989K7640l7263l623j355p0250l880K2086J8805n0499N0410K6625
6452B490807j1495k558Q5229L6229K5362K3364M2916J2094J2152O2746J10921
6441B887767P3054L1817O6893J10082Q3547J25834J17772Q8626J83862J06755
6431C876009O7303Q6885l097j20724m8058p5755n2285L184L4668K7902M5687Q5980
6419C927699Q6523P9125Q903j697q8667j16015q6186q1141r3613r5481j23752
6408C415698j30775o2370r5995o3191m5070o7944K698o3253o0562q9600o026M1820
$$ y = [3534617, 3652393, 3727807, 3763682, 3832522, 3867127, 3840408, 3779585, 3690099, 3599513, 3524553, 3350260, 3191286, 3111173, 3060860, 2955497, 2914037, 2776784, 2762555, 2692626, 2633157, 2653645, 2545100, 2512111, 2539751, 2502488, 2498865, 2497510, 2427260, 2423380, 2445466, 2464271, 2413772, 2464182, 2490807, 2479312, 2476754, 2561983, 2598212, 2623574, 2646938, 2689854, 2701948, 2714100, 2776846, 2887767, 2960821, 2992638, 3059531, 3169613, 3253160, 3378994, 3496766, 3585392, 3769254, 3876009, 3943312, 4030197, 4027100, 3906376, 3858318, 3782563, 3730278, 3733462, 3768130, 3796032, 3841719, 3927699, 4014222, 4093347, 4102250, 4100553, 4011886, 3895871, 3809685, 3728544, 3634931, 3539450, 3415698, 3284923, 3222553, 3126558, 3063367, 3018297, 2950353, 2953051, 2889798, 2829236, 2739636, 2733610, 2775430]
6396B775430m5257N30k9723r140J750j6235Q6173k089k3629o077k3126J1717L4175
6383B754499J6823R773k5139M9610j224K3770K2092l9143o1548j7511n7734N0954
6371B725222N5837j7904K7783J5767P677k1508j616K8525l6693k8017j2483P4711
6359B817301N7787N3723J4965P88J3707R35l1505N5690M3409p5852K9813k0146
6347B960615P8935j1442j9078R9846L21K2033J10231O996L497k5976J00498J464
6335C327940J8082P2661O295M9482R277l4937M5153K1913K5164J15928j4713R595
6323C651840N9118k1325N7078K5481P9093L0169k7920Q5445R856k0520O9893M4114
6311D042322M5981k9062k2791l100O7433J07609L8186m9162j6557p014j2959J7565
$$ y = [2775430, 2730173, 2730703, 2700980, 2691840, 2693590, 2677355, 2763528, 2761439, 2737810, 2731733, 2708607, 2720324, 2754499, 2771322, 2781095, 2755956, 2805566, 2804342, 2828112, 2850204, 2811061, 2749513, 2732002, 2674268, 2725222, 2781059, 2763155, 2790938, 2806705, 2814382, 2792874, 2791258, 2819783, 2783090, 2755073, 2742590, 2817301, 2875088, 2928811, 2943776, 2944564, 2958271, 2959206, 2927701, 2983391, 3026800, 2950948, 2980761, 2960615, 3039550, 3028108, 3009030, 3108876, 3109197, 3131230, 3241461, 3248457, 3251954, 3225978, 3326476, 3327940, 3346022, 3418683, 3424978, 3474460, 3483737, 3448800, 3493953, 3515866, 3541030, 3656958, 3642245, 3651840, 3710958, 3689633, 3746711, 3772192, 3851285, 3881454, 3853534, 3938979, 3948835, 3928315, 3998208, 4042322, 4088303, 4059241, 4036450, 4033350, 4100783, 4208392, 4246578, 4197416, 4180859, 4173845, 4160886, 4178451]
6299D178451J07307J09515J0268k3707k7764P4036Q5364M3807R2801N2977n0604
6288D652451J05636L0129o999N2515P911k8005j3219m5866K6642o8909o9416m637
6276D638233q519p0162j0789J0970l7694K7479N7853O0645q1407m9292J461O4751
6264D603529L7834M9332j1905P3107N2649N114J0604K7424j277N2536L7523K0857
6252D957327J5973L7981R9926O2447P8689J57893M5521M4148J21075J73702J38981
6241E933663J34394K48917K19614J55764J32666J69355J14589L1778N3824O374
6231G200938n5967k2043q6583l6164m5770m8450k191J9881l2133K4591O0744N386
6219F982239P977j2128L984M0620Q8527R1873O2982N7196J21262J28911P4738
$$ y = [4178451, 4285758, 4395273, 4405541, 4381834, 4354070, 4428106, 4513470, 4557277, 4650078, 4703055, 4652451, 4758087, 4788216, 4781217, 4833732, 4841643, 4813638, 4800419, 4754553, 4781195, 4712286, 4642870, 4638233, 4629714, 4559552, 4548763, 4559733, 4522039, 4549518, 4607371, 4668016, 4586609, 4537317, 4538778, 4603529, 4641363, 4690695, 4678790, 4751897, 4804546, 4809660, 4820264, 4847688, 4846411, 4898947, 4936470, 4957327, 4973300, 5011281, 5111207, 5173654, 5252343, 5410236, 5455757, 5499905, 5620980, 5794682, 5933663, 6068057, 6316974, 6536588, 6692352, 6825018, 6994373, 7108962, 7140740, 7194564, 7200938, 7144971, 7122928, 7036345, 7000181, 6954411, 6905961, 6903770, 6923651, 6891518, 6916109, 6976853, 6982239, 6990216, 6978088, 6982072, 7022692, 7111219, 7203092, 7266074, 7323270, 7444532, 7573443, 7648181]
6208G648181j864j8766n8338j30633j50811j04781j17085j88660q5782p5470j16460
6197F599531n9040l8586m5145p2834R486K4920k7640Q290k2986O6651j3503L2731
6185F461875R4414P1931Q9066J20716R4732J88418J23937J50254J49407K09065
6175G753815K08247K23308K70564K46479J08329M8569k4914m3003j11347p4050
6165H605997j39663j82355j40603j94405l3274o3917q0181J01957J0977k5230
6155G859303J16791J43621J96297J34149J92990L00204L31386L84384M23682N36390
6145A0619197N49413N67882O03700N89656N55864M51327K33441n0461l68111n69415
6135A3182493o41556n56492m87717m13120k97010l48436k85977k63218m4470m8503
$$ y = [7648181, 7646317, 7627551, 7569213, 7438580, 7287769, 7182988, 7065903, 6877243, 6791461, 6715991, 6599531, 6540491, 6501905, 6456760, 6383926, 6393412, 6418332, 6390692, 6398982, 6375996, 6442647, 6429144, 6461875, 6556289, 6628220, 6717286, 6838002, 6932734, 7121152, 7245089, 7395343, 7544750, 7753815, 7962062, 8185370, 8455934, 8702413, 8810742, 8859311, 8834397, 8791394, 8680047, 8605997, 8466334, 8283979, 8143376, 7948971, 7915697, 7851780, 7771599, 7873556, 7884533, 7859303, 7976094, 8119715, 8316012, 8450161, 8643151, 8943355, 9274741, 9659125, 10082807, 10619197, 11168610, 11736492, 12340192, 12929848, 13485712, 13937039, 14170480, 14120019, 13751908, 13182493, 12540937, 11984445, 11496728, 11083608, 10786598, 10438162, 10152185, 9888967, 9844497, 9795994]
6125I795994r1153L7959r3859P6324J48488Q9291J34209J91193J87458K09957
6115A0685861L34881L47976M49574M83688M49025M01583N32560M33120L19494
6106A4437762K20567j35848m10126m15928m44581l24864l45352j67518k39010
6097A2175102j08224q7030r4952l6491n0708O583J7928n3426J6710R252O0158
6086A1854902M5379N71Q8488Q6265O5000J25275J87968K03568J79730K68437K52175
6075A3357758K24029J95547N3820l615n0507o5634j22231j21253m1536p8099j28089
6064A3220190o6193j60448j11589j37513j67667j86562j02585j03403j65326j63090
6054A1855814j72418j26365j01849n9615p3287j1840O429l5144n5927m6362J4386
$$ y = [9795994, 9704841, 9742800, 9648941, 9725265, 9873753, 9963044, 10097253, 10288446, 10475904, 10685861, 11020742, 11368718, 11818292, 12301980, 12751005, 13152588, 13685148, 14118268, 14437762, 14658329, 14522481, 14112355, 13696427, 13251846, 12926982, 12581630, 12414112, 12175102, 12066878, 11979848, 11884896, 11848405, 11797697, 11804280, 11822208, 11768782, 11785492, 11794744, 11854902, 11900281, 11900852, 11989340, 12075605, 12140605, 12265880, 12453848, 12657416, 12837146, 13105583, 13357758, 13581787, 13777334, 13831154, 13827539, 13777032, 13711398, 13589167, 13467914, 13426378, 13348279, 13220190, 13153997, 12993549, 12881960, 12744447, 12576780, 12390218, 12287633, 12184230, 12018904, 11855814, 11683396, 11557031, 11455182, 11395567, 11322280, 11310440, 11316869, 11281725, 11225798, 11179436, 11193822]
6043A1193822m6440P879l5179o7976m6415R454q209p387K8896p320n3021N1009
6031A1019113l9031p238j33231p0300q4697n4458p7127n1847n9015o7343j8275
6020A0356551N3336N0085J1959J25482J12834J61717J04469N6369O7517J08930
6010A1209249P1489J20911J70134J24618j301l9960J8368j9215j9854L5992J4027
5999A1684458l9944q9045k4960L7050J6325k7657k7202p2139q8314m1691j7764
5988A1309117n839j06790q8510m2670M5528J2892p0664Q5647q5009j62627r2585
5977A0798490r7320o2962j9024J2782j06823k38952j45818j92991k34642j41517
5967I571223j31105j69202j53727j61543k02344j23534j68427j63496m9201l7206
$$ y = [11193822, 11147382, 11155261, 11120082, 11052106, 11005691, 11015145, 11006936, 10999549, 11028445, 11021125, 10968104, 11019113, 10980082, 10972844, 10839613, 10769313, 10684616, 10630158, 10553031, 10501184, 10442169, 10374826, 10356551, 10409887, 10459972, 10471931, 10597413, 10710247, 10871964, 10976433, 11032802, 11100319, 11209249, 11280738, 11401649, 11571783, 11696401, 11695100, 11655140, 11673508, 11654293, 11634439, 11670431, 11684458, 11644514, 11555469, 11530509, 11567559, 11583884, 11556227, 11529025, 11456886, 11368572, 11326881, 11309117, 11303278, 11196488, 11107978, 11065308, 11110836, 11123728, 11053064, 11138711, 11053702, 10891075, 10798490, 10701170, 10638208, 10619184, 10631966, 10525143, 10286191, 10140373, 9947382, 9712740, 9571223, 9440118, 9270916, 9117189, 8955646, 8753302, 8629768, 8461341, 8297845, 8248644, 8211438]
5957H211438j9074k9091q1167p7426j5934J6929N316k8098n8017p5840O9025M5194
5945G963255q9107N701O3421M1118O9464J33687R8438O2963J46963J02958Q0870
5934H679731J51053R8255L560m7529m1764K8028K2538l8867k1872M6712O0584
5923H940429O6246N9797J0736m4039l2413l7364m5430K5046O0115K0736J6427
5912I040286L1061p5853L0495N9602l7608q9204K4245L2468L3040J2347k0048
5901I040831Q6485M9917J09748O5058Q8457P2679J24820J05859J21198J14688
5891I979740J19489J94077J22386P4142L7099K9279P4825O6138R6741L7685O238
5880A0837839l2918n6744P5337J08684P4388N8474L6430K200l9825p720O124j00795
$$ y = [8211438, 8192364, 8163273, 8082106, 8004680, 7988746, 8005675, 8010991, 7982893, 7924876, 7849036, 7918061, 7963255, 7874148, 7879849, 7943270, 7984388, 8053852, 8187539, 8285977, 8348940, 8495903, 8598861, 8679731, 8830784, 8929039, 8932599, 8885070, 8843306, 8871334, 8893872, 8855005, 8833133, 8879845, 8940429, 9006675, 9066472, 9077208, 9033169, 9000756, 8963392, 8917962, 8943008, 9003123, 9023859, 9040286, 9071347, 8995494, 9025989, 9085591, 9047983, 8958779, 8983024, 9015492, 9048532, 9060879, 9040831, 9127316, 9177233, 9286981, 9352039, 9440496, 9513175, 9637995, 9743854, 9865052, 9979740, 10099229, 10293306, 10415692, 10489834, 10526933, 10556212, 10631037, 10697175, 10793916, 10831601, 10837839, 10804921, 10748177, 10823514, 10932198, 11006586, 11065060, 11101490, 11103690, 11063865, 11056145, 11062269, 10961474]
5868A0961474j58124j66798j63295j49831j06381j26739j02238j07561n2256q9623
5858I738628p9510k3917J2296k1387J9843N9308J28436k5736N0712P0476N7546
5847I986695L3079M8135M3240Q3008J22003L5848J09114N1680J7853j3733P8059
5836A0594981k797n6960q9078l929k1452p382j9931M4878O0450n145p4913n5749
5824A0362973j26832j60057j61698j45811j58070k31414j18359p8482j33279j26385
5814H922586m7054j8861j6158j4587J07461L6569K7333j3576o1505r426r4l0256
5802H882432o3740m3039n8741k7749M0800P0098j9865J11339J49120Q0535J26988
5791I248178Q1304J29702J16134J7307L4700o1510n5852l0038k6452N7359O9736
$$ y = [10961474, 10803350, 10636552, 10473257, 10323426, 10217045, 10090306, 9988068, 9880507, 9828251, 9738628, 9659118, 9635201, 9647497, 9626110, 9645953, 9705261, 9833697, 9807961, 9858673, 9929149, 9986695, 10019774, 10067909, 10111149, 10194157, 10316160, 10352008, 10461122, 10512802, 10530655, 10516922, 10594981, 10592184, 10535224, 10446146, 10442217, 10420765, 10413383, 10393452, 10438330, 10498780, 10493635, 10418722, 10362973, 10236141, 10076084, 9914386, 9768575, 9610505, 9379091, 9260732, 9182250, 9048971, 8922586, 8875532, 8856671, 8840513, 8825926, 8933387, 8969956, 8997289, 8983713, 8922208, 8912782, 8912688, 8882432, 8818692, 8775653, 8716912, 8689163, 8729963, 8800061, 8780196, 8891535, 9040655, 9121190, 9248178, 9329482, 9459184, 9575318, 9592625, 9627325, 9565815, 9509963, 9479925, 9453473, 9510832, 9580568]
5780I580568l4868O848O885n851K9383q257n2505j23816j11951q7495j01218j60290
5768H937433l5320j20180j12893p0654p6820q1489j2661l7267K5119j2641j37726
5757H264901l6611m2564r8149l5207j9959j49949j05853r5071r8655r7381q8079
5746G397423o8962n9242l0806O859m9158J4175l8091K3442O990k7936M7409O1422
5734G283525J0684m5970l414k0253K3701K4642L9359J8811P5707L6393K4710L2497
5722G500392N916Q365k862j5420M5600M974P547L6070P6680L8540p030N9562m8268
5709G710066j9532k9942m1406O071o1815P829j8484m3532l6131L7734N9625N0832
5697G621315L2675n8988M9044O2434j1285M2431M2373m2436k6941P0642J74j01720
$$ y = [9580568, 9545700, 9552548, 9559433, 9553582, 9582965, 9574708, 9522203, 9398387, 9286436, 9198941, 9097723, 8937433, 8902113, 8781933, 8669040, 8598386, 8521566, 8440077, 8427416, 8390149, 8415268, 8402627, 8264901, 8228290, 8185726, 8087577, 8052370, 8032411, 7882462, 7776609, 7681538, 7582883, 7485502, 7397423, 7328461, 7269219, 7238413, 7245272, 7196114, 7210289, 7172198, 7195640, 7202630, 7174694, 7222103, 7283525, 7294209, 7248239, 7244825, 7224572, 7248273, 7272915, 7312274, 7331085, 7406792, 7443185, 7467895, 7500392, 7506308, 7514673, 7511811, 7496391, 7541991, 7546965, 7554512, 7590582, 7667262, 7705802, 7698772, 7758334, 7710066, 7690534, 7660592, 7619186, 7625257, 7563442, 7571271, 7552787, 7509255, 7473124, 7510858, 7570483, 7621315, 7653990, 7595002, 7644046, 7706480, 7695195, 7737626, 7779999, 7737563, 7710622, 7781264, 7781438, 7679718]
5685G679718m986L1748q258L0304Q37K4875M6957J0379K8618l0633J5631M4797
5673G869987P2953P7730M6797P38R3765K0324P425J07604J10196J15674N8795
5662H581988J54243K4772J19864K8675j70208j03352n7376o211M514P6018O0840
5651H713767J35855P1448M2589R7914K14245K21332K43816L18305L07389K90407
5641A0657067K32414J37702J66724J34892J1816l6731r6581n3954j75149j04912
5631A0873288m5729m6857K1593p3305q9709j15628p3211n3346K5724k7698l8790
5620A0356332m912j1006L1031l1290P068J9916l4917K4289O8954K6372N7885l1211
5608A0478511m4046j57680q2681j3889j08505j13353j22806j02341j47341q6398
$$ y = [7679718, 7674732, 7706480, 7698222, 7728526, 7729363, 7754238, 7801195, 7811574, 7840192, 7809559, 7825190, 7869987, 7942940, 8020670, 8067467, 8068205, 8161970, 8182294, 8189719, 8297323, 8407519, 8523193, 8581988, 8736231, 8761003, 8880867, 8909542, 8739334, 8635982, 8578606, 8572395, 8576909, 8652927, 8713767, 8849622, 8921070, 8963659, 9061573, 9275818, 9497150, 9740966, 10059271, 10366660, 10657067, 10889481, 11027183, 11193907, 11328799, 11340615, 11303884, 11207303, 11153349, 10978200, 10873288, 10827559, 10780702, 10802295, 10728990, 10639281, 10523653, 10450442, 10397096, 10422820, 10395122, 10356332, 10351420, 10340414, 10371445, 10340155, 10347223, 10367139, 10332222, 10356511, 10425465, 10451837, 10509722, 10478511, 10434465, 10276785, 10194104, 10180215, 10071710, 9958357, 9835551, 9733210, 9585869, 9499471]
5598I499471j24524p4641o6583j15920r3068m7182l0323r730q9131L1273m667
5587H874975q0911J20800M9257L678N0407N8265p8937K9956M0237o232R689Q8360
5575I159544k0217m7568L8420N2745O8927L3056L7623N3071M485o7781m8176j16491
5563I147638n0510n2540l3906J013n4994j9880k9164p6474k8946l7837R5274R835
5551H869509K5266R842N6032O0728N5462J09795M0515N9910R8400J19459J97297
5540I702215L6975j8804L621o9574n1416q4592j03539j35897m0757K0319O4063
5529I322614J9597k1652O4916N4407L1166J16803J16832J49273P9868L2793N2916
5518A0019533Q1420R4550j4087m6578R656m8096K2431k9293K2275P0984N8791
$$ y = [9499471, 9374947, 9300306, 9233723, 9117803, 9024735, 8977553, 8947230, 8937500, 8848369, 8879642, 8874975, 8794064, 8914864, 8964121, 8967799, 9018206, 9076471, 8997534, 9027490, 9067727, 9061495, 9071184, 9159544, 9139327, 9091759, 9130179, 9182924, 9251851, 9284907, 9322530, 9375601, 9380086, 9312305, 9264129, 9147638, 9097128, 9044588, 9010682, 9011695, 8956701, 8936821, 8907657, 8831183, 8802237, 8764400, 8859674, 8869509, 8894775, 8904617, 8960649, 9021377, 9076839, 9186634, 9227149, 9287059, 9385459, 9504918, 9702215, 9739190, 9720386, 9724007, 9654433, 9603017, 9518425, 9414886, 9278989, 9238232, 9258551, 9322614, 9342211, 9320559, 9385475, 9439882, 9471048, 9587851, 9704683, 9853956, 9933824, 9966617, 10019533, 10100953, 10195503, 10181416, 10134838, 10144494, 10096398, 10118829, 10089536, 10111811, 10182795, 10241586]
5507A0241586K1573k0465l5369j20412q1596q3979r6872o8827j11019m1083p0358
5496I533179k5836J052m1055Q3220J16377N994J61819P0407Q4903N0610J9954
5485A0060624O6622M6948R2372R7018J77154J60374J02331k1772L0233M457r2937
5474A0723424n6283k5j2054p3636o2549j10291j66107j40511j22365j68347j62595
5463I648661q9618q1285K9766J5668M6766L8766R3272R3636L6306k2216K4152
5452I833874q12K2547K1869P5545Q6883Q6832J17270K9958j4070j05472k3115
5441A0131309k1021j14101l4863n4877J344Q2868k0976M8254J08841J11371p204
5430A0230945P5480O9609J01608N2826J5429j2357P3408P1620J7182o782P2590
$$ y = [10241586, 10263159, 10242694, 10207325, 10086913, 10005317, 9921338, 9824466, 9755639, 9644620, 9603537, 9533179, 9507343, 9508395, 9467340, 9550560, 9666937, 9672931, 9834750, 9905157, 9990060, 10040670, 10060624, 10127246, 10174194, 10266566, 10363584, 10540738, 10701112, 10803443, 10781671, 10811904, 10816361, 10723424, 10667141, 10667116, 10655062, 10581426, 10518877, 10408586, 10242479, 10101968, 9979603, 9811256, 9648661, 9559043, 9477758, 9507524, 9523192, 9569958, 9608724, 9701996, 9795632, 9831938, 9809722, 9833874, 9833062, 9855609, 9877478, 9953023, 10039906, 10126738, 10244008, 10273966, 10259896, 10154424, 10131309, 10110288, 9996187, 9961324, 9906447, 9907791, 9990659, 9969683, 10017937, 10126778, 10238149, 10230945, 10306425, 10376034, 10477642, 10530468, 10545897, 10533540, 10606948, 10678568, 10695750, 10688968, 10761558]
5419A0761558j1740j60838p8420j34828r6068j32103n5394j28091q2398o9719
5409I811959k4698o7862k8814k1281K5615J6591l9992m2698K3179o9654J9897
5398I602242j4697N0882R3312P1672J03347P7472K0381N7185N8392l3800j1195
5387A0075193k8090l4573L6798K3088O3478J37063J09988R6670M6076O0300j09448
5376A0476543j42854j38260j27106j45182j37106q0282q3533q0902p9763o5964
5366I395591l6991l3657P905l0783L9781L0528K9520J24896P8663Q8603J43307
5355I837363N1155O9524R3805J20247O3616N326M715O4368Q7059P7612l6748K9619
5343A0467661J2953l9058K4233K6850K2026M4458L3773P7388Q7080J35747N3929
$$ y = [10761558, 10749818, 10588980, 10510560, 10375732, 10279664, 10147561, 10092167, 9964076, 9881678, 9811959, 9787261, 9719399, 9690585, 9669304, 9694919, 9711510, 9671518, 9628820, 9651999, 9582345, 9602242, 9587545, 9638427, 9731739, 9803411, 9906758, 9984230, 10004611, 10061796, 10120188, 10086388, 10075193, 10047103, 10012530, 10049328, 10072416, 10135894, 10272957, 10382945, 10479615, 10525691, 10585991, 10476543, 10333689, 10195429, 10068323, 9923141, 9786035, 9705753, 9622220, 9541318, 9461555, 9395591, 9358600, 9324943, 9332848, 9302065, 9341846, 9372374, 9401894, 9526790, 9605453, 9694056, 9837363, 9888518, 9958042, 10051847, 10172094, 10235710, 10241036, 10245751, 10310119, 10397178, 10474790, 10438042, 10467661, 10480614, 10441556, 10465789, 10492639, 10514665, 10559123, 10592896, 10670284, 10757364, 10893111, 10947040]
5332A0947040R883J30915P6310J2501O3373P5246Q5935R2107J20806P8557J0608
5321A1703281M0234M8690P7636O1411J46066J29020J01515L4038P8914J52456
5311A2573261J29862J41579J31186N6192k4390j23996r6744o0515j02370n8681
5301A2565384j5332O5534Q0108R2756K4587N1230J13426O5409J44321J44827J79091
5290A3511341J72172J81314J22543J22993K01591K11762K69044K03712J82634
5281A5179106J96738K26153K52575K72840J97508L56708M08313L51636M61530
5272A7903107N17069M98412O50187N71006N53661M94428L61434L20272J58609
5263B2028185L1243m7156j23073j49124k92638l02202k79514k67156k52364k18960
$$ y = [10947040, 10956923, 11087838, 11164148, 11176649, 11240022, 11315268, 11401203, 11493310, 11614116, 11692673, 11703281, 11743515, 11792205, 11869841, 11931252, 12077318, 12206338, 12307853, 12341891, 12420805, 12573261, 12703123, 12844702, 12975888, 13032080, 13007690, 12883694, 12786950, 12726435, 12624065, 12565384, 12550052, 12615586, 12695694, 12788450, 12813037, 12864267, 12977693, 13043102, 13187423, 13332250, 13511341, 13683513, 13864827, 13987370, 14110363, 14311954, 14523716, 14792760, 14996472, 15179106, 15375844, 15601997, 15854572, 16127412, 16324920, 16681628, 17089941, 17441577, 17903107, 18420176, 18918588, 19568775, 20139781, 20693442, 21187870, 21549304, 21869576, 22028185, 22059428, 22012272, 21889199, 21740075, 21447437, 21145235, 20865721, 20598565, 20346201, 20127241]
5253B0127241j63346k18273j51457j04262j60714k34527j75599j81045j81018
5244A8557000j89563j33494j07745j78056k23864j89426l14176l45588m33019
5235A6442069l54200l64685k92286k85607k83231k08761j93883k20534j84819
5226A4054063j91655k09998j55389j69037k16460k57573k16971j98553k05301
5217A2233126q1238q0031j22019q6899j49710j02366j19553p2191n442l2834o1895
5206A1318948r6642J26445k7330n476R587k2338R23K859J1253k3607j6758J2394
5194A1290258P1403M3094J01913J49706J06271K9289J07747J84831M9607J4149
5184A2148268q090j4328P415K6953J02224N0689J23270O7975Q1930J27089J13610
$$ y = [20127241, 19963895, 19745622, 19594165, 19489903, 19329189, 19094662, 18919063, 18738018, 18557000, 18367437, 18233943, 18126198, 17948142, 17724278, 17534852, 17220676, 16875088, 16442069, 16087869, 15723184, 15430898, 15145291, 14862060, 14653299, 14459416, 14238882, 14054063, 13862408, 13652410, 13497021, 13327984, 13111524, 12853951, 12636980, 12438427, 12233126, 12151888, 12071857, 11949838, 11862939, 11713229, 11610863, 11491310, 11419119, 11413677, 11380843, 11318948, 11222306, 11348751, 11321421, 11315945, 11325532, 11303194, 11304117, 11306976, 11318229, 11294622, 11277864, 11290258, 11361661, 11404755, 11506668, 11656374, 11762645, 11791934, 11899681, 12084512, 12134119, 12148268, 12140178, 12125850, 12133265, 12160218, 12262442, 12313131, 12436401, 12504376, 12586306, 12713395, 12827005]
5173A2827005J23322J71301J56981R9398O9648K8584N2215M00j4312Q6093J29670
5162A3730305J2916P2371J50479M8373L3500N7329k3726j9779N7685J8435K77
5151A4138165L6606J36805M9793N7949J18916J70071J44315J72257J12252J34277
5141A5271406J42402J92817K07818J66435K71874K70358J69449K78437K36072
5132A7207068J83765K63679L14247K84410L24872L34191L10967M00082L42715
5123A9965996K70356L47359L85335L32886K67658L19376N24474N12549M03208
5114B3329197N02971M93499O23546O97149P67104P63907Q11473Q42399R02369
5105B9733614J028769J087568J163282J296349J434456J528560J602045J686030
$$ y = [12827005, 12950327, 13121628, 13278609, 13378007, 13447655, 13476239, 13528454, 13528854, 13514542, 13600635, 13730305, 13743221, 13815592, 13966071, 14014444, 14047944, 14105273, 14081547, 14061768, 14119453, 14137888, 14138165, 14174771, 14311576, 14361369, 14419318, 14538234, 14708305, 14852620, 15024877, 15137129, 15271406, 15413808, 15606625, 15814443, 15980878, 16252752, 16523110, 16692559, 16970996, 17207068, 17390833, 17654512, 17968759, 18253169, 18578041, 18912232, 19223199, 19623281, 19965996, 20236352, 20583711, 20969046, 21301932, 21569590, 21888966, 22413440, 22925989, 23329197, 23832168, 24325667, 24949213, 25646362, 26413466, 27177373, 27988846, 28831245, 29733614, 30762383, 31849951, 33013233, 34309582, 35744038, 37272598, 38874643, 40560673]
5097D0560673J945852K131595K215732K404022K654501L031581L380622L713254
5089F2037832M139266M732657N229956N821052O576506P442014Q249789R222546
5081A13451618J0536986J2025994J3848036J6681466J9859366K2817844K5213072
5074B34434382K7107197K8444768K9484556K9280688K5448858J4924341J218835
5067C90343625j2937339k4909650k8868375k9287922k6349066k2825262k0197720
5060B24968291j7758729j5891662j4420959j2974355j1454925j0050514q701370
5053A33715777p393178o550253n803650n053989m563275l966327l533470l129649
5045I3721986k849806k525460k269803j933934j643421j449598j162956p62260
$$ y = [40560673, 42506525, 44638120, 46853852, 49257874, 51912375, 54943956, 58324578, 62037832, 66177098, 70909755, 76139711, 81960763, 88537269, 95979283, 104229072, 113451618, 123988604, 136014598, 149862634, 166544100, 186403466, 209221310, 234434382, 261541579, 289986347, 319470903, 348751591, 374200449, 389124790, 390343625, 377406286, 352496636, 323628261, 294340339, 267991273, 245166011, 224968291, 207209562, 191317900, 176896941, 163922586, 152467661, 142417147, 133715777, 126322599, 119772346, 113968696, 108914707, 104351432, 100385105, 96851635, 93721986, 90872180, 88346720, 86076917, 84142983, 82499562, 81049964, 79887008, 79124748]
5037G9124748n91813l37137j56306q3655J24077L42689N06574P51634R65421J243044
5027H1889276J512113J710902J801795J857593K059640K232204K452872K612750
5019I8129145K593209K567091K541112K814111L336643M014517M889357N742646
5011A26627831O733571P794611R300906J1102601J3412709J6304929J9684155
5004B10961313K2351659K4516860K6957703K8733542K9352663K8107198K2463642
4997C93444580J1675642J856560q450395j9753641k5266848k6982225k5243462
4990C01280211k1626020j9362566j7017502j4927561j3130695j1434184r653253
4983A94128430q037970o543353n216363m225474l305437k594139k399728k881533
$$ y = [79124748, 78532935, 78195798, 78039492, 77955837, 78079914, 78422603, 78929177, 79680811, 80646232, 81889276, 83401389, 85112291, 86914086, 88771679, 90831319, 93063523, 95516395, 98129145, 100722354, 103289445, 105830557, 108644668, 111981311, 115995828, 120885185, 126627831, 133361402, 141156013, 150456919, 161559520, 174972229, 191277158, 210961313, 233312972, 257829832, 284787535, 313521077, 342873740, 370980938, 393444580, 405120222, 406976782, 398526387, 378772746, 353505898, 326523673, 301280211, 279654191, 260291625, 243274123, 228346562, 215215867, 203781683, 194128430, 186090460, 179547107, 174330744, 170105270, 166799833, 164205694, 161805966, 158924433]
4975A58924433l836953m916042n783049o086735o011780n583703n310843m889885
4967A16505443m555297m312725l995699l662290l336739l084363k821758k474228
4959H8262344k233747k043253j959461j803716j674911j631991j672985j656644
4951G3585636j732026j611004j581670j551914j455083j404582j340056j177959
4943F1731342j072502j004053q55414q60468p27666p32598p02619p01177p65808
4934E4309037p54027q93009j001874j021397j165815j183980j228914j165803
4926D5894218j105269j021089j019448r10182p40896o09588n95338n56226m06755
4917C8929427l91199l47397l98844m34584n09854n82848o69936p66366q66523
$$ y = [158924433, 155087480, 150171438, 144388389, 138301654, 132289874, 126706171, 121395328, 116505443, 111950146, 107637421, 103641722, 99979432, 96642693, 93558330, 90736572, 88262344, 86028597, 83985344, 82025883, 80222167, 78547256, 76915265, 75242280, 73585636, 71853610, 70242606, 68660936, 67109022, 65653939, 64249357, 62909301, 61731342, 60658840, 59654787, 58799373, 57938905, 57211239, 56478641, 55776022, 55074845, 54309037, 53555010, 52662001, 51660127, 50638730, 49472915, 48288935, 47060021, 45894218, 44788949, 43767860, 42748412, 41838230, 41097334, 40487746, 39892408, 39336182, 38929427, 38538228, 38190831, 37791987, 37357403, 36847549, 36264701, 35594765, 34828399, 33961876]
4908C3961876q50808p62512p29144p04217p27201o45591n65062n43320n27671
4899B7906350m62131m40900l89784l90000l43107l76152l22063l20090m26319
4890B4435804m10802m45519m59368k86312k32706k69443k17746j77823j03272
4881B1832813j29427p8657r1473l1172m648m913P5849J67619K84217K08936K64873
4870B2494017L03608L22060K75439J31091j30428l12416n18502o56031n64941
4861B1343897n04733l91328m63309n18615m41085m35023m00087l24688k99015
4852A7566014k46602k35180j37587k01923k07074j49360k08742j46357j65151
4843A5868038k06893k11707j26179r5401m4084r3327j41079j91575j46621j53327
$$ y = [33961876, 33111068, 32348556, 31619412, 30915195, 30187994, 29542403, 28977341, 28434021, 27906350, 27444219, 27003319, 26613535, 26223535, 25880428, 25504276, 25182213, 24862123, 24435804, 24025002, 23579483, 23120115, 22833803, 22601097, 22331654, 22113908, 21936085, 21832813, 21703386, 21624729, 21533256, 21502084, 21497436, 21492523, 21568372, 21735991, 22020208, 22229144, 22494017, 22797625, 23119685, 23395124, 23526215, 23395787, 23083371, 22564869, 21908838, 21343897, 20839164, 20447836, 19984527, 19465912, 19024827, 18589804, 18189717, 17865029, 17566014, 17319412, 17084232, 16946645, 16744722, 16537648, 16388288, 16179546, 16033189, 15868038, 15661145, 15449438, 15323259, 15227858, 15183774, 15090447, 14949368, 14757793, 14611172, 14457845]
4833A4457845j96358o4150j23857k04743n8384r0877j0008o3594p1778j69953
4823A3404143j66736j29121j42506j47496j45967j67105j51933o8779p2312p9918
4813A2132270j24498j01825j06788j16317j14858l1150J08639P1043k6707P2759
4803A1762568O7704J24083J49555J39020Q5772P1027J21813N5812L7121Q9443
4793A2703918J01435J71724K77776L59629K84012L13406L35296L70601M09199
4784A5326996L13403K68625K75965K48005K70906K55997K08602J78021K22068
4775A7568588Q9028J1506m002k5693j8716L9339L0901J55374O1324J66803J72888
4764A8247340P2901P1492j9221k6948n9867n0640m9237q8555n8080n4400j91986
$$ y = [14457845, 14261487, 14197337, 14073480, 13868737, 13810353, 13719476, 13709468, 13645874, 13574096, 13404143, 13237407, 13108286, 12965780, 12818284, 12672317, 12505212, 12353279, 12284500, 12212188, 12132270, 12007772, 11905947, 11799159, 11682842, 11567984, 11536834, 11645473, 11716516, 11689809, 11762568, 11830272, 11954355, 12103910, 12242930, 12328702, 12399729, 12521542, 12577354, 12614475, 12703918, 12805353, 12977077, 13254853, 13614482, 13898494, 14211900, 14547196, 14917797, 15326996, 15640399, 15909024, 16184989, 16432994, 16703900, 16959897, 17168499, 17346520, 17568588, 17657616, 17669122, 17665120, 17639427, 17620711, 17660050, 17690951, 17846325, 17907649, 18074452, 18247340, 18320241, 18391733, 18372512, 18345564, 18285697, 18235057, 18185820, 18097265, 18039185, 17984785, 17792799]
4753A7792799l41203l38768l20307m21829l62461l56254l15496k70181k68685
4744A4797615k54509l19674l33256k65687l37833k83721k40553k98438k57222
4735A2206722k70623k55234k24279j97304j67170k37837j01084j16993j16368
4726A0519830j07909n8920o9219q5759n2551n0234m9862q3696r1567l7041l8679
4715I794393L8574L9884J6940j8253k5592j4548j43069q330J0612o410m1117m8057
4703I595027j5572m9379j3881n2109j04796k2197O4176L3805j8872l180M8295
4692I461317q558K1124K2620N8345J00936K1994Q4032J13073J23402J56865J25962
4681A0281112J596n5694n0974j64175j37408j44209j05912j11432q1205m8027
$$ y = [17792799, 17451596, 17112828, 16792521, 16370692, 16008231, 15651977, 15336481, 15066300, 14797615, 14543106, 14223432, 13890176, 13624489, 13286656, 13002935, 12762382, 12463944, 12206722, 11936099, 11680865, 11456586, 11259282, 11092112, 10854275, 10753191, 10636198, 10519830, 10411921, 10353001, 10283782, 10198023, 10145472, 10095238, 10045376, 9961680, 9870113, 9833072, 9794393, 9832967, 9872851, 9889791, 9871538, 9845946, 9831398, 9688329, 9679999, 9690611, 9684201, 9643084, 9595027, 9579455, 9530076, 9516195, 9464086, 9359290, 9337093, 9401269, 9435074, 9416202, 9413022, 9461317, 9452759, 9473883, 9496503, 9554848, 9655784, 9677778, 9761810, 9874883, 9998285, 10155150, 10281112, 10282708, 10227014, 10176040, 10011865, 9874457, 9730248, 9624336, 9512904, 9431699, 9383672]
4671I383672l9831N158J0226L1521m6872R1373R3465R9651J48784J97726P1271
4660A0046144Q9712R7913P2112P2452K7479J1582o5361j8457m7491k294O1439
4649A0345230O3388L6093l5122K0634J15592m4139m7923k0424o1651n0329m0538
4638A0280811o5935j09911J2917n7402r7195j47185m2963q0511k8266K1740K3174
4627I709274J21204p126L2185L972K6234q8748j9082o2799j02689l7218o2507
4616I512700L5579J4561J18047M6774o4369j8053l4636J7489J7288j2253n2622
4605I580505o5181p3752n2780k551m2834m6363o2730q1251m7381o8380j91042
4594H846260j33207q6537j30812j12679M4367n177j58680p1746m2846j32940j27342
$$ y = [9383672, 9343841, 9348999, 9359225, 9390746, 9343874, 9435247, 9528712, 9628363, 9777147, 9974873, 10046144, 10135856, 10233769, 10305881, 10378333, 10405812, 10417394, 10352033, 10333576, 10286085, 10283791, 10345230, 10408618, 10444711, 10409589, 10430223, 10545815, 10501676, 10453753, 10433329, 10371678, 10321349, 10280811, 10214876, 10104965, 10117882, 10060480, 9963285, 9816100, 9773137, 9692626, 9664360, 9686100, 9709274, 9830478, 9823352, 9855537, 9859509, 9885743, 9796995, 9777913, 9715114, 9612425, 9575207, 9512700, 9548279, 9562840, 9680887, 9727661, 9663292, 9645239, 9610603, 9628092, 9645380, 9633127, 9580505, 9515324, 9441572, 9388792, 9386241, 9343407, 9297044, 9234314, 9153063, 9105682, 9037302, 8846260, 8713053, 8626516, 8495704, 8383025, 8427392, 8422215, 8263535, 8191789, 8148943, 8016003, 7888661]
4583G888661p2763o5032k3617j10269p2451l0269l1278j3091j2464k5759J9641
4572G451309K8224M8013O60Q9260P7676R9342J55177M7564R5110J20754Q2682
4561H295771j7122R3872J21140M3486N2379N0134J29324R3755J07113K2448K1057
4550I013357J5266J9927j5274n1901j7786O2308n6647M5143L8613n7467O3051
4539I058590L0705M0687L403p793O8797J04718P4049K9200k9974P119J2231M8965
4527I440697J076j9492J05288J38126j8384J26289J30713P3767P2962J22026K20893
4516A0393961J76623J98502K20251J99388K79961K74175L29396L97706L96056
4507A2866019M23578M71723N84913P17272R15934R22975J051743J239056J254590
$$ y = [7888661, 7815898, 7750866, 7727249, 7616980, 7544529, 7514260, 7482982, 7469891, 7457427, 7431668, 7451309, 7479533, 7527546, 7528206, 7617466, 7695142, 7794484, 7949661, 7997225, 8092335, 8213089, 8295771, 8278649, 8372521, 8493661, 8537147, 8589526, 8639660, 8768984, 8862739, 8969852, 8992300, 9013357, 9028623, 9048550, 9033276, 8981375, 8963589, 9025897, 8969250, 9014393, 9053006, 8995539, 9058590, 9089295, 9129982, 9133385, 9125592, 9194389, 9299107, 9373156, 9402356, 9372382, 9379501, 9391732, 9440697, 9441773, 9422281, 9527569, 9665695, 9647311, 9773600, 9904313, 9978080, 10051042, 10173068, 10393961, 10570584, 10769086, 10989337, 11188725, 11468686, 11742861, 12072257, 12469963, 12866019, 13289597, 13761320, 14346233, 15063505, 15979439, 16902414, 17954157, 19193213, 20447803]
4498B0447803J313353J263646J234910R96285N30009L3718m28511o78141n74520
4489B4138552n60217k91659j25913j57169K6338J41069K67011L92189N23214N94634
4479B4948049P32879Q21997R87989J101934J248327J513443J640761J866615J959652
4470C6821646K170595K365403K464557K511704K479518K279872J966413J776381
4462E4836089J761750J867993K089513K047431J879979J460004R34147M6316p22437
4453F6200785j386097j915980k143830k156783k060096k030264j769223j673356
4445E1065156j482760j333939j199050r61885p90114o69836m16651k33756j57308
4436D3819857j20569j04974j99487k37348l87793n72002q78016j146374j332671
$$ y = [20447803, 21761156, 23024802, 24259712, 25255997, 25786006, 25819724, 25391213, 24713072, 24138552, 23578335, 23286676, 23160763, 23003594, 23029932, 23171001, 23438012, 23830201, 24353415, 24948049, 25680928, 26502925, 27490914, 28592848, 29841175, 31354618, 32995379, 34861994, 36821646, 38992241, 41357644, 43822201, 46333905, 48813423, 51093295, 53059708, 54836089, 56597839, 58465832, 60555345, 62602776, 64482755, 65942759, 66876906, 66923222, 66200785, 64814688, 62898708, 60754878, 58598095, 56537999, 54507735, 52738512, 51065156, 49582396, 48248457, 47049407, 46087522, 45297408, 44627572, 44210921, 43977165, 43819857, 43699288, 43594314, 43394827, 43157479, 42769686, 42197684, 41319668, 40173294, 38840623]
4427C8840623j267587j257891j199813j063438j001502r56185q32394p54517p41358
4418B9765938o11922n34376m92698m37728l81969l31264l74004k28815k38781
4409B6134381k02059j70351j61591j50889k12724k04832k42158k44214m38997
4400B4106566o42991n43332n48579o28000o44535n23187n05611n41103m73880
4391A9055348m58010m29483l35680l71086l82621l56498l97226l53504l34969
4382A5636271k99276l37400l33222l69705l37160l43821l88769k58145k52084
4373A2716689k67930k66444k60186k88503k24710k17416k22552j62036j50540
4364A0656372j18560j15755j29792j26528p8840j36310l9733n5814j34016j01179
$$ y = [38840623, 37573036, 36315145, 35115332, 34051894, 33050392, 32094207, 31261813, 30507296, 29765938, 29154016, 28619640, 28126942, 27689214, 27307245, 26975981, 26601977, 26373162, 26134381, 25932322, 25761971, 25600380, 25449491, 25236767, 25031935, 24789777, 24545563, 24106566, 23463575, 22920243, 22371664, 21743664, 21099129, 20575942, 20070331, 19529228, 19055348, 18597338, 18167855, 17832175, 17461089, 17078468, 16721970, 16324744, 15971240, 15636271, 15336995, 14999595, 14666373, 14296668, 13959508, 13615687, 13226918, 12968773, 12716689, 12448759, 12182315, 11922129, 11633626, 11408916, 11191500, 10968948, 10806912, 10656372, 10537812, 10422057, 10292265, 10165737, 10086897, 9950587, 9910854, 9855040, 9721024, 9619845]
4354I619845q0391j49021j69316j38840k04537k64623j91940j17486j89406k13753
4344G900532j50028j23609j25260j61949r3372j50494j55562j93661j07977j39302
4334F499318r9121r6004r9424j00661r6656o0999o5988j843r2627j04650o9722
4323E611623j14494j26685K8344j12824q7178l0156j9544o7790n5492m9129o0834
4312D915841n3805j9212J2683o2974J5228n7262n9161J2319L6911m9339j9985
4301D671244L9353N0445p823K5462K6214n6993p2430k807J730K5737K2359O817
4289D729308p4939n6892P7545l9664K5784M7941P932M7255J3864n1351J8158J08932
4277D853873M2892J17957Q5352Q0204L1765L3607J18079J28989R5160K1138O1635
$$ y = [9619845, 9539454, 9390433, 9221117, 9082277, 8877740, 8613117, 8421177, 8303691, 8114285, 7900532, 7750504, 7626895, 7501635, 7339686, 7246314, 7095820, 6940258, 6746597, 6638620, 6499318, 6400197, 6304193, 6204769, 6104108, 6007452, 5946453, 5880465, 5878622, 5785995, 5681345, 5611623, 5497129, 5370444, 5398788, 5285964, 5198786, 5168630, 5149086, 5081296, 5025804, 4976675, 4915841, 4862036, 4842824, 4855507, 4792533, 4807761, 4750499, 4691338, 4703657, 4740568, 4691229, 4671244, 4710597, 4761042, 4753219, 4778681, 4804895, 4747902, 4675472, 4672665, 4674395, 4700132, 4722491, 4729308, 4654369, 4597477, 4675022, 4635358, 4661142, 4709083, 4717015, 4764270, 4778134, 4726783, 4744941, 4853873, 4896765, 5014722, 5100074, 5180278, 5212043, 5245650, 5363729, 5492718, 5587878, 5609016, 5670651]
4266E670651J52939J78808J50267K27951K07796K32194L59426M46146M00665L69977
4256H396820N12818N98566P59229R35467J088947J382201J649183J851409J876250
4247A9050890J901281K116307K175435J906107P87639o47226j695598k206105
4239B3388730k241841j924534j627865j474761j219662j159742r67219r69649
4231A1803457q63917o85711n89015n71581n41022l88407m20470m13851l09508
4222G019975k81237k44684k87895k71458k29872k34147k20514k10181j57511j31939
4212D750537j26849j23112r8665m6251q8359m7110j12024q6068o0600r6280r7057
4201C768162k9211n8204n9347j13257o8070m1807m6551p3105n5556n5933n7879
$$ y = [5670651, 5823590, 6002398, 6152665, 6380616, 6588412, 6820606, 7180032, 7626178, 8026843, 8396820, 8909638, 9508204, 10267433, 11202900, 12291847, 13674048, 15323231, 17174640, 19050890, 20952171, 23068478, 25243913, 27150020, 27937659, 27290433, 25594835, 23388730, 21146889, 19222355, 17594490, 16119729, 14900067, 13740325, 12773106, 11803457, 10939540, 10253829, 9664814, 9093233, 8552211, 8163804, 7743334, 7329483, 7019975, 6738738, 6494054, 6206159, 5934701, 5704829, 5470682, 5250168, 5039987, 4882476, 4750537, 4623688, 4500576, 4401911, 4355660, 4267301, 4220191, 4108167, 4022099, 3961499, 3865219, 3768162, 3738951, 3680747, 3621400, 3508143, 3440073, 3398266, 3351715, 3278610, 3223054, 3167121, 3109242]
4190C109242K2786n6072r3445j3494l7815k8492M1990p2397l2253m770n8691n8876
4178B717713m8978q4117N247K4932j2497o5479J4493k9735m7210m2720R538J6884
4166B458071L2784M5800p9687m6041K2097K3823M5081l7956j1350N897M164P637
4154B470320j8341K3063o3435k1497O0948L7603k9811j06731L1030l816j3180
4143B366153J9185k8770k4331k1315n2424j0534n353M082j0865j0402K6149k6829
4131B224746J9883l986N4927n4687n3694M5788j779k4063j4923K2041L0969j7668
4119B227554J0181k4967q563J2026m0357k6209J5035q500L7882O2856j7182n4161
4107B185595q0915k9615j1382k7277m069q4104k4017O2655m0073j3131q6635q554
$$ y = [3109242, 3132028, 3075956, 2982511, 2969017, 2931202, 2902710, 2944700, 2872303, 2840050, 2835280, 2776589, 2717713, 2668735, 2584618, 2589865, 2614797, 2602300, 2536821, 2551314, 2521579, 2474369, 2431649, 2441187, 2458071, 2490855, 2536655, 2456968, 2410927, 2433024, 2456847, 2501928, 2463972, 2452622, 2458519, 2462683, 2470320, 2451979, 2475042, 2411607, 2390110, 2451058, 2488661, 2458850, 2352119, 2383149, 2379333, 2366153, 2385338, 2356568, 2332237, 2310922, 2258498, 2247964, 2242611, 2246693, 2235828, 2225426, 2251575, 2224746, 2244629, 2240643, 2295570, 2240883, 2187189, 2232977, 2231198, 2207135, 2192212, 2214253, 2245222, 2227554, 2237735, 2212768, 2204205, 2216231, 2175874, 2149665, 2164700, 2156200, 2194082, 2256938, 2239756, 2185595, 2104680, 2075065, 2063683, 2036406, 2032337, 1948233, 1924216, 1986871, 1946798, 1933667, 1847032, 1838478]
4095A838478K079K7665l0117q2258K2953k9672m2073l652O7822m703q9867o220
4083A670435M8192k9949j7670l515j7029l2948k5927k7641N5399l4734O357N3339
4071A644309K5466k6546j72997q9094P9628P0349J0083l118K941M2890n0483L3760
4059A567188k9697o8973n06K4678K253K204o3302L0600L0164k0698l2299m9678
4047A391934J9273M1146q1056J2090K2884l1531k8774L4208M762m9735K4530J0080
4035A369811K8372m7693l068l3488J3316K6311J8467j5922N2408J7627J8023o5974
4023A378190m3161P92P5140J9962k7726L6296N1025m3685q4118K2335k8828n1429
4011A304793j8034M521N5059j8386m6525k25m7512M0762l4553n5619J4694J13839
$$ y = [1838478, 1840557, 1868222, 1838105, 1755847, 1778800, 1749128, 1707055, 1703403, 1771225, 1766522, 1676655, 1670435, 1718627, 1688678, 1671008, 1667493, 1650464, 1617516, 1591589, 1563948, 1619347, 1584613, 1590970, 1644309, 1669775, 1643229, 1470232, 1381138, 1460766, 1531115, 1541198, 1538080, 1541021, 1583911, 1533428, 1567188, 1537491, 1468518, 1468012, 1492690, 1494943, 1497147, 1433845, 1464445, 1494609, 1473911, 1441612, 1391934, 1411207, 1452353, 1371297, 1383387, 1406271, 1374740, 1345966, 1380174, 1384936, 1335201, 1359731, 1369811, 1398183, 1350490, 1347422, 1313934, 1327250, 1353561, 1372028, 1356106, 1408514, 1426141, 1444164, 1378190, 1335029, 1335821, 1410961, 1430923, 1403197, 1439493, 1490518, 1446833, 1362715, 1385050, 1356222, 1304793, 1286759, 1291280, 1346339, 1327953, 1281428, 1281203, 1233691, 1274453, 1239900, 1184281, 1198975, 1312814]
3999A312814M3507r3203p3649K7813j9391j879m686N9009j8915K3842R17l7777
3987A218402J2022J9944R790j7923l9954m1046L0012P660m777n3675N4164L5001
3975A229620L2124m0744m5855o2580L716P8245L7870n6671k0228M159L2820J2659
3963A205135j9394k2134K8246k3219K0698J622j077Q4791O443r656O906K2100
3951A300461L2279r189K3799L0187m8175J7656J8755M94j9948L2184m392m2699
3939A331412k3323K4107L3630n3393n9755P1229R334L1639J0998n4928N9029M3892
3927A423871j4901P76j9214k7497K5182N6337K7812k5005O339K0473J9592l885
3915A489880L016N9349l7518m5344J542J8721p737k9670q381k2905j0494P862
$$ y = [1312814, 1356321, 1263118, 1189469, 1217282, 1197891, 1196012, 1191326, 1250335, 1231420, 1255262, 1256179, 1218402, 1230424, 1250368, 1260158, 1242235, 1202281, 1161235, 1191247, 1198907, 1194130, 1140455, 1194619, 1229620, 1261744, 1221000, 1175145, 1112565, 1116281, 1194526, 1232396, 1175725, 1155497, 1159656, 1192476, 1205135, 1185741, 1163607, 1191853, 1168634, 1189332, 1190954, 1189877, 1274668, 1281111, 1271455, 1278361, 1300461, 1332740, 1323551, 1347350, 1377537, 1329362, 1347018, 1365773, 1366267, 1346319, 1378503, 1374111, 1331412, 1308089, 1332196, 1365826, 1312433, 1252678, 1323907, 1333241, 1364880, 1375878, 1320950, 1379979, 1423871, 1408970, 1409746, 1390532, 1363035, 1388217, 1444554, 1472366, 1447361, 1453700, 1474173, 1493765, 1489880, 1492896, 1552245, 1514727, 1469383, 1470925, 1489646, 1481909, 1452239, 1443858, 1420953, 1410459, 1418321]
3903A418321M5217J286j5040j1544n9639n0087J02267J3692r2894m446k0323K1647
3891A348457k0293L7796N4154n0551j00233q199J7696j0863j4360l1786J1059
3880A232877p8380l1315K1638L4064K4034k9549O3461m567q37k4964l414J3402
3868A216450n213j2326l0245k113j2333L3803L3786K0085m1179L7557M0177n5717
3856A222732l1604M7995K5707m4487L1225K7855k3007j0025L9760J608k1710M2978
3844A309027M5106o0228l5242L8806j5056L4596k929j3290l6803J1842q706K4358
3832A291481n0296L3199J5860n2752j2503K338k0082J2442j4092j958N2765m8635
3820A207767Q273p618J9378o9746Q46j8021K6244n4828m67J1588p3901L0012P5152
$$ y = [1418321, 1463538, 1464824, 1449784, 1438240, 1378601, 1328514, 1430781, 1444473, 1351579, 1347133, 1326810, 1348457, 1328164, 1365960, 1420114, 1369563, 1269330, 1261131, 1278827, 1267964, 1253604, 1221818, 1232877, 1154497, 1123182, 1144820, 1178884, 1202918, 1173369, 1236830, 1232263, 1231426, 1206462, 1203048, 1216450, 1211237, 1198911, 1168666, 1166553, 1154220, 1188023, 1221809, 1241894, 1200715, 1238272, 1278449, 1222732, 1191128, 1239123, 1264830, 1220343, 1251568, 1279423, 1256416, 1246391, 1286151, 1287759, 1266049, 1309027, 1354133, 1293905, 1258663, 1297469, 1282413, 1317009, 1314080, 1300790, 1263987, 1275829, 1267123, 1291481, 1241185, 1274384, 1290244, 1237492, 1224989, 1227327, 1207245, 1219687, 1205595, 1203637, 1256402, 1207767, 1216040, 1208422, 1227800, 1158054, 1158900, 1140879, 1167123, 1112295, 1111828, 1123416, 1049515, 1079527, 1154679]
3807A154679o6495m9500L8716K8132J9900M1928l2322J4539K9197j30744p2307
3796I75723L7338L9260j5318N800j7833n936K317K3189L9285n6690k8220J6122
3784A015037l5972N3057J2857K352K5257j10552j6949M3763J7972J2686n94J095
3772A020009q407j2417q0112K4198J6615K0493k9572j7426o239j9227n928P0830
3760I72817j525m8448m4965L8328M809j5189N3823J9326J2029j4627n9465l1174
3748H85739k183j7263K4019J7339k7176K7843k0339l5337O839N7462k4604J6239
3736I08578N5942j5278J138m718j1996j5826Q585J043J6971M638m863Q233q605
3723I43842j1806P586K9380N469j2487K870J456M0841M7824K8979l967j4846m1732
$$ y = [1154679, 1088184, 1038684, 1077400, 1105532, 1125432, 1167360, 1135038, 1149577, 1178774, 1048030, 975723, 1013061, 1052321, 1037003, 1042803, 1024970, 1019034, 1021351, 1044540, 1083825, 1027135, 998915, 1015037, 979065, 1032122, 1044979, 1047331, 1072588, 962036, 945087, 988850, 1006822, 1019508, 1018914, 1020009, 1011602, 999185, 919073, 943271, 959886, 980379, 950807, 933381, 927142, 907915, 901987, 972817, 971292, 922844, 877879, 916207, 921016, 905827, 959650, 978976, 991005, 976378, 916913, 885739, 883556, 866293, 890312, 907651, 880475, 908318, 887979, 852642, 859481, 916943, 892339, 908578, 964520, 949242, 950380, 945662, 933666, 917840, 926425, 927468, 944439, 949077, 944214, 952447, 943842, 932036, 939622, 969002, 974471, 961984, 964854, 966310, 1007151, 1054975, 1083954, 1079987, 1065141, 1023409]
3710A023409Q9446n4679p356L3105l0759J3128L6687m9955J0359k2037q068L8890
3698A072170J7712m7342l9145o560L2953J7359j328p30j5836L0107R115K9421
3686A097896r065k3632j931P4996m052J8004j3581j7057O5314Q0510k382M3002
3674A308022l3171j3333P0706k528O2555j1186l9297o432j3886N3300O2860j6870
3662A420740K0697l2406M9280k8107N3510M1560q448Q314K2274O0987n8617K1914
3650A571698L006O8783L4271l3567r6270J9727L9578j0359J6979m189Q281L4948
3638A652886K1564k2276J213J3875J7194n802m2058n2678K5437K4494O0788O2293
3626A756930k4355J2101N8780j3030K6994L6270Q722Q3910P1517j145j2673O6745
$$ y = [1023409, 1112855, 1058176, 1050820, 1083925, 1053166, 1066294, 1102981, 1053026, 1063385, 1041348, 1033280, 1072170, 1089882, 1042540, 1003395, 996835, 1029788, 1047147, 1045819, 1045089, 1029253, 1059360, 1068475, 1097896, 1088831, 1065199, 1063268, 1138264, 1134212, 1152216, 1138635, 1121578, 1186892, 1267402, 1265020, 1308022, 1274851, 1261518, 1332224, 1329696, 1392251, 1381065, 1341768, 1335336, 1321450, 1374750, 1437610, 1420740, 1441437, 1409031, 1458311, 1430204, 1483714, 1525274, 1516826, 1525140, 1547414, 1608401, 1549784, 1571698, 1574704, 1643487, 1677758, 1644191, 1547921, 1567648, 1607226, 1596867, 1613846, 1609657, 1617938, 1652886, 1674450, 1652174, 1653387, 1667262, 1684456, 1678654, 1636596, 1583918, 1609355, 1633849, 1694637, 1756930, 1732575, 1744676, 1803456, 1790426, 1817420, 1853690, 1862412, 1946322, 2017839, 2016694, 2004021, 2070766]
3614B070766L6285r229m7565O1128k4470O1987O3533L0961L7336J0737K1221L3932
3602B346622j1860L9022L0246K7176N8824K811Q3679L6811P0868N7102P1544O9388
3590B882233J51967N0716N1481M4366Q3282J43889Q4949Q2144J07569J72671Q0045
3579C935312M5765J22492J21874K00284J70820J66254L03668K76845K56398L03199
3569E902911L87221M11884N78936O04035N72498O35461O52713O80623N01589P9955
3559A1007826j93700m31816m57665l59517k93154j73999j82763j34689q9778m8107
3549H642638k086P6996J35564J34606K46542K66031L33006M13236M76120N70082
3539A1292735O68047P29416Q23800J147608J250556J286198J360531J418292J413087
$$ y = [2070766, 2107051, 2097822, 2050257, 2111385, 2086915, 2148902, 2212435, 2243396, 2280732, 2291469, 2312690, 2346622, 2334762, 2373784, 2404030, 2431206, 2490030, 2492841, 2576520, 2613331, 2684199, 2741301, 2812845, 2882233, 3034200, 3084916, 3136397, 3180763, 3264045, 3407934, 3492883, 3575027, 3682596, 3855267, 3935312, 3981077, 4103569, 4225443, 4425727, 4596547, 4762801, 5066469, 5343314, 5599712, 5902911, 6290132, 6702016, 7280952, 7884987, 8457485, 9092946, 9745659, 10426282, 10927871, 11007826, 10814126, 10382310, 9924645, 9565128, 9271974, 9097975, 8915212, 8780523, 8690745, 8642638, 8640552, 8717548, 8853112, 8987718, 9234260, 9500291, 9833297, 10246533, 10722653, 11292735, 11960782, 12690198, 13513998, 14661606, 15912162, 17198360, 18558891, 19977183, 21390270]
3530B1390270J480936J208486O88499l20410q42724j250423j235248j078647j057587
3521A8983152q71664q89095q08244p14999o66844o34674n35221m32924l63610
3512A3065877l84403l00421k88587j47532r5625J7218N1818J30265J91668L63334
3502A2603612L34817L90612L61198M36209M15598L56785K91637j79443o41197
3493A4369828p50479p84597o51409o22339m79975l95337m45084m64685m08966
3484I366957l82770l57674l00569k63860k48344k47541j44529j88798r2158j28283
3474G012431j13310j01180l3157l3781l4097m2973j31593m2898j02447n4439j00864
3463F221692k10603j13027j37005j86483j67844j18379j63295o7638j53413o810
$$ y = [21390270, 22871206, 24079692, 24768191, 24447781, 23605057, 22354634, 21119386, 20040739, 18983152, 18111488, 17222393, 16414149, 15699150, 15032306, 14397632, 13862411, 13429487, 13065877, 12681474, 12381053, 12092466, 11944934, 11849309, 11866527, 11918345, 12048610, 12240278, 12603612, 12938429, 13329041, 13690239, 14126448, 14542046, 14898831, 15190468, 15011025, 14369828, 13619349, 12834752, 12183343, 11561004, 11081029, 10685692, 10240608, 9775923, 9366957, 8984187, 8626513, 8325944, 8062084, 7813740, 7566199, 7421670, 7232872, 7140714, 7012431, 6899121, 6797941, 6764784, 6731003, 6696906, 6653933, 6522340, 6479442, 6376995, 6322556, 6221692, 6011089, 5898062, 5761057, 5574574, 5406730, 5288351, 5125056, 5057418, 4904005, 4897195]
3453D897195j42761j59907j45578j39026l0364j21310j10905q6232j9868r0658
3443C850586k2961j5785r1469j05162j28057l2964k4627n8770n3932k6257j00373
3432C190229o1966J3469m9627j6627R60j13143l1697j621J404j03473n2448P380
3420B782840k5093m895m4268j4753l9970l1660l6915J5236p4145n4937l5496j4982
3408B420962k5819K1016l4431k5082j5106m8340j9303J0605j1027K481M6155q263
3396B313848L134o010m877k2886L7669k5022J5920L5551m149P6541m3936o0298
3384B315485Q486L1805l9577j5359l3771J8365j8488k7709m406J6941K3652k4181
3372B251243j6180n0982l3478q2775o0365L0512k5849q992K4522l1212J2298K0229
$$ y = [4897195, 4754434, 4594527, 4448949, 4309923, 4279559, 4158249, 4047344, 3961112, 3941244, 3850586, 3827625, 3811840, 3720371, 3615209, 3487152, 3454188, 3429561, 3370791, 3316859, 3290602, 3190229, 3128263, 3141732, 3092105, 3075478, 3076438, 2963295, 2931598, 2929977, 2931381, 2827908, 2775460, 2782840, 2757747, 2752852, 2708584, 2693831, 2653861, 2622201, 2585286, 2600522, 2526377, 2471440, 2435944, 2420962, 2395143, 2416159, 2381728, 2356646, 2341540, 2293200, 2273897, 2284502, 2273475, 2275956, 2322111, 2313848, 2316982, 2310972, 2306095, 2283209, 2320878, 2295856, 2311776, 2347327, 2343178, 2419719, 2375783, 2315485, 2323971, 2355776, 2316199, 2300840, 2267069, 2285434, 2266946, 2239237, 2234831, 2251772, 2275424, 2251243, 2235063, 2184081, 2150603, 2067828, 2007463, 2037975, 2012126, 2003134, 2027656, 1996444, 2008742, 2028971]
3360B028971o3604k919L1556K932k4773l7622N7469m0237k6334j3546o2311L0253
3348A879835m5660l0434M2860p9443L1440J555l0958l1267l493L344k9182l4904
3336A673693L460k712N460m3108k4638J1604n8090K6707M7207M9804O017p094
3324A688310N6854M944j3508l0526p7708J5655J13803L7688P8212J4870n0029
3313A838565N5792K3815K7353j2796P6929O0535K9146j1132Q2713P8615R7010
3302B346545L7124L1926M0818M4931J56553J20400J10298J20232M1542J74434
3292C224803K04701J60573J09764K5703R1220R0426O8601K2258o6P0240K3310
3281D091533n9469J3946J7171K4453p2402l0041K4297L0835n2243k6116N6594
$$ y = [2028971, 1965367, 1962448, 1994004, 1996936, 1972163, 1934541, 1992010, 1951773, 1925439, 1911893, 1849582, 1879835, 1834175, 1803741, 1846601, 1767158, 1798598, 1800153, 1769195, 1737928, 1734435, 1737779, 1708597, 1673693, 1677153, 1674441, 1679901, 1636793, 1612155, 1623759, 1565669, 1592376, 1639583, 1689387, 1695404, 1688310, 1745164, 1750108, 1736600, 1706074, 1628366, 1644021, 1757824, 1795512, 1873724, 1888594, 1838565, 1894357, 1918172, 1945525, 1932729, 2009658, 2070193, 2099339, 2088207, 2170920, 2249535, 2346545, 2383669, 2415595, 2456413, 2501344, 2657897, 2778297, 2888595, 3008827, 3050369, 3224803, 3429504, 3590077, 3699841, 3725544, 3816764, 3907190, 3975791, 3998049, 3997983, 4068223, 4091533, 4032064, 4046010, 4063181, 4087634, 4015232, 3985191, 4009488, 4040323, 3988080, 3961964, 4018558]
3270D018558J7350m8943M6215K8305O3195J40885R3210J41759K51979K43606J51386
3259E147505J79299K15207K27117K41384L10546J70997K30602J63444O4419K6195
3249F976715j9608n2474j33581j45357j0352j22622j57422k7109r8858j39719
3239F069613k15366k22573k46614j40284j07186j72249j24955m9535j05951J4628
3229D699528n3344O938L0599N3171P9831Q4118Q5925J25492N9237P8863J18608
3218E368966P5081M3855N7806N5663p4319n1444o4379n1353m0729m8777o0982
3207E209388j23419j23067j14646k29805j29624j20868j94815l5691p0371j64182
3197C902900l9433m0229p5862o0611o9798o6576l1737J0299q521o9063m2065J8786
$$ y = [4018558, 4035908, 3986965, 4033180, 4061485, 4124680, 4265565, 4358775, 4500534, 4752513, 4996119, 5147505, 5326804, 5542011, 5769128, 6010512, 6321058, 6492055, 6722657, 6886101, 6950520, 6976715, 6957107, 6904633, 6771052, 6625695, 6615343, 6492721, 6335299, 6308190, 6209332, 6069613, 5854247, 5631674, 5385060, 5244776, 5137590, 4965341, 4840386, 4790851, 4684900, 4699528, 4646184, 4653122, 4683721, 4736892, 4816723, 4900841, 4986766, 5112258, 5171495, 5250358, 5368966, 5444047, 5487902, 5545708, 5601371, 5527052, 5475608, 5411229, 5359876, 5319147, 5270370, 5209388, 5085969, 4962902, 4848256, 4618451, 4488827, 4367959, 4173144, 4137453, 4067082, 3902900, 3863467, 3823238, 3747376, 3686765, 3616967, 3550391, 3518654, 3528953, 3520432, 3451369, 3409304, 3428090]
3185C428090L4879k9706m9277j17798m1255p3303m1109Q136L249p2091m2603k0032
3173B987180m0576K9053L5133J0646j9353L7622J3700k8884l1650R8199K2113
3162C113183N6518m610M6592K6726j23282l1571L944j3605j0449K4570p4760l1927
3150B981329O20n9823R711r479m0772N7036M7307k1751K3707K4293l9938O251
3138B978491r656n2048j12443j26276p0816p1785j17245r5191j42855q5069k7960
3127B067147p9594o1504m2157q3943r0184l3028l5150q8005n8248o809k8472m1153
3115A418900k7993p4968K9135j3638m5981o2798K487p973j1889q250p2103l7342
3103A087587j2554k0536k1836L2906l1417N884m7182l2955r9244J0181L3608J858
$$ y = [3428090, 3462969, 3433263, 3383986, 3266188, 3224933, 3151630, 3110521, 3118657, 3121906, 3049815, 3007212, 2987180, 2946604, 2975657, 3010790, 3021436, 3002083, 3039705, 3053405, 3024521, 2992871, 3091070, 3113183, 3169701, 3165091, 3211683, 3238409, 3115127, 3083556, 3087500, 3073895, 3063446, 3088016, 3013256, 2981329, 2981949, 2922126, 2931837, 2922358, 2881586, 2938622, 2985929, 2964178, 2987885, 3012178, 2972240, 2978491, 2968835, 2916787, 2804344, 2678068, 2607252, 2535467, 2418222, 2323031, 2180176, 2095107, 2067147, 1987553, 1926049, 1883892, 1799949, 1709765, 1676737, 1641587, 1553582, 1495334, 1488525, 1460053, 1418900, 1390907, 1315939, 1345074, 1331436, 1285455, 1222657, 1225144, 1217171, 1205282, 1197032, 1124929, 1087587, 1075033, 1054497, 1032661, 1065567, 1034150, 1040034, 992852, 959897, 860653, 870834, 904442, 906300]
3091I06300j0109M723j469l465p6202m6122R066k7273K4248J0124L1462m7125
3079G74158r0794l309Q522l1540l888L0119L724m3422o71l9934p0019K9290K9395
3066E91631K0515P7757l1948n4873n2880O759j2175j852M6119M927J5444k3169
3054E86255q7801J8633M9666l9588j1018K7200l9308j5439R46j0662J0984O440
3042D96308m8421j6845J590K4986p440K8144k0351r940M5906n5903L0554J6585
3030D85173k3129p3144p3618J7952O4155N81L0732j9420q2957l4698P5722J0190
3018C77539J0159l5771l7164l0656N0015j1265j069Q6673J6245q0328j9468k5364
3006B99546l8492j5179N4603P6997m9301J8105J163K9228q536l3495M2238r578
$$ y = [906300, 896191, 900914, 899445, 895980, 819778, 773656, 782722, 755449, 779697, 789821, 821283, 774158, 683364, 680055, 688577, 657037, 653149, 683268, 686992, 643570, 642899, 602965, 532946, 562236, 591631, 612146, 689903, 657955, 603082, 550202, 556961, 544786, 542934, 589053, 593980, 609424, 586255, 498454, 517087, 566753, 527165, 516147, 543347, 504039, 488600, 489546, 478884, 489868, 496308, 447887, 431042, 432632, 457618, 450178, 478322, 457971, 448031, 493937, 438034, 468588, 485173, 462044, 388900, 315282, 333234, 397389, 397970, 428702, 409282, 326325, 291627, 367349, 377539, 387698, 351927, 314763, 284107, 334122, 322857, 321788, 408461, 424706, 344378, 324910, 299546, 261054, 245875, 300478, 377475, 328174, 346279, 347442, 376670, 368134, 334639, 376877, 367299]
2994C67299M7717j6931n0354m536m5246L7004k8500k3437N0570J4273N1371j4848
2982C84382m8007r625l1909L3662k2602K9578N59L2696L0922M7795o5618o110
2970C75723L5774L005J3660K1935L4419n4184M4508J0875k4540M623m6020M2046
2958D61824N0054J4903K0139K6399O989K9438J2717n2412J5090k7878O6329J1280
2946F34872K5320L0909K4335L6903K8421L7445J8324M2220J0038n097J47634P3798
2934A105122l3734R465j9798M782P2555J4355l8333J2373o260K7037K1992P4046
2922A243602J7703J4736M0327N3095P7045J1671q523P6110O4235P6475J9112J5962
2910A701550O5520o747J3040J8934J9019M0511L6353M1667L419P8786P3808Q478
$$ y = [367299, 415016, 398085, 347731, 343195, 297949, 334953, 306453, 283016, 333586, 347859, 399230, 384382, 336375, 326750, 294841, 328503, 305901, 335479, 336038, 368734, 399656, 447451, 381833, 375723, 411497, 414502, 428162, 450097, 484516, 430332, 474840, 485715, 461175, 465798, 419778, 461824, 511878, 526781, 546920, 573319, 580308, 609746, 622463, 570051, 585141, 557263, 623592, 634872, 660192, 691101, 715436, 752339, 780760, 818205, 836529, 878749, 888787, 883690, 1031324, 1105122, 1071388, 1080853, 1061055, 1065837, 1138392, 1152747, 1114414, 1126787, 1120527, 1147564, 1169556, 1243602, 1261305, 1276041, 1316368, 1369463, 1446508, 1458179, 1449656, 1525766, 1590001, 1666476, 1685588, 1701550, 1767070, 1760323, 1773363, 1792297, 1811316, 1851827, 1888180, 1929847, 1933266, 2012052, 2085860, 2094338]
2898B094338N9341M6805J268l7654O7302Q089J1385l2877p2649J5100O709K6624
2886B193781p207M1725J14408Q7519l5043M7592P4675R7920o169M5289N4937M9953
2874B759380K1732M7685m9389p3886o965L6065l5233r686l4202j68209j7919K6816
2862B496189j8154m9076N994o169n775m8910o559k55l1040m5765N9279q609n1522
2849B289628m2907Q0331r416M968j957K4808l61q351R170l9791K186j9870l2033
2836B256405l0627k2066n3123r7220o6317m1696j2249p4215j12900k7874n2725
2825A665393r8008k5513L0899r6294n0969L8389K272n5926j4540N52p5790n259
2813A315206j9901q3865r0889l757M60K3197K9607m1344m0031p9579J3958p047
$$ y = [2094338, 2153679, 2200484, 2201752, 2164098, 2231400, 2239489, 2250874, 2217997, 2145348, 2160448, 2167157, 2193781, 2186574, 2228299, 2342707, 2430226, 2395183, 2442775, 2517450, 2615370, 2609201, 2654490, 2709427, 2759380, 2781112, 2828797, 2779408, 2705522, 2698557, 2734622, 2699389, 2689703, 2655501, 2487292, 2469373, 2496189, 2478035, 2428959, 2434953, 2428784, 2423009, 2374099, 2367540, 2367285, 2336245, 2290480, 2349759, 2341150, 2289628, 2246721, 2327052, 2317636, 2322604, 2320647, 2345455, 2345094, 2336743, 2345913, 2306122, 2308308, 2288438, 2256405, 2225778, 2203712, 2150589, 2053369, 1987052, 1945356, 1933107, 1858892, 1745992, 1718118, 1665393, 1567385, 1541872, 1572771, 1476477, 1425508, 1463897, 1466169, 1410243, 1395703, 1396255, 1320465, 1315206, 1295305, 1211440, 1120551, 1116794, 1117254, 1140451, 1170058, 1128714, 1088683, 1009104, 1023062, 1016015]
2801A016015P862l5308m7747O7484p2688j04185l4054k0791l5534o7352k4625
2790F49077K3146J3977l7891q2261Q337J868M5489K0662r2627j167k4098r084
2778E15428L0690M5107r173q5431m4667j3699m2805N923p574K2864J490n9564
2766C58589l9550l3876k4139K9440j9985J5503J3885L8192K0380n047l0731K7214
2754C49875O272j267m658l8573l1919q0737J5903J9351j2332L25J14518q1192
2742B55566J9736J8556r0733O17K5055J496m3218l802N8410k7837n1274M2040
2730B04612L6770j1794Q943K4496m3774l8776k9744j880l7050L3658j9975m8532
2718G6954M5404K2481L1474K6222N983p6085N1561L7118J5765K1790k8048n2009
$$ y = [1016015, 1023877, 988569, 940822, 1008306, 935618, 831433, 797379, 776588, 741054, 673702, 649077, 672223, 686200, 648309, 566048, 574385, 576253, 621742, 642404, 549777, 548610, 524512, 515428, 546118, 591225, 582052, 496621, 451954, 438255, 395450, 401373, 393799, 416663, 418153, 358589, 319039, 285163, 261024, 290464, 270479, 285982, 299867, 338059, 358439, 353392, 322661, 349875, 356147, 354880, 350222, 311649, 279730, 198993, 214896, 234247, 221915, 222240, 336758, 255566, 275302, 293858, 203125, 203742, 228797, 230293, 187075, 183273, 241683, 213846, 162572, 204612, 241382, 229588, 238531, 263027, 219253, 180477, 150733, 148853, 111803, 145461, 125486, 76954, 122358, 144839, 176313, 202535, 208518, 132433, 183994, 221112, 236877, 258667, 230619, 178610]
2706A78610m1117j2652N5172R509n5952j1338n2488P3510j4933o4210J6902K4254
2694A05267R20N2622l1960J6206K9861L877m1101Q124j4776L3344J18150p5056
2682B05478o4655K9677k7686j201L558m4151l948P4545j11630k4092R8783K4271
2670A58949j2557l7214m3679J0256p03l5301M8504K7160J6523J914j7143l1166
2658H5543J0356O3768P197j03776K5517r242J0426M80L8461N3740J811m3989o1602
2645G8690j171k8864J6957J5592L5430j7468J1656k7497J1214K8870p080l6856
2633G9473o644J1917k3345j7908K0557R5410m0670j0046K4576K635j2532k4313
2621I9110K0752m8332j9600O4990K3585M3848m5125l2970n2454q281O0882n1617
$$ y = [178610, 137493, 124841, 180013, 189522, 133570, 122232, 69744, 143254, 128321, 64111, 81013, 105267, 106187, 158809, 126849, 143055, 172916, 176793, 135692, 143816, 129040, 162384, 280534, 205478, 140823, 170500, 142814, 141613, 145171, 101020, 97072, 171617, 59987, 35895, 134678, 158949, 146392, 109178, 65499, 75755, 75052, 39751, 88255, 115415, 131938, 133852, 116709, 85543, 95899, 159667, 166864, 63088, 88605, 79363, 89789, 90269, 128730, 182470, 184281, 140292, 78690, 77519, 48655, 65612, 81204, 116634, 99166, 110822, 83325, 94539, 123409, 116329, 79473, 72829, 84746, 61401, 43493, 64050, 159460, 118790, 108744, 133320, 135955, 123423, 99110, 119862, 71530, 51930, 116920, 140505, 184353, 139228, 106258, 53804, 45523, 106405, 54788]
2609E4788k4083M9826M8220l926m0353K3567m9280O9879N0116l5984n0195n3225
2597C9350J2559J6627j435j9341O127Q207o6801N4418N2791k6136o109K730L0949
2584A03936k9740O0823K3007j1299J3342o5812J2170k3943J8520j9509o585M1628
2572A16538p9411K6610K9274o885p87q951o694N0024n2246j0437k6099r936O9256
2559I0256k620p569K6113M2330o7026J0232r255p746m6999M277M4129j0730k758
2546F2634l5491m3267M3328M4373M6222k6841m1497K1041K8125k3713N398k338
2534G7974k6984O3489j2955q3521P297N323J4367J7511l2385J27121n8777m3286
2522E5174K0956n1096j9220L554K0358P8537K8448k3216l3929k9185n0321M4544
$$ y = [54788, 30705, 80531, 128751, 124825, 84472, 108039, 58759, 128638, 178754, 142770, 92575, 39350, 51909, 68536, 67101, 47760, 53887, 62094, -4707, 49711, 102502, 76366, 70257, 72987, 103936, 74196, 135019, 158026, 146727, 160069, 94257, 106427, 82484, 101004, 81495, 74910, 116538, 37127, 63737, 93011, 86126, 85339, 76388, 69694, 119718, 67472, 57035, 30936, 21000, 90256, 87636, 80067, 106180, 148510, 81484, 91716, 82461, 74715, 27716, 31993, 76122, 65392, 62634, 27143, -16124, 27204, 71577, 117799, 90958, 49461, 70502, 98627, 74914, 80312, 77974, 50990, 114479, 101524, 18003, 25300, 30623, 44990, 62501, 30116, 157237, 98460, 55174, 76130, 25034, 5814, 9368, 29726, 108263, 136711, 113495, 79566, 50381, 60, 44604]
2510D4604M9622k7541j7362N5448m8443m6606J5542O3084r4364L5790O0720k7542
2498F2952l0919k6927L9408L5381k3254j8897l5256L2488J9609k1812p5908R0635
2486D7500L9102K4474n6390K7698K2626p6556l111k8357J12561K352m37o9504
2474D1958m275k7372N3846L4878j1214o296M2551n3719l3520Q786O6580J8048
2462A30251j3154l8113J4378q1950K1071O3343K6890l4183M0429J6053j9041j243
2450A24731k4108P893N0581j8530o2081j9872j4446L4913j0922j2302O4536l7653
2438H2740k272K9328J0476k5016P0231L3991j4593l4021j3657j4805l8868J9096
2426A02630q1185O4608P0809J8764K0294j4775n9581k1612O1744O5766J6645J5825
$$ y = [44604, 94226, 66685, 49323, 104771, 56328, 9722, 25264, 88348, -6016, 29774, 90494, 62952, 32033, 5106, 44514, 79895, 56641, 37744, 2488, 34976, 54585, 32773, -43135, 47500, 86602, 111076, 54686, 82384, 105010, 28454, 25343, -3014, 109547, 111899, 111462, 41958, 37683, 10311, 64157, 99035, 87821, 81525, 124076, 70357, 36837, 45623, 112203, 130251, 117097, 78984, 93362, 11412, 32483, 95826, 122716, 88533, 128962, 145015, 125974, 124731, 100623, 108516, 159097, 140567, 78486, 58614, 44168, 79081, 68159, 55857, 120393, 82740, 80468, 109796, 120272, 95256, 165487, 199478, 184885, 150864, 137207, 122402, 83534, 102630, 21445, 86053, 156862, 175626, 195920, 181145, 121564, 99952, 161696, 227462, 244107, 259932]
2414B59932m4736K0756k6680L7598M234j6800R1884K8264L1365J6054j0073J37061
2402E28859L3366K4621O5148R6261N4208J25349Q4014J29736J52229J99912J98747
2391A692450K65899K48443K21330J68830J70668K7470j79633k97597j91713j67567
2381A958580j81312j49083j73970j42745j21398n8695j23626n1817p1082j07329
2371G77523n7184o2528l3018J2067j7641j5017l3912l2513k4520O107q5372M6798
2359D80790J2427q1710n9321j2900K0912l7204j8279j6671l2504m6440r1858K5373
2347A42615M5228L5928O561j58M9703l87k6053K1450l2162k4970j2559L2543l5258
2334B02481J8069l3335k95j7673o614K7608o2566l6994M3743p843N6548m5545
$$ y = [259932, 215196, 235952, 209272, 246870, 251104, 234304, 326188, 354452, 385817, 401871, 391798, 528859, 562225, 586846, 651994, 748255, 802463, 927812, 1011826, 1141562, 1293791, 1493703, 1692450, 1958349, 2206792, 2428122, 2596952, 2767620, 2795090, 2615457, 2317860, 2126147, 1958580, 1777268, 1628185, 1454215, 1311470, 1190072, 1131377, 1007751, 955934, 884852, 777523, 720339, 657811, 624793, 636860, 619219, 604202, 570290, 537777, 513257, 519364, 433992, 480790, 493217, 411507, 352186, 339286, 360198, 322994, 304715, 288044, 255540, 209100, 117242, 142615, 187843, 223771, 230332, 230174, 279877, 279490, 253437, 274887, 242725, 217755, 205196, 237739, 202481, 220550, 187215, 186920, 169247, 162633, 190241, 127675, 90681, 134424, 126581, 183129, 137584]
2322A37584k0167K1668J2723K423j6031K1104M6699m8497o2854J3021k3790L5915
2310A19798m066l3002K9922j2755L4335P7926n0358m5196M4119o4867J3119l2531
2298G6444m4146M7404j1285p211k550L7964m7111m3514J7900L3457K7755O8671
2286A53778o1010P177o5665l4544J0732J0423j3448M4783L4653r955J5651j2979
2274G9596K260k9168m700k7159M2620O8206j04796P1215l1010m6175k0881L512
2262C520P7576j2889j9963M3358k5242l7615l3625l2371R4086K4426r2246O592
2250d393L6277J882J0854j5040Q533j1620o1131L0317N9820K1026k0405k351J2441
2237F6210o0761K2687M5293j6792J1274l1144J6430L3430L1090l8320k5192k9084
$$ y = [137584, 117417, 139085, 151808, 154231, 138200, 159304, 206003, 157506, 94652, 107673, 83883, 119798, 115732, 82730, 112652, 99897, 134232, 212158, 161800, 116604, 160723, 95856, 108975, 76444, 32298, 79702, 68417, 61206, 58656, 96620, 49509, 5995, 23895, 57352, 85107, 153778, 92768, 99945, 34280, -264, 10468, 20891, 7443, 52226, 86879, 76924, 92575, 79596, 81856, 52688, 47988, 20829, 63449, 131655, 26859, 98074, 67064, 20889, 8, 3520, 81096, 68207, 48244, 91602, 66360, 28745, -4880, -37251, 56835, 81261, -10985, -4393, 31884, 33766, 44620, 29580, 38113, 26493, -34638, -4321, 55499, 76525, 56120, 53769, 66210, 5449, 28136, 73429, 56637, 67911, 36767, 53197, 86627, 117717, 79397, 54205, 25121]
2225B5121M4073p842M46O5655j7508k4700j8759l4870k803k4580%N351R0377k451
2211I7510p5921N1781M765l5617L0336J4330J932O437k1186M1097o4566m6484
2199D414l19J3430n4872j0453j4249O5147N4051l6519N080M5390o6197j5642p4809
2186h5548O6756J6682j686N690k3123k1782Q965M0368L5203l0817q262j2919Q819
2173a654L8368R272m1546m774k2509J07007K6072r3189N776m2021M4458K5321
2161E0581J3279N726j9214k6318m2681J2472P6502l4267J1282q599k0140K073
2149B0696J5507M0132r3130n2922N2283J5979p855M6799n8202k4184J7458m7276
2137g4715P7568M4762j8136n9729K0488M4305k2952m7195K1582L4556k5251j5327
$$ y = [25121, 69194, 61352, 61798, 127453, 109945, 85245, 66486, 31616, 28813, 4233, 4233, 9584, 99961, 97510, 21589, 73370, 78135, 42518, 72854, 87184, 89116, 95553, 74367, 115464, 50898, 4414, 4095, 17525, -37347, -47800, -62049, 3098, 57149, 20630, 25710, 71100, 4903, -10739, -85548, -18792, -2110, -3796, 1894, -21229, -43011, -34046, 6322, 41525, 10708, 2446, -10473, -1654, 36714, 45986, 4440, -334, -22843, 84164, 110236, 17047, 22823, -19198, 25260, 50581, 63860, 69586, 50372, 24054, -18627, -6155, 70347, 36080, 47362, 38763, 18623, 20696, 36203, 76335, -16795, -69717, -17434, -1455, -9310, 37489, -20713, -44897, -27439, -74715, 2853, 47615, 29479, -30250, -9762, 34543, 11591, -35604, -14022, 20534, -4717, -20044]
2125b0044n0776p531P0008J1606K4278o6349N6951M7153m2043n4822K4284M3337
2113C6052l1170r787o763J6502l5891M9348J7206k3481l7448J9696M4792q673
2101C0383N3864m2246k0977k4467J379l716l761M3519o5858l862L8477P65J0711
2088A4211L2775l2562K1487l7466n961n0822J0653K1091N881N686R688L7369j5096
2075A6934l8677J862N0237k7749M7346k1922K9229j5400j4085L2455Q617l4935
2063C3912M3512n2686o7889K0038P7248L5730l9670j768m939o5251M0519K5646
2051D4402m1635L867j3363j7730j0249J4750r656m1702N4805l4832k0851R3224
2039B1030L6249L6235n7542j634l2245l5523n2420N0N8413N1014r412m291L6123
$$ y = [-20044, -70820, -78351, -8343, 3263, 27541, -38808, 18143, 65296, 23253, -31569, -7285, 36052, 4882, -4905, -11668, 4834, -31057, 18291, 35497, 12016, -25432, -5736, 39056, 30383, 84247, 42001, 21024, -3443, -2064, -5780, -9541, 33978, -31880, -35742, 2735, 3500, 14211, 46986, 14424, 35911, -1555, -7516, -58338, -47685, -26594, -20713, -15027, -5339, 32030, 16934, -21743, -19881, 30356, 2607, 49953, 28031, 57260, 41860, 27775, 60230, 68847, 33912, 77424, 24738, -43151, -23113, 54135, 89865, 50195, 48427, 43488, -21763, 18756, 44402, 2767, 6634, -6729, -24459, -34708, -19958, -29614, -71316, -16511, -51343, -72194, 21030, 57279, 93514, 35972, 34338, 2093, -33430, -85850, -85800, -27387, 23627, 14215, 9924, 46047]
2026D6047k6174l2258l484M8046Q708j5967L8270j5577k0154k3740J8350Q05m1809
2013a8937M0818j6018n7173M6559N5949K7673J1063l3987l2919k9112J9150K5153
2001C8219K4131p5001P671n0818o9829J14320M5867m8199o878l7494k556N8973
1989a594K2485m453l0518j5794m4701K9035M8544q692o2706N77J8411N3892j5218
1976a0732k3801K1886j3095k9512K7680J0957j2252k7240m1636N7305L5229k184
1964g395M96l080K8411j8218l3861M2133j1369l8871J5052L1745M3660n7281m7129
1951e5707k0451j3009M9760K5720J7597N3798o4245j8845k0513j5020M8452M38
1939a2025J7534N168N6721m6740n1536l5020j1513j1552M9110J6117R510k3652
$$ y = [46047, 19873, -12385, -15869, 32177, 40885, 24918, 63188, 47611, 27457, 3717, 22067, 22872, -18937, 21881, 5863, -51310, -4751, 51198, 78871, 89934, 55947, 23028, -6084, 13066, 38219, 62350, -12651, -4980, -55798, -125627, -11307, 34560, -13639, -20517, -58011, -60567, -1594, 20891, 16438, -14080, -29874, -74575, -45540, 3004, -5688, -68394, -67817, -49406, 4486, -10732, -34533, -12647, -25742, -55254, -27574, -16617, -28869, -56109, -97745, -40440, -5211, -7395, -6899, -9979, 18432, 214, -33647, 8486, -2883, -41754, -26702, 5043, 48703, -8578, -55707, -76158, -89167, -39407, -13687, 3910, 57708, -6537, -25382, -45895, -60915, -12463, -12025, 5509, 10677, 67398, 20658, -30878, -65898, -77411, -88963, -39853, -23736, -14226, -37878]
1927c7878n512L6369k847n8068j2486K0404L0803r361l345j9106n1515K7288L580
1914h1674M5949L9851J2093M045M215K2575k0276l8014L4899k7937k3654J1698
1902a6230m030j653k5918R895K5300J147J8574j3501L3329m7235n3139Q565M7097
$$ y = [-37878, -43390, -7021, -9868, -67936, -80422, -60018, -29215, -38576, -41921, -61027, -112542, -85254, -81674, -35725, 4126, 16219, 20264, 24479, 47054, 26778, -11236, 23663, -4274, -27928, -16230, -20260, -21913, -47831, -37936, -12636, -11489, 7085, -6416, 26913, -20322, -73461, -64896, -17799]
$$ [...]
##END NTUPLES=NMR SPECTRUM
##END=
