##TITLE=1H_CA-9370-1
 200.13MHz,DMSO-d6,
 8 sc
 
 14.8.2025
##JCAMPDX= 6.0         $$ Bruker NMR JCAMP-DX V2.0
##DATA TYPE= NMR SPECTRUM
##DATA CLASS= NTUPLES
##ORIGIN= UXNMR, Bruker Analytische Messtechnik GmbH
##OWNER= pz
$$ XWIN-NMR		Version 3.5
$$ Thu Aug 14 14:04:22 2025 Russian Standard Time (UT+4h)  she@DPX200
##.OBSERVE FREQUENCY= 200.1313
##.OBSERVE NUCLEUS= ^1H
##.ACQUISITION MODE= SIMULTANEOUS
##.ACQUISITION SCHEME= undefined
##.AVERAGES= 8
##.DIGITISER RES= 18
##SPECTROMETER/DATA SYSTEM= spect
##.PULSE SEQUENCE= zg30
##.SOLVENT NAME= DMSO
##.SHIFT REFERENCE= (INTERNAL, DMSO, 0, 15.5155)
##AUDIT TRAIL= $$ (NUMBER, WHEN, WHO, WHERE, WHAT)
$$ ##TITLE= Audit trail, XWIN-NMR		Version 3.5
$$ ##JCAMPDX= 5.01
$$ ##ORIGIN= Bruker BioSpin GmbH
$$ ##OWNER= she
$$ F:/spectra/data/she/nmr/H-C/1/pdata/1/auditp.txt
$$ ##AUDIT TRAIL=  $$ (NUMBER, WHEN, WHO, WHERE, WHAT)
(   1,<2025-08-14 14:03:15.78 +0400>,<she>,<DPX200>,
      <created by zg, POWCHK disabled, PULCHK disabled
       configuration hash MD5:
       00 E9 B6 7A A2 85 ED C7 34 08 36 98 17 FE 4E 26
       data hash MD5: 16K
       02 DF 45 79 E7 84 B4 F7 3B 4D 9E 08 AE 83 25 6A>)
(   2,<2025-08-14 14:03:17.90 +0400>,<she>,<DPX200>,
      <Start of raw data processing
       efp BC_mod = 2 LB = 0.25 FT_mod = 6 PKNL = 1 PHC0 = -1562.386 PHC1 = 10.19228 SI = 16K 
       data hash MD5: 16K
       AD C7 37 48 43 70 C9 E6 33 2D 4D C8 00 68 C6 FF>)
(   3,<2025-08-14 14:03:44.01 +0400>,<she>,<DPX200>,
      <pk PHC0 = -14.32491 PHC1 = 17.8 
       data hash MD5: 16K
       31 FA 94 E5 76 1D E5 76 F9 75 3F 0E AA 44 80 BB>)
(   4,<2025-08-14 14:03:47.87 +0400>,<she>,<DPX200>,
      <abs ABSG = 5 
       data hash MD5: 16K
       C0 FF 3C 15 2D D5 17 00 E9 59 7A 9B 2F DB 2F C6>)
$$ ##END=
$$ 
$$ hash MD5
$$ 02 66 42 A6 97 5E A3 70 55 6D E4 31 75 D4 50 DE
##$RELAX= 
##$RELAX= 
##$RELAX= 
##$RELAX= 
##$RELAX= 
##$RELAX= 
$$ Bruker specific parameters
$$ --------------------------
##$DU= <F:/spectra>
##$EXPNO= 1
##$NAME= <H-C>
##$PROCNO= 1
##$TYPE= <nmr>
##$USER= <she>
##$AMP= (0..31)
100 100 100 100 100 100 100 100 100 100 100 100 100 100 100 100 100 100 
100 100 100 100 100 100 100 100 100 100 100 100 100 100 
##$AQSEQ= 0
##$AQ_mod= 1
##$AUNM= <au_zg>
##$AUTOPOS= <>
##$BF1= 200.13
##$BF2= 200.13
##$BF3= 200.13
##$BF4= 200.13
##$BF5= 200.13
##$BF6= 200.13
##$BF7= 200.13
##$BF8= 200.13
##$BYTORDA= 1
##$CFDGTYP= 0
##$CFRGTYP= 5
##$CHEMSTR= <none>
##$CNST= (0..31)
1 1 145 1 1 1 1 1 1 1 1 1 1 1 1 1 1 1 1 1 1 1 1 1 1 1 1 1 1 1 1 1 
##$CPDPRG= <>
##$CPDPRG1= <>
##$CPDPRG2= <>
##$CPDPRG3= <>
##$CPDPRG4= <mlev>
##$CPDPRG5= <mlev>
##$CPDPRG6= <mlev>
##$CPDPRG7= <mlev>
##$CPDPRG8= <mlev>
##$CPDPRGB= <>
##$CPDPRGT= <>
##$D= (0..31)
0 0.7 0 0 0 0 0 0 0 0 0 0.03 0 0 0 0 0 0 0 0 0 0 0 0 0 0 0 0 0 0 0 0 
##$DATE= 1755165795
##$DBL= (0..7)
120 120 120 120 120 120 120 120 
##$DBP= (0..7)
150 150 150 150 150 150 150 150 
##$DBP07= 0
##$DBPNAM0= <>
##$DBPNAM1= <>
##$DBPNAM2= <>
##$DBPNAM3= <>
##$DBPNAM4= <>
$$ [...]
##$SUBNAM3= <"">
##$SUBNAM4= <"">
##$SUBNAM5= <"">
##$SUBNAM6= <"">
##$SUBNAM7= <"">
##$SUBNAM8= <"">
##$SUBNAM9= <"">
##$SW= 18.0517328524113
##$SWIBOX= (0..15)
0 0 2 0 0 0 0 0 0 0 0 0 0 0 0 0 
##$SW_h= 3612.71676300578
##$TD= 16384
##$TD0= 1
##$TE= 0
##$TE2= 300
##$TE3= 300
##$TEG= 300
##$TL= (0..7)
0 120 120 120 120 120 120 120 
##$TP= (0..7)
150 150 150 150 150 150 150 150 
##$TP07= 0
##$TPNAME0= <>
##$TPNAME1= <>
##$TPNAME2= <>
##$TPNAME3= <>
##$TPNAME4= <>
##$TPNAME5= <>
##$TPNAME6= <>
##$TPNAME7= <>
##$TPOAL= (0..7)
0.5 0.5 0.5 0.5 0.5 0.5 0.5 0.5 
##$TPOFFS= (0..7)
0 0 0 0 0 0 0 0 
##$TUNHIN= 0
##$TUNHOUT= 0
##$TUNXOUT= 0
##$USERA1= <user>
##$USERA2= <user>
##$USERA3= <user>
##$USERA4= <user>
##$USERA5= <user>
##$V9= 5
##$VALIST= <valist>
##$VCLIST= <CCCCCCCCCCCCCCC>
##$VD= 0
##$VDLIST= <DDDDDDDDDDDDDDD>
##$VPLIST= <PPPPPPPPPPPPPPP>
##$VTLIST= <TTTTTTTTTTTTTTT>
##$WBST= 1024
##$WBSW= 4
##$XGAIN= (0..3)
0 0 0 0 
##$XL= 0
##$YL= 0
##$YMAX_a= 252644
##$YMIN_a= -441399
##$ZGOPTNS= <>
##$ZL1= 120
##$ZL2= 120
##$ZL3= 120
##$ZL4= 120
##$ABSF1= 15.51441
##$ABSF2= -2.537439
##$ABSG= 5
##$ABSL= 3
##$ALPHA= 0
##$AQORDER= 0
##$ASSFAC= 0
##$ASSFACI= 0
##$ASSFACX= 0
##$ASSWID= 0
##$AUNMP= <proc_1d>
##$AZFE= 0.1
##$AZFW= 0.1
##$BCFW= 0
##$BC_mod= 2
##$BYTORDP= 0
##$COROFFS= 0
##$CY= -3
##$DATMOD= 1
##$DC= 0
##$DFILT= <>
##$DTYPP= 0
##$F1P= 0
##$F2P= 0
##$FCOR= 1
##$FTSIZE= 16384
##$FT_mod= 6
##$GAMMA= 0
##$GB= 0
##$INTBC= 1
##$INTSCL= 3.241238e-09
##$ISEN= 128
##$LB= 0.25
##$LEV0= 0
##$LPBIN= 0
##$MAXI= 10000
##$MC2= 0
##$MEAN= 0
##$ME_mod= 0
##$MI= 1.114404
##$NCOEF= 0
##$NC_proc= -9
##$NLEV= 6
##$NOISF1= 3.799351
##$NOISF2= 2.8
##$NSP= 0
##$NTH_PI= 0
##$NZP= 0
##$OFFSET= 15.51551
##$PC= 1
##$PHC0= -1576.711
##$PHC1= 27.99228
##$PH_mod= 1
##$PKNL= yes
##$PPARMOD= 0
##$PSCAL= 0
##$PSIGN= 0
##$REVERSE= no
##$SF= 200.130001239116
##$SI= 16384
##$SIGF1= 3
##$SIGF2= 2
##$SINO= 0.751879
##$SIOLD= 32768
##$SREGLST= <19F.Aceton>
##$SSB= 0
##$STSI= 16384
##$STSR= 0
##$SW_p= 3612.71676300578
##$SYMM= 0
##$S_DEV= 0
##$TDeff= 16384
##$TDoff= 0
##$TI= <>
##$TILT= no
##$TM1= 0
##$TM2= 0
##$TOPLEV= 0
##$USERP1= <user>
##$USERP2= <user>
##$USERP3= <user>
##$USERP4= <user>
##$USERP5= <user>
##$WDW= 1
##$XDIM= 16384
##$YMAX_p= 451127325
##$YMIN_p= -4454823
$$ End of Bruker specific parameters
$$ ---------------------------------
##NTUPLES= NMR SPECTRUM
##VAR_NAME=  FREQUENCY,     SPECTRUM/REAL,   SPECTRUM/IMAG
##SYMBOL=    X,             R,               I
##VAR_TYPE=  INDEPENDENT,   DEPENDENT,       DEPENDENT
##VAR_FORM=  AFFN,          ASDF,            ASDF
##VAR_DIM=   16384,         16384,           16384
##UNITS=     HZ,            ARBITRARY UNITS, ARBITRARY UNITS
##FACTOR=    0.220516191357247, 1,           1
##FIRST=     3105.11895655576, 0,            0
##LAST=      -507.597806450018, 0,           0
##MIN=       -507.597806450018, -4454823,    0
##MAX=       3105.11895655576, 451127325,    0
$$ Real data points
##PAGE= N=1
##DATA TABLE= (X++(R..R)), XYDATA
$$ [...]
8109A14935895Q8674m823j273399R46786J20121J273005Q28754j107311O79286
8100A16486988m89919k43643K7075O1290j26942J9959P37356k90079j039166j670126
8090A13472793J366389M60558O2096n85622j87714j19231M72400k41606j688484
8081A13011579R0786n44981J83502O75860R36947j683697j20743o49816j089414
8072A10810023l46251m08064M54506j882926j990654P04983j670838k168588l9903
8063A03462288J053701o45477j783815j504752m02417o79632m34688j376474j636480
8054I6052254m48273j578568n1141k25074j040581m36260N16673j905910j458437
8045H9424683M22470p25972j596543p03914r82290m88902n45807j396731k89990
$$ y = [114935895, 115024569, 115019746, 113746347, 114693133, 114813254, 116086259, 116915013, 115807702, 116486988, 115997069, 115753426, 115780501, 115841791, 115714849, 115734808, 116472164, 116182085, 115142919, 113472793, 114839182, 115299740, 115361836, 114776214, 114588500, 114469269, 114941669, 114700063, 113011579, 113102365, 112557384, 112740886, 113416746, 114353693, 112669996, 112549253, 111899437, 110810023, 110463772, 110055708, 110510214, 108627288, 106636634, 107341617, 105670779, 103502191, 103462288, 104515989, 103870512, 102086697, 100581945, 100179528, 99499896, 99065208, 97688734, 96052254, 95603981, 94025413, 93974272, 93749198, 92708617, 92272357, 92789030, 90883120, 89424683, 89847153, 89121181, 87524638, 86820724, 85838434, 85349532, 84803725, 83406994, 83117004]
8036H3117004l82309p75294j449182j473999k76573j193781J059508O04050k436942
8027G6792482K70072O49584k50043j833861j872763j219575j403382K44725k08372
8018G1168867k10983l24859m34815j25846j11536p79189r30589O1109p19691l36638
8008F7255830r58381j141469o00835j153375j477969J23781N73341K96674P19393
7999F3636990j918539j512050p49746j422009M32439N73649P05776k580929j331744
7990E5833837P54431p2971q1482M18401L29982j46620j440603j618731K94518
7981E4270762M55199o7762j413343j161752o28863J109200j195321j226968n40792
7972D9600360j082007J052398p77138o98573j37392M80849k42112P22240j363476
$$ y = [83117004, 82734695, 81959401, 80510219, 79036220, 78759647, 77565866, 78625374, 79229424, 76792482, 77062554, 77712138, 77462095, 75628234, 73755471, 72535896, 71132514, 71377239, 71168867, 70957884, 70633025, 70198210, 70072364, 69960828, 69181639, 68251050, 68312159, 67592468, 67255830, 66297449, 65155980, 64555145, 63401770, 61923801, 62047582, 62620923, 62917597, 63636990, 61718451, 60206401, 59456655, 58034646, 58467085, 59040734, 59746510, 57165581, 55833837, 56588268, 56515297, 56433815, 56852216, 57182198, 57035578, 55594975, 53976244, 54270762, 54725961, 54658199, 53244856, 52083104, 51454241, 52563441, 51368120, 50141152, 49600360, 48518353, 49570751, 48793613, 48095040, 47957648, 48438497, 48196385, 48918625, 47555149]
7963D7555149q28976k01169j658556n8061r8702o23295j141163O54266m46477
7954D3153016n30988p64320M42997j006528J220164J536253j878139P1469M3188
7945D2287112p69160K66683r13795j990893l60451P49389j6566q32142M77026
7936C8897203L63800j167700q77595K48544K7825j54669n72932N8778l48557j331635
7926C5143062J12959R53163k22105r09275r74782j53271p54001l53689n94057
7917C2248004L78317K58660j081286R5929o34786M70918n26008O1828m76690q87227
7907B9907659K27841N85255R84499j646960j399891R86787K75181j478113j101578
7898B7340680J364m52447L9785P96074M72782K99861J015534j733772j340393
$$ y = [47555149, 46726173, 46525004, 44866448, 44808387, 44709685, 44086390, 42945227, 43599493, 43153016, 42622028, 41857708, 42300705, 41294177, 42514341, 44050594, 42172455, 42243924, 42287112, 41517952, 41784635, 40870840, 38879947, 38519496, 39268885, 39252319, 38420177, 38897203, 39261003, 38093303, 37215708, 37464252, 37492077, 37337408, 36764476, 36823254, 36474697, 35143062, 35256021, 36209184, 35987079, 35077804, 34103022, 33949751, 33195750, 32842061, 32248004, 32626321, 32884981, 31803695, 31899624, 31264838, 31735756, 31209748, 31271576, 30794886, 29907659, 30135500, 30720755, 31705254, 30058294, 28658403, 29645190, 29920371, 28442258, 27340680, 27342044, 26889597, 26929382, 27725456, 28198238, 28498099, 29513633, 27779861, 26439468]
7889B6439468l86224j132330J265253j39922o71960m22656J43655J203900m02839
7880B5896345j824812M59346n55528L61180N66771L44067J0559q67856M44849
7871B4834921j209935K10600l5209p25339n43836L08056j069190j47102l92815
7862B1230151J29119o64368K68361p91340j630065k17240Q40247M93461j026716
7853A8631610O15725N42928K51978n51107o49338j8578J423825o74528j061574
7844A8510941j097941Q07107M15252p94621l89300M36041l41818J289103P27484
7835A9562248j020179o44142j296648K21283J58030p38884m31637O53281R36911
7826A7400263l11243j88507n55557p84841l02804J095779K44047j250735k48701
$$ y = [26439468, 26053244, 24920914, 26186167, 26046245, 25374285, 24951629, 25095284, 26299184, 25896345, 24071533, 24530879, 23975351, 24336531, 24903302, 25247369, 25257928, 24390072, 24834921, 23624986, 23835586, 23800377, 23075038, 22531202, 22839258, 21770068, 21622966, 21230151, 21359270, 20694902, 20963263, 20171923, 18541858, 18324618, 19164865, 19658326, 18631610, 19247335, 19790263, 20042241, 19491134, 18841796, 18823218, 20247043, 19572515, 18510941, 17413000, 18220107, 18635359, 17840738, 17451438, 17887479, 17545661, 18834764, 19562248, 18542069, 17897927, 16601279, 16822562, 16980592, 16241708, 15810071, 16463352, 17400263, 17089020, 16900513, 16344956, 15560115, 15257311, 16353090, 16597137, 15346402, 15097701]
7817A5097701K03026M07077J31150J43959j165082N45882M59540o87089J44869
7808A5281033Q60663j29903j926344J43650M45412m92913K52431r09580Q57837
7799A4382286K083919j803519j001845P5804p19850l52645l68569k89156l63424
7790A1643001q78543M48887N50868m95417R41018K74683N23551k89558k97884
7781A2420606n79247j034380p40080P26478R84029o12400L75270j090986K25157
7772A0674447l01417J323380J771411m2150o03768q03968o61853m09904M33802
7763A1379980q64090k77408r81566Q84024n85366q31430R54963q6128j47021l21481
7753I124477j191349J704523N11533l07507m1508j066018J287753M42978j578938
$$ y = [15097701, 15300727, 15707804, 15838954, 15982913, 14817831, 15363713, 15823253, 15136164, 15281033, 16141696, 16011793, 14085449, 14229099, 14674511, 14181598, 14434029, 13524449, 14382286, 16466205, 14662686, 13660841, 13736645, 13016795, 12664150, 12295581, 12006425, 11643001, 10764458, 11213345, 11764213, 11268796, 12209814, 12484497, 13008048, 12718490, 12420606, 11841359, 10806979, 10066899, 10793377, 11777406, 11165006, 11540276, 10449290, 10674447, 10373030, 11696410, 13467821, 13425671, 12821903, 12017935, 11356082, 10946178, 11379980, 10515890, 10238482, 9256916, 10140940, 9555574, 8724144, 9679107, 9592979, 9445958, 9124477, 7933128, 9637651, 10149184, 9841677, 9800169, 8734151, 10021904, 10464882, 8885944]
7744H885944j617293K000137L47548q75477O85386Q31119m29045k14304j522932
7735H091083M02371Q97799L82578q96195j499721O3875Q19513N06322j113314
7726G654311j287396K67806J268916j63409O41954O1873O89750m64144N39622
7717I209283j107238j840680R22095l02l02828r36798K113881L38962j018030
7708G378345j1496n11933J38520o16953J436965o11755j164594m6081R67646l43585
7698F615079l58744O03295r82682M969J186965k44581j390985k91809k04020m81747
7688D455740J551848N04612j799269o19013O387J058915J345899l53874j342233
7679D809012K16101K66076O53782l59147m87658p0289k72639K33666N66285m67895
$$ y = [8885944, 7268651, 9268788, 9616336, 8740859, 9426245, 10257364, 9828319, 9614015, 8091083, 8493454, 9391253, 9773831, 8877636, 7377915, 7441790, 8261303, 8767625, 7654311, 6366915, 6634721, 7903637, 7740228, 8382182, 8444055, 9133805, 8669661, 9209283, 8102045, 6261365, 7183460, 7183158, 6880330, 5943532, 8057413, 8396375, 7378345, 7366849, 6854916, 6993436, 6376483, 7813448, 7201693, 6037099, 5991018, 6958664, 6615079, 6256335, 6859630, 5876948, 5881917, 7068882, 6824301, 5433316, 5141507, 4937487, 4455740, 6007588, 6512200, 4712931, 4093918, 4100305, 5159220, 6505119, 6151245, 4809012, 5025113, 5291189, 5944971, 5585824, 5098166, 5027877, 4755238, 4988904, 5555189, 5087294]
7669E087294k59703m50370M02274L40178j469060N95938l65845N92893j39221
7660D334378N7037J088100j844009k88256J413025k49358j150583L83643L04913
7651D048890j12422k33619J68538k9311M93798j396324m23871M02529l0648Q26280
7641C713840P32912Q58987o31493J3465j379769R50252j622698m699J111593k13526
7631C528864o80912J135581L43228r37925r82077K04468L70777J19169j495610
7622A605563K83831J032566k32618K83977q261N50827J006873j84024j272234
7613C066500j99378m15503L20031p19434P33663o18824O75882j062428J475333
7604C255842N03468j177896n96075P35370K79873J36698r57256n39256Q71070
$$ y = [5087294, 4827591, 4377221, 4779495, 5119673, 3650613, 4246551, 3880706, 4473599, 4334378, 4391415, 5479515, 3635506, 3347250, 4760275, 4510917, 3360334, 3743977, 4048890, 3936468, 3702849, 3871387, 3842076, 4335874, 2939550, 2515679, 2918208, 2887560, 3713840, 4446752, 5305739, 4674246, 4687711, 3307942, 4258194, 2635496, 2630797, 3742390, 3528864, 2847952, 3983533, 4326761, 3388836, 2406759, 2611227, 2982004, 3101173, 1605563, 1889394, 2921960, 2689342, 2973319, 2965058, 3515885, 4522758, 4338734, 3066500, 2867122, 2451619, 2771650, 2052216, 2785879, 2167055, 2842937, 1780509, 3255842, 3759310, 2581414, 1985339, 2720709, 3000582, 3137280, 2180024, 1640768, 2511838]
7595B511838K62409o87947L63463l43968M01014J052210n32215K02300P23320
7586C952424j65242Q0765l80786l68114j41735p63502Q12973l06507K95404O03168
7576C618848j58395O879J80995j706304J70340k74796O57243O6671J767056j37978
7566D190559k128009K14330K585208p84840j956711P15029J133638R9343K38862
7557D307409J26470j048482O68281O31883n07902m91397L81480l03467l57034
7548C407241j006305J87047O29816N48330p30907N43290J173513P3460k019074
7539B806411p7419M30941M31465N01568p68279l33283R9023j47199K7811m80216
7529B490823N19252L69009p06822l54139m94630N3841N60583J315285o10474j462757
$$ y = [2511838, 2774247, 2086300, 2449763, 2105795, 2506809, 3559019, 3026804, 3229104, 3952424, 3787182, 3867947, 3487161, 3119047, 2977312, 2213810, 3026783, 2720276, 3015680, 3618848, 3460453, 3467332, 3648327, 1942023, 2112363, 1837567, 2494810, 2561481, 4328537, 4190559, 2062550, 2276880, 4862088, 4077248, 2120537, 2835566, 3969204, 4068547, 4307409, 4433879, 3385397, 4053678, 4685561, 4177659, 3686262, 4067742, 3764275, 3407241, 2400936, 2587983, 3217799, 3766129, 3035222, 3578512, 4752025, 4825485, 2806411, 2728992, 3159933, 3591398, 4092966, 3324687, 2991404, 3090427, 2943228, 2971039, 2490823, 3010075, 3379084, 2672262, 2318123, 1823493, 1877334, 2437917, 3753202, 3142728, 1679971]
7519A679971O90923m01804j047212J082337Q94864m31536P8592p36244n1332L1396
7509A789955J72150j179658j43009R57162M29672n33828n00632Q30657p40875
7500A081594M70675J88372p88631r91854j55845J94640J314264N20377m07277
7491A426315r73297o18382q36406K141003n20773j310006J323627K48291K42954
7482A123326l71712j030016o73660K72880P85358L16498r08023J172460j233359
7473e46248R28223J470650r76385o05193m96187J166684o04141N84400M43555
7464A365358j830089n14914J685021l13599l92880j253286L34864J616738r34184
7455b36971l24424p55090M01096N68597j174866l20148K116284R6213j467101
$$ y = [1679971, 2370894, 1969090, 921878, 2004215, 2899079, 2467543, 2546135, 1809891, 1758559, 1789955, 1962105, 782447, 639438, 1596600, 2026272, 1492444, 991812, 1822469, 1081594, 1552269, 1740641, 952010, -39844, -195689, -1049, 1313215, 1833592, 1426315, 453018, -165364, -1001770, 1139233, 618460, -691546, 632081, 880372, 1123326, 751614, -278402, -952062, -679182, 106176, 422674, -485349, 687111, -546248, 381975, 1852625, 876240, 271047, -225140, 941544, 337403, 921803, 1365358, -464731, -979645, 705376, 391777, -1103, -1254389, -919525, 697213, -236971, -561395, -1316485, -915389, -346792, -1521658, -1841806, 274478, 370691, -1096410]
7446a096410J285766N3597l28298J13751p95677K14144J241411Q81748j846768
7437b76736N31908L86815r72208q00272M97222J60504m85422P74241K05660P09414
7427G31126j083997l55726O52174j90685m54755M18670n11839L90250m93663O93419
7417b05026r28014l97010M03391J530362j476610J217855J019221j471728n04002
7408h11561L64695L2599j675967J463639P47393n89936k92175R1980O26541o0545
7398a03337R30489l01965j115766N73256o81908O27262j763504P06512O0985L55118
7388g12858J46861q43304L18675J233291j286828N67545J85079o02404l9769Q8136
7378i45576r64622m6511P21051o78306L73752O57638n24295j372626J046235J87743
$$ y = [-1096410, 189356, 242953, -85345, 28406, -767271, -553127, 688284, 1570032, -276736, 255172, 641987, -330221, -1130493, -633271, -472767, -958189, -183948, 21712, 731126, -352871, -708597, -56423, -247108, -701863, -283193, -795032, -404782, -898445, -205026, -1133040, -1530050, -1126659, 403703, -1072907, 144948, 1164169, -307559, -811561, -446866, -414267, -2090234, -626595, 120798, -469138, -761313, -669333, -42792, -103337, 827152, 525187, -590579, -17323, -699231, -71969, -1835473, -1128961, -1067976, -712858, -565997, -1409301, -1090626, 142665, -1144163, -576618, -391539, -993943, -1033712, -945576, -1910198, -1956709, -1235658, -1913964, -1540212, -882574, -1406869, -2779495, -1733260, -1545517]
7368a545517m38782N23128J431073j98917L41024M14252j264396n10338m25000
7359a673473O87046k87054J77917N024n34432n50417K63221J867113J94758m50580
7349c00877j672276o80604M88146M09757K88544o52716J697891j21640l44321
7340h88096K35692q53242p06800K93116J730814J84096k80912r52395o93290Q33433
7330a097584j527707p345l45446R60091K95972n76076m56153Q57248J243527p08835
7320a362308Q49884N93419q609M9668j151866m37466O39558Q88954K33956j370349
7310a075159M59927n57927m04436m65124Q77244r990K45901J202990J153911j604494
7300a77157j543364M49204J877491J3058j115102N06404K66949j331925k37640
$$ y = [-1545517, -1984299, -1461171, -30098, -229015, 112009, 526261, -738135, -1248473, -1673473, -986427, -1273481, -1095564, -1090540, -1624972, -2175389, -1912168, -45055, 149703, -300877, -1973153, -2653757, -2165611, -1755854, -1467310, -2120026, -422135, -543775, -888096, -652404, -1505646, -2212446, -1919330, -188516, -4420, -285332, -1237727, -1931017, -1097584, -2625291, -2632636, -2978082, -2017991, -1722019, -2298095, -2754248, -1897000, -653473, -1362308, -512424, 80995, 72386, 122054, -1029812, -1467278, -827720, 61234, 295190, -1075159, -615232, -1173159, -1577595, -2042719, -1165475, -1175465, -929564, 273426, 1427337, -177157, -1720521, -1271317, 606174, 619232, -495870, 10534, 277483, -1054442, -1292082]
7291a292082K63708J35521n9663r23736K08968O12109P93190O91460P29045q47882
7281C10638n15324j74319r71689q20936l18575P29253J483332j078866L81565
7272i74921J42967j112509j08824n64345R14821R4360l89076k4897L87995J399661
7262b34768P33554m93213n77091l97661n8489o58315J046744M741j03058j80329
7252i17885k87602q03854M75807J128120j58710n6135m7110n7656O44132L50178
7242B69285j327004k13011L66161K50451P97762q82932l22004o8127K26660R6381
7232h06378j077109Q54976k6725L01999L54707J70216L55047j6934p07143m15786
7222a013130O96773K10478r73429R62764n64912l3841J99216p28444P88792K78063
$$ y = [-1292082, -1028374, -892853, -952516, -1876252, -1667284, -1055175, -261985, 429475, 1158520, 310638, -204686, -379005, -1350694, -2171630, -2490205, -1760952, -277620, -1356486, -974921, -831954, -1944463, -2053287, -2617632, -1702811, -1608451, -1997527, -2022424, -1634429, -234768, 498786, 5573, -571518, -969179, -1027668, -1685983, -639239, -634498, -737556, -917885, -1205487, -2009341, -1533534, -405414, -564124, -620259, -667369, -725025, -80893, 269285, -1057719, -1270730, -904569, -654118, 143644, -739288, -1061292, -1129419, -902759, -806378, -1883487, -1028511, -1055236, -753237, -398530, -228314, 126733, 109799, -597344, -1013130, -316357, -105879, -1079308, -116544, -681456, -715297, -516081, -1244525, -455733, -177670]
7212a77670N17304M96930k66380j433072P30256o67585P22144M87313r94218P34434
7202A49456m72807j512764R3092P06650L26786q87188J187192O83471l15912M97739
7192D55715p02258j36573n194L04110j518020P20383L17045q89620Q75483R33214
7182C54285j180157j085208P51308J036433p56208R47825M1120j497168l44259
7173a732029L01160l97393k59914J225521L15854p8379l16316m44526j96136R230
7163a572928J91079J99082Q31672M04576j58350M62195p27180o21940n12982m2625
7153a547401M53195Q524J336967j23255J56905j56913K799j63438J85744O5650
7143B18777o01018m51780M20278J003267o37156l26731J73822P98765R41978m32901
$$ y = [-177670, 339634, 836564, 570184, -862888, -132632, -800217, -78073, 409240, -584978, 149456, -323351, -1836115, -1743023, -1036373, -709587, -1596775, -409583, 273888, -42024, 455715, -246543, -383116, -388310, -84200, -1602220, -881837, -564792, -1454412, -578929, 354285, -825872, -1911080, -1159772, -123339, -879547, 68278, 109398, -1387770, -1732029, -1430869, -1828262, -2088176, -862655, -546801, -625180, -941496, -1386022, -1582158, -1572928, -1381849, -1182767, -351095, 53481, -104869, 357326, -369854, -991794, -1504776, -1547401, -1094206, -1085682, 251285, 128030, 284935, 128022, 130821, -32617, 153127, 218777, -382241, -834021, -413743, 589524, -47632, -374363, -200541, 598224, 1540202, 1107301]
7133A107301N31577J40288j561815K9706J427247M12758q07877l50045m64105
7124D65035j266314K33715J94772K4603P14066n78278n34714P56203N32849k22163
7114C19774Q78293J391974l31079P5086P49895j568519R71194k9209q94143J004228
7104B567494K48697o71381j669674R87882j57997L64967j160818k58494R94733
7095A245409l99263n11732J051857K55943k69776R9805r44335P03128O21407M05482
7085B257925q07778L11304j036930J454042j028784m02217J086722l68283j072195
7076C93806P75253R37187N07882j95347j3914j39280k03732R60823K36634o84346
7066B574966m40880J086894J24008j729702r12943J066796J495900j557174k24556
$$ y = [1107301, 1638878, 1779166, 217351, 247057, 1674304, 2087062, 1279185, 929140, 465035, -801279, -567564, -372792, -348189, 365877, -212401, -747115, 9088, 541937, 319774, 1198067, 2590041, 2258962, 2334048, 3083943, 1515424, 2486618, 2457409, 1563266, 2567494, 2816191, 2144810, 475136, 1463018, 1305021, 1669988, 509170, 250676, 1245409, 846146, 334414, 1386271, 1642214, 1372438, 1472243, 527908, 1231036, 1852443, 2257925, 1450147, 1761451, 724521, 2178563, 1149779, 747562, 1834284, 1466001, 393806, 1169059, 2106246, 2614128, 2418781, 2404867, 2265587, 2061855, 3022678, 3259312, 2574966, 2134086, 3220980, 3344988, 1615286, 702343, 1769139, 3265039, 1707865, 1483309]
7057A483309N4304k23541K65881J04553p09902o59029N73012k82749R61623L18637
7047A886098L07329n85877N7355k77621J258498L60680l18864q15271R29537n914
7037B795950p57009J363073o52842j866737L07860P63095J00865m72029q842q34651
7027G38733J532218J084553o34954j101063L019n95037j24249Q63985L91695j89124
7017A969776j094479J149174j238511K55037m13719k25565J211448J045514N59023
7008C217698l48735o8020K26135M46495l45563o05187o47272O31913K68344n86291
6998B189517P70373M64361r80351o19526m93468O27649J386171R9238M1609k42001
6988C243572K26611p58808q64059j611182L12314J751264J191481K77625Q48070
$$ y = [1483309, 1537613, 1314072, 1579953, 1684506, 974604, 315575, 888587, 605838, 1567461, 1886098, 2193427, 1607550, 1664905, 1387284, 2645782, 3006462, 2687598, 1872327, 2801864, 2795950, 2038941, 3402014, 2749172, 882435, 1190295, 1953390, 2054255, 1582226, 1573384, 738733, 2270951, 3355504, 2720550, 1619487, 1622506, 1027469, 903220, 1767205, 2158900, 1969776, 875297, 2024471, 785960, 1040997, 627278, 401713, 1613161, 2658675, 3217698, 2868963, 2800943, 3027078, 3473573, 3128010, 2522823, 1875551, 2507464, 2775808, 2189517, 2959890, 3424251, 2443900, 1824374, 1330906, 1958555, 3344726, 3443964, 3485573, 3243572, 3470183, 2711375, 1847316, 236134, 548448, 2299712, 3491193, 3768818, 4616888]
6979D616888m25686j95484J68563k43037J1885n02878L35098K6435o47058r75898
6969B168828N4756N95432J61018K89461j43991l12483j61999K44651Q87098j55278
6959C627493l18121M94334R36751O13787J70110K43071k60651m85784P25224J041659
6949F787873m99706j164988j82770M36789q64323n09140k70547N15756J107408
6940E356352L80563K01591K32535J49863R13n51957j451824P09472K30470O10000
6930E867978p52553J494048l69591j096047n99758M61343M4272m58674J119536
6921E710554K3531L02128n16621j742236j16293P61169R09450p11060j024495
6912C596127O7449j543512M59758M36004J1177J722652P2330q3061j15364j90277
$$ y = [4616888, 4191202, 3995718, 4164281, 3921244, 3933129, 3430251, 3765349, 3791784, 3144726, 2168828, 2223584, 2819016, 2980034, 3269495, 3125504, 2813021, 2651022, 2895673, 3782771, 3627493, 3309372, 3803706, 4740457, 5354244, 5524354, 5767425, 5506774, 5020990, 5746214, 6787873, 6288167, 5123179, 4940409, 5377198, 4512875, 4003735, 3733188, 4248944, 5356352, 5736915, 5938506, 6171041, 6320904, 6321817, 5769860, 4318036, 5027508, 5257978, 5867978, 5115425, 6609473, 6239882, 5143835, 4544077, 5005420, 5049692, 4591018, 5710554, 5734085, 6036213, 5519592, 3777356, 3661063, 4422232, 5331682, 4620622, 3596127, 3663576, 2120064, 2579822, 3015826, 3027003, 4749655, 4821985, 4738924, 4623560, 4433283]
6902D433283o22853j091214R1593J3947k83919j46180O34003L10260L43573k96213
6892C386280O20051p98356P65819P58562r86601k81213P6887n43638J56345L2660
6882C186796j288160J433228R35695j592399k94937Q87219l73530r64426Q59524
6873B789010N96358q53545j093062n72160K009711m0772q64646j92051M19350
6864B198193N3829N79985P9125m50523O31449p95702j61755N57915o48224L13308
6854B357600L31312p87914P2826L21111K68101J55079J395883M78211n86659j178586
6844B826964P9777O05125K02761l69267P0005P10537J56160j108515M46959j609051
6834B011455q80789J328310M90886m60750o23281l56009J99572n40111o91360
$$ y = [4433283, 3810430, 2719216, 2810809, 2824756, 2540837, 2394657, 3028660, 3338920, 3682493, 3386280, 4006331, 3207975, 3973794, 4732356, 3745755, 3464542, 3541429, 2997791, 3154136, 3186796, 1898636, 3331864, 4267559, 2675160, 2380223, 3267442, 2893912, 1929486, 2789010, 3385368, 2531823, 1438761, 866601, 2876312, 2835540, 1970894, 1778843, 2198193, 2252022, 2832007, 2911132, 2460609, 3092058, 2296356, 2134601, 2692516, 2044292, 2357600, 2688912, 1900998, 1973824, 2294935, 2563036, 2718115, 4113998, 4592209, 4005550, 2826964, 2906741, 3511866, 3714627, 3345360, 3415365, 4125902, 4282062, 3173547, 3620506, 2011455, 1130666, 2458976, 2949862, 2489112, 1865831, 1509822, 1709394, 1169283, 477923]
6825D77923J104850O08448j6554m62438J062340M26658o38090J60875N31506j189903
6815B065615K06539Q43496k02260j262127J43433P53839K54766J503110n81095
6806C725316O61815p2562n00951j067115R06766L29868m30073j281422p2416R32924
6796C132150j051046R01819J63762M63683m33810j5418j242173N3818J007775
6787B980560j254437l02436M7951q9006Q06844k6667K98126K54379m50907J274125
6777C538532j69073m65084K24679J02130J84378l43057o19323Q57803r27205p21964
6767A661816J217046O06254j88980r1282j09930R57793J026642r11905Q2362j075878
6757C173938j153238j112723J705019k02938j98126R57002L54651j103575k05668
$$ y = [477923, 1582773, 2191221, 2174667, 1712229, 2774569, 3201227, 2563137, 2724012, 3255518, 2065615, 2272154, 3115650, 2913390, 1651263, 1794696, 2548535, 2803301, 4306411, 3725316, 4387131, 4314569, 3813618, 2746503, 3653269, 3983137, 3553064, 2271642, 2199226, 3132150, 2081104, 2982923, 3146685, 3610368, 3176558, 3161140, 1918967, 1972785, 2980560, 1726123, 1423687, 1471638, 1382632, 2189476, 2162809, 2460935, 2715314, 2264407, 3538532, 3369459, 2904375, 3129054, 3231184, 3415562, 3072505, 2453182, 3310985, 2383780, 1661816, 2878862, 3485116, 3296136, 3204854, 3094924, 4052717, 5079359, 4167454, 4249816, 3173938, 2020700, 907977, 2612996, 2410058, 2211932, 3168934, 3523585, 2420010, 2214342]
6748B214342L29313l19716j1986R07634n08916N0064l93188O27000l25430n37315
6738B031802K19209J78220J220121q44278J77763p76471K76027J520428p53872
6729C248949n01306Q18221K40770q78436J61447L29982O26711o13765j55213M69292
6719C746652j512420k21916R10853K084758p78584q51164O99296J42061k098791
6710B120745R60481L96703m7937l70758r8438J263342o87969j490833L01098Q40311
6700C186745m14775m93101k08202L71839K04361P13012K02146O61213j345680
6691B877558l16963N37215j529545J251255r365N16466k91654o81565Q25045N05004
6681C683451l28183J215267J38046K02887P96205p45750p53529l19628j55521
$$ y = [2214342, 2543655, 2223939, 2211953, 3119587, 2610671, 2660735, 2267547, 2894547, 2569117, 2031802, 2251011, 2429231, 3649352, 2805074, 2982837, 2206366, 2482393, 4002821, 3248949, 2747643, 3565864, 3806634, 2928198, 3089645, 3419627, 4046338, 3432573, 3277360, 3746652, 2234232, 2012316, 2923169, 5007927, 4229343, 3378179, 4077475, 4219536, 2120745, 3081226, 3477929, 3429992, 3059234, 2960796, 4224138, 3536169, 2045336, 2346434, 3186745, 2771970, 2278869, 2070667, 2442506, 2646867, 3359879, 3562025, 4223238, 2877558, 2560595, 3097810, 1568265, 2819520, 2810155, 3326621, 3034967, 2353402, 3178447, 3683451, 3355268, 4570535, 4708581, 4911468, 5707673, 4961923, 4208394, 3888766, 3733245]
6672C733245O24557k53823j433997R70159j252427J32725L90279l20504J083874
6663C674088J28497L08854L62691N8876K17813J2324r66315n01322N97861J087106
6653D980473q12898K33926R19110K03255J273722j02574r64080J70473K54853
6644F156260p49071n78951m46235P14466N00397N62081q95597Q27318n29j11660
6634E978479L51510m75601p12635M12628r05935J640739O76975j616748m6840
6625E302572k26035p00006j156932J334403m85968J077359M25166p75327R29533
6616E724765l95957P44638o98449r70684Q21944K88461P9094L4243M93725K17436
6606F339216N59865O87528P8562m02059l73734Q0216q90668n85912P66977m39184
$$ y = [3733245, 4357802, 4103979, 2669982, 3640141, 2387714, 2520439, 2910718, 2590214, 3674088, 3802585, 4111439, 4474130, 4533006, 4750819, 4763143, 3796828, 3295506, 3893367, 4980473, 4167575, 4401501, 5320611, 5523866, 6797588, 6695014, 5730934, 5901407, 6156260, 5407189, 4828238, 4382003, 5096469, 5596866, 6158947, 5263350, 6090668, 6090139, 5978479, 6329989, 5854388, 5141753, 5554381, 4648446, 6289185, 6966160, 5349412, 5302572, 5076537, 4376531, 3219599, 4554002, 4068034, 5145393, 5570559, 4795232, 5724765, 5328808, 6073446, 5374997, 4404313, 5226257, 5514718, 5593812, 5628055, 6121780, 6339216, 6899081, 7586609, 7665171, 7263112, 6889378, 6969594, 6078926, 5493014, 6259991, 5820807]
6596E820807o98525J24747J94653R97008k37638N27052m30169K46815J22069R5125
6586F761944J05891l24226N17640j551554J195284P68342q78573r85783J066307
6577F675272J53503l2155K027933L55551r30869m77675n35633R50355L14752l69924
6567H131110M3682k82926k92266Q46327L63384n06455n33002r80679M46640M40445
6557G676260M07843L70788o47636Q67078Q93736j101355j20439J065068J23191
6548I534534j6109j800059j38984R43019P99564n7863R96615j00792j311921J73397
6538I021401P83415R87169j14907m47480N4768N5925m56574p68561O13254P24563
6528A0452973j97385l12127o24216N53247j069577O26917K89093J067080O28827
$$ y = [5820807, 5122282, 5247029, 5441682, 6438690, 6201052, 6728104, 6297935, 6544750, 6666819, 6761944, 6867835, 6543609, 7061249, 5509695, 6704979, 7473321, 6594748, 5608965, 6675272, 6828775, 6796620, 8824553, 9180104, 8249235, 7771560, 7235927, 8186282, 8501034, 8131110, 8174792, 7891866, 7599600, 8445927, 8809311, 8302856, 7769854, 6789175, 7235815, 7676260, 8084103, 8454891, 7807255, 8674333, 9568069, 8466714, 8346275, 9411343, 9534534, 9518425, 7718366, 7579382, 8522401, 9321965, 9264102, 10260717, 10159925, 8848004, 9021401, 9804816, 10791985, 10677078, 10229598, 10284366, 10340291, 9883717, 9115156, 9728410, 10452973, 10255588, 9943461, 9319245, 9872492, 8802915, 9429832, 9718925, 10786005, 11414832]
6519A1414832j621691l58754L86363Q49684k25320M71350J78638j104177J078914
6510A1069839N89292j415345p86496K56673j33945M26653k76642M7407N92264
6501A0369700j57610J246341P15978K39601j126687M64165J288108r05565o15983
6492A1518048M84751m46495l7779R01772Q24647r50313M19107n02814q05289P25845
6482A2131480m36156Q08253o43551O40809L73426N8676j115854J61112J095502
6473A3073697n74404j110363N56691N44550o45475J099203l56871k206868J96745
6464A0576905J01095p60830k71878J013093j61808o9419L03661Q65964o04333
6455A0992450j69209n6150k8822K79952j232247r35478J226995P61216N7888O7858
$$ y = [11414832, 9793141, 9434387, 9820750, 10670434, 10445114, 10916464, 11095102, 9990925, 11069839, 11659131, 10243786, 9457290, 9713963, 9580018, 10006671, 9730029, 9777436, 10369700, 10212090, 11458431, 12174409, 12414010, 11287323, 11751488, 13039596, 12134031, 11518048, 12002799, 11556304, 11518525, 12420297, 13244944, 12294631, 12713738, 12210924, 11405635, 12131480, 11695324, 12503577, 11860026, 12500835, 12874261, 12932937, 11817083, 11978195, 13073697, 12499293, 11388930, 11945621, 12490171, 11844696, 12943899, 12587028, 10380160, 10576905, 10678000, 9917170, 9645292, 10658385, 10496577, 10427158, 10730819, 11596783, 10992450, 10823241, 10767091, 10738269, 11018221, 9785974, 8850496, 10077491, 10838707, 10896595, 10964453]
6445A0964453p4348p33614k0114n21415P25929O13414j454386o03232M83903N79636
6435I960226m16334O8395j12383j66715K34053r94870Q22742J149258j70069l69461
6425A0004842j391289J919023k55902J140138P31235l96922k706718P44609J413791
6416A1202807M54476j462563J18051Q38657Q70801k66522q62420j45476k91204
6407A0456607Q65479k86599K53729j12777l80692p14823q4731Q73457L33189j489988
6397I712851L90970m6666l96825O61757Q78378m01846M18961p19755l31907O15140
6387A0781058j87591J67074J80082N728k12422j157245q20868J115494Q43007
6378A0714317k05309M92835R36691o93515n0272J203678M2383M5077m37466o41958
$$ y = [10964453, 10890105, 10156491, 10136377, 9614962, 10340891, 10954305, 9499919, 8896687, 9380590, 9960226, 9543892, 9612287, 9499904, 9333189, 9567242, 8572372, 9395114, 10544372, 10374303, 10004842, 8613553, 10532576, 10276674, 11416812, 12148047, 11751125, 9044407, 9789016, 11202807, 11657283, 10194720, 10312771, 11151428, 12022229, 11755707, 10893287, 10747811, 10456607, 11322086, 11035487, 11289216, 11176439, 10795747, 10080924, 9996193, 10869650, 11202839, 9712851, 10103821, 10057155, 9660330, 10322087, 11200465, 10798619, 11217580, 10497825, 10165918, 10781058, 10593467, 10760541, 10940623, 10946351, 10733929, 9576684, 8755816, 9871310, 10714317, 10509008, 11001843, 11938534, 11245019, 11194747, 12398425, 12440808, 12485885, 12048419, 11406461]
6368A1406461m26653Q14189q00996q58546K67122j60163L63391j713780Q91188
6359I782213J200280M55720L02064J129815k38626r08832O68639o71248l51442
6350A1368583J219806R7771p10795n47342M13995J677385j503007n40466J85424
6341A1661354p3998O65889J8288J9238p81680Q62219j035883O45810m5282J50405
6331A2086360J461181J70741J04990j453607p63834J293714j035689j550951J965297
6322A2278202p07303L49608j78545L14300q49526k21155L72253P00028J062409
6313A3120271O30477o63262J97846l5667l55067L9088K31968p5573j279164l21776
6303A1489141K331858J919611j448824k72553P47425m018j597094K39068q19278
$$ y = [11406461, 10979808, 11793997, 10993001, 10134455, 10401577, 10241414, 10604805, 8891025, 9782213, 10982493, 11438213, 11740277, 12870092, 12631466, 11722634, 12391273, 11720025, 11368583, 12588389, 12686160, 11975365, 11428023, 11842018, 13519403, 12016396, 11475930, 11661354, 11587356, 12253245, 12271533, 12290771, 11509091, 12371310, 11335427, 11981237, 11935955, 12086360, 13547541, 13718282, 13823272, 12369665, 11605831, 12899545, 11863856, 10312905, 12278202, 11570899, 11920507, 11741962, 12056262, 11206736, 10985581, 11357834, 12057862, 13120271, 13750748, 13087486, 13285332, 13249665, 12894598, 12933686, 13165654, 13090081, 11810917, 11489141, 13820999, 15740610, 14291786, 14019233, 14766658, 14762640, 13165546, 13404614, 12585336]
6294A2585336J1363J034244n99118M22219l17009M53794l97871l86176J20873
6285A2927655k28503J044035j061518L03223k97699K87684Q84437J399029L1381
6276A5289724j328563L08651q55054K6319M52373M32608J419620m1695m08100
6267A5295883l42178q36469N03680R46950o78320k25734J037385K40477n33661
6258A5408013j09539K67271L64086m80570J080108P64975r49346j30717K70186
6249A6484467K25762M51650J58712J17844l34894q25728K41000J116311J006878
6240A8642002j325681M90064N28661J06812q82636j211593J490518Q4491p92018
6231A7130620M45298K38137j52768j86374J151661j380673P81528L76o42440M15915
$$ y = [12585336, 12596699, 13630943, 13031825, 13454044, 13137035, 13590829, 13192958, 12806782, 12927655, 12699152, 13743187, 12681669, 12984892, 12687193, 12974877, 13859314, 15258343, 15289724, 13961161, 14269812, 13414758, 13441077, 13893450, 14326058, 15745678, 15703983, 15295883, 14953705, 14117236, 14620916, 15567866, 14889546, 14663812, 15701197, 15941674, 15408013, 15298474, 15565745, 15929831, 15449261, 16529369, 17294344, 16344998, 16214281, 16484467, 16710229, 17161879, 17320591, 17438435, 17103541, 16277813, 16518813, 17635124, 18642002, 17316321, 17806385, 18335046, 18441858, 17559222, 16347629, 17838147, 17922638, 17130620, 17575918, 17814055, 17661287, 17474913, 18626574, 17245901, 18027429, 18027805, 17385365, 17801280]
6221A7801280L42357M38341P85737L43300J77350m03312j559634j153770J60517
6212A6932166O60644k95786J169614m01321O63295j138549M06801N80777L80005
6203A8957646M80239L53720R91145r96479P01538J643728o43997q07687j084495
6194A9595358r07473O69546K03568M66692K07107O12154J38428p00864O21772
6185B0906288O39058k04242p66740o51074J131801J067610K34568n94648m90499
6176B1272122o26372N1554J280410P83892q40104o38202p82105J019794J519346
6167B3040335l68375P34677q19238k35698n37979L29097M94276l6901O26380q15908
6157B2410666m09354R29350O2401N57032K08192k36888J403262L11476j116300
$$ y = [17801280, 18143637, 18581978, 19367715, 19711015, 19888365, 19485053, 17925419, 16771649, 16932166, 17592810, 17297024, 18466638, 18065317, 18728612, 17590063, 17996864, 18577641, 18957646, 19437885, 19791605, 20782750, 19786271, 20487809, 22131537, 21487540, 20679853, 19595358, 18687885, 19357431, 19560999, 20027691, 20234798, 20846952, 20985380, 20284516, 20906288, 21545346, 21341104, 20574364, 19923290, 21055091, 22122701, 22357269, 21762621, 21272122, 20645750, 20697304, 21977714, 22761606, 21921502, 21283300, 20501195, 21520989, 23040335, 22671960, 23406637, 22587399, 22351701, 21813722, 22142819, 22637095, 22600194, 23226574, 22410666, 22001312, 22930662, 22993063, 23550095, 23758287, 23521399, 24924661, 25236137, 24119837]
6148B4119837k57522l23591L95618K88262q91972J232599Q63983n09375q61908
6139B4055931L73510M37270r89298J02534j74803O39521n99563K85174j32379
6130B3997897J47542O51011M94931r23219r21349o59934J841197N33148j793495
6121B3367729Q18717J031831J099557P4468n75635l68021J181934K08128j148835
6112B5689873m33911J114487p28984l61576K50419r04428j20881R45152n80557
6103B4869594J529646m71834N47998P81364j108049K37028l91673P81123J911316
6094B8686513m38006j378081K91337M36582K95460K28143j002729k10916P46363
6085B7654666J92571k02414K98174M2341K13876P58685Q30439j11779j437642
$$ y = [24119837, 23862315, 23538724, 23934342, 24222604, 23330632, 24563231, 25427214, 24917839, 24055931, 24429441, 24866711, 23877413, 23979947, 23805144, 24444665, 23845102, 24130276, 23997897, 24145439, 24796450, 25291381, 24368162, 23446813, 22786879, 24628076, 25161224, 23367729, 24186446, 25218277, 26317834, 26392302, 25816667, 25448646, 26630580, 26838708, 25689873, 25255962, 26370449, 25641465, 25279889, 25530308, 24625880, 24504999, 25450151, 24869594, 26399240, 25927406, 26475404, 27256768, 26148719, 26385747, 25994074, 26775197, 28686513, 28248507, 26870426, 27161763, 27598345, 27893805, 28121948, 27119219, 26908303, 27654666, 27847237, 27644823, 27942997, 27985338, 28199214, 28957899, 29788338, 29676559, 28238917]
6076B8238917K20005L97027o50317N1709K6654j37187Q65077l99349j452502q6675
6066B7073359J222141J72945O8648R45591N88170j382761j71855o36934J178578
6057B9057882O39786O43697l27774Q7062O2508L3690j121477M985J787344j263426
6047B9604277R08680M01976o93980J87466N21478o50874Q15574j3593j63632m02315
6037C0515057L85855K94782J015304k01013M61763j09340O65919J40827j355830
6028C1813324o50119O37495P70574j587926O64245j01444k0822p48234Q8089R13337
6018C1778519R92118p7625L140L90296K50146j7448j377613j47690N06420R26554
6008C3226817J20997P98283o35974q83120m80207l52582J481628Q18591O2095
$$ y = [28238917, 28458922, 28855949, 28205632, 28257341, 28283995, 28146808, 29011885, 28612536, 27160034, 27073359, 28295500, 28468445, 28537093, 29482684, 30070854, 28688093, 28516238, 27879304, 29057882, 29697668, 30341365, 30013591, 30100653, 30163161, 30196851, 29075374, 29080359, 30867703, 29604277, 30512957, 30914933, 30220953, 30408419, 30929897, 30279023, 31094597, 31081004, 30917372, 30515057, 30900912, 31195694, 32210998, 32009985, 32471748, 32362408, 33028327, 33169154, 31813324, 31163205, 31800700, 32571274, 30983348, 31647593, 31546149, 31525327, 30777093, 30865182, 31778519, 32770637, 32693012, 32696152, 33086448, 33336594, 33319146, 31941533, 31793843, 32300263, 33226817, 33347814, 34146097, 33510123, 32627003, 32146796, 31794214, 33275842, 34094433, 34156528]
5999C4156528P74971K80926n22297N06782j38025L1193N49916j398969j44416
5990C4096609J090329l90957j142047k92022L41271J252104J150426Q82143Q58293
5981C7846149k004248r50441R01820J91501L09509k18482o10506K44731K054388
5972C7764421J74791R36072m95699j608486J535027j88534j065136r6612Q15552
5963C7771396j262280R66416K055358o81719r77164j62015n2517N72744O1918
5954C8292137J658294R21207l72518j902327O4704M26256n36816N35473N69693
5945C9656103k88317Q06254p18603M34089J425905l04864O86314P20821n87846
5936D1829856m87249J022483q98016K61101q8452J40252M67342L41343M67578
$$ y = [34156528, 34931499, 35212425, 34690128, 35196910, 35058885, 35090078, 35639994, 34241025, 34096609, 35186938, 34795981, 33653934, 33361912, 33703183, 34955287, 36105713, 36987856, 37846149, 35841901, 34891460, 35793280, 35984781, 36294290, 36075808, 35465302, 35710033, 37764421, 37939212, 38875284, 38379585, 36771099, 38306126, 38117592, 37052456, 36955844, 37771396, 36509116, 37475532, 39530890, 38849171, 37872007, 37709992, 37657475, 38230219, 38292137, 39950431, 40871638, 40499120, 38596793, 38661497, 39087753, 38550937, 39086410, 39656103, 39367786, 40174040, 39455437, 39889526, 41315431, 41010567, 41696881, 42417702, 41829856, 41342607, 42365090, 41467074, 41728175, 41639723, 41779975, 42247317, 42588660, 43056238]
5927D3056238l92614N8971J11422J66119P30431m41623J88112q9376P62325J0195
5917D4160200M88303k59055j391242K186174P78024L4446J90423M03991k65321
5908D6325943O59833j223675p38777R78781m54554j25756P7191J271403l19507
5899D6450882k80764p23497R37518M97207Q38590K10638l57747J644855j58073
5890D9059609R6067M42377m2066o75564N7287J473013k39043j097788k36204j23090
5880D8714598K37494P91658l72924J287679m11639q2224L17909J69200K99578
5871E0951329Q42529m98827J74460J001162P29122l9653m5889J209482O48759
5862E4972474k3646j52303K81217K01231m29959K92252Q99863l64819Q20766K60471
$$ y = [43056238, 42663624, 42722595, 42834017, 43000136, 43730567, 43288944, 43477056, 43387680, 44150005, 44160200, 44648503, 44389448, 42998206, 45184380, 45962404, 45996850, 46187273, 46591264, 46325943, 46985776, 45762101, 45023324, 46002105, 45547551, 45421795, 45498986, 46770389, 46450882, 46170118, 45446621, 46384139, 46881346, 47719936, 47930574, 47572827, 49217682, 49059609, 49155676, 49598053, 49555987, 48880423, 48937710, 50410723, 50171680, 49073892, 48837688, 48714598, 48952092, 49743750, 49370826, 50658505, 50246866, 50164642, 50482551, 50651751, 50951329, 51793858, 51295031, 51469491, 52470653, 53199775, 53160122, 53114233, 54323715, 54972474, 54948828, 54796525, 55077742, 55278973, 54849014, 55141266, 56041129, 55676310, 56497076, 56757547]
5852E6757547m6159m80102M63204N09929M86704Q72112J24429o44448R45871M25342
5842E9414429l74885K68199M35874K62751N90328k5511J558513L83804j259495
5833F1254007P10130J663504M61409l86224m45167k74822l33828J152745J278383
5824F5080137l80873R26641l01064J98112Q27493O01080q39858L17514L66489
5815F6795671j544313J969889k32281O75291Q93168N36821n09970l58768O64574
5806F8890082J597060M46334l77143L99311n9130Q25191J6054k94094m99528J88842
5796G1132979J125484R07031k96226O74200J1545O95589Q48017M89402K01470
5787G5789491M65224R57657n56767n22253k68449N14324J396256P78156j00231
$$ y = [56757547, 56711388, 56231286, 56694490, 57204419, 57691123, 58563235, 58687664, 58043216, 58989087, 59414429, 59039544, 59307743, 59743617, 60006368, 60596696, 60571185, 62129698, 62513502, 61254007, 61964137, 63627641, 64089050, 63702826, 63257659, 62982837, 62649009, 63801754, 65080137, 64699264, 65625905, 65324841, 65522953, 66350446, 66951526, 66111668, 66429182, 66795671, 65251358, 67221247, 66988966, 67664257, 68557425, 69094246, 68584276, 68225508, 68890082, 70487142, 70933476, 70556333, 70955644, 70896514, 71721705, 71737759, 71443665, 70944137, 71132979, 72258463, 73165494, 72869268, 73543468, 73555013, 74250602, 75098619, 75588021, 75789491, 76254715, 77212372, 76655605, 76133352, 75864903, 76379227, 77775483, 78553639, 78453408]
5778G8453408L21233o36613M15015J036163J56612R75213J346367p4045n1022
5769H1942331J375500r82532R53316n1314K67335P39320q0748N53187r69245q8018
5759H3659132J126622J573251L1999J786845O84701m65765l85316L03132L81005
5750H8695606m1983J937828j067722J107649M61009L51016O22358R00643J714295
5741I4680699k01987M70208n17814j82168R38060l41607k72158J098262J427549
5732I7099044M98342k74908K547550N07245o07273k213j66352J347749J503331
5723A02452515J053055l09362L28526K40305k15558O73497J322429J311715M44915
5714A07302037j11163m8456J137360R54587O15244K70849N35993J136848Q1895
$$ y = [78453408, 78774641, 78138028, 78553043, 79589206, 79745818, 80721031, 82067398, 81993353, 81942331, 83317831, 82335299, 83288615, 83237301, 83504636, 84243956, 84163208, 84716395, 83747150, 83659132, 84785754, 86359005, 86391004, 88177849, 88862550, 88396785, 88011469, 88314601, 88695606, 88653623, 90591451, 89523729, 90631378, 91092387, 91443403, 92065761, 92966404, 94680699, 94478712, 94948920, 94431106, 94248938, 95186998, 94845391, 94573233, 95671495, 97099044, 97597386, 97322478, 99870028, 100377273, 99770000, 99767787, 99601435, 100949184, 102452515, 103505570, 103196208, 103524734, 103765039, 103549481, 104222978, 105545407, 106857122, 107302037, 107190874, 107142418, 108279778, 109234365, 109849609, 110120458, 110656451, 111793299, 111875194]
5705A11875194J797301j07211n44927n0089J631843J346733O8245Q34057j08302
5696A16742844J126657Q44030j71729M10338J734641J769630K75733J686754O46943
5687A25065841J15122N3749K47029J115421J941140P74064K28936R22229p31425
5678A29732106N90428R67913J395752K603021J92642K69240K461838j685J25613
5669A38336868O94920L00367j41437J138459J848965J174710L24905J770067J222430
5660A46670254J193373J106383J482867J054633j016731J650143J082691N14426
5652A53738039J568192J166410o09854J031998J738450J180741J532646J37002
5644A61483624J779503N42405J220587J276341k52403J015489K150879N73854
$$ y = [111875194, 113672495, 113565284, 113020357, 112970268, 114602111, 115948844, 116017089, 116851146, 116742844, 117869501, 118713531, 118541802, 118952140, 120686781, 122456411, 122732144, 124418898, 125065841, 125180963, 125234712, 125481741, 126597162, 128538302, 129312366, 129541302, 130463531, 129732106, 130322534, 131290447, 132686199, 135289220, 135481862, 135751102, 138212940, 138211255, 138336868, 139031788, 139332155, 139190718, 140329177, 142178142, 143352852, 143677757, 145447824, 146670254, 147863627, 148970010, 150452877, 151507510, 150490779, 152140922, 153223613, 153738039, 155306231, 156472641, 155862787, 156894785, 158633235, 159813976, 161346622, 161483624, 163263127, 163805532, 165026119, 166302460, 166050057, 167065546, 169216425, 169790279]
5636A69790279J534226J741626R37539N47402J153425J695537J15929K37861J850783
5627A79604607K275864n43L28042J686406J132917M89737O11943J798288Q79525
5618A88806786J000984J903724J879046p5770J852459J776912J470765J465190
5610B00080096P53947K453002J616547J054258N87743J415005J596378J884800
5602B11441776J629419J339038J409740N32496R12488K209796L163492Q93351
5594B23531596N23593J467476K305756K361049J459547J154672J912910J434389
5586B36150988K043186K524808J361934K427102J426610P62257R05718K002840
5578B49605443J108369L288372L010742J958294J400111J691637Q83829J952281
$$ y = [169790279, 171324505, 173066131, 174003670, 174551072, 175704497, 177400034, 177515963, 177753824, 179604607, 181880471, 181879928, 182207970, 183894376, 185027293, 185517030, 186128973, 187927261, 188806786, 189807770, 191711494, 193590540, 193514770, 195367229, 197144141, 198614906, 200080096, 200834043, 203287045, 204903592, 205957850, 206545593, 207960598, 209556976, 211441776, 213071195, 214410233, 215819973, 216352469, 217264957, 219474753, 222638245, 223531596, 224055189, 225522665, 227828421, 230189470, 231649017, 232803689, 234716599, 236150988, 238194174, 240718982, 242080916, 244508018, 245934628, 246696885, 247602603, 249605443, 250713812, 254002184, 257012926, 258971220, 260371331, 262062968, 262946797, 264899078]
5570B64899078J905048L733238R17872J599968J511528J471905K605239M18286
5562B79062162J448532K775396L231320J050603L127105K211604J738085J605951
5554B96250758K053665L371596J008078J703535L354438K917276J543230J419925
5546C13622501K401100J725495L087034J720294J466851J725799K816261L070178
5538C31635513N76505K967703K430439K708005K568879R91357K069714L018817
5530C48966932K341878J460049K036699K477275L072655K017092J818796M35933
5522C64627309L267756L140968J755167K449517K540661P54832L114438L938506
5514C85589154P37581J652928K488258K865606K509305J609123R48966K351581
$$ y = [264899078, 266804126, 270537364, 271455236, 273055204, 274566732, 276038637, 278643876, 279062162, 280510694, 283286090, 286517410, 287568013, 290695118, 292906722, 294644807, 296250758, 298304423, 301676019, 302684097, 304387632, 307742070, 310659346, 312202576, 313622501, 316023601, 317749096, 320836130, 322556424, 324023275, 325749074, 328565335, 331635513, 332212018, 335179721, 337610160, 340318165, 342887044, 343878401, 345948115, 348966932, 351308810, 352768859, 354805558, 357282833, 360355488, 362372580, 364191376, 364627309, 367895065, 371036033, 372791200, 375240717, 377781378, 378536210, 381650648, 385589154, 386326735, 387979663, 390467921, 393333527, 395842832, 397451955, 398400921, 400752502]
5506D00752502J684186K146033J541208K038437K657190J278526J831349N70017
5498D14499448J108743K689876J894934K479250J316923J081710J270702J272118
5490D27613704K209308J892255Q15579J009579J239623J609969J623615Q29233
5482D38842865P28709k27215J644661K420524N23894P25660J253730p97941J207659
5473D46322546J115855j33881J376393o00901Q03633n67236o35967J259284k27151
5464D48712575O83695J423219L07836p07967R8069j8971m43427l93077K50206
5455D49912158p49797m37684n95151J61735j164470k004023j779550O11644j36042
5446D43818820k638359j681606j625240J23827j081367J48191j584545k021419
$$ y = [400752502, 402436688, 404582721, 406123929, 408162366, 410819556, 412098082, 413929431, 414499448, 415608191, 418298067, 420193001, 422672251, 423989174, 425070884, 426341586, 427613704, 429823012, 431715267, 432530846, 433540425, 434780048, 436390017, 438013632, 438842865, 439571574, 439344359, 440989020, 443409544, 443933438, 444659098, 445912828, 445114887, 446322546, 447438401, 447304520, 448680913, 448080012, 448883645, 448316409, 447680442, 448939726, 448712575, 449396270, 450819489, 451127325, 450419358, 450517427, 450498456, 450055029, 449661952, 449912158, 449162361, 448724677, 448129526, 448291261, 447126791, 445122768, 443343218, 443954862, 443818820, 441180461, 439498855, 437873615, 437997442, 436916075, 437064266, 435479721, 433458302]
5438D33458302j918927j124134j81200r87330l005385j800047j0344j676274j064126
5429D21690535j152256k861889j907440j391323k336550k892158k804892j442489
5421D04901538j297867m49065j847383k653818k764034k871209j991360j186743
5413C89840059j092594q80983l939594k569665j319101l143111l186595l365740
5405C70342676j642046n53061k533328j967569j943581l373865j761868j729263
5397C54838095k474008k039338k705708k332573j796483k793151j543033k171172
5389C36982629k689021r58165k215880k161406k133929j691348k470392k765284
5381C19897204k840725j667985j122689k606777k404151k216829l099959k489425
$$ y = [433458302, 431539375, 430415241, 430234041, 429246711, 426241326, 424441279, 424430935, 422754661, 421690535, 420538279, 417676390, 415768950, 414377627, 412041077, 409148919, 406344027, 404901538, 403603671, 403154606, 401307223, 398653405, 395889371, 393018162, 391026802, 389840059, 388747465, 387866482, 383926888, 381357223, 380038122, 376895011, 373708416, 370342676, 368700630, 368147569, 365614241, 363646672, 361703091, 358329226, 356567358, 354838095, 352364087, 350324749, 347619041, 345286468, 343489985, 340696834, 339153801, 336982629, 334293608, 333335443, 331119563, 328958157, 326824228, 325132880, 322662488, 319897204, 317056479, 315388494, 314265805, 311659028, 309254877, 307038048, 303938089, 301448664]
5373C01448664r79643j865474j750600j900658l122108o82859l307750q60651
5365B86978921r04351l393947k274753q22142j934959j060605k240204l331257
5357B71016703m42812j880284l153722j189434Q32141l669306j974134j096795
5349B58442357k151479j327255j567299k126484j561054j223737j677429j500095
5341B45307525j140858k622310o20135j831747k332003l22674q00429k788982
5333B32848387q55843m27031k88742k001597j399092j556532j221723k264449
5325B22833378j95744n50486j673415j040943l74422j335971j628609k039933
5317B13993855n0805q48821j799333j697626j607369q14822r03004q06185k18567
$$ y = [301448664, 300469021, 298603547, 296852947, 294952289, 291830181, 291147322, 287839572, 286978921, 286074570, 282680623, 280405870, 279583728, 277648769, 276588164, 274347960, 271016703, 270573891, 268693607, 265539885, 264350451, 265182592, 261513286, 259539152, 258442357, 256290878, 254963623, 253396324, 251269840, 249708786, 248485049, 246807620, 245307525, 244166667, 241544357, 240924222, 239092475, 236760472, 236437798, 235637369, 232848387, 231992544, 231565513, 231276771, 229275174, 227876082, 226319550, 225097827, 222833378, 222637634, 222087148, 220413733, 219372790, 218998368, 217662397, 216033788, 213993855, 213943050, 213094229, 211294896, 209597270, 207989901, 207175079, 206272075, 205465890, 205247323]
5308B05247323k080774r57195P06435j519972j93314n86777q72166j433564m80398
5299A97829598j356973r48136k149676J202930j150381j454363q2361m62792j349222
5290A90078624n6J234444j640454j274036p75535r19643j02254K51308m70090
5281A86382308j599889j062879j912712m08834L01561j128777r62724k69358m9626
5272A79289070L72767j289453j185726r10228j623128R914j005411q78480L07142
5263A73086467q03516M98875m09223j866965k46952P72066j820413j641915k79756
5254A67288668j148688j462284j390375M13734P88938l67198k93083j296323j516458
5245A61016931j147848n69009j519412j649871K2601r60499j25425o41854n03730
$$ y = [205247323, 203166549, 202209354, 202915789, 201395817, 201202503, 200615726, 199743560, 198309996, 197829598, 196472625, 195524489, 193374813, 194577743, 193427362, 191972999, 191890638, 191427846, 190078624, 190078568, 191313012, 189672558, 188398522, 187622987, 186703344, 186601090, 186852398, 186382308, 184782419, 183719540, 181806828, 181397994, 181699555, 180570778, 179608054, 179338696, 179289070, 179661837, 178372384, 177186658, 176276430, 174653302, 174663216, 173657805, 172779325, 173086467, 172282951, 172781826, 172372603, 170505638, 170258686, 171030752, 169210339, 167568424, 167288668, 166139980, 164677696, 163287321, 163701055, 164489993, 164122795, 163829712, 162533389, 161016931, 159869083, 159300074, 157780662, 156130791, 156153392, 155192893, 155067468, 154425614, 153921884]
5236A53921884r96918m36557j094260j642806K74031j99488P93516p84907j175312
5227A48659183p95407j173867j214837R89967m67841k194824R89092O06696K83999
5218A45682161n86764j239257m77823J1413j66109r59686J45309j28422j426095
5209A40854727q2236P29963p03490r29124j97275n53429m236n08901r05035J02169
5199A37803133O99835N46633L5318p9284n44568K49089O47688p67523j417063
5190A37173258l26935J531271l89493q96319j22674j64008k13728J301610o0626
5181A37832356j409579N38862Q01856o82443j468340O00399j19376K44577Q99305
5172A37237617n02237L14267l4587j24138N71520n08088n24948k4314J203955
$$ y = [153921884, 152924966, 152488409, 151394149, 149751343, 150025374, 149825886, 150619402, 149834495, 148659183, 147863776, 146689909, 145475072, 146465039, 145997198, 143802374, 144791466, 145398162, 145682161, 145095397, 143856140, 143378317, 143389730, 143223621, 142263935, 142409244, 142280822, 140854727, 140772491, 141502454, 140798964, 139869840, 139672565, 139119136, 139114900, 138605999, 137700964, 137803133, 138502968, 139049601, 139084919, 139005635, 138461067, 138710156, 139357844, 138590321, 137173258, 136846323, 138377594, 137988101, 137091782, 136969108, 136805100, 136591372, 137892982, 137832356, 136422777, 136961639, 137763495, 137081052, 135612712, 136213111, 136093735, 136338312, 137237617, 136735380, 137049647, 137015060, 136890922, 137462442, 136954354, 136429406, 136405092, 137609047]
5163A37609047J3195m98844m73634j57838R85381R44873j190484J466464R97553
5154A39695713q67457j32590p18609Q07995j97874Q1275n43008O49080k66666
5145A38507859P31507l02512m26864M88651J28670o26514J00613K32285J090304
5136A39923999m65415o9451M39351o82174r22679m33916J068022R01594R04966
5127A40664297j206409J29995k97920j13771M31471N23893j355213o67445R20729
5118A39029627m5558n35144J699174O68843j725440k28580J417034k01414l72678
5109A39705864Q08510J88961o75959p78631R46600J052270q51285j369932M70954
5100A39497352O62528r62682j179197N68803j01585R20070K63060L37387m23605
$$ y = [137609047, 137622242, 137123398, 136649764, 136491926, 137477307, 138422180, 137231696, 138698160, 139695713, 138828256, 138695666, 137977057, 138785052, 138587178, 138668453, 138125445, 138774525, 138507859, 139239366, 138936854, 138509990, 138998641, 139127311, 138500797, 138601410, 138833695, 139923999, 139458584, 139389133, 139828484, 139146310, 138223631, 137789715, 138857737, 139759331, 140664297, 139457888, 139587883, 139289963, 139176192, 139607663, 140131556, 138776343, 138108898, 139029627, 138984069, 138448925, 140148099, 140816942, 139091502, 138862922, 140279956, 140078542, 139705864, 140514374, 140703335, 140027376, 139248745, 140195345, 141247615, 140396330, 139026398, 139497352, 140159880, 139197198, 138018001, 138586804, 138485219, 139405289, 139668349, 140005736, 139582131]
5091A39582131P69524J248865q311l59557q63001M7010N93690L83705L18580M80104
5081A42192740o61975J062281R88006k74410n74727j310242o38149L65821R133
5072A41158478N19068J70749J017996L76431N91879K67317k15244O64839m08796
5063A44142717R0936o26378M81458M77818O35070O80300L43350j13965J340118
5054A47451424J19405L13814J259429N91392r1073n58462M35157l39185P02975
5045A49884876R97807J828902L83931l04123K52596K16248p44308K64405J421570
5036A54201904P44360O65327J066077R08257j41614K54306J232377J293464N53655
5027A60778113j1196j194445J005225L527650J335134o03751K64483J93602Q02281
$$ y = [139582131, 140351655, 141600520, 141592209, 141232652, 140369651, 140416661, 141010351, 141394056, 141712636, 142192740, 141530765, 142593046, 143581052, 143306642, 142731915, 141421673, 140783524, 141149345, 141158478, 141677546, 141848295, 142866291, 143242722, 143834601, 144101918, 143886674, 144551513, 144142717, 144233653, 143607275, 144088733, 144566551, 145201621, 145881921, 146225271, 146111306, 147451424, 147570829, 147884643, 149144072, 149735464, 149644391, 149085929, 149521086, 149181901, 149884876, 150882683, 152711585, 153095516, 152791393, 153043989, 153260237, 152515929, 152780334, 154201904, 154946264, 155611591, 156677668, 157585925, 157444311, 157698617, 158930994, 160224458, 160778113, 160766917, 159572472, 160577697, 164105347, 165440481, 164836730, 165101213, 165294815, 166097096]
5018A66097096K253506R2765J82059Q39928Q88744M09770Q19339N36811J383682
5009A73503700O55019J254325O10144Q85994K014048J238220J046892J511489
5001A82719831Q29706J248584K50447J894087K53624L36318J814065J646538J924407
4992A92917607O82283J009246J95533K738194J451140J590716K319357R17851
4984B03821927J144183N53697J366221K603846K623219K221407n22680K67664
4976B14079484K779328K948293K941261J251417J748439K152377J531633J349508
4968B30781740J474156K980017J740008K945368K621101L385958K476881K074367
4960B50479596J955564K316486K171856J506924K852855R67919K847669K889582
$$ y = [166097096, 168350602, 168443367, 168625426, 169465354, 170354098, 170763868, 171583207, 172120018, 173503700, 174158719, 175413044, 176023188, 176909182, 178923230, 180161450, 181208342, 182719831, 183549537, 184798121, 185048568, 186942655, 187196279, 187532597, 189346662, 190993200, 192917607, 193599890, 194609136, 194804669, 197542863, 198994003, 200584719, 202904076, 203821927, 204966110, 205519807, 206886028, 209489874, 212113093, 214334500, 213811820, 214079484, 216858812, 219807105, 222748366, 223999783, 225748222, 227900599, 229432232, 230781740, 232255896, 235235913, 236975921, 239921289, 242542390, 245928348, 248405229, 250479596, 252435160, 254751646, 256923502, 258430426, 261283281, 262251200, 265098869, 267988451]
4952B67988451J880273L097711K317006J715198L707086L204311K117263J991238
4944B88018537J975916L954380R32725J862897L384611J663969P85609K364691
4936C04943335K009084J618773J451311K691464K454702K91928J311370K019649
4928C18791616K276120J340047J495737K79767L41382K714162J323297j8965P35343
4919C29278506J221297O01106n28485M38138J343087J079163j294084L58340J748788
4910C34245856P59734j0719M99860J332140k6424m14980K93312J382551l0647
4901C38030683J265583J206117n00720K44621M21750J282906O78729P34266K4032
4892C43387967N06958J206235k32209J119194Q09568O26115o69713J406349M66815
$$ y = [267988451, 269868724, 272966435, 275283441, 276998639, 280705725, 283910036, 286027299, 288018537, 289994453, 293948833, 294881558, 296744455, 300129066, 301793035, 302578644, 304943335, 306952419, 308571192, 310022503, 312713967, 315168669, 315460597, 316771967, 318791616, 321067736, 322407783, 323903520, 324183287, 324524669, 327238831, 328562128, 328543163, 329278506, 330499803, 331100909, 330572424, 331010562, 332353649, 333432812, 332138728, 332497068, 334245856, 335005590, 334994871, 335494731, 336826871, 336800447, 336385467, 336678779, 338061330, 338030683, 339296266, 340502383, 340001663, 340246284, 340668034, 341950940, 342629669, 343363935, 343387967, 343894925, 345101160, 344868951, 345988145, 346797713, 347423828, 346754115, 348160464, 348627279]
4883C48627279M66914P43467O10065J847674O36360J295267Q31524K36320O87061
4874C55981931J928858J179935J329001K322940L743675Q55033J140444K300035
4866C70781852J906116K369810J617483R83270J678268K158966L229555K560789
4858C87286109K504578J707603J706380K955441K711581K467834J204911L003632
4850D05548069K311378J337912J274644J857632K188985K472805J850565K24362
4842D19066352K000013K933895J414251K640272J690336q93615J690201J292793
4834D31834498L87624J241649Q59093K37185O13701J05029P02725M62663j067468
4825D35376699O247N83315m3033Q40246k12368Q83069M1409J029637Q71199k181213
$$ y = [348627279, 349094193, 349837660, 350447725, 352295399, 352931759, 354227026, 355058550, 355294870, 355981931, 357910789, 359090724, 360419725, 362742665, 366486340, 367341373, 368481817, 370781852, 372687968, 375057778, 376675261, 377658531, 379336799, 381495765, 384725320, 387286109, 389790687, 391498290, 393204670, 396160111, 398871692, 401339526, 402544437, 405548069, 407859447, 409197359, 410472003, 412329635, 414518620, 416991425, 418841990, 419066352, 421066365, 424000260, 425414511, 428054783, 429745119, 428851504, 430541705, 431834498, 432222122, 433463771, 434322864, 434560049, 435173750, 435278779, 435981504, 436444167, 435376699, 435382946, 435966261, 435923228, 436763474, 436551106, 437434175, 437475584, 438505221, 439376420, 437195207]
4815D37195207J2624j052286o96958n21983l62329l96253J74746p66667l68723
4806D33217378j260288q76434j214998j953492k186565j326352j349196j957939
4798D21092114k106715j741615k900846j865262j405263l719615k907154m080880
4790D00364764k257472k615771n288104k762662j992809m094617k769421l260849
4782C75323059m367244n192129m127138j725525l047240l919686m676815n285875
4774C42981407l081145l652453m298111l342306j700279l172089k305626l671433
4766C17757965m132303l563957k721742k798033l425404l490509k388788l181295
4758B92055934k799122k726613l483707k501945j825940k673790k200174k021118
$$ y = [437195207, 437207831, 436155545, 435458587, 434936604, 434574275, 434178022, 434352768, 433586101, 433217378, 431957090, 431080656, 429865658, 427912166, 425725601, 424399249, 423050053, 421092114, 418985399, 417243784, 414342938, 412477676, 411072413, 407352798, 404445644, 400364764, 398107292, 395491521, 390203417, 387440755, 385447946, 381353329, 378583908, 375323059, 370955815, 365763686, 361636548, 359911023, 356863783, 352944097, 348267282, 342981407, 339900262, 336247809, 331949698, 328607392, 326907113, 323735024, 321429398, 317757965, 313625662, 310061705, 307339963, 304541930, 301116526, 297626017, 295237229, 292055934, 289256812, 286530199, 283046492, 280544547, 278718607, 276044817, 273844643, 271823525]
4750B71823525k981694k979565k302136k84444j013711k573349j550086j434526
4742B56704014j357448j382154j063195k283559k556553j118392k160041p09526
4734B44073146m77764n93451k511009m18777l36889j842532l05861N30205o60064
4725B37457004j812620j089329j424731j306272k92023l10706p82097Q98692j088242
4716B30249676M96284O09262k599062n34101M42765O1005j445517r82069k564437
4707B23733806Q07419J95361j08019J199394j319268n94867P35373j065040j996089
4698B21588070o89474J10441j96159J22670j356586j597970r18465p63433M54695
4689B16753789j186093q53842L11489m55741j105775n82560n04170j120664l22087
$$ y = [271823525, 268841831, 265862266, 263560130, 263275686, 262261975, 259688626, 258138540, 256704014, 255346566, 253964412, 252901217, 250617658, 248061105, 246942713, 244782672, 244073146, 243595382, 243001931, 240490922, 240072145, 239735256, 237892724, 237586863, 238117068, 237457004, 235644384, 234555055, 233130324, 231824052, 231532029, 231221323, 230439226, 231337918, 230249676, 230745960, 231355222, 228756160, 228222059, 228664824, 228725829, 227280312, 226298243, 223733806, 224541225, 224736586, 224628567, 225827961, 224508693, 223913826, 224649199, 223584159, 221588070, 220898596, 221009037, 220812878, 220935548, 219578962, 217980992, 217062527, 216299094, 216753789, 215567696, 214713854, 215025343, 214569602, 213463827, 212881267, 212377097, 211256433, 210934346]
4680B10934346M0178p38241p37897L86936K00833j38946j101834j925847J21554
4671B07041082J463113m88131l59353l29926K34087Q11465k50584Q54860O27694
4662B09604307j111769J337409N21549j79205Q79145K171825R44514J152998J969896
4653B17290669J9557k81675J367501O96726J338844K401944J787331J578052J122799
4644B27321748K974602K09483J879794K299936K836853K580578J897312L673287
4636B45673593J874183J774458L055886J608381L747048L456063K782175K673976
4628B66645763L957918M071646L257646K733781K300755M770932L310953K493928
4620B93543322L429519M264149L578809L485465K817072M319149L440558K550191
$$ y = [210934346, 210974524, 210236283, 209498386, 209885322, 210086155, 209947209, 208845375, 206919528, 207041082, 208504195, 208016064, 207656711, 207326785, 207560872, 208372337, 208121753, 208976613, 209604307, 208492538, 209829947, 210351496, 210172291, 211051436, 213223261, 214167775, 215320773, 217290669, 217310226, 217028551, 218396052, 219092778, 220431622, 222833566, 224620897, 226198949, 227321748, 230296350, 230505833, 232385627, 234685563, 237522416, 240102994, 242000306, 245673593, 247547776, 249322234, 252378120, 253986501, 257733549, 261189612, 263971787, 266645763, 270603681, 274675327, 277932973, 280666754, 282967509, 287738441, 291049394, 293543322, 296972841, 301236990, 304815799, 308301264, 311118336, 315437485, 318878043, 321428234]
4612C21428234N248765L650463M214539M501106L140584L724597L380250M710332
4604C53998870K993830K151892L584814L992802M919389K455714L618041L130177
4596C80845529K478694L464925L366354N75415P80486J239262K842605K312552
4588C97905822R21786M7218J79245P89152j448970k05393j928834j130502k023300
4579C93106224k041785k232811k963623j809407n912220m250567m339962n322474
4571C64233375m463611n265045n092278n208589o968831o080093m938670n013611
4563C21202647m966438p012040p126417m504027o495881n691751n997827p127000
4555B72281266n618359n539069m121949n800432n666645n433594n662769n013324
$$ y = [321428234, 326676999, 330327462, 334542001, 339043107, 342183691, 345908288, 349288538, 353998870, 356992700, 359144592, 362729406, 366722208, 371641597, 374097311, 377715352, 380845529, 383324223, 386789148, 390155502, 390730917, 391511403, 392750665, 395593270, 397905822, 398827608, 398874826, 399054071, 399843223, 398394253, 398188860, 396260026, 395129524, 393106224, 391064439, 388831628, 385868005, 384058598, 378146378, 373895811, 369555849, 364233375, 359769764, 354504719, 349412441, 344203852, 337235021, 331154928, 326216258, 321202647, 316236209, 309224169, 302097752, 297593725, 291097844, 285406093, 279408266, 272281266, 266662907, 261123838, 257001889, 251201457, 245534812, 240101218, 234438449, 229425125]
4547B29425125l476539m342414m014943l586115m258305m973840m021416l138546
4539A97613007l404551m612927m209106l329592k580119j224213k997663l978540
4531A71276296j596782k737101l063681k625079j510946l434896k249093k030598
4523A52028120k167475j765736k115935j953626l280086k654135q44058l97427
4515A36849642j899567n39354j328371k597782j531698j997796k165448J39937
4507A24929563k074526k070197j312095k07870j166730k172916j379333j115472
4499A13430424k21778j348040j479383j030340j297396j727437P01312k08257
4491A06819105k124202j766422l29669O12431q82068j037077r10614j433048k253407
$$ y = [229425125, 225948586, 221606172, 217591229, 214005114, 209746809, 204772969, 200751553, 197613007, 194208456, 189595529, 185386423, 182056831, 179476712, 178252499, 175254836, 171276296, 169679514, 166942413, 163878732, 161253653, 159742707, 156307811, 154058718, 152028120, 149860645, 148094909, 145978974, 144025348, 140745262, 138091127, 137247069, 136849642, 134950075, 134410721, 133082350, 130484568, 128952870, 126955074, 124789626, 124929563, 122855037, 120784840, 119472745, 119264875, 118098145, 115925229, 114545896, 113430424, 113208646, 111860606, 110381223, 109350883, 108053487, 106326050, 107027362, 106819105, 104694903, 102928481, 102598812, 103211243, 102329175, 101292098, 100381484, 98948436, 96695029]
4482I6695029O17937m77522p47823N52803l37856l15422r51858q57092n96056
4473I3582140j080105q55669j693714n69588j083892q37602l59945p42899m74073
4464H5884653j36207p85282o54362J80904j447200q77694M21980m29130p26686
4455H1430976j081047j512503L62525j31129j020772K32116J019975K63631j16760
4446G9447012j512186j124465j664230L44418L73509l81620o40002j175990k421671
4437G1244775P99828O94642P71083r29442q17330L7576J77299m76150j455349
4428G0046932J74972q65099j61997j09619l36050r03610k71009k59890n38886
4419F6775744J053851J039320j640780j468821q81917n0928Q4534p75205r81894
$$ y = [96695029, 97312966, 96835444, 96087621, 96640424, 96302568, 95987146, 95035288, 94178196, 93582140, 92502035, 91646366, 89952652, 89383064, 88299172, 87461570, 87101625, 86358726, 85884653, 85748446, 84963164, 84308802, 84489706, 83042506, 82164812, 82586792, 82157662, 81430976, 80349929, 78837426, 79199951, 79068822, 78048050, 78280166, 79300141, 79563772, 79447012, 77934826, 76810361, 75146131, 75490549, 75864058, 75482438, 74842436, 73666446, 71244775, 72044603, 72739245, 73510328, 72580886, 71763556, 71801132, 71978431, 71502281, 70046932, 70221904, 69356805, 69194808, 69085189, 68749139, 67845529, 67574520, 67314630, 66775744, 67829595, 68868915, 67228135, 65759314, 64877397, 64826469, 64911003, 64135798, 63153904]
4410F3153904O0147L18236J07124l05032j155398j033245N81257J203534j7315
4401F2913212n32860j61652J74072O40477m59101j252763q18060J08862n57981
4392F0054206j049164Q44825K062299m63786k586801l36680M53365O17n91286
4383E8387595j412602N16325K36112j047942P70280j39132j533031M82587n57267
4374E5702925j30888O35448L58131o86971O66857J25905O86542r40202j349380
4365E5068367P968K02173j25760o34542r72174R91552n7447r06116M1160P0946
4355E3686127k48373J320026Q46991p73934J37584o41791J173958p40811j169894
4346E3589883J07117K0085n46549j66144k40815l27790p78083L65240J926883
$$ y = [63153904, 63214051, 63532287, 63639411, 63334379, 62178981, 61145736, 61726993, 62930527, 62913212, 62380352, 62218700, 62392772, 63033249, 62574148, 61321385, 60503325, 60612187, 60054206, 59005042, 59849867, 61912166, 61448380, 58861579, 58524899, 58978264, 58978881, 58387595, 56974993, 57491318, 57727430, 56679488, 57449768, 57310636, 55777605, 56260192, 55702925, 55572037, 56207485, 56565616, 55878645, 56545502, 56671407, 57357949, 56417747, 55068367, 55076335, 55278508, 55152748, 54518206, 53546032, 54537584, 54480137, 53574021, 53615181, 53686127, 53437754, 54757780, 55604771, 54830837, 54968421, 54326630, 55500588, 54759777, 53589883, 53697000, 53717085, 53170536, 53004392, 52763577, 52435787, 51657704, 52022944, 53949827]
4337E3949827Q32765j20390j408625q0652K59304L65298j56277k63606L03487
4328E3681131j48209k48149r7153j224666j275628N76295J001152P66911L54385
4319E3386069Q91943N03076j342384q82398L87657l46179P17318R4736L25749
4310E3735587j450220J73720Q2571J94866K42117J400526P72100N89409q35683
4301E4904993J4231J66997j61350n27927q66669J346271o74821O80882O77303
4292E5559910k11577k07501j44380N88355k069p24837k2941L76226K22984O55475
4282E6089645p29999N19267J305022n87027l5208N88826K41323L16715n18109
4273E7190455j052563J225745J41740q61770Q17842j274967m25800k30074l6648
$$ y = [53949827, 54782592, 54662202, 53253577, 53172925, 53432229, 53797527, 53641250, 53377644, 53681131, 53532922, 53284773, 53187620, 51962954, 50687326, 51263621, 52264773, 53031684, 53386069, 54278012, 54781088, 53438704, 52556306, 52943963, 52597784, 53315102, 53409838, 53735587, 52285367, 52459087, 52541658, 52736524, 52978641, 54379167, 55151267, 55740676, 54904993, 54919224, 55086221, 54924871, 54396944, 53530275, 54876546, 54201725, 54882607, 55559910, 55348333, 55140832, 54996452, 55584807, 55582738, 54857901, 54834960, 55211186, 55434170, 56089645, 55359646, 55878913, 57183935, 56596908, 56561700, 57150526, 57391849, 57708564, 57190455, 56137892, 57363637, 57505377, 56643607, 57461449, 56186482, 55760682, 55530608, 55493960]
4264E5493960J009465R05888o39666n3134K90824J07385R30335k80259J03160
4255E7867958r58849J520391m07963m74131J183679M0043J69286q19121j34628
4246E7986665O49317n00539o31779r5298O52782j08587R05934J64240R3769L26768
4236E9443272j308056J60871J331802p95759P7998n63553P474j384650J74273
4227E7143672J289708m24816k132692r2888L57762k12623K88548K54756n65956
4218E5905471j653599P50611j132290q73691r85454o18153J014687q29086j058962
4209E0519534p85416j342316j03088l79894J81527l82986j020123o55954q26548
4200D5204736P24894n14970j252586k11445M21483P38122j831265m89790j21588
$$ y = [55493960, 56503425, 57409313, 56769647, 56716513, 57007337, 57114722, 58045057, 57764798, 57867958, 56909109, 58429500, 58021537, 57547406, 58731085, 58771128, 58940414, 58121293, 57986665, 58635982, 58135443, 57503664, 57408366, 58061148, 57952561, 58858495, 59022735, 59116504, 59443272, 58135216, 58296087, 59627889, 58832130, 58910128, 58346575, 58354049, 56969399, 57143672, 58433380, 58008564, 55875872, 55782984, 56140746, 55928123, 56216671, 56471427, 55905471, 54251872, 55002483, 53870193, 52996502, 52011048, 51392895, 52407582, 51578496, 50519534, 49734118, 48391802, 48288714, 47908820, 48090347, 47707361, 46687238, 46031284, 45204736, 45929630, 45414660, 44162074, 43950629, 44372112, 45110234, 43278969, 42789179, 42667591]
4191D2667591p71136j818777j18129J61836j353693K03053N14886o77090l98959
4182C8409582M05714j472395r75214R3908N15169R85150o41079k168142k19091
4173C4933602p90802K80601l38389O20626R19573o23447m2584j690672j019228
4164C2249280j217965J556987J79985n24884P2155l99860M64289o47609R9655
4155C1832033L60554m86945n37281j691409q1441L80570j56934n44155j17116
4146B8957876k17033k51526j2787P54217o4414j231092Q31428N24183o46853j136570
4136B7507429k96453K42380o80311j2767O13935j212955P92675N83481j036922
4127B6500492J83933j686261N28108n11520J033012j744019m22414J250042j534682
$$ y = [42667591, 41896455, 40077678, 39959549, 40121385, 38767692, 38970745, 39485631, 38808541, 38409582, 38815296, 37342901, 36367687, 36461595, 36976764, 37961914, 37320835, 35152693, 34933602, 34142800, 34423401, 34085012, 34705638, 35625211, 35001764, 34959180, 33268508, 32249280, 31031315, 32588302, 32768287, 32243403, 32315558, 31915698, 32379987, 31732378, 31832033, 32192587, 31705642, 31168361, 29476952, 29395511, 29776081, 29619147, 29074992, 28957876, 28740843, 28489317, 28476530, 29230747, 29166333, 27935241, 28766669, 29290852, 28643999, 27507429, 27210976, 27453356, 26773045, 26760278, 27374213, 26161258, 26953933, 27537414, 26500492, 26684425, 24998164, 25526272, 25014752, 26047764, 24303745, 23881331, 25131373, 23596691]
4118B3596691q28055J4125M19225J507273r64113r05825J736018L43646j074261
4109B3844724P86193M00986m72675J62082j147121q32340R97786M35405j169066
4100B3005974o79787j839338J137967J922566j16763L86947l48235j327556q4938
4091B2056837q22157J046971J511578P41173n93638m32001j011991m26792l39481
4082B1730499N64379N66151M15962j525819J92419K9216j05357R02130Q15163
4073B3584743j228181n62486J478368q551K56373j98234q39890j18500k47613
4064B2116029N26653m85293o39738O0771J653937R02721n97294j001257L38636
4055B2875165L52288k4545j3133K86480L86568j158320M52878R49649J3337J67787
$$ y = [23596691, 22768636, 22782761, 23201986, 24709259, 23745146, 22839321, 24575339, 24918985, 23844724, 24630917, 25031903, 24559228, 24721310, 23574189, 22741849, 23739635, 24175040, 23005974, 22326187, 20486849, 21624816, 23547382, 23430619, 23817566, 23469331, 22141775, 22056837, 21234680, 22281651, 23793229, 24534402, 23940764, 23508763, 22496772, 22069980, 21730499, 22294878, 22861029, 23276991, 21751172, 21943591, 21972807, 21867450, 22769580, 23584743, 22356562, 21794076, 23272444, 23263893, 23520266, 23322032, 22482142, 22363642, 22116029, 22642682, 22157389, 21517651, 21578422, 23232359, 24135080, 23537786, 22536529, 22875165, 23227453, 23202908, 23189775, 23476255, 23862823, 22704503, 23157381, 24107030, 24120367, 24288154]
4045B4288154j012116Q18224Q62780j65821j872001n56495K93101J057773M06416
4036B4120015L79246P42702N67811n52740l59890R79711k427492L23290J609739
4027B5382392r5908N0887O54064k28179R59949n36166j272989N02056k2312J457578
4017B6851372J493868k261734J99137Q57665j88253r5460r2629P29604p40515
4008B6753055j004704J347596J408654p10039j112550M5969l97196K67440K44245
3999B6842470P2623k56022O19287N78623n25070J2832J525666Q84586r13922l71032
3989B8470041M91305q30407O83029L65391K81785k106279J36545j178527L14866
3980B6627749J454069K11754j69136J64254o2654j450720k21153O61927l16827
$$ y = [24288154, 23276038, 24094262, 24957042, 24791221, 22919220, 22362725, 22655826, 23713599, 24120015, 24499261, 25241963, 25809774, 25257034, 24897144, 25876855, 23449363, 23772653, 25382392, 25286484, 25337371, 25991435, 25763256, 26723205, 26187039, 24914050, 25416106, 25393794, 26851372, 28345240, 26083506, 26282643, 27140308, 26952055, 26856595, 26763966, 27493570, 26753055, 25748351, 27095947, 28504601, 27794562, 26682012, 26727981, 26330785, 26598225, 26842470, 26915093, 26659071, 27278358, 27856981, 27331911, 27344743, 28870409, 29754995, 28841073, 28470041, 28961346, 28130939, 28813968, 29179359, 29461144, 27354865, 27491410, 26312883, 26627749, 28081818, 28293572, 28124436, 28288690, 28226036, 26775316, 26554163, 27216090, 26899263]
3971B6899263n96625j202429J201595O76242m58569r51703n87455n41382K83351
3962B4722288P98645M07822k68011o28761p28733p78454j024830J729797m75324
3953B3754439r47368L34921p43887n82323K32262l72617k832778P97746l39629
3944A9300766J89105M09327P16520O05760p35424k722315J217819k22376P27245
3935A9486427p2528m19170J457533m79770k01469l01536j111518K17364j547423
3926A7027910p26383J274117R99430j277248k00190M14459j653405j142565R51811
3917A5667936P20391J123785j45688j071821o55228l62593J185227j290129k28134
3908A4943746Q79910j86668o81959o85637J093586k85520j179889o97735n13125
$$ y = [26899263, 26302638, 25100209, 26301804, 26978046, 26519477, 25567774, 24980319, 24438937, 24722288, 25520933, 25928755, 25660744, 25031983, 24303250, 23524796, 22499966, 24229763, 23754439, 22807071, 23141992, 22398105, 21815782, 22048044, 21675427, 18842649, 19640395, 19300766, 19489871, 19899198, 20615718, 21221478, 20486054, 17763739, 18981558, 18759182, 19486427, 19413899, 18994729, 20452262, 19972492, 19771023, 19469487, 18357969, 18575333, 17027910, 16301527, 17575644, 18575074, 17297826, 17097636, 17512095, 15858690, 14716125, 15667936, 16388327, 17512112, 17366424, 16294603, 15639375, 15276782, 16462009, 15171880, 14943746, 15823656, 15636988, 14955029, 14269392, 15362978, 15077458, 13897569, 13199834, 12686709]
3899A2686709J15863M2440q00152k40431J566409M84728q79331r2374q50406J320440
3889A3353895j356539k76312J651528p58492l28879k95742o69815j42363R44046
3880A2121327Q01174o07868j241157n55568J208241m59337q37345m83754J184646
3871A1130359m78886R0142P11066n66711L79110m21983J178805j796959k076070
3862H148873n15269R62669N59314R37264n42826j168844P31736M76463r42456
3853H646924P70793j91604p89409M30433J564740n58649j492277n83312n82771
3844G214868J398311N1451l29364j20308l06060K10277J087286L57675p70496
3835H793640k55579j3313o73490p00165r66413J825999J225015j1639L52767J771426
$$ y = [12686709, 12802572, 12845012, 12044860, 11804429, 13370838, 13855566, 12976235, 12883861, 12033455, 13353895, 11997356, 11721044, 13372572, 12614080, 12285201, 11989459, 11319644, 11177281, 12121327, 12922501, 12314633, 11073476, 10517908, 11726149, 11266812, 10429467, 9945713, 11130359, 10651473, 10741615, 11452681, 10885970, 11265080, 10843097, 12021902, 10224943, 8148873, 7633604, 8596273, 9155587, 10092851, 9550025, 8381181, 9112917, 9589380, 8646924, 9417717, 9226113, 8436704, 8867137, 10431877, 9873228, 8380951, 7797639, 7214868, 8613179, 8664630, 8335266, 8214958, 7908898, 8119175, 9206461, 9564136, 8793640, 8538061, 8524748, 7851258, 7151093, 6184680, 8010679, 9235694, 9224055, 9576822, 11348248]
3825A1348248o59370r87917l73480p36815j431835L49837J439418j533220M3526
3816G458392n57044J734991M43789j591860Q4466Q24368J74129j469362k54117
3807F847752N83900J449177J70911p6692j479911p00870J509270r55165n06142
3798F842230j92500J327964M39880m63078r4682L97871j392153L74558k547j087037
3788F150506o50156J117569K10138l0924J08599J281162j992784J164853Q97128
3779H256091p9179j066220k84079j12266o2850P27094k3063O51182j359365o67238
3769E980107N36297Q77505j561682r28518Q78222P37399p91493q53187O18533
3760E493183K7465N1491J198365l9581l64927l52683n1203k27094K28987M48825
$$ y = [11348248, 10688878, 9700961, 9327481, 8590666, 7158831, 7508668, 8948086, 7414866, 7458392, 6901348, 8636339, 9080128, 7488268, 7572734, 8397102, 8571231, 7101869, 6847752, 7431652, 8880829, 9051740, 8975048, 7495137, 6794267, 8303537, 7348372, 6842230, 6649730, 7977694, 8417574, 7954496, 7859814, 8257685, 6865532, 7240090, 7237543, 6150506, 5500350, 6617919, 6828057, 6797133, 6905732, 8186894, 6194110, 7358963, 8256091, 8176912, 7110692, 6826613, 6714347, 6651497, 7378591, 7355528, 8006710, 6647345, 5980107, 6516404, 7393909, 5832227, 4903709, 5781931, 6519330, 5727837, 4874650, 5493183, 5520648, 5572139, 6770504, 6730923, 6365996, 6013313, 5962110, 5735016, 5964003, 6412828]
3750F412828R26845q40470j067534N23556j65524l46435n84546q63668M75851
3741D470903O87237o8904Q13109j36553j17601M57322j223211K77281k92634J95403
3731E062352p83530Q8038O113J544563n41021j58880m25444J93834Q38674k1770
3721E802929r7363m68586O37453Q6925n53055n45268L02732n70407M3501j30370
3711D508491n38288N56675J270730k49103k93617J5952j541855o86746R45041
3702C987280J152505o98687J31342M80805o08641j34119N8466j27546P15780j13985
3692D843200n46564L98334K57396M12426q28923M65883j040693j68645N11649
3683D304063j21279R52788o3275L30639j644749J102114n18988o27753k1789P58244
$$ y = [6412828, 7339673, 6499203, 5431669, 5955225, 5789701, 5443266, 4858720, 3995052, 4470903, 5158140, 5089236, 5902345, 5765792, 5648191, 6105513, 4882302, 5159583, 4866949, 5062352, 4278822, 4366860, 4372973, 5917536, 5376515, 5217635, 4792191, 4986025, 5824699, 5802929, 5705566, 5236980, 5874433, 5961358, 5408303, 4863035, 5165767, 4595360, 4638861, 4508491, 3970203, 4526878, 5797608, 5548505, 5254888, 5270840, 3728985, 3042239, 3987280, 5139785, 4441098, 4572440, 5053245, 4444604, 4310485, 4368951, 4241405, 4957185, 4843200, 4296636, 4694970, 4952366, 5364792, 4535869, 5001752, 3961059, 3792414, 4304063, 4182784, 5135572, 5072297, 5402936, 3758187, 4860301, 4341313, 3713560, 3691771, 4450015]
3673D450015m07760m92722O68708j44759M84885M05349j00830l71981K00070k90341
3663D400634m01703p0419P16575J380809n53016j548456O45601R25683Q40641
3654F336349j151652Q39275o23496o11837j110981J39063k01223j115544k52390
3645B247564M11806P26521L16013M13978M27894j170659l3416N41235O25705o30284
3635C876357J457968J222271r7380n04551j628223k47621j94707N27133n35711
3626C875536k94301r9918R19245r91813O51815N31238k60593J9816m46104j406224
3616B498697J236263n26279J026972L65319o53519p73221J34793j05842J113396
3607D316579O20497j843758R57648k46600l83807J226257n52466m21327L86982
$$ y = [4450015, 4042255, 3549533, 4218241, 4073482, 4558367, 4963716, 4862886, 4490905, 4690975, 4400634, 3998931, 3928512, 4645087, 6025896, 5472880, 3924424, 4570025, 5495708, 6336349, 5184697, 6023972, 5400476, 4788639, 3677658, 3816721, 3615498, 2499954, 2247564, 2659370, 3385891, 3701904, 4115882, 4543776, 3373117, 3339701, 3880936, 4506641, 3876357, 5334325, 6556596, 6459216, 5954665, 4326442, 4078821, 3884114, 4411247, 3875536, 3581235, 3481317, 4400562, 3408749, 4060564, 4591802, 4331209, 4351025, 3904921, 2498697, 3734960, 3208681, 4235653, 4600972, 3947453, 3174232, 3309025, 3203183, 4316579, 4937076, 3093318, 4050966, 3804366, 3420559, 4646816, 4094350, 3673023, 4060005]
3598D060005K56440r44765j9838J244759m84480M36509r4703o25139J42326j29724
3588C841390K21456K52462n99526m19863l19851O90338r70777L06367L92675k06500
3578C188171k96410J196080K49083L13449j591990M11617m45196j21160n21774
3569B381870k5440J557064l5697n48988M6197P84586J12382P68138n52944j612875
3559B874293J410275M97566K25440n90171j54475k43444n30586j2286L55945L15355
3549D147912j75734j412222m45492P16577K90168P9718k31903L55678j43415Q78257
3539D059544P3456j83483n04367M80728R97715j534648p8885r0864m2540K12998
3529C389654R51973N93398n53602q40641K20139J80714q07602N46521m23847j88293
$$ y = [4060005, 4316445, 3371680, 3351842, 4596601, 4112121, 4548630, 4453927, 3828788, 3971114, 3841390, 4062846, 4315308, 3715782, 3295919, 2976068, 3666406, 2695629, 3001996, 3394671, 3188171, 2891761, 4087841, 4336924, 4650373, 3058383, 3470000, 3024804, 2903644, 2381870, 2356430, 3913494, 3877797, 3328809, 3375006, 4159592, 4271974, 5040112, 4487168, 2874293, 4284568, 4782134, 5007574, 4417403, 4262928, 4019484, 3488898, 3476612, 3832557, 4147912, 3972178, 2559956, 2114464, 2831041, 3121209, 3200927, 2969024, 3324702, 3181287, 4059544, 4133000, 3949517, 3445150, 3925878, 4923593, 3388945, 3310060, 3219196, 3176656, 3389654, 4341627, 4935025, 4381423, 3540782, 3760921, 3941635, 3134033, 3680554, 3256707, 3068414]
3519C068414L02145o37712Q98246K73656o41412P51666m33974K81153J98707J85540
3509D246429M46809P21849M33406k25841j69861Q70572q98753L82793K28280k773731
3499C261952q57705R71427O94312R24436J51474L05443j36054j95550l94978R76464
3489E701221K45861L35768j56635p80356p2322P84208J57107m2179k12066R51609
3479F912216L12180j586025o01353O33356j353787J282249r09876N57666R19675
3470F166301M50755o00675r17075J487507N79149J02281M25283j607480j210549
3461D875497J402032j04210q97839J202502R45001n07189r74681j03429J108747
3452F946431k63775p10932O32436l61187k39199Q55574J077254p36133j461710
$$ y = [3068414, 3370559, 2732847, 3631093, 3904749, 3263337, 4015003, 3581029, 3862182, 4060889, 4246429, 4693238, 5415087, 5848493, 5622652, 5452791, 6323363, 5424610, 5807403, 6035683, 3261952, 2404247, 3375674, 4069986, 4994422, 5145896, 5451339, 5315285, 5119735, 4724757, 5701221, 5947082, 6282850, 6126215, 5345859, 5273537, 6057745, 6214852, 6172673, 5960607, 6912216, 7224396, 5638371, 5037018, 5670374, 4316587, 5598836, 4688960, 5246626, 6166301, 6617056, 6016381, 5099306, 6586813, 7165962, 7268243, 7693526, 6086046, 4875497, 6277529, 6173319, 5275480, 6477982, 7422983, 6915794, 5941113, 5837684, 6946431, 6682656, 5971724, 6604160, 6242973, 6003774, 6859348, 7936602, 7200469, 5738759]
3443E738759R18719R53049J008436n82157r88610J085304J069553M71402m52589
3434I221866N62931L27672q95025R70819L7587J25345n95904k181108N25959J614125
3424I714267l4892J268104m00500J9321K45412M76494m31033m9818j824751j042803
3414G939801J335813J481411Q4581p39214j051632L0820K06456M31360L62838
3405A0082234N09721l91468k45891J57090k6650k92203k06006m29352p52973O10588
3395I015090L49184l08047k10780R8178j754739P2244M87971J66835j0119j515720
3385F390097J126270J190648l47366j011615K74747J21293n14079j389619R06541
3376F746917P76386K23271q26353L79452j653532Q9856L61765Q51528j77570o28107
$$ y = [5738759, 6657478, 7610527, 8618963, 8036806, 7048196, 8133500, 9203053, 9674455, 9221866, 9784797, 10112469, 9217444, 10188263, 10225850, 10351195, 9755291, 7574183, 8100142, 9714267, 9679375, 10947479, 10546979, 10566300, 10811712, 11288206, 10857173, 10807355, 8982604, 7939801, 9275614, 10757025, 10841606, 10102392, 9050760, 9081580, 9288036, 9719396, 10082234, 10591955, 10200487, 9954596, 10111686, 10085036, 9792833, 9586827, 9157475, 8404502, 9015090, 9364274, 9056227, 8845447, 8943625, 7188886, 7261130, 7749101, 7915936, 7905817, 6390097, 7516367, 8707015, 8359649, 7348034, 7622781, 7744074, 7229995, 5840376, 6746917, 7523303, 7746574, 6920221, 7299673, 5646141, 5735997, 6097762, 6949290, 6771720, 6143613]
3366F143613n00082J262900l92666R0406M01868j147352P86432o03105M37709
3357F479723o87840N26706J208771n4914n34101L06713N8266p38235q29118J635856
3347G371827j36608M58764j274351p16608n17355j31186J40443M74313j26778
3338E542461q60315M06565M2304K5965O9404n86350J27267J62132J17990q58179
3328D189244O8605K162916m65859k321894Q34739N93751j70883K32264m39500
3319D683383J391455o71134k91451J57968j674511n21280J348038K12733l79066
3310D256135N62686r23318J409550P6336q15582j90606P33375r94503J69144J514678
3300E797895p21523r9011p88645l79767M26492M85004n03549j161131L58739M14431
$$ y = [6143613, 5643531, 6906431, 6513765, 6604171, 7006039, 5858687, 6645119, 6042014, 6479723, 5791883, 6318589, 7527360, 7472446, 6938345, 7245058, 7303324, 6565089, 5735971, 7371827, 7235219, 7693983, 6419632, 5703024, 5185669, 5054483, 5194926, 5669239, 5542461, 4682146, 5088711, 5131015, 5156980, 5226384, 4640034, 4767301, 4929433, 5047423, 4189244, 4257849, 6420765, 5954906, 3633012, 4467751, 5061502, 4890619, 5122883, 4683383, 6074838, 5403704, 5112253, 5270221, 3595710, 3074430, 4422468, 4635201, 4256135, 4818821, 3895503, 5305053, 5381389, 4565807, 4375201, 5108576, 4114073, 4283217, 5797895, 5076372, 4977361, 4188716, 3808949, 4235441, 4720445, 4216896, 3055765, 3414504, 3828935]
3290C828935Q34545q78637K49951J09768j90939m50039K31012j362472M52270
3281B824394L9670J00953L59093j28166J02277L95477M5853J070443j2402r46693
3271C850899p03736j003621R7707J28744O57064q93928K34793L46613J02113L6428
3261B853076m10411o86707J234936K5937j208750j9419Q08339L77466Q90711r01142
3251B964036j24758K37092J324708k77118n05999n31975M75135m11762n62386
3242B586973p58577k49470J63991K53329k98397N79563L54374L1315p1176k22576
3232B369349M51382o08333r95791j79353J99286j309323J437651J514867O02351
3223C482086L85175m67808k12730k03241j79319Q45062K3593j766745p93811R4175
$$ y = [3828935, 4663480, 3784843, 4034794, 4144562, 3953623, 3503584, 3734596, 2372124, 2824394, 2864064, 2965017, 3324110, 3195944, 3298221, 3693698, 3739551, 4809994, 4797592, 3850899, 3147163, 2143542, 2241249, 2369993, 3027057, 2133129, 2367922, 2714535, 2816648, 2853076, 2442665, 1755958, 2990894, 3016831, 1808081, 1788662, 2597001, 2974467, 3865178, 2964036, 2839278, 3076370, 4401078, 4123960, 3617961, 3085986, 3561121, 3149359, 2586973, 1828396, 1578926, 1742917, 1996246, 1697849, 2277412, 2631786, 2663101, 2591925, 2369349, 2820731, 2212398, 1216607, 1037254, 1236540, -72783, 1364868, 2879735, 3482086, 3867261, 3399453, 3186723, 2983482, 2804163, 3649225, 3672818, 1906073, 1112262, 1206437]
3213A206437J167193j92047L20680l52268L15370Q49435q97453j32795k148807
3204A35745M35892J153105k76923K53059K32283n75947p01654O06231M09616k56441
3194A414966j65564r57472M84169K71342j364872J6816R84499Q14317k36095J65829
3184A427935L0554K64905m92686n19415J516026J88883j651225J068758q23664
3175A010071r74021J176379J893891N37976K59410M04609r95251m47411k49503
3166B616150J66575j846086n95414L74731K78014J526827R40512r07160O26520
3157C180669j563870J071409J044854q85419p13177N64403m16102n89532o50572
3148A042663K9822j44986M57787Q33362K80733O08329M6570O03280q81819J214736
$$ y = [1206437, 2373630, 2181583, 2502263, 2149995, 2465365, 3314800, 2417347, 2284552, 135745, 571637, 1724742, 1447819, 1700878, 1933161, 1357214, 655560, 1261791, 1671407, 1414966, 1249402, 291930, 776099, 1047441, -317431, -300615, 683884, 1498201, 1262106, 1427935, 1458489, 1723394, 1230708, 711293, 2227319, 2416202, 764977, 1833735, 1010071, 36050, 1212429, 3106320, 3644296, 3903706, 4308315, 3313064, 2865653, 2616150, 2782725, 936639, 341225, 715956, 993970, 2520797, 3461309, 2554149, 3180669, 1616799, 2688208, 3733062, 2847643, 2134466, 2698869, 2282767, 1693235, 1042663, 1072485, 927499, 1385286, 2218648, 2499381, 3107710, 3154280, 3757560, 2875741, 4090477]
3138D090477K42664p21771q55627m42350P34857J175818l38487k01975K61599
3129C945205o30131q66814k62476P12675j19367m63569J570920k2683O16458q31799
3119C648419j28349P28568l17854j254605Q64631J252288Q2667n18978j141794
3110C214993O94969J377366j36857l29561j197691N34206j66763Q80927p67994
3101D103595p76020N89771l71570L023854q03465k03319Q631P9910l7876K54346
3091E867857K25967l42260K62984j05813j224787J82786N103J362201M15650j0961
3081F638727j308996O932P54175j174288n18884L4146P44184R25238K09172K12228
3071F522634M32893L43002J73658L42879l80448j035046Q12838J481412j483106
$$ y = [4090477, 4333141, 3611370, 2755743, 2313393, 3048250, 4224068, 3885581, 3683606, 3945205, 3315074, 2448260, 2185784, 2898459, 2779092, 2315523, 3886443, 3863760, 4480218, 3648419, 3520070, 4248638, 3930784, 2676179, 3540810, 4793098, 4875765, 4356787, 3214993, 3909962, 5287328, 5150471, 4820910, 3623219, 4157425, 3990662, 4871589, 4103595, 3327575, 3917346, 3545776, 6569630, 5766165, 5562846, 5571477, 5651387, 5613511, 5867857, 6093824, 5751564, 6014548, 5908735, 4683948, 4866734, 4871837, 6234038, 6649688, 6638727, 5329731, 5336663, 6090838, 4916550, 4397666, 4431812, 5175996, 6101234, 6310406, 6522634, 6955527, 7298529, 7472187, 7815066, 7434618, 6399572, 7212410, 8693822, 7210716]
3062G210716j168893J347595l70162p37864N28094j258833O27198Q03075l13772
3053F667154j038413n57303J531793p97574j002469N64685J358001j665766j277252
3044C782856L55415J561081L86528q11775j129316Q93151q3977n16026j072050
3035C365887l46445Q74159k89598l13040R83640R24191P98910n60273R38618j362517
3025E013532k009303O80828N5842J9978j475656n37684N11611J727287l99773
3016C586662j032609L2900K01761r92615o3869O37004j06916m95515j133335l04159
3006C29309K017480N30331L64030r08541m63218Q02682m73754P5521L58694j358536
2996A273998J84751k39978J08853K76120q31864n76737R02720K88934l7502K12894
$$ y = [7210716, 6041823, 7389418, 7019256, 6281392, 6809486, 5550653, 6177851, 6980926, 6667154, 5628741, 5071438, 6603231, 5805657, 4803188, 5367873, 6725874, 5060108, 3782856, 4138271, 5699352, 6085880, 5274105, 4144789, 5037940, 4953963, 4437937, 3365887, 3019442, 3893601, 3604003, 3290963, 4274603, 5198794, 5997704, 5437431, 6376049, 5013532, 3004229, 3685057, 3740899, 3760877, 2285221, 1747537, 2259148, 3986435, 3586662, 2554053, 2586953, 2788714, 1796099, 1732230, 2369234, 2262318, 1766803, 633468, 329309, 2346789, 2877120, 3241150, 2332609, 1869391, 2672073, 2198319, 2273840, 2632534, 1273998, 1458749, 1218771, 1327624, 1603744, 771880, 195143, 1097863, 1386797, 1349295, 1562189]
2986A562189k78784m20825R03898o76539p43671o10755P38493O60460Q67224J357442
2976C359132j925122M49990q23675j382489m19593M32023p74218l80867J70539
2967a294280K73945M27318J196397Q95367l90275k92511l31040J028822J93532
2958A707275j151739P79960r11258P15723o60353j029645k38255k88286o72408
2949a748986l38365P85862J658431M74982n68327Q85950r72570Q3924Q58786j069503
2939E0184j123867K87757R85212l75543l24212o26909P00873O77670k4143j981943
2929a754921n77432K91469J603068P28408n12810p02800L73310J482174j237161
2920c06695r15518o44676J71595J572146J061891j858758L54894O51888j154244
$$ y = [1562189, 1283405, 862580, 1766478, 1089939, 346268, -264487, 474006, 1134466, 2001690, 3359132, 1434010, 1884000, 1060325, -322164, -741757, -309734, -1083952, -1464819, -1294280, -1020335, -593017, 603380, 1498747, 1108472, 815961, 484921, 1513743, 1707275, 555536, 1335496, 424238, 1139961, 479608, -550037, -788292, -1076578, -1748986, -2087351, -1301489, 356942, 831924, 263597, 1149547, 176977, 260901, 1119687, 50184, -1073683, -785926, 199286, -176257, -500469, -1127378, -426505, 251165, 227022, -1754921, -2332353, -2040884, -437816, 290592, -222218, -925018, -551708, 930466, -306695, -1222213, -1866889, -1695294, -123148, 938743, -920015, -565121, 86767, -1067477]
2911a067477k60362J16423l4900m17128k78169P29796K59495q07219O13126J277879
2901A31464K65061o03264M23281l98250J79854m61254j105564Q00138n30338q6542
2891a385414j051464Q1381O07405p67274j28601O41048J022476k38972j402370
2882b621785R58364o02364p77938j04567J288578N91576L24973M42400q06606
2873a307369O25021q4059q40916r34147l9816J72635Q48543N90407k38474N4580
$$ y = [-1067477, -1327839, -1211416, -1246316, -1663444, -1941613, -1211817, -952322, -1759541, -1146415, 131464, 396525, -206739, 216542, -181708, -1854, -463108, -1568672, -768534, -1298872, -1385414, -2436878, -2355497, -1748092, -2515366, -2643967, -2002919, -980443, -1219415, -2621785, -1663421, -2265785, -3043723, -3148290, -1859712, -1268136, -943163, -500763, -1307369, -682348, -766407, -1607323, -2541470, -2581286, -2408651, -1560108, -969701, -1208175, -1153595]
$$ [...]
##END NTUPLES=NMR SPECTRUM
##END=
