##TITLE=1H_CA-9370-0
 200.13MHz,DMSO-d6,
 8 sc
 
 14.8.2025
##JCAMPDX= 6.0         $$ Bruker NMR JCAMP-DX V2.0
##DATA TYPE= NMR SPECTRUM
##DATA CLASS= NTUPLES
##ORIGIN= UXNMR, Bruker Analytische Messtechnik GmbH
##OWNER= pz
$$ XWIN-NMR		Version 3.5
$$ Thu Aug 14 13:59:04 2025 Russian Standard Time (UT+4h)  she@DPX200
##.OBSERVE FREQUENCY= 200.1313
##.OBSERVE NUCLEUS= ^1H
##.ACQUISITION MODE= SIMULTANEOUS
##.ACQUISITION SCHEME= undefined
##.AVERAGES= 8
##.DIGITISER RES= 18
##SPECTROMETER/DATA SYSTEM= spect
##.PULSE SEQUENCE= zg30
##.SOLVENT NAME= DMSO
##.SHIFT REFERENCE= (INTERNAL, DMSO, 0, 15.5144)
##AUDIT TRAIL= $$ (NUMBER, WHEN, WHO, WHERE, WHAT)
$$ ##TITLE= Audit trail, XWIN-NMR		Version 3.5
$$ ##JCAMPDX= 5.01
$$ ##ORIGIN= Bruker BioSpin GmbH
$$ ##OWNER= she
$$ F:/spectra/data/she/nmr/H-C/1/pdata/1/auditp.txt
$$ ##AUDIT TRAIL=  $$ (NUMBER, WHEN, WHO, WHERE, WHAT)
(   1,<2025-08-14 13:58:03.00 +0400>,<she>,<DPX200>,
      <created by zg, POWCHK disabled, PULCHK disabled
       configuration hash MD5:
       00 E9 B6 7A A2 85 ED C7 34 08 36 98 17 FE 4E 26
       data hash MD5: 16K
       C4 DF 37 18 59 7C 52 10 10 2D A4 5E AA 0E BF 30>)
(   2,<2025-08-14 13:58:05.15 +0400>,<she>,<DPX200>,
      <Start of raw data processing
       efp BC_mod = 2 LB = 0.25 FT_mod = 6 PKNL = 1 PHC0 = -1560.025 PHC1 = 10.19228 SI = 16K 
       data hash MD5: 16K
       C4 71 BF 07 ED 24 72 BC 87 B6 C3 E0 17 8A D1 62>)
(   3,<2025-08-14 13:58:20.96 +0400>,<she>,<DPX200>,
      <pk PHC0 = -2.360614 PHC1 = 0 
       data hash MD5: 16K
       FD 49 0D 27 09 80 F3 1C D5 9B 88 46 55 92 50 44>)
(   4,<2025-08-14 13:58:24.14 +0400>,<she>,<DPX200>,
      <abs ABSG = 5 
       data hash MD5: 16K
       89 FD 56 DA FE 6D F8 9D 4A E8 16 12 ED 78 33 EA>)
$$ ##END=
$$ 
$$ hash MD5
$$ A8 15 16 AD 01 16 3B CC 3E 5D BE A2 58 82 88 54
##$RELAX= 
##$RELAX= 
##$RELAX= 
##$RELAX= 
##$RELAX= 
##$RELAX= 
$$ Bruker specific parameters
$$ --------------------------
##$DU= <F:/spectra>
##$EXPNO= 1
##$NAME= <H-C>
##$PROCNO= 1
##$TYPE= <nmr>
##$USER= <she>
##$AMP= (0..31)
100 100 100 100 100 100 100 100 100 100 100 100 100 100 100 100 100 100 
100 100 100 100 100 100 100 100 100 100 100 100 100 100 
##$AQSEQ= 0
##$AQ_mod= 1
##$AUNM= <au_zg>
##$AUTOPOS= <>
##$BF1= 200.13
##$BF2= 200.13
##$BF3= 200.13
##$BF4= 200.13
##$BF5= 200.13
##$BF6= 200.13
##$BF7= 200.13
##$BF8= 200.13
##$BYTORDA= 1
##$CFDGTYP= 0
##$CFRGTYP= 5
##$CHEMSTR= <none>
##$CNST= (0..31)
1 1 145 1 1 1 1 1 1 1 1 1 1 1 1 1 1 1 1 1 1 1 1 1 1 1 1 1 1 1 1 1 
##$CPDPRG= <>
##$CPDPRG1= <>
##$CPDPRG2= <>
##$CPDPRG3= <>
##$CPDPRG4= <mlev>
##$CPDPRG5= <mlev>
##$CPDPRG6= <mlev>
##$CPDPRG7= <mlev>
##$CPDPRG8= <mlev>
##$CPDPRGB= <>
##$CPDPRGT= <>
##$D= (0..31)
0 0.7 0 0 0 0 0 0 0 0 0 0.03 0 0 0 0 0 0 0 0 0 0 0 0 0 0 0 0 0 0 0 0 
##$DATE= 1755165482
##$DBL= (0..7)
120 120 120 120 120 120 120 120 
##$DBP= (0..7)
150 150 150 150 150 150 150 150 
##$DBP07= 0
##$DBPNAM0= <>
##$DBPNAM1= <>
##$DBPNAM2= <>
##$DBPNAM3= <>
##$DBPNAM4= <>
##$DBPNAM5= <>
$$ [...]
##$SUBNAM3= <"">
##$SUBNAM4= <"">
##$SUBNAM5= <"">
##$SUBNAM6= <"">
##$SUBNAM7= <"">
##$SUBNAM8= <"">
##$SUBNAM9= <"">
##$SW= 18.0517328524113
##$SWIBOX= (0..15)
0 0 2 0 0 0 0 0 0 0 0 0 0 0 0 0 
##$SW_h= 3612.71676300578
##$TD= 16384
##$TD0= 1
##$TE= 0
##$TE2= 300
##$TE3= 300
##$TEG= 300
##$TL= (0..7)
0 120 120 120 120 120 120 120 
##$TP= (0..7)
150 150 150 150 150 150 150 150 
##$TP07= 0
##$TPNAME0= <>
##$TPNAME1= <>
##$TPNAME2= <>
##$TPNAME3= <>
##$TPNAME4= <>
##$TPNAME5= <>
##$TPNAME6= <>
##$TPNAME7= <>
##$TPOAL= (0..7)
0.5 0.5 0.5 0.5 0.5 0.5 0.5 0.5 
##$TPOFFS= (0..7)
0 0 0 0 0 0 0 0 
##$TUNHIN= 0
##$TUNHOUT= 0
##$TUNXOUT= 0
##$USERA1= <user>
##$USERA2= <user>
##$USERA3= <user>
##$USERA4= <user>
##$USERA5= <user>
##$V9= 5
##$VALIST= <valist>
##$VCLIST= <CCCCCCCCCCCCCCC>
##$VD= 0
##$VDLIST= <DDDDDDDDDDDDDDD>
##$VPLIST= <PPPPPPPPPPPPPPP>
##$VTLIST= <TTTTTTTTTTTTTTT>
##$WBST= 1024
##$WBSW= 4
##$XGAIN= (0..3)
0 0 0 0 
##$XL= 0
##$YL= 0
##$YMAX_a= 267025
##$YMIN_a= -583141
##$ZGOPTNS= <>
##$ZL1= 120
##$ZL2= 120
##$ZL3= 120
##$ZL4= 120
##$ABSF1= 15.49458
##$ABSF2= -2.557269
##$ABSG= 5
##$ABSL= 3
##$ALPHA= 0
##$AQORDER= 0
##$ASSFAC= 0
##$ASSFACI= 0
##$ASSFACX= 0
##$ASSWID= 0
##$AUNMP= <proc_1d>
##$AZFE= 0.1
##$AZFW= 0.1
##$BCFW= 0
##$BC_mod= 2
##$BYTORDP= 0
##$COROFFS= 0
##$CY= -3
##$DATMOD= 1
##$DC= 0
##$DFILT= <>
##$DTYPP= 0
##$F1P= 0
##$F2P= 0
##$FCOR= 1
##$FTSIZE= 16384
##$FT_mod= 6
##$GAMMA= 0
##$GB= 0
##$INTBC= 1
##$INTSCL= 3.241238e-09
##$ISEN= 128
##$LB= 0.25
##$LEV0= 0
##$LPBIN= 0
##$MAXI= 10000
##$MC2= 0
##$MEAN= 0
##$ME_mod= 0
##$MI= 1.114404
##$NCOEF= 0
##$NC_proc= -7
##$NLEV= 6
##$NOISF1= 3.799351
##$NOISF2= 2.8
##$NSP= 0
##$NTH_PI= 0
##$NZP= 0
##$OFFSET= 15.51441
##$PC= 1
##$PHC0= -1562.386
##$PHC1= 10.19228
##$PH_mod= 1
##$PKNL= yes
##$PPARMOD= 0
##$PSCAL= 0
##$PSIGN= 0
##$REVERSE= no
##$SF= 200.13000145969
##$SI= 16384
##$SIGF1= 3
##$SIGF2= 2
##$SINO= 0.751879
##$SIOLD= 32768
##$SREGLST= <19F.Aceton>
##$SSB= 0
##$STSI= 16384
##$STSR= 0
##$SW_p= 3612.71676300578
##$SYMM= 0
##$S_DEV= 0
##$TDeff= 16384
##$TDoff= 0
##$TI= <>
##$TILT= no
##$TM1= 0
##$TM2= 0
##$TOPLEV= 0
##$USERP1= <user>
##$USERP2= <user>
##$USERP3= <user>
##$USERP4= <user>
##$USERP5= <user>
##$WDW= 1
##$XDIM= 16384
##$YMAX_p= 369378589
##$YMIN_p= -1017113
$$ End of Bruker specific parameters
$$ ---------------------------------
##NTUPLES= NMR SPECTRUM
##VAR_NAME=  FREQUENCY,     SPECTRUM/REAL,   SPECTRUM/IMAG
##SYMBOL=    X,             R,               I
##VAR_TYPE=  INDEPENDENT,   DEPENDENT,       DEPENDENT
##VAR_FORM=  AFFN,          ASDF,            ASDF
##VAR_DIM=   16384,         16384,           16384
##UNITS=     HZ,            ARBITRARY UNITS, ARBITRARY UNITS
##FACTOR=    0.220516191357247, 1,           1
##FIRST=     3104.89889973287, 0,            0
##LAST=      -507.817863272912, 0,           0
##MIN=       -507.817863272912, -1017113,    0
##MAX=       3104.89889973287, 369378589,    0
$$ Real data points
##PAGE= N=1
##DATA TABLE= (X++(R..R)), XYDATA
$$ [...]
9706 2721996 2623047 2764085 2852542 2493851 2450169 2914531 2991206 2706444 2642138 2589453 2720818
9695 2720818 3049289 3170029 2921418 2809867 2742982 2765012 3141273 2788138 2940710 3024163
9685 3024163 3051039 3040308 2939145 2672638 2741334 3061604 3082804 2841713 2792120 3131133
9675 3131133 3195401 3185433 3348371 3480181 3684509 3702000 3456609 3032635 3264518 3381760
9665 3381760 3352366 3237350 3424173 3452234 3723348 4000275 3862316 3613586 3513555 3568766
9655 3568766 3733129 3774368 3705871 3454603 3219868 3315004 3387226 3373418 3209004 3411528
9645 3411528 3503762 3578419 3652713 3678263 3756536 3659633 3637657 3971136 3786776 3969434 4013914
9634 4013914 4116968 4172939 4024566 3762647 3715790 3983897 4132667 4134934 4076190 4091140 4383894
9623 4383894 4349235 4451799 4535191 4468226 4475492 4397292 4287723 4097802 4315679 4188960 4279044
9612 4279044 4369584 4365749 4294625 4585904 4581765 4802152 4688106 4644044 4717195 4769151 4629154
9601 4629154 4743988 4833984 4761072 4992409 4953285 4839269 5089306 4995312 4889515 5035035
9591 5035035 5365216 5509056 5387943 5383176 5639189 5707391 5612057 5522687 5395142 5540437
9581 5540437 5847912 6129791 5787093 5847082 5810414 5845504 5822717 5884164 6077575 6099251 6114237
9570 6114237 6419968 6030860 6118117 6225634 6529020 7005899 7203732 7020135 7083198 7336029
9560 7336029 7444270 7343479 7454644 7528636 7391365 7535331 7165380 7359725 7706219 7778735
9550 7778735 8063281 8213236 8428124 8608229 8881420 8805153 8793342 8912842 9324920 9198651
9540 9198651 9270889 9591947 9610830 10008739 9991926 10210764 10399855 10517982 10821470 11145438
9530 11145438 11272958 11267639 11398814 11718073 12095113 11998220 12113090 12716137 12503029 12875935
9520 12875935 13058213 13297637 13680401 13568884 13848579 13993559 14300961 14692907 14850946
9511 14850946 14795601 15235648 15264104 15543016 15810228 16088613 16581553 16482776 16782509 17328310
9501 17328310 17776516 18044595 18152061 18427182 18953631 18922576 19179642 19346553 19684234 20207966
9491 20207966 20521502 20603737 20789346 20970164 21121287 21596600 21510336 21325157 21246738 21459150
9481 21459150 21224403 21465895 21669908 21743644 21877189 21549668 21388248 21144356 20586989 20293587
9471 20293587 20499331 20445204 20202106 19801767 19399991 19288885 19139713 19012725 18750840 18372675
9461 18372675 18184811 18105365 17846540 17253253 17291538 17119998 16874927 16711395 16168352 15795273
9451 15795273 15662923 15393966 15171837 14923817 14722311 14407127 14377287 13906952 13701173 13529220
9441 13529220 13331252 13118416 12919801 13049434 12789557 12369492 12027091 12116707 11876577 11795234
9431 11795234 11784709 11371379 11326818 11329925 10839951 10509907 10538138 10418226 10049804 9883968
9421 9883968 10002768 9851539 9760449 9610307 9597732 9548184 9471079 9315602 9118793 9141086
9411 9141086 8997761 8851996 8728157 8785246 8548541 8283222 8500064 8685509 8208217 7930661
9401 7930661 8213538 8294363 8119026 7806405 7808607 7758728 7411991 7198049 7267132 7403808
9391 7403808 7285945 7050803 7575782 7516191 7195771 7051832 7149603 7226979 7358300 7306021
9381 7306021 7153433 6958232 6941849 7005468 6609038 6329923 6522837 7027745 6938560 6780566
9371 6780566 6572791 6508570 6412101 6361095 6386751 6357331 6091324 6052749 5952385 6064018 6100939
9360 6100939 5976391 5757457 5740520 5939023 6313274 5653759 5760072 5925598 6059375 6151851
9350 6151851 5842970 5768262 5507925 5351429 5514207 5425871 5343739 5332409 5550891 5667703
9340 5667703 5570976 5256106 5093335 5397497 5166082 5323263 5366172 5206259 4990379 5070873
9330 5070873 5057240 5152129 5125941 5391164 5109511 5075126 5209264 4993828 5006119 4744667
9320 4744667 4895155 4824591 4764116 4752745 4810555 4620867 4570751 4863488 4833412 4822787 4819440
9309 4819440 4956242 4790623 4898390 4814247 4832749 4789489 4367140 4360143 4792684 5147832
9299 5147832 5155681 4651045 4700790 4793602 4710083 4809734 4521958 4590156 4453990 4717365 4570232
9288 4570232 4253488 4279443 4422452 4282523 4230551 4282628 4218789 4241886 4134669 4106027 4051852
9277 4051852 4142261 4126405 4149800 4617192 4589792 4114394 3914530 3776545 3908835 3885766
9267 3885766 3852983 3948202 3928049 4142814 4113505 4131442 3906551 3638064 3771713 3832225 3917344
9256 3917344 4151448 3909468 3916633 3990367 3878417 3724614 3907432 3905823 3862530 3708608 3480367
9245 3480367 3617174 3439739 3505960 3916368 3603667 3211262 3172385 2901008 3170316 2964189
9235 2964189 3258194 3393425 3428755 3225908 3510902 3530822 3562781 3499842 3576359 3486669 3526906
9224 3526906 3556493 3341108 3272090 3597872 3533336 3658515 3762720 3357729 3515834 3503635
9214 3503635 3458984 3644136 3388340 3209702 3372897 3394935 3602656 3748407 3424095 3086363
9204 3086363 3174105 3153503 3463665 3750408 3495500 3381349 3515340 3797962 3920955 3414220
9194 3414220 3502081 3227587 3221918 3430366 3414834 3158983 2791229 2847679 3040560 3105171 3316053
9183 3316053 3493373 3265328 3119030 3436260 3169070 3491467 3538157 3239917 3589183 3492396
9173 3492396 3340160 3572800 3629071 3475908 3468169 3360983 3134324 2947594 3097701 3379532
9163 3379532 3124364 3118112 3153271 2976812 3286232 3544892 3270520 3123440 3011328 3239505
9153 3239505 3161795 2973029 2985723 3607864 3587482 3380882 3391398 3435579 3455036 3218894 3155004
9142 3155004 3245611 3248780 3302595 3247927 3291928 3454942 3348043 3378678 3449592 3415788 3398848
9131 3398848 3438546 3546050 3358408 3191368 3182191 2830923 3174741 3490735 3446959 3335641
9121 3335641 3046122 2918381 3340727 3382810 3294749 3087927 3244342 3429319 3407085 3517319
9111 3517319 3504419 3465020 3539315 3134065 3302637 3351779 3269251 3354857 3356659 3188286 3550381
9100 3550381 3649319 3882036 3818472 3650368 3488180 3232066 3421759 3344326 3183489 3569401
9090 3569401 3518976 3303037 3395358 3387736 3521209 3818408 3828628 3436027 3549717 3468074 3598312
9079 3598312 3733224 3655984 3250310 3478977 3699852 3531931 3637368 3715460 3777963 3937337
9069 3937337 3347659 3152601 3604325 3631511 3669861 3623229 3644921 3634511 3713605 4038922 4019280
9058 4019280 3890627 3790697 3743880 3573399 3545570 3477029 3374562 3720312 3593422 3555171
9048 3555171 3573799 3825026 3748050 3678996 3350328 3355528 3602604 3510400 3651972 3749403 3865676
9037 3865676 3753415 3820453 3934285 3854574 3809713 3844497 3729382 3640135 3673138 3573123 3136119
9026 3136119 3425958 3498746 3634819 3741772 3626434 3703275 3731739 3400982 3464513 3615383
9016 3615383 3577662 3487815 3325990 3510347 3694515 3477776 3826392 3629441 3827810 4231600
9006 4231600 4032732 3912272 3812696 3674311 3602402 3699360 3572055 4050087 4109609 3866357
8996 3866357 4091753 3941630 3955770 4138814 3990236 4245702 4018692 3875305 3869139 4003113
8986 4003113 4493014 4353430 3884320 3893686 4109221 3765471 3823061 3743305 3733843 3882265 4075290
8975 4075290 4380517 4450648 4519376 4337460 4546753 4264331 4258929 4523920 4498300 4480062 4283191
8964 4283191 4392980 4391977 4597506 4539935 4336818 4135972 4141517 4286839 4111908 4036563 4100526
8953 4100526 4130293 4192521 4191270 4136044 4581362 4515032 4527132 4674275 4692251 4682213 4683966
8942 4683966 4670918 4938035 4926052 4749199 4841415 4921349 4642747 5144064 5344608 5251169
8932 5251169 5083121 5249098 5514922 5250564 5213837 5369985 5335671 5403467 5552217 5592760
8922 5592760 5607549 5626208 5873242 5845685 6161051 6474011 6866151 6847835 6809069 7023920
8912 7023920 6942750 6748470 6797878 6681153 6546577 6453395 6498067 6848979 6868175 6403840
8902 6403840 6568113 6511550 6111833 6109437 6049828 6183655 6179837 6166782 5946074 6125703 6488756
8891 6488756 6310036 6102887 5948438 6180490 6600351 6323326 6524014 6587120 6609665 6546730
8881 6546730 6833977 6743492 6540809 6868705 6969853 7054489 6955368 6849303 6648857 6965705
8871 6965705 7084120 6924063 6993327 6734805 6710892 6924980 6659787 6467327 6726961 6992012
8861 6992012 6999878 6831712 6372274 6450267 6852771 6763343 6078914 6222831 6559167 6490093
8851 6490093 6210801 6473403 6193715 5955479 5824995 5678472 5907139 5803942 5570550 5834490
8841 5834490 5719244 5783008 5881238 5964789 5822793 5516980 5481499 5597291 5858945 5807817
8831 5807817 5612625 5560252 5859242 6136785 5994842 5892492 5942583 5833236 5518087 5864559
8821 5864559 6113380 5539873 5546214 5539912 5690248 5654062 5610954 5399181 5406655 5304870 5232359
8810 5232359 5432210 5443447 5411291 5319166 5081354 5068629 5125420 5398828 5270267 5193873 5368851
8799 5368851 5176471 4973436 4977773 4816259 5061308 4963154 4909884 5426402 5608403 5298867
8789 5298867 4894999 5190274 5413449 5249072 5132754 5415374 5255932 5209802 4930282 4759431
8779 4759431 4797460 4775545 5093324 5140330 5266043 5330055 5453112 5493521 5195967 5021456
8769 5021456 5052172 5130563 5106049 4907667 5051124 4983577 4976841 4985733 5003255 5022076 4910192
8758 4910192 4959361 4859927 5139489 5506094 5540125 5393022 4967112 4623207 4935622 5010055
8748 5010055 5026646 5022768 5042788 5305002 5475388 5322722 5052700 4900600 4781422 4857740
8738 4857740 5216945 5436620 5406598 5238615 5407307 5336882 5026095 5289275 5389635 5373715
8728 5373715 5424233 5278595 5124868 4936082 4854818 5129307 5199058 5158768 5265854 5186153
8718 5186153 5083453 5220649 5285579 5276035 5303905 5094009 4895768 5243127 4905118 5038561
8708 5038561 5261139 5378853 5361581 5302510 5169651 4910103 4999590 5218312 5365890 5133136
8698 5133136 5487707 5393679 5447627 5567301 5345361 5316142 5542979 5344425 5317708 5419269
8688 5419269 5267479 5394332 5229343 5123764 5431530 5445146 5587435 5964125 5974857 6071842
8678 6071842 5953900 5823507 5793249 5833779 5897040 5679500 5354250 5623960 5819454 5710985
8668 5710985 5671178 5534012 5781905 5798889 5458966 5506554 5717255 5806200 5808183 6121982 6037661
8657 6037661 5920749 6115864 6049970 6055558 6171464 6058462 6043731 5932581 6172937 6334296
8647 6334296 6124306 5931502 6185165 6416800 6226325 5989335 5773113 6117209 6180870 6155979
8637 6155979 6193900 6265992 6196379 6264707 6225746 6173592 5980853 6261192 6551356 6535312 6725154
8626 6725154 6464673 6618089 6872366 6663594 6766444 6900540 6914354 6834071 6632592 6770056
8616 6770056 6476888 6294385 6661645 6695887 6440717 6344976 6390295 6724612 6657584 6670376
8606 6670376 6867658 6576856 6311278 6573808 6861616 6910365 6914772 6879782 7168560 6974206
8596 6974206 6799439 6733015 6772865 6976986 6970830 7097769 6984813 7007378 7109325 7011653 6993177
8585 6993177 7337371 7617027 7216687 7324509 7187971 7406305 7539476 7717105 7422851 7425387
8575 7425387 7193398 7313035 7495855 7531920 7646958 7484383 7341668 7347578 7704779 7851714
8565 7851714 7631511 7496171 7311647 7277408 7518246 7217447 7382388 7415874 7646975 7375688
8555 7375688 7474624 7646383 7553236 7558160 7657521 8264150 8355723 7996734 7964505 7713997 7869273
8544 7869273 8045972 8090193 7989475 8011554 8210356 8107940 8220026 8350494 8216590 8152540
8534 8152540 8180775 8206712 8125829 8354909 8239606 8185432 8243009 8382600 8464495 8694485 8844034
8523 8844034 8944419 9109991 9004822 8890610 8640239 8301473 8271308 8430498 8512651 8546462
8513 8546462 8563318 8976631 8917565 8891456 8993120 8835089 8981829 8977803 9042839 8964300 9127552
8502 9127552 9158249 9279094 9394989 9546874 9487924 8962078 8704229 8967151 9288620 9329538
8492 9329538 9191759 9311832 9479533 9209667 9521556 9660068 9640118 9620192 9867094 9919921
8482 9919921 9866774 9700780 9536279 9670592 9720555 9804126 10015704 10311733 10072013 9729311
8472 9729311 10115970 9976186 10300288 10464482 10157984 10312177 10431762 10584885 10530438 10404719
8462 10404719 10562363 10659290 11023005 10966070 10788291 10759025 11081238 11361798 11342752 11374328
8452 11374328 11609248 11931472 11730351 12071389 12270964 12005299 11941486 12152015 12302930 12268061
8442 12268061 12164203 12687522 12541029 12939614 12941312 12862768 13176346 13483992 13519467 13146878
8432 13146878 13187579 13254372 13344820 13502503 13547656 13963455 14606215 14432078 14273850 14332307
8422 14332307 14400371 14433948 14749894 14700443 14751835 14677786 14821221 15250462 15506177 15505455 15663794
8411 15663794 15858884 15948306 16165939 16113279 16173461 16551394 16677258 16704408 16944762 17274912
8401 17274912 17501846 17579828 17915069 17894602 17662213 18257323 18557031 18963564 19268873 19708572
8391 19708572 20002308 20072898 20550921 21114273 21353325 21499213 21892509 22161853 22372202 22913959
8381 22913959 23136137 23998154 24280230 24805889 25445334 25559564 25981639 26497639 27389287
8372 27389287 27476939 27492212 27987570 28189880 27956804 28241977 28375370 28655359 28672808 28738885
8362 28738885 28829337 28883876 28903719 29413019 30032668 30323486 29756868 29707377 30127113 30477321
8352 30477321 30654477 30827975 31251823 31924377 32091552 32169262 32691298 33163496 33297259 33878244
8342 33878244 34503755 34985093 35717992 36444301 37025496 37403102 38284167 39194659 39935416
8333 39935416 40869254 41732463 42558439 43431995 44262148 44990159 45840801 46734846 47876376
8324 47876376 49006600 49817625 50538421 51270839 52264531 52860190 53566084 54053441 54508026
8315 54508026 55067238 55738917 55755670 55920018 55822539 55887269 56048894 56295160 56423633 56809743
8305 56809743 57077601 57095589 57181158 57396909 57429449 57961058 58651819 59225023 59355657 59729996
8295 59729996 60387016 60622653 61352341 61934253 62643497 63277481 63910132 64918869 65769618
8286 65769618 66621098 67205705 67814070 68195110 68810158 69836474 70103730 70091995 70388513
8277 70388513 70509983 70174918 70018434 69585689 68958698 68351057 67996281 66914945 66240789
8268 66240789 65358290 64497902 63352949 62375381 61552134 60768770 59356654 58208046 57305179
8259 57305179 56556219 55879623 54888866 54058053 53357954 52537979 51443372 50800653 50169783
8250 50169783 49511503 48862233 48422473 47734565 47251673 46746817 46345316 46132980 45789646
8241 45789646 45527197 45189438 44731657 44591006 44575863 44016943 43751188 43586436 43327252 43320303
8231 43320303 43190285 43508774 43716145 43402940 43197530 43355757 43731539 43917056 43806250
8222 43806250 44024086 44553456 45205555 45331661 45325687 45686652 46294352 46407014 46754846 47549775
8212 47549775 47821052 48582948 49113197 49659061 50235646 51072906 52112052 52508727 53418033
8203 53418033 54670383 55872225 56966902 58096373 59113311 60044996 61059789 62533345
8195 62533345 63495926 65218515 64999015 68078928 71836233 72142445 73013583 73196985 74268035
8186 74268035 74953958 76016172 76475303 77377477 77948943 78309810 78619236 79035411 79271783
8177 79271783 79123432 78759682 78422662 77994579 77099729 76829721 76726390 75905166 74988246
8168 74988246 74479014 73979199 73653808 73302727 72933324 72660865 72119128 71656851 71124791
8159 71124791 70305842 70382789 70339211 70308234 70149249 70182216 70122148 69890932 69659598 69861308
8149 69861308 70109120 69647320 69741026 69696606 69444400 69520708 69417501 69151165 69040758 68647483
8139 68647483 68557160 68347903 67809463 67305191 66917577 66053414 65335813 64996157 64346331 63513359
8129 63513359 62925782 62622775 61957169 61455545 60934725 60554495 60281868 60070985 59475896
8120 59475896 59554737 59590968 59363221 59516089 59975943 60024970 60112965 60744279 61236045 62115999
8110 62115999 62384797 62690617 63697196 64787556 65970747 67155458 68665547 70262034
8102 70262034 72290279 74364345 76373362 78756966 81262473 84310710 87432072 90567206
8094 90567206 94086524 97526656 101487923 105865229 109680356 113510745 117229299 120124171
8086 120124171 122803828 124978707 126645030 127572705 128258362 128464297 128289540 128127971 127830112
8077 127830112 127089471 126233021 124747997 123210873 121079927 118109732 114750491 111513972
8069 111513972 107952154 104365457 100586765 96529144 93086559 89626597 86009357 82364046
8061 82364046 79409190 76429462 73404934 70418621 68006493 65345188 62923845 60504356
8053 60504356 58076968 55851985 54217440 52483271 50663101 49317393 47588575 45906743
8045 45906743 44733069 43338234 42293485 41578552 40280225 39176862 38249618 37487509 36694698
8036 36694698 35505008 34690251 34032125 33640222 32956593 32332322 31461112 30768193 30523789
8027 30523789 30037737 29233044 28840925 28606816 28178890 27772562 27020638 27005204 26590957 25686643
8017 25686643 25372102 25022367 24767079 24396417 23886841 23613773 23778898 23084525 22548964
8008 22548964 22364093 22333168 22283086 22100631 21837641 21161061 20968631 21158893 21057519 20810397
7998 20810397 20757495 20546645 20074292 20086158 20128560 19674116 19183634 19204862 19163473 18925114
7988 18925114 19030498 18879524 18438434 18200036 18099159 18082133 18193375 17773264 17738896 17738473
7978 17738473 17494239 17550650 17565802 17155488 17068545 17195668 17100810 16917138 16675956 16541605
7968 16541605 16610186 16957056 16966437 16624062 16261091 16085933 16332326 16415633 16061604 16042224
7958 16042224 16191518 15947176 16033357 16045821 15965940 15797651 15906118 15723036 15033066 14743043
7948 14743043 15091572 15389190 15417098 15178417 15047419 15017488 14924345 14825459 14749076 14666837
7938 14666837 14716040 14550837 14552663 14499008 14632411 14539865 14353043 14629424 14794490 14713221
7928 14713221 14636913 14302646 14215465 14344446 14259494 14426827 14167360 14145147 14082903 14138598
7918 14138598 14380704 14379992 14364986 14016312 13824722 13879737 13563127 13341030 13550629 13583716
7908 13583716 13773362 13502400 13030494 13075294 12873641 12932701 13169083 13188525 12853538 12643593
7898 12643593 12600666 12527487 12077667 12020920 11909073 11735590 11638987 11429469 11466810 11150751
7888 11150751 11226992 11423113 11503061 11369487 11161259 10685734 10618452 10693758 10403188 10258932
7878 10258932 10362087 10603549 10635394 10537301 10470027 10341389 10303476 10260608 10366753 10216636
7868 10216636 9924972 9680748 9732911 9754846 9620084 9868105 9905059 9903208 9945576 9924859 9633564
7857 9633564 9473568 9503608 9477945 9318025 9572276 9558823 9431436 9405068 9440721 9672612
7847 9672612 9699633 9473922 9517326 9900094 9585306 9261635 9393470 9444601 9245989 9040332
7837 9040332 9318075 9404756 9189360 9117934 9098916 8937534 9128356 9407937 9477420 9532235
7827 9532235 9166398 8818557 8823821 9157760 9450076 9289406 9289277 8844175 8682333 9271550
7817 9271550 9039291 8824072 8745908 8820143 8790620 8533197 8660017 8647123 8661567 8674622 8795777
7806 8795777 8796814 8628773 8356606 8599188 8665434 8666109 9010427 8500945 7696046 8254437 8448633
7795 8448633 8524853 8320824 8413017 8633745 8346794 8350955 8292303 8437510 8299477 8296623 8280868
7784 8280868 8370452 8644269 8840684 8858117 8655457 8585160 8710609 8633769 8761760 8725409
7774 8725409 8711197 8778002 8820444 8970109 8765404 8527604 8471523 8391309 8273132 8208227 8201161
7763 8201161 8349266 8231850 8381669 8519580 8451359 8512159 8282202 8246157 8312245 8284589
7753 8284589 8828297 8849410 8829530 8672140 8465249 8469442 8193703 8381307 8495261 8518789
7743 8518789 8262111 8284391 8600491 8710117 8554869 8458903 8356229 8480781 8591598 8467308
7733 8467308 8538739 8628424 8515400 8161811 7949455 8344814 8527059 8608104 8264607 8202595
7723 8202595 8356859 8385495 8416496 8575876 8610153 8472632 8463997 8649411 8378701 8147931
7713 8147931 8191778 7958694 7969070 8136383 8228078 8175558 8545275 8606021 8263778 8100741
7703 8100741 8141763 8245717 8373578 8418268 8705497 8622872 8657445 8720752 8453654 8418009 8417413
7692 8417413 8539324 8509188 8573575 8281568 8013053 7945562 8090963 8306004 8093106 7935068
7682 7935068 8129918 8213386 7949280 8027996 7989228 7738145 8003725 8100427 7784485 7712323
7672 7712323 7970162 7840220 8025903 7965630 7610680 7551869 7955839 8065213 7963243 8010093
7662 8010093 7723341 7394908 7516764 7734347 7616878 7811761 7843242 7547028 7812161 7785629
7652 7785629 7952013 7950890 7647023 7475598 7776797 7931737 7629228 7555829 7748832 8131188
7642 8131188 8106242 8107176 8106115 7793899 7791357 7955315 7778413 7993655 8082641 7815976 7606230
7631 7606230 7840172 8124890 8173051 7797969 7765125 7561887 7705393 7771799 7571680 7907241
7621 7907241 8051769 7996792 8219927 8046912 7922621 8003417 7949967 7848807 7728970 7687302
7611 7687302 7711884 7978607 8016030 7898676 7870428 8007632 8337430 7943191 7825468 8179946
7601 8179946 8267255 8105515 8080960 8282788 8209297 7865911 8145371 8272124 8175416 7746575
7591 7746575 7891729 7908986 8005157 7717241 7565508 7878424 7907115 7897136 8001142 8219154
7581 8219154 8273509 8135171 7908520 7553505 7667820 7837286 7711337 7846781 7953816 8128952
7571 8128952 7822601 8069922 7692818 7710155 8093003 7979997 8199405 8335463 8190524 8060066
7561 8060066 8166965 8452466 8281858 8225206 8241237 8273336 8047965 7981003 8537000 8402238
7551 8402238 8325153 8652716 8614544 8492782 8409322 8313156 8629364 8717996 8596691 8432760
7541 8432760 8649304 9164799 9481334 9850160 9450444 9224036 9239145 9361545 9477008 9444523
7531 9444523 9232877 9241665 9123445 9120565 9003637 8820619 8722742 8904019 9032566 8800208
7521 8800208 8615618 8761820 8728446 8594793 8630487 8899040 8632812 8501563 8746941 8651721
7511 8651721 8603978 8584504 8416358 8326796 8097074 8116088 8285552 8498982 8381003 8327156
7501 8327156 8400022 8279550 8232993 8254050 8320332 8441127 8286705 8036057 8150949 8216609
7491 8216609 8172000 8126745 8183721 8145113 8050759 7979155 8233451 8290319 8203166 8320221 8312042
7480 8312042 8278151 8580628 8721691 8844041 8812175 8592932 8355352 8452954 8535934 8534590 8101890
7469 8101890 8104860 8042465 8136397 8147472 8467754 8339079 7990535 8131579 8251897 8274524 8113894
7458 8113894 8155266 8530748 8356971 8180582 8258894 8559899 8601122 8277553 8245051 8638894
7448 8638894 8868570 8703090 8373904 8621251 8549477 8221091 8388976 8546512 8717180 8726951
7438 8726951 8628516 7978817 8338068 8556270 8575214 8639434 8351558 8451249 8606335 8526061
7428 8526061 8570388 8713755 8912244 8908281 8825434 8803517 8614099 8731372 8731808 8543166 8823237
7417 8823237 8662286 8421457 8507764 8748783 8812745 8941559 8567264 8584955 8981425 8784911
7407 8784911 8736560 8730883 8697045 8669756 8703943 8662161 8551775 8712052 8804347 8820575 8775167
7396 8775167 9109599 8967750 8820800 8984371 8951785 8596849 8636597 8808760 8809746 8843169 8876646
7385 8876646 9303296 9164738 8726750 8935241 9002461 8869005 8846487 8731804 8674255 8787746
7375 8787746 8769053 8729584 8646488 8899393 8866663 8843424 8917818 8920811 8876232 8760102 8673680
7364 8673680 8885304 9183421 9086852 9089443 9049284 9199821 9107873 9007665 9112288 9142747 9091250
7353 9091250 9248516 9107449 9021249 9129786 9228138 9046989 8867388 8500437 8756993 8847038
7343 8847038 9069437 8969200 9159904 9243964 9070888 9135404 9448720 9156118 8997266 9292021
7333 9292021 9426403 9647304 9539204 9498763 9527508 9353183 9279887 9294494 9270939 9423897
7323 9423897 9305247 9356673 9523615 9316888 9018910 9197948 9461402 9304047 8981582 9211823
7313 9211823 9534834 9635465 9631638 9310799 9364049 9359631 9222150 9199212 9207941 9564198 9637781
7302 9637781 9384125 9366946 9439302 9419624 9459347 9691468 9528480 9475067 9342605 9164303
7292 9164303 9399159 9361954 9635943 9786477 9431629 9335374 9810131 9704510 9385009 9290830
7282 9290830 9443521 9409047 9304372 9367809 9690702 9538354 9502216 9379440 9338168 9364878
7272 9364878 9686901 9876743 9740709 9826707 9833146 9905008 9873435 10115653 10158814 10104367 9979974
7261 9979974 9791550 9733023 9835613 9945953 9855196 9726198 9759653 9890078 9931423 9764655
7251 9764655 9690960 9678117 9747120 9728692 9720547 9635171 9527399 9723607 9769875 10017444 10468081
7240 10468081 10393085 10125996 10251115 10142102 10300641 10312320 10299171 10293995 10159973 10235709
7230 10235709 9828163 9644039 9704260 10006617 10228502 10069300 9735520 10095707 10218050 9917771
7220 9917771 9917568 9993938 10212990 10185730 10272937 10002662 10151297 10181388 9968606 10150797 10196260
7209 10196260 10270243 10298930 10159841 10287272 10224150 10025515 10344766 10322991 10092254 9987325
7199 9987325 10148747 10279877 10399307 10374603 10262622 10648099 10446946 10444500 10087470 10191506
7189 10191506 10471947 10410908 10411101 10517982 10505836 10699756 10573264 10380137 10590913 10540246
7179 10540246 10510304 10794870 10990080 10672783 10662664 10604372 10671288 10731902 10670337 10884281
7169 10884281 10960116 10773737 10548512 10362340 10799936 10663813 10817348 10666021 10845251 10994368
7159 10994368 10824250 10465296 10295895 10302013 10306025 10792193 10997157 10899372 10816898 10683054
7149 10683054 10567110 10475955 10538477 10462342 10442618 10669571 10723487 10994043 11113457 11155085
7139 11155085 10927015 11143104 11052313 11097747 11304640 11044060 11018257 10990116 10914095 11085333
7129 11085333 11022202 10922972 11069839 11249990 11429563 11542978 11526438 11288936 11221770 10920610
7119 10920610 11231971 11091854 11083086 11211331 10994838 11167172 11251250 11225898 11491317 11511784
7109 11511784 11537252 11550166 11488810 11189059 11177114 11253048 11376591 11330171 11423815 11421119 11169880
7098 11169880 11338382 11314376 11575858 11697714 11812761 11720234 11536187 11557716 11312211 11543946
7088 11543946 11992244 11773127 11951159 11985354 11786258 11413322 11256084 11711346 11772940 11553126
7078 11553126 11409040 11315145 11348506 11456268 11527322 11821695 11809177 11901438 11843396 11473068
7068 11473068 11605406 11453100 11498606 11539720 11873787 11862391 11961578 11774139 11977946 11987896
7058 11987896 12176926 12096115 11672494 11995367 12247043 12279349 12002279 12223239 12325296 12110356
7048 12110356 11884483 11974670 12053340 12418196 12453602 12035199 11987962 12114286 11969222 12215917
7038 12215917 12499897 12319082 12182366 12256396 12457045 12306375 12377105 12456232 12663269 12748690
7028 12748690 12520700 12412075 12291265 12330844 12420527 12116077 11740382 12251603 12504565 12567760
7018 12567760 12378981 12216045 12215011 12229351 12046814 12141001 12701791 12682108 12515434 12390619
7008 12390619 12524562 12507769 12442697 12612636 12574264 12455709 12607350 13057271 13105596 12767971
6998 12767971 12735623 12715014 12740756 12848769 12748665 12774576 12782435 12742553 12760274 12830700 12960642
6987 12960642 13236656 13060424 12757601 12840117 13145137 13503442 13179127 13325433 13182755 13048965
6977 13048965 12850703 12783124 13112831 13207870 13194052 13333973 13359757 13386597 13442404 13250299
6967 13250299 13233989 13286916 13428088 13344028 13156808 13195041 12998745 13296319 13550470 13157923
6957 13157923 13205572 13523987 13381830 13080207 13180767 13504343 13696679 13340284 13186065 13181539
6947 13181539 13166419 13697512 13868242 13755918 13416390 13390295 13772157 13796788 14005322 13997086
6937 13997086 13508871 13656688 13783058 13369719 13473419 13596752 13778021 13806263 13834330 13865625
6927 13865625 13497393 13635314 13852766 13654437 13937733 13757209 13572371 13853615 13864094 14040550
6917 14040550 13889342 13765171 13842931 13752175 13779237 14309554 14331359 14382522 14186426 13908240
6907 13908240 14148238 13976837 14066038 13998708 14223746 13971052 14065599 13933037 14012360 14080546
6897 14080546 14024414 14045125 14086055 14300988 14698074 14739264 14789281 14561291 14349019 14626208
6887 14626208 14944813 14965284 14428172 14677814 14807774 14751839 14671469 14543208 15003835 14677291
6877 14677291 14742761 14522134 14592999 14579070 14713018 14997622 14695690 14649462 14469897 14680068
6867 14680068 14841507 14921993 14800615 15063428 15037350 14830673 14953924 15118617 15155476 15086289
6857 15086289 15182151 15248442 15033251 15337621 15116659 15202807 15081612 15029461 15422682 15415167
6847 15415167 15464552 15767734 15432267 15457629 15591648 15308193 15532484 15535018 15485306 15323865
6837 15323865 15127947 15325998 15265699 15662338 15834660 15736313 15589957 15457251 15539668 15853929
6827 15853929 15652523 15597266 15536380 15629227 15913606 15622372 15726970 15639279 15742922 16221692
6817 16221692 15998289 15883608 16186877 16254204 16067219 16205859 16091793 15849898 15850743 15914319
6807 15914319 16046549 16216217 16234771 16150940 16297805 16258252 16311701 16058580 16156047 16481413
6797 16481413 16571145 16694347 16863993 16602468 16312562 16401954 16153093 16079553 16492488 16047790
6787 16047790 16141034 16144313 16424976 16790576 16668565 16654544 16423643 16252414 16554176 16757488
6777 16757488 16749714 16288406 16226315 16596502 16808109 16832522 16812880 17045509 16954115 17001836 16762884
6766 16762884 16785989 16787953 16727790 16497084 16827602 16746838 16618118 16963071 17153036 17265329
6756 17265329 17169073 17348916 17372856 17592190 17696958 17711881 17608906 17299885 17025762 17071430
6746 17071430 17166614 17439897 17507636 17647715 17592061 17233134 17314384 17348267 17437829 17468710 17622910
6735 17622910 17742726 17767490 17891265 17778274 17548012 17866318 17853676 17960644 17775417 17658358
6725 17658358 17699207 17849940 17810848 18101831 18297858 18162539 18096078 17855895 17811595 18082803
6715 18082803 18241701 18057774 18120429 18200442 18134574 18233652 18182134 18072633 17944703 18171914
6705 18171914 18435271 18299440 18466890 18347128 18337488 18465190 18458486 18205884 18298758 18256698
6695 18256698 18564923 18632779 18764084 18564109 18568716 18749465 18594225 18578729 18434297 18297716
6685 18297716 18489771 18709055 19018080 19153486 18863204 18844017 18891133 19023173 19035531 18858730
6675 18858730 19100983 19407366 19554279 19663180 19395250 19271183 19339844 19523475 19233296 19453318
6665 19453318 19625008 19620349 19385274 19122583 19197732 19421667 19710116 19466574 19621666 19716120
6655 19716120 19543520 19929294 19929936 19963762 20137713 20163189 19773487 19979604 20091269 20021528
6645 20021528 19909457 19739274 19892416 19892255 19898968 20053976 20257404 19967721 20142153 19953632
6635 19953632 20004850 20180234 20308050 20247404 20339122 20471273 20373215 20287150 20411910 20376154
6625 20376154 20535948 20394515 20652402 20496915 20463323 20509346 20362049 20210666 20529476 20778539
6615 20778539 20890260 20810210 20605805 20724431 20859558 21068483 21173915 21239747 21064581 21083542
6605 21083542 21567829 21692417 21405934 21186070 21144679 21486922 21409527 21520805 21764937 21549763
6595 21549763 21481061 21499791 21508047 21852113 21778045 21785263 21878849 21903637 21964678 21931686 21894854
6584 21894854 21786027 21717542 21664273 21823147 22120330 22065693 22318085 22233339 22140497 21929026
6574 21929026 22060782 22178710 22358676 22384241 22075027 21880101 22042272 22029302 22294931 22648718
6564 22648718 22816124 22598668 22632733 22702472 22689662 22766276 22834306 22861979 23267463 23294955 23318146
6553 23318146 23158511 22996979 22901478 22904500 23061785 23140970 23219395 23173959 23289938 23428053
6543 23428053 23139646 23286983 23375869 23467555 23667632 23829401 23775821 23428097 23713573 23607457
6533 23607457 23502566 23991466 23900411 23630948 23653838 23789908 24080107 23864691 23968346 24213155
6523 24213155 24149395 24347544 24498056 24118034 24289722 24416692 24244536 24452479 24405136 24345664
6513 24345664 24533965 24632951 24716272 24590611 24578702 24594502 24736998 24545254 24816934 24798373
6503 24798373 24809592 24912824 24760748 24901997 24893725 24749276 24875116 24870493 25459507 25632647
6493 25632647 25482451 25373727 25423606 25142196 25529521 25946988 25928774 26072131 25605408 25690277
6483 25690277 25907469 25923815 25901027 25785109 25868669 26045507 26154041 26118962 26038970 26235254
6473 26235254 26064721 25937434 26100298 26098852 26195640 26550038 26395133 26154462 26219782 26520308
6463 26520308 26810827 26832122 27187488 27075921 27014941 27074037 27020281 26883477 26782434 26881457
6453 26881457 27164638 27202329 27488258 27463824 27119471 27253843 27520373 27201884 27354364 27404241
6443 27404241 27105898 27307240 27493816 27630485 27556996 27781975 27587363 27643004 27735025 27906931
6433 27906931 27836290 27816344 28008947 28033749 28435100 28188646 28032837 28148097 28030386 28287233
6423 28287233 28430813 28507447 28416551 28345370 28331996 28506372 28456780 28714637 29191297 28980122
6413 28980122 29096386 29249519 29235851 28944409 29015619 29290180 29027628 29142792 29016073 28933257
6403 28933257 28937734 29137383 29459073 29430837 29388261 29570839 29445471 29731261 29961653 30035795
6393 30035795 29937900 29926172 30004381 29988090 30160017 30373370 30774384 30483056 30281456 30275562
6383 30275562 30467235 30804345 30657987 30676510 30627454 30510509 30427235 30727146 30807691 30790408
6373 30790408 30827927 31250537 31386420 31185424 31362257 31159576 31225806 31201554 31164223 31078114
6363 31078114 31299610 31658569 31647868 31832015 31698899 31878069 32039945 31977860 32176588 32313164
6353 32313164 32136613 32005942 32157093 32158639 32546529 32442336 32479582 32432329 32519641 32497572
6343 32497572 32364339 32575430 32669369 32802593 32670754 33007801 32916438 32935360 33202927 33155151
6333 33155151 33182703 33221284 33302934 33417179 33249635 33217970 33218559 33384911 33647937 33978147 34245765
6322 34245765 33930924 34129389 33842032 33885198 33882956 33781865 33807809 33993783 34051064 34064367
6312 34064367 34550454 34665695 34524996 34694952 34694286 34788919 34804930 34821057 34848207 34800836 34797166
6301 34797166 34934408 34883966 34805991 35247761 35468438 35944386 35592694 35468670 35434379 35109230
6291 35109230 35812816 35845727 35648104 35831067 36028979 36262708 35831612 36055551 36179203 36388765
6281 36388765 36577014 36573662 36572013 36652982 36663191 36903005 36887506 36713792 36924303 37285905 37173888
6270 37173888 37128316 37285845 37478998 37076113 37110018 37190124 37155305 37144743 37298270 37762760
6260 37762760 37785588 38003456 38101516 38086592 38074874 38045871 38011408 38131896 38410773 38767161
6250 38767161 38473917 38701495 38663835 38714441 38591492 38828750 39007060 39022484 38960941 39164715
6240 39164715 39062268 39113379 39515072 39584970 39260885 39108959 38924228 38998094 39236565 39386078
6230 39386078 39532537 39533624 40043791 40677838 40649985 40436300 40405300 40520613 40668876 40651417
6220 40651417 40857971 40729990 40876226 40798606 40767309 40834548 41068326 41063295 41300806 41293587 41141550
6209 41141550 41113221 41056839 41378443 41619029 41586685 41608955 41517282 41441323 41544454 41926011
6199 41926011 42076093 42169274 42428893 42478720 42660153 42446693 42046964 42278392 42361969 42632562
6189 42632562 42854781 42482779 42436140 42678473 42592206 42655032 43015626 43392826 43454562 43475908
6179 43475908 43821590 43558465 43717528 43626519 43742624 43868404 43883167 44160556 44169874 44324363
6169 44324363 44560180 44620002 44707801 44912747 44771802 44864920 45192571 44940094 44537981 44508785
6159 44508785 44500397 44428601 44443025 44933645 45249310 45231396 45390395 45559002 45638056 45416280
6149 45416280 45698590 45878095 46194603 46042898 46143517 46239135 46157249 46538731 46519963 46191659
6139 46191659 46073131 46560994 46789124 46817101 46832021 47090612 47277346 47188756 47134450 47270245
6129 47270245 47151242 47155901 47293067 47517761 47519652 47491223 47529046 47392108 47543168 47430727
6119 47430727 47736042 47994153 48067142 48336179 48463968 48095502 48115896 48606993 48791297 48685984
6109 48685984 48361445 48222936 48520761 48760960 48835497 48972195 49144846 49265299 48910067 49146392
6099 49146392 49845990 49749174 49698082 49764902 49707072 49611247 49632662 49843397 49726860 50277568
6089 50277568 50325009 50365967 50357074 50469078 50707419 51101085 51045091 51181959 51215989 50992369
6079 50992369 51240643 51444618 51376017 51322452 51410378 51266447 51347233 51505229 51660614 51674624
6069 51674624 51642220 51879487 52114859 52100731 52221687 52220560 52215804 52251068 52006881 52550345 52961917
6058 52961917 52537726 52018243 52605373 53155564 53348885 53237947 53126352 53279549 53437201
6049 53437201 53588800 53725870 53739148 53520491 54025400 53993347 53260178 53431171 53909921 54042704
6039 54042704 54303264 54136369 54255836 54415561 54368638 54063165 54238674 54387640 54597944 54522052
6029 54522052 54506369 54621828 54943780 55176314 54879667 55029956 55062286 55217912 55015583 55248596
6019 55248596 55595138 55571088 55500400 55548607 55678056 55940933 55889113 55564283 55879440 56081233
6009 56081233 55929691 55901714 56109421 56047063 56302967 56262866 56257317 56397155 56684106 56682507 57185613
5998 57185613 57238629 57005878 56945065 56910181 56965610 57271537 57314035 57230787 57189558 57182709 57542576
5987 57542576 57423012 57411150 57530111 57866597 58174779 58170759 58084464 58085589 57939653 58076411
5977 58076411 58302941 58516681 58492125 58575556 58567295 58843850 58786494 58914250 58945802 58578186
5967 58578186 58631310 58667011 58894499 59056882 58990426 58862221 59142687 59194214 59204442 58816599
5957 58816599 58936362 59369897 59402496 59681917 59729507 59665030 59509958 59499899 59373548 59336590
5947 59336590 59434609 59727278 59732359 59928573 60046282 60296143 60265173 59913683 60002597 60104075
5937 60104075 60451170 60383106 60216194 60000819 59899486 59944476 60198947 60274522 60738093 60662207
5927 60662207 60640755 60986707 61318687 61087799 60663862 60758702 60917258 60731049 60966418 60871013
5917 60871013 60893593 61106694 60903646 60870128 60891503 61107645 61410840 61470619 61091120 60664350
5907 60664350 60943618 60996080 60994090 61385597 61371026 61329218 61420644 61734254 61622252 61737362
5897 61737362 61939861 61919779 61853621 61962630 61605317 61605350 61735650 61459805 61523628 62059204 62166247
5886 62166247 61831133 61608868 62146084 62233809 62111495 61989842 62094299 62107901 62353378 62476918
5876 62476918 62305245 62170871 62086126 61947125 62136450 62089611 62210316 62209563 61787803 61951883
5866 61951883 61886692 61588746 61782631 62278994 62463871 62151340 61963736 62272425 62244692 62205472
5856 62205472 62399464 62273583 62288405 62175259 62227907 62673791 62681408 62674654 62536600 62584702 62551059
5845 62551059 62368707 62356683 62379483 62510920 62566417 62421088 62427312 62431797 62449941 62390565 62489314
5834 62489314 62543789 62542486 62474337 62390463 62401628 61951443 61870604 61892732 62298030 62443299 62407148
5823 62407148 62373000 62035597 62184114 62245781 62640239 62396880 62197350 62345726 62203859 62239952
5813 62239952 62194225 62520781 62403967 62051171 62051703 62117133 62227737 62072559 62122966 62207459 61891355
5802 61891355 61928412 62255814 62176312 62051221 62086800 62319297 62446380 62206549 61979333 62139759
5792 62139759 62057451 61780019 61658452 61783449 61621910 61796498 61869849 61543561 61498421 61333315
5782 61333315 61511630 61491714 61274736 61178220 61183869 61146012 61283179 61409764 61105445 61109025 61329741
5771 61329741 61166450 60880027 60924751 60946306 60946126 61081363 61038875 60727618 60961358 60791846
5761 60791846 60769578 61018006 60939447 60760671 60442855 60129279 60363242 60425466 60385870 60439491
5751 60439491 60113567 60018652 60104958 59903354 59815768 59764505 59610256 59579265 59798535 59698286
5741 59698286 59462045 59546277 59484878 59674899 59805246 59732991 59578012 59447741 59181111 59110335
5731 59110335 58884770 58746186 58879287 58822490 59086055 59082657 58568781 58539460 58742034 58623735
5721 58623735 58870921 58541593 58516611 58618019 58383727 58139827 58131650 58027542 57932400 57795100
5711 57795100 57632435 57909666 58220294 58130318 57913109 57757396 57509489 57436608 57490259 57457008
5701 57457008 57389445 57042136 56945911 56970179 56951121 56979162 56928507 56874426 56716092 56806345 56600316
5690 56600316 56426803 56044776 56030768 56119545 56197341 55770085 55780677 56037741 55862171 55628976
5680 55628976 55626141 55630927 55806356 55587393 55375854 55380017 55145350 55173610 55061581 54836543 54779868
5669 54779868 54947056 54815307 54917838 55004133 54669504 54594194 54716832 54552035 54566843 54554535
5659 54554535 54317736 54124885 54055106 54073467 53770355 53931051 53826017 53521876 53504235 53493098
5649 53493098 53328846 53262392 53166490 53128226 52970385 52915029 52980650 52926904 52851917 52742077 52361448
5638 52361448 52214037 52319955 52143817 52051323 51912600 51894091 51792008 51635467 51369601 51619066
5628 51619066 51884327 51493853 51427339 51301744 51404067 50978955 50794009 50506745 50409615 50603481
5618 50603481 50654229 50649911 50544023 50334813 50278461 50452607 50150523 49932265 49733689 49625380
5608 49625380 49582667 49631336 49559083 49740012 49575816 49373251 49272791 49000080 49080891 49355646
5598 49355646 48834644 48489807 48471518 48402841 48541200 48078302 48064726 48086428 47903781 48070874
5588 48070874 47963973 47873179 47933798 47859680 47530775 47702911 47909085 47641861 47312591 47022558
5578 47022558 46823562 46929189 47021467 46940749 46753908 46748851 46709048 46715987 46819201 46343976 46129186
5567 46129186 45780008 45578383 45877596 45746403 45486877 45481594 45312086 45092952 45269298 45333866
5557 45333866 44965046 44925308 44993957 44905246 44726032 44461351 44612860 44571482 44189402 43940085
5547 43940085 44009533 44075294 44000028 43825920 43821885 43914148 43858305 43747844 43365852 43171106 43075392
5536 43075392 43085902 43334728 42994371 42863741 42843749 43183883 43109466 42751065 42604401 42709441
5526 42709441 42736905 42566516 42562603 42244231 41877249 41906884 41785102 41703555 41643530 41623738 41339594
5515 41339594 41355441 41530598 41472601 41357298 41160694 40990879 40896783 40772316 40805662 40762907
5505 40762907 40766088 40528294 40199543 40242028 40234671 40315508 40137399 40288246 40163793 39931322
5495 39931322 39883660 39574855 39418655 39245726 39411835 39222566 39275826 39288452 38917469 39193460
5485 39193460 39065291 38862295 38882556 38505856 38448440 38574723 38842383 38677503 38392880 38393047
5475 38393047 38612912 38163546 38420578 38448350 38170269 38274304 38270266 37799622 37564980 38062192
5465 38062192 38020377 37854712 37452689 37357452 37337484 37259702 37142254 37169182 37058165 36925821
5455 36925821 36516714 36660894 36563133 36544314 36600310 36414333 36269591 36232090 36482021 36219881
5445 36219881 35960465 35846010 35490839 35405806 35243974 35202834 35181332 35300347 35115606 35075742
5435 35075742 35079862 35108260 35069910 34806805 34374208 34570398 34547916 34691525 34613106 34379647
5425 34379647 34215906 34371435 34469392 34436109 33956590 34004503 34091720 33834458 33386743 33379387
5415 33379387 33243100 33118581 33288032 33045051 32915736 33012279 33186982 33167324 33157422 32817086
5405 32817086 33022927 32810174 32848460 32773009 32710715 32673392 32344301 32264820 32018401 32060298
5395 32060298 32065479 31979481 32112839 32290610 32418180 32242914 32043191 32015450 31942181 32060277
5385 32060277 31928729 31734263 31656387 31659066 31365835 31188159 31088514 30942335 30961505 31122292
5375 31122292 31268118 31253241 31347047 31228915 31215677 31253608 31160839 31233714 31088195 30404371
5365 30404371 30399928 30546939 30587790 30273935 30154916 30093092 30307991 30428365 30358882 30066495
5355 30066495 29814274 29726978 29808959 29807624 29557966 29489905 29772649 29785120 29689671 29764857 29902196
5344 29902196 29526834 29257399 29723651 29474626 29239630 29350888 29107804 28895540 28747292
5335 28747292 29104049 29124386 29070894 28927770 28825475 28695067 28809225 28942320 28616082 28322643
5325 28322643 28190979 28436007 28783459 28637325 28699830 28531419 28385558 28381270 28255249 28025811
5315 28025811 27806646 27633840 27949733 28243452 27783325 27470632 27701481 27466273 27688524
5306 27688524 27836099 27638976 27959511 27899589 27651730 27572846 27442816 27130457 27330266 27373736
5296 27373736 27431634 27436067 27397625 27265463 26995665 27079299 26885378 26544655 26733382 26834718
5286 26834718 26823595 26598162 26743261 26669184 26707018 26808745 26845276 26912281 26666155 26463114
5276 26463114 26426743 26207759 26030968 26191417 26440764 26630995 26544583 26312654 26270909 26220268
5266 26220268 26128812 25987706 25888631 25983887 25977146 25831238 25857884 26048547 25921071 25853987 25892274
5255 25892274 25913906 25541354 25612006 25484572 25467782 25652781 25532384 25799496 25652422 25540102
5245 25540102 25542812 25431869 25199245 25349735 25310883 25384652 25258823 25128049 25292162 25218766
5235 25218766 25136453 25141803 25199596 25238725 25145946 25188928 24837989 24924829 25098864 24856199 24663268
5224 24663268 24501658 24492950 24377103 24754886 24660859 24585380 24605908 24622414 25036976 25014492 24628639
5213 24628639 24456055 24669785 24944684 24903472 24787296 24813926 24474190 24050988 24015194 24227323
5203 24227323 24167087 24095608 24088415 24256827 24142684 24120983 24280655 24424136 24551354 24366637
5193 24366637 24395839 24367755 24581749 24602009 24754571 24615548 24331088 24486009 24391584 24329387
5183 24329387 24623941 24599080 24393531 24400186 24534056 24720625 24462314 24608050 24856875 24588985
5173 24588985 24368892 24404165 24201236 24319228 24372374 24608315 24510542 24481477 24298045 24441808
5163 24441808 24246733 24503610 24509211 24386659 24422825 24465792 24959551 24816738 24752567 24806430
5153 24806430 24673517 24739059 24694338 24538348 24674219 24569460 24507212 24461602 24541295 24595563
5143 24595563 24574567 24591980 24826075 24882673 24845623 24578320 24680200 24949304 24957042 24963425 25065029
5132 25065029 25372764 25208722 24910848 25137554 25067440 25120913 25374928 25522124 25529446 25998699
5122 25998699 25790446 25474638 25747198 25747724 25767400 25917197 25804916 25857383 26157206 26284148
5112 26284148 26107986 25824253 25879821 26127662 25984849 26233399 26749085 26894678 26793942 26926815
5102 26926815 27100062 27165770 27415225 26964235 26798581 27258850 27226702 26840349 26793601 27114045
5092 27114045 26975502 27054660 27323702 27506233 27344393 27158498 27265540 27481536 27547963 27488753
5082 27488753 27589910 27378613 27418384 27264887 27052449 27464588 27545939 27478037 27313683 27209443
5072 27209443 27463582 27851552 27862433 27516834 27127444 27484932 27468091 27619351 27726894 27827110
5062 27827110 27509580 27374308 27596896 27826295 27802751 27456821 27785207 28126553 27785186 27873714
5052 27873714 27958721 28026659 27946698 28070532 28357649 28443862 28406203 28660596 28775095 28927343
5042 28927343 28956378 28802422 29118270 29272732 29214697 29221282 29372202 29624043 29748068 29815911
5032 29815911 29871134 29726637 29746494 29589551 30167316 30469775 30649133 30315643 30651022 30827481
5022 30827481 30717414 30770355 31078603 31130138 31443547 31820737 31742123 31596706 31573704 32223682
5012 32223682 32480265 32352287 32692403 33077249 33140042 33502626 33661112 33544012 34011965 33991139
5002 33991139 33961996 34351003 34788248 34890823 35050867 35380173 35544811 35788316 36179224 36392786
4992 36392786 36894855 37152634 37073528 37326512 37679259 37444584 37654979 37957798 38181072 38508393
4982 38508393 39187082 39373001 40030420 40594503 41074813 41590152 41808338 42111915 42648709
4973 42648709 43299841 43967158 44601416 45037898 45717724 46602183 47582726 48497475 49161933
4964 49161933 49871419 51047805 52412480 53677551 54707964 55814775 57410465 58646071
4956 58646071 59806417 61449665 63130522 64608221 65818814 67028493 68100029 68528492
4948 68528492 68457047 68709617 68411875 68050383 67879327 67545684 67397355 67001693 66332991 65568817
4938 65568817 65140864 64806986 64215398 64384472 64185704 63953732 63940300 63712371 63315284 62954266
4928 62954266 62503832 62361856 61892476 61499442 61365686 61198296 60834935 60262423 59917872
4919 59917872 59711596 59566088 59424684 59450508 59663525 59554069 59588282 59439076 59428134 59742636
4909 59742636 59444123 59418249 59969521 60278219 60128291 60311197 60735333 60877660 61341740 61506978
4899 61506978 61721204 61782897 62441196 62824213 62997501 63423267 63786682 64127493 64635816 65264805
4889 65264805 66241204 66878721 67167629 67655217 68159895 68805431 69371629 70032298 70636215
4880 70636215 71102997 71974546 72818755 73340430 73833763 74645599 75519327 76465882 77460965
4871 77460965 78098955 78597625 79293117 80474390 81586977 82948194 83903761 84928408 86126644
4862 86126644 86930163 87922133 89362989 90949317 92362351 93734285 95099793 96443493
4854 96443493 97746171 99511663 101090418 102802757 104428185 105870133 107873086 109983700
4846 109983700 112055997 114065761 115730467 117780105 120158444 122563097 124816598 127026780
4838 127026780 129516758 132218240 134743660 137363304 140207933 142921404 145897775 148761508
4830 148761508 151831601 155065179 158599708 161958578 165396496 169575229 173593709 177569396
4822 177569396 181469283 185810878 190551466 195820032 200536699 205714302 211153987 216629401
4814 216629401 222786986 229176046 235381379 241896586 248815934 255740580 263224505 270494785
4806 270494785 278042157 285875049 293888984 301852956 309370865 316969412 324524975 331393850
4798 331393850 338475052 344635571 350459928 355532256 359423747 362878745 366029506 367883247
4790 367883247 368927100 369378589 368565158 366752219 364713927 361626363 358125002 353574020
4782 353574020 348256606 342986176 337823885 331869411 326033542 319543089 312823302 306439709
4774 306439709 299915859 293208751 286565976 280171144 273522151 267187688 261139539 254769152
4766 254769152 248893674 243118199 237087089 230940227 225404900 220403115 215216933 210488654
4758 210488654 205501470 200369068 195903682 191851635 187754888 183975311 179738779 175749862
4750 175749862 172121700 168330628 164854745 161503062 158173283 155377151 152369440 149132314
4742 149132314 146258874 143576825 140748198 137584691 135219114 132914829 130495734 128225136
4734 128225136 126131733 124002966 122100376 119809427 117636384 116072483 114053104 112170868
4726 112170868 110304480 108656636 106787758 105283743 103775659 102263931 100760868 99085057
4718 99085057 97620227 96356683 95069207 93796596 92600587 91397104 90259240 89069265
4710 89069265 87460889 86676174 85819574 84805778 83803499 82933815 81819143 81047796 80303906
4701 80303906 79246589 78647921 77728540 76876676 76016205 75208313 74786800 74181323 73264214
4692 73264214 72633618 72135703 71510385 71221546 70555008 70079015 69316030 68652323 68510701
4683 68510701 67966526 67463074 67160901 66901952 66422687 65906403 65672805 65118715 64656568
4674 64656568 64506304 64278324 63570719 63522179 63374471 62936522 62678493 62338228 61945706 61873317
4664 61873317 61841841 61609881 61508670 61365255 61257732 61096542 61066580 60988647 60968886 61047160
4654 61047160 60859033 61251027 61058240 61063925 61418967 61716915 61866954 61764205 61724140 62104870
4644 62104870 62606380 62886304 63171015 63282577 63804941 64131275 64673994 65322646 65999247
4635 65999247 66764627 67488743 68565664 69645544 70436960 71434600 72927745 75029267 76382186
4626 76382186 77545764 79206054 80884164 82227913 83130715 83877667 84403746 84924048 85154572
4617 85154572 85365563 86026751 86699548 87538912 88176642 89469720 90658867 92352109 94015267
4608 94015267 95704598 97622526 99625921 102073600 104270794 106560203 108806838 111470305
4600 111470305 113966876 115976284 118975593 121953713 124530909 127036704 128932445 130954863
4592 130954863 132747968 134299232 136015439 137482132 138147188 138789999 138976438 138679162 137834944
4583 137834944 136704760 135359108 133688881 132090677 130108924 127981737 125465614 122583662
4575 122583662 119405208 116378987 113138808 109945537 106687051 103418785 99905768 96523699
4567 96523699 93159970 89908498 86223056 82781007 79692542 76845339 74099133 71444542
4559 71444542 68969313 66293974 63965332 62024571 60048686 58063206 56344098 54665055
4551 54665055 52765207 51153114 50046790 49179283 48190162 46649351 45167765 44251982 43294023
4542 43294023 42259718 41428098 40551705 39817544 39264562 38686047 38139655 37331734 36813389
4533 36813389 36069475 35277756 34754056 34250461 33849116 33492390 32909146 32641410 32340515
4524 32340515 31274744 30833046 30737240 30269409 30133464 29867532 29461397 29347653 28834797
4515 28834797 28410807 28292367 27962050 27688961 27380323 27062240 26919029 26672298 26350172
4506 26350172 25867489 25630546 25379602 25455885 25330537 25293304 24977365 25128791 24745837 24511867
4496 24511867 24267696 24135557 23831400 23733396 24095976 23779216 23463501 23299244 23206187 22560386
4486 22560386 22455830 22609784 22536035 22596165 22485225 22165150 21962338 22191175 22201919 21689320
4476 21689320 21355186 21177419 21114374 21259378 21075158 20835107 20560469 20421468 20093273 19834045
4466 19834045 20126620 20201850 20017493 19618658 19282116 19342485 19351341 19111660 18950723 18946542
4456 18946542 18959371 18920407 18663439 18473872 18153777 17942035 17715078 17713504 17567509 17206750
4446 17206750 17230647 17202158 17305193 17164371 16978662 16988383 16735112 16957740 16863808 16461020
4436 16461020 16658997 16600128 16235103 15948061 16179053 16238975 15937499 15682945 15422303 15321649
4426 15321649 15389989 15256059 15119055 15066391 14733127 14706408 14528469 14322169 14533055 14634970
4416 14634970 14367130 14303227 13947864 13931472 13998486 13623932 13726795 13527883 13312071 13626693
4406 13626693 13672703 13330591 13153014 13136349 13252093 13061035 13180879 13222006 13031305 12734830
4396 12734830 12485069 12166653 12364959 12548560 12631440 12517023 12618984 12408341 12083293 11959011
4386 11959011 11870109 11725746 11837421 12025880 11759542 11395883 11557264 11567711 11281520 11304225
4376 11304225 11019323 11130629 11089615 10838816 10728106 11034985 11227681 10685184 10466122 10705643
4366 10705643 10708081 10707985 10566889 10348579 10247933 10615685 10409129 10392250 10294545 10494797 10459479
4355 10459479 10156877 9816628 9878099 10268527 9936418 9464807 9284435 9338972 9429122 9805200
4345 9805200 9935784 9748726 9494883 9407920 9343479 9372773 9129095 8979089 8961196 9194234
4335 9194234 9290426 9647307 9362530 9225269 9097697 8903058 8843658 8975807 8877812 8661810
4325 8661810 8784837 9040467 9101701 8690112 8568504 8880474 8695669 8748255 8795650 8742164
4315 8742164 8852937 8713868 8577501 8565675 8705440 8544440 8519194 8399339 8622882 8629632
4305 8629632 8418870 8329114 8153099 8274284 8451524 8426536 8287435 8146191 8139209 8255668
4295 8255668 8077194 8034148 8075274 7939363 7984778 8157709 8020197 8036113 7869279 7753715
4285 7753715 7692190 7694525 7970423 8267818 8014797 8013442 7862550 7694410 7836982 7788316 7925096
4274 7925096 7941365 7986203 7700498 7806240 7656570 7745046 7523956 7456297 7428472 7395366 7538952
4263 7538952 7399494 7451176 7404773 7152943 7294867 7273072 7312122 7178116 7087496 7100624 7111451
4252 7111451 7061641 6940728 7087501 7054056 7286858 7100457 6766566 6595462 6502678 6703238
4242 6703238 6675132 6646796 6807221 7132763 7199395 7200677 7092174 7123155 6449716 6677595 6808539
4231 6808539 6648595 6710166 6803305 6935742 6728095 6493384 6592347 6665097 6572660 6589562 6738812
4220 6738812 7090389 6795680 6756986 6931506 6829703 7142230 7042241 6979825 7001100 6905851
4210 6905851 6967758 6909081 6859815 7045780 7320818 7673048 8053067 7896436 7940514 8229277
4200 8229277 8321562 8490427 8872814 8846974 9200770 9477593 9252357 9275445 9261002 8974883
4190 8974883 8947688 9037043 8824831 8445091 7953094 8026359 8213380 7768068 7518226 7401572
4180 7401572 7744549 7626574 7572982 7216080 7172149 7356847 7249646 6945446 7003364 6828043
4170 6828043 6623631 6392287 6083566 6028594 6243543 6489389 6490404 6037737 5986419 5972190
4160 5972190 5952860 6105220 5930261 6026387 5827971 5898572 6037219 5993003 6094529 5714200
4150 5714200 5880270 5706131 5547574 5592226 5444535 5426573 5227651 5521293 5366204 5491187
4140 5491187 5516036 5173566 5416393 5370210 5166865 5227317 5327161 5144640 4995869 5352619
4130 5352619 5311900 5282782 5269949 5119005 5246117 5550599 5376319 5388593 5426901 5570496
4120 5570496 5523625 5291264 5303538 5247885 5457277 5484950 5520132 5299872 5139782 5429262
4110 5429262 5408537 5505282 5203470 5134801 5361228 5589716 5527327 5601088 5548882 5619658 5661009
4099 5661009 5557078 5694099 5573703 5749235 5442711 5425608 5418565 5408846 5166867 5458146
4089 5458146 5617477 5735035 5717748 5651031 5710715 5737548 5959799 5815889 5853853 5829771 5884069
4078 5884069 5739505 5902583 5936563 6385795 6758972 6679208 6632888 6931332 6863170 6855826 6726021
4067 6726021 6715134 6740344 7298652 7634561 7610468 7873753 7953802 8072277 8196459 8374034
4057 8374034 8842860 9340719 9525514 9999465 10296934 10487529 10785465 10866018 11332071 11804384
4047 11804384 12018371 12457845 12765828 13310544 14067287 14424999 14580972 14987762 15125476
4038 15125476 15320066 15572075 15360059 15094803 15079713 14896580 14857126 14600623 14484458 14357988
4028 14357988 13870468 13363647 13368312 12954229 12787116 12370659 12448705 12130420 11262869 11249710
4018 11249710 10887175 10588559 10260086 10119551 10009742 9850747 9591681 9330549 9178888
4009 9178888 8811675 8389766 8134905 7806283 7893011 7523325 7295941 7700040 7396872 6899649
3999 6899649 6979207 6783830 6618697 6270505 6319417 6269626 6408897 6204049 5861063 5951739
3989 5951739 5926414 5707412 5873583 5667542 5404972 5347370 5149475 5173538 5172257 5050124
3979 5050124 5021156 5016553 4913527 5033905 4739890 4819437 4764783 5011997 4822006 4871485 4724741
3968 4724741 4885934 4999722 4858479 4810294 4583320 4533335 4461215 4531623 4619666 4168266
3958 4168266 4018716 4119692 4252431 4186043 4211758 4279808 4285044 4133402 4175567 4235496 4119688
3947 4119688 3925477 3848054 4176456 3991415 3882609 3725761 3629414 3570124 3715987 3914930
3937 3914930 3995077 3780685 3799454 4032391 4135210 4118471 4285538 3979441 3664383 3438368
3927 3438368 3509379 3915891 4003284 3772789 3829298 3878242 3895621 4317801 4089020 4047925 4026953
3916 4026953 3936442 3953792 3834908 3525007 3546071 3906405 3868199 4132449 4332913 3863434
3906 3863434 3592227 3448888 3402119 3392921 3538848 3580736 3750513 3683820 3369756 3485868
3896 3485868 3878408 4054486 3773238 3818549 3612462 3580938 3285045 3285751 3519535 3638663
3886 3638663 3605516 3277499 3324752 3322723 3646188 3414595 3231228 3158819 2951281 3093914
3876 3093914 2985455 3114411 3375766 3129418 2801881 2955765 3085451 3399057 3215608 3146072
3866 3146072 2899348 2944103 2764413 2611263 2925623 3119901 2973819 3091267 3196915 3158936
3856 3158936 2690115 2684615 2704219 2573090 2541068 2507109 3071385 2897463 2625556 2959243
3846 2959243 3166000 2884900 2669120 2554968 2894477 2801989 2925269 2972158 2822249 2935690
3836 2935690 3111830 2993956 2819037 2577164 2786874 2831231 2835422 2879879 2990781 2648232
3826 2648232 2734070 2937222 2735361 2402375 2486259 2795560 2875895 2752870 2652171 2984873
3816 2984873 2865438 3003312 3076685 3042688 3015540 3128808 2728607 2679750 3056431 3112668
3806 3112668 3115555 2961681 2810608 2874390 2907051 2638192 2391865 2230927 2469913 2818080
3796 2818080 3037402 2691609 2775346 2889492 2725690 2555742 2281473 2731466 2791852 2300710
3786 2300710 2329901 2598523 2591709 2573092 2561453 2725373 2882300 2809416 2825970 3053617 3001579
3775 3001579 2816300 2725275 2512776 2221144 2254396 2159948 2253423 2382765 2222376 2336099
3765 2336099 2652487 2461989 2499285 2583797 2232774 2290539 2314796 2574901 2502336 2173525
3755 2173525 2124579 2118679 2094368 2426195 2286456 2109203 2323666 2131107 2376146 2490684
3745 2490684 2562044 2431594 2556432 2613160 2567131 2692277 2565075 2298488 2431085 2364726
3735 2364726 2342484 2270173 2066727 2296879 2213375 2405501 2038943 1926742 2163206 1964123
3725 1964123 2114860 2145910 2253902 1955923 1934466 2354625 2375142 2366307 2114506 2063379 1961736
3714 1961736 1861593 1678793 1989421 2056216 2023096 2308372 2312137 2394270 2066983 1982996 2256178
3703 2256178 2527375 2419604 2525675 2612668 2483513 2138575 2059857 2361546 2227926 2115585
3693 2115585 2108432 2108953 2211972 2473492 2436604 2431714 1667891 1578684 1829112 1727171 1886926
3682 1886926 1782056 1670903 1923713 1885901 1967376 1669041 1641834 1946160 2010210 2192463
3672 2192463 2107645 1944618 1814389 1778493 2158001 2279665 2191070 1947059 1927696 2025360
3662 2025360 2124010 2323175 1941567 1602409 1693981 2171859 2159909 1964393 2006778 1863091
3652 1863091 1766338 1733821 1822952 1822441 1874697 2086926 1779753 1766724 1787861 2160963 2282008
3641 2282008 2354974 2034560 1871490 2028330 1997066 1778401 1733944 1638866 1742752 1903487
3631 1903487 2098254 1974610 1894573 1589537 1522915 1420787 1714531 1926688 1773817 1689889
3621 1689889 1800569 1767520 1933655 1914789 1952547 1882474 1761623 1856108 1922960 2005712 1751453
3610 1751453 2026281 1879035 1903178 1611733 1699043 1966815 1857026 1986074 1898887 1687246
3600 1687246 1739874 1675177 1743485 1775741 1991909 1825257 1328258 1358267 1481308 1858654
3590 1858654 2242753 1951842 1736914 1529941 1802818 1931811 1928803 2009007 2129182 2016892
3580 2016892 2196002 2016378 2239151 1850736 1352395 1717255 1704834 1653617 1506547 1435487
3570 1435487 1562093 1666425 1595968 1776566 1633958 1708595 1978963 1946844 1880137 1725264
3560 1725264 1879101 2234237 1898228 1626576 1682525 1590637 1712918 1651488 1394103 1445826
3550 1445826 1667373 1766865 1836906 1516511 1706340 1719826 1857949 2159113 2305177 1904228
3540 1904228 1575825 1815604 2014199 1996610 1682967 1649069 1882543 1955080 1690345 1967834
3530 1967834 2108501 2311600 2495447 1996617 1547063 1786821 2073222 2018346 2058141 2225943
3520 2225943 2094532 1879502 1804848 1724950 1513784 1757972 1635342 1655009 1853354 1914204
3510 1914204 2078311 1921349 1785923 1995866 1903246 1744889 1743257 1955239 2306046 2159726
3500 2159726 1831762 1797028 1807542 2219684 2203497 1973281 1924504 2077768 2017261 1699198
3490 1699198 1644710 2114171 2235017 1656979 1815140 1742792 1840060 1988560 1964989 1861941
3480 1861941 1933777 1956306 2193865 2207829 2292618 2358823 2268781 2445350 2414819 2342062 2290379
3469 2290379 2402712 2373032 1825663 2271564 2647532 2352240 2123802 2364979 2285244 1993242
3459 1993242 2289592 2305185 2171915 2131836 2363958 2007190 2338395 2374952 2295500 2171491
3449 2171491 2163923 2328948 2305073 2455572 2447938 2560736 2501267 2730936 2828960 2741583 2929403
3438 2929403 3043956 3089501 2790496 3026953 2988792 2997354 3282864 3242957 3346840 3172412
3428 3172412 3586583 3820161 3445657 3488097 3397299 3697432 3774103 3812653 3745227 3673495 3710990
3417 3710990 3903627 3902870 3915598 3855883 3554094 3399090 3653380 3722318 3949810 3821694 3644970
3406 3644970 3431256 3271527 3394376 2988949 3039753 3143918 3016861 2702919 3138773 3463045
3396 3463045 3206445 2671267 2687444 3081225 3063179 2918903 2710092 2756798 2470727 2211678
3386 2211678 2131222 2091861 2331638 2342684 2389865 2485341 2546093 2514108 2718573 2815414 2409582
3375 2409582 2414320 2418857 2527572 2269614 2348388 2381477 2154678 2455567 2446506 2551139 2105632
3364 2105632 2147823 2134931 2032446 2289207 2228568 2205069 2281365 2055790 2309196 2317702 2347127
3353 2347127 2153119 2437046 2307383 2346381 2366068 2406452 2267158 2266219 2363183 2568723 2768084
3342 2768084 2496569 2023608 1782287 1861035 2067681 2307948 2053972 1757859 1735628 1687745
3332 1687745 1839057 1952286 2093945 1906381 2021427 2055049 1898524 1800102 1802321 2088236
3322 2088236 1885074 1807352 1600616 1731676 1715191 1605351 1721043 1722372 1555977 1698118
3312 1698118 1893874 1953396 1969484 1891894 1945653 1953345 1860681 1842564 1822337 1869032 1666747
3301 1666747 1481959 1419269 1493674 1509134 1653828 1635668 1518376 1604734 1533429 1216317 1278376
3290 1278376 1364672 1402720 1395200 1535510 1612458 1859581 1872519 1445684 1301354 1588769 1599449
3279 1599449 1550300 1387755 1168207 1494578 1936812 1802732 1687670 1301065 1160485 1552893
3269 1552893 1898497 1660690 1702387 1706591 1647338 1552077 1465356 1444904 1534343 1211830 1404329
3258 1404329 1358429 1252061 1271661 1391484 1424247 1388722 1330683 1182502 1396551 1519830
3248 1519830 1603773 1354706 1318020 1226744 1149531 984426 1051900 1285522 1327664 1289903 1354364
3237 1354364 1140400 952270 1119686 1001238 1098857 1420426 1324924 1216574 1314347 1561080
3227 1561080 1255543 1000445 1282468 1513587 1443994 1447107 1502998 1355406 1081209 891808
3217 891808 1209460 1143709 1091568 1351481 1172480 981273 820627 1165485 1418055 1134405
3207 1134405 1133624 914860 933887 1135701 1078381 1067218 800520 1184677 1091933 816341 878471
3196 878471 957066 1100295 1040693 769883 747301 728854 823135 941693 1099645 1191437 983753
3185 983753 723113 1159913 1497524 1330790 1280178 1417532 1259047 1216629 1245076 1118725
3175 1118725 1149501 1114475 976176 1063268 751073 760599 1041896 1177600 1110471 1159754 1194952
3164 1194952 1234686 1132344 713043 817135 1072365 1149889 1276715 1473259 929633 835788
3154 835788 1089516 828552 967930 916604 815947 1032766 1184845 997470 978207 1289266
3144 1289266 1121501 1049485 1338784 1348813 1231273 1224933 1202712 1326848 1450576 1498063 1450955
3133 1450955 1418510 1294844 1559553 1781417 1579989 1450850 1259316 1262135 1046590 1326277
3123 1326277 1247598 1085272 1378627 1379837 1486954 1351796 1233373 1196332 1040566 1029513
3113 1029513 1480236 1637289 1524022 1408571 1455025 1317010 1384252 1151601 1198730 1185484
3103 1185484 1488726 1928623 1705148 1438820 1414896 1427675 1317288 1363512 1347353 1586557
3093 1586557 1504066 1532413 1591199 1539735 1513127 1822417 2021051 1851572 1541347 1708506
3083 1708506 1868123 1664669 2064585 1944891 2203140 2440725 2136273 1919654 2030355 2155249
3073 2155249 1834819 1465755 1547744 1806883 1884854 2041511 1924930 1665621 1966345 2107799
3063 2107799 1937573 1799558 2013535 2038173 1952427 2124398 2389541 2164162 2025769 1882278
3053 1882278 1770893 1976026 1948377 2064899 1673676 1650518 2020955 2092426 1812298 1479928
3043 1479928 1750810 1986161 1730572 1770414 1918093 1736052 1556189 1471682 1498781 1736946
3033 1736946 1720229 1841746 1906014 1683820 1241438 1123253 1238586 1535734 1638288 1706593
3023 1706593 1728999 1764183 1412674 1344391 1542862 1580325 1538000 1102733 1268179 1237955 1209081
3012 1209081 990101 1111085 1094884 1148041 1118690 1011960 1009751 1163648 1287787 1381535 1329927
3001 1329927 1160709 1124411 1072282 1053719 967125 1020323 981355 1095070 1054665 779091 973543
2990 973543 808966 875346 1005314 781314 443432 591886 911938 876528 842963 534007
2980 534007 778127 717459 649939 448412 556091 546242 574571 606442 467038 657270 559333
2969 559333 645348 506605 605315 517739 629593 973837 771776 1011574 756145 507142
2959 507142 546910 584269 499266 682780 648619 579023 1050829 791286 873686 944987 592994
2948 592994 391524 752146 707049 609105 563202 574580 509117 301140 133642 93699 515368
2937 515368 593872 667109 543850 551529 187048 141466 240256 220551 395831 929938 810015
2926 810015 496289 355220 536745 397606 169681 321094 316575 136894 554320 704917
2916 704917 392785 499660 858033 721501 359664 257861 37519 -11996 213770 332627
2906 332627 423779 562945 358817 421331 523791 485590 248709 591156 372515 172412
2896 172412 326695 569503 634719 719885 707922 301425 430020 392950 446122 150581 285399
2885 285399 568534 421470 347663 198579 460735 503126 606870 476004 244170 508526
2875 508526 511292 378755 674236 1004364 578503 107784 288353 239548 342617 452835
2865 452835 509202 555508 475104 271439 142578 415233 469199 525567 349055 41518 193453
2854 193453 256641 49233 401575 649172 307984 351892 219193 99286 -107029 283165
2844 283165 550032 373933 253750 -68515 -167762 93293 508960 637389 568662 225267
2834 225267 136640 300910 556819 347902 101196 264016 549704 281320 -30422 434547
2824 434547 636052 328578 103179 91700 357495 222008 -25915 -46372 14838 -120454
2814 -120454 149508 504563 496468 314383 159092 22815 78956 309137 230021 -42202
2804 -42202 -193734 -10632 -147642 -142668 -70196 167062 386517 493941 190728 281036 202510
2793 202510 -105667 -85373 164792 249732 134334 -163854 -131981 153616 204512 -102932
2783 -102932 113685 167287 -28007 46323 -19264 150842 115237 207107 -161666 -319933 77146
2772 77146 70374 124751 73853 -11602 -287267 -117988 188074 151634 200098 45120 32054
2761 32054 257961 180605 359061 660679 653272 221272 296651 204128 18476 -207456 29168
2750 29168 21238 -217792 60953 -73634 111518 68874 339568 211504 -107899 -380951
2740 -380951 -476571 -237062 175567 341302 160376 -61473 210119 332926 55108 -6580
2730 -6580 26964 -2132 169229 673066 649997 104221 83169 189824 297596 192287 164776
2719 164776 156641 279928 356560 540355 301737 -89957 53767 -62825 42950 166082
2709 166082 -192230 -422294 -257369 -2569 -138902 296389 123535 65686 154319 166394
2699 166394 275882 249859 -70576 -163666 41531 -85046 -413949 -290832 -234071 -97985
2689 -97985 -143619 12975 350737 327046 358028 176465 220636 349312 235187 -51940 -21877
2678 -21877 51643 221549 292618 355244 41786 -149603 116270 -61696 -155893 -76627 -135000
2667 -135000 13654 -105384 -25829 185910 314013 300303 340167 392156 101556 36361 -160791
2656 -160791 -311720 -166675 58022 364970 -65673 -509412 -368805 96896 -98783 -414521
2646 -414521 -206092 -118591 -201191 100300 234130 278704 -111109 -207136 -35717 -347899
2636 -347899 -316990 -284200 -438327 -9677 -247085 -294182 -32560 -260358 -190222 -69934
2626 -69934 -56444 -36832 6787 -73203 -67219 102023 140417 42494 79304 36261 55141 36085
2614 36085 181350 181543 -186496 -23591 402373 497989 38828 -49976 -55390 -70174 115529
2603 115529 246054 378908 247621 -55028 -94404 12070 223595 -150320 -104531 -346972
2593 -346972 -110228 413016 207777 253631 146371 121753 290293 176306 14026 56079
2583 56079 29299 48498 -128534 -21941 64440 101885 -87231 51334 156737 -90438 -358354
2572 -358354 -334559 303600 246277 55221 139962 52389 42341 97592 202692 -220002 42547
2561 42547 233077 -8345 -8908 19297 157053 213952 -63498 98511 194215 168058 135107
2550 135107 359216 660725 365721 -98925 127363 179220 24437 -88951 118682 163651
2540 163651 69309 276153 207368 328559 209015 395365 513228 494734 217459 -16456
2530 -16456 109539 181399 -61243 291216 325532 337350 219332 133382 75001 -101871 -310236
2519 -310236 -341723 -319071 -228514 -197062 -263617 -159314 -53226 -175787 -8245 186381 -10359
2508 -10359 163360 10605 429565 430233 401644 155617 367222 290869 172956 130778 141222
2497 141222 90887 -70881 286592 426728 449083 337496 463893 424031 193377 99751
2487 99751 371248 122381 66549 192410 168274 168384 91677 258461 246498 306127 492200
2476 492200 678161 573553 438379 219419 222300 294533 434427 200522 -135046 -20850
2466 -20850 65972 -52283 297709 588751 607181 386566 79744 -41067 213995 400161
2456 400161 476134 408105 89154 -289369 52812 163339 -113132 -124069 62060 359358
2446 359358 254882 185284 48960 270539 352454 363768 490561 573759 666801 360478 297258
2435 297258 194246 16948 158010 92951 634326 547283 580469 531686 377945 548027
2425 548027 724093 331979 402202 230804 -161273 131314 267601 -70177 66041 345031
2415 345031 508663 393553 141240 269219 309412 175803 -78465 6102 250031 164440
2405 164440 280825 474490 583376 847244 628166 588507 420515 815733 770266 719139
2395 719139 605357 695911 601258 511704 571332 478555 291036 319604 371232 300258 377751
2384 377751 391083 868042 761463 562025 611082 665294 718411 1204495 960875 934586 929410
2373 929410 1009156 1089285 825475 899812 739527 911568 1066947 791795 984089 1081379
2363 1081379 1410427 1572005 1424470 1227511 1609664 1620637 1961087 1786851 1557663 1442905
2353 1442905 1602034 1820871 1600363 1925239 2001150 2379001 2112704 2306036 2364306 2309192
2343 2309192 2180022 2062576 2143746 2290505 2487845 2514108 2348128 2650012 3119053 3272159
2333 3272159 3321584 3586072 3277859 3537515 3769615 3873625 4272705 4427857 4703953 5374177
2323 5374177 6005076 6083554 6457029 6821123 7100172 8069029 8927111 9232368 10005932 10860957
2313 10860957 11587316 12347062 13198249 13995520 15267346 16380071 17693720 18671776 19473719
2304 19473719 20289455 20713659 20586078 20098159 19364695 18706800 18040222 17124899 16302129
2295 16302129 15573755 14971753 14401173 13730456 12965920 12308286 11677749 11090861 10235301
2286 10235301 9787466 9289223 8406434 7998612 7815926 7197751 6647342 6253792 5848808
2277 5848808 5642580 5045506 4548558 4559682 4359270 4292070 4101840 3932494 3786855 3411227
2267 3411227 3092971 3142562 3258117 2877954 2808831 2850253 2650166 2954398 2547499 2354471
2257 2354471 2268158 2351198 2161177 1982535 2098650 1922488 2081990 2233902 2174243 2331339
2247 2331339 2274642 1988840 1630395 1650957 1694569 1612052 1534196 1270457 1531781 1569090 1435370
2236 1435370 1323271 1359701 1304079 1427990 1530025 1201665 1193319 1524747 1542183 1085311
2226 1085311 705204 883834 738791 665223 790825 695316 569346 728533 547176 481437
2216 481437 665691 651710 654087 760124 1052177 734778 538317 828244 821736 684795 402139
2205 402139 15505 679881 1000932 871619 553827 286271 287302 601153 699707 461953
2195 461953 490633 750367 748141 712545 842225 745790 843559 879112 428149 394749 675678
2184 675678 658057 599817 363937 343617 342322 328183 378459 478778 356334 333123 130994
2173 130994 292192 449495 419858 393535 455146 606382 198391 388804 379717 -158 249827
2162 249827 407263 481888 286989 462266 450140 133541 58289 114739 123113 204664 247052
2151 247052 369267 420762 170536 286780 195828 225421 60800 -198271 -15780 114891
2141 114891 211627 184564 68035 -109183 296031 352131 272849 165785 370373 312673 37880
2130 37880 -10982 70415 121504 243596 135461 10931 -260298 -392764 -555796 -179943
2120 -179943 -85258 -124381 -18022 10848 -304885 286630 511920 417117 444567 69291 238491
2109 238491 354769 240200 76396 102066 -27132 124888 -108971 -48586 42873 370271
2099 370271 337794 348628 164831 -368184 -112846 136777 115493 239380 276822 379404
2089 379404 91035 -22948 -56619 95646 12782 137970 217234 134824 135076 -8128 -101186
2078 -101186 -49077 138756 60715 -111033 45693 -396674 -393731 -159638 -171850 78850 545416
2067 545416 735222 313056 231599 -99177 -202933 212007 7448 -50054 28879 115327
2057 115327 137071 299178 103748 -34645 -222767 -60074 244049 65051 -157797 -281923
2047 -281923 -164132 -248746 -193832 -17226 -208324 -20010 -176684 -430445 -438692 -379488 -270563
2036 -270563 -360839 -209013 -17873 -44045 378228 294044 150982 176047 289083 -25469
2026 -25469 -39439 11233 -151938 -187239 9131 328426 207666 6772 3735 -10537 -4215
2015 -4215 -323246 -322461 207427 -123563 -349538 -168547 141847 73700 4823 -99799 23785
2004 23785 -83917 -275795 -410893 -475337 -599655 -184914 -121342 -333210 -230313 -276155
1994 -276155 -520664 -415710 -393779 -364512 -350596 -328088 -557758 -513054 -166964 95053 -227046
1983 -227046 -674997 -535666 -33086 12316 -139718 -247027 162909 158364 225973 -75625
1973 -75625 -445816 -313526 -40265 -179457 -86388 -122279 -114829 -20830 -166367 -333925 -681606
1962 -681606 -571176 -160793 -139467 -3874 -99456 -92054 -201226 -787399 -214889 -39670
1952 -39670 -160793 -105225 -288341 -314155 -270955 -530340 -577228 -317059 -69598 153458 449333
1941 449333 276574 149321 -95201 -291987 -277655 -388174 -111873 -140044 41037 209585
1931 209585 94078 185101 -125396 -31728 -177983 -570361 -486071 -250959 -337295 -302397 -417904
1920 -417904 -63510 -143501 -164473 -193698 -425347 -328466 -20345 -123169 -292969 -269999 43391
1909 43391 62690 12138 -222796 -295884 -219466 -41425 140811 -231937 -533364 -345252 -41910
1898 -41910 -35002 -278665 -483199 -414864 -173315 -15373 -221450 -255975 -39324 24112 -26254
1887 -26254 207018 108851 205579 -169377 -122231 -516551 -613173 -287527 -156119 -231177 -312005
1876 -312005 -112370 -29674 67979 -98829 -24480 10367 12968 -52240 -86709 -279874 33997
1865 33997 -143131 -387232 -494909 -534018 56186 104865 19846 -181053 -62792 87580
1855 87580 304367 -43389 -157113 -7984 -299654 -581593 -366524 -271274 -349238 -177385
1845 -177385 -163852 -203778 -77036 -253286 -599937 -159863 -155942 -322449 -370908 -293861 -489912
1834 -489912 -375346 -329225 -166283 215587 66294 -332255 -422529 -322389 2854 -213073
1824 -213073 -249880 9893 -14309 -219699 -239476 188450 -13985 43497 113081 -117339 73054
1813 73054 35854 -190094 98812 -13805 -244689 -109378 -154707 -299545 -264766 -236232 -312057
1802 -312057 -299454 -159779 111919 183931 14066 -130742 -123042 -227860 211990 232662 133646
1791 133646 115856 46663 -62717 -565783 -558382 -525080 -616526 -714576 -639628 -478380 -327797
1780 -327797 -112015 -148539 -324838 -272170 -402975 66412 55786 -318006 -282348 -67311
1770 -67311 -98875 -28827 76111 -128126 32886 323933 264749 -65693 -293125 -146734
1760 -146734 -182057 42189 11900 -320288 -482972 -441894 -545072 -662186 -445458 -463029
1750 -463029 -703754 -329905 -229250 -324188 -187972 -238400 -153273 -336282 -222519 -268907
1740 -268907 -173853 -175522 -337584 -604396 -347761 -249093 -106652 -1533 -86359 -284608 -161148
1729 -161148 -185670 -228309 -18060 -228107 -288643 -365599 -354909 -517389 -265468 -363078 -380918
1718 -380918 -218465 -367816 -222641 -101644 -351781 -224926 -416618 -365140 -248104 -408571
1708 -408571 -362592 -361985 42622 -104643 -176583 64136 -158880 -266520 -324690 -370735 -390103
1697 -390103 -301771 -291896 -397301 -205227 10851 164098 -428346 -429471 -392919 -433061 -317851
1686 -317851 -354730 -546943 -584960 -431115 -356587 -102525 -376435 -358085 -287815 -172825 -120335
1675 -120335 -359619 -203020 -12536 126764 106297 -87980 -269206 -367041 -102692 -26314
1665 -26314 -99287 118945 -87420 -185474 -215055 -263219 -213232 -433421 -449137 -405352 -360619
1654 -360619 -602764 -613980 -343445 -405470 -222837 -117639 -129475 -365650 -609781 -456088
1644 -456088 -393208 -304022 -129571 -21457 -411982 -431775 -388871 -178706 -134061 -192921 320929
1633 320929 151084 -105069 -2193 -216091 37479 -169590 -209185 -436950 -573462 -179854
1623 -179854 -332521 -447822 -187142 -50474 -81118 -420837 -479349 -496548 -767340 -653406
1613 -653406 -482212 -424989 -390512 -271201 -347741 -373059 -341726 -232443 -66802 -286099 -609509
1602 -609509 -128572 -65797 -408898 -179240 -87456 -443948 -338243 -138023 -114964 -403690
1592 -403690 -317829 48936 -20743 -111260 -198771 -401580 -262431 -244610 -377500 -421428 -699219
1581 -699219 -645683 -515812 -491729 -528874 -521260 -251789 -210330 -515 -30723 -266589 -167234
1570 -167234 57614 -86351 -451855 -463104 -209105 -204465 -357932 61143 -78918 -636644
1560 -636644 -423828 -350728 -269659 -413213 -582601 -108152 58795 -311577 -401034 -441330
1550 -441330 -177798 -98766 -89119 -340850 -498234 -313630 -263259 -101184 -67447 -286175 -179900
1539 -179900 -127655 -197814 -231355 -136028 35676 -30540 125570 333111 68603 -205873 -117467
1528 -117467 -52442 -85172 -43401 -250934 -293732 -364649 -697939 -524120 -393349 -199869 -73478
1517 -73478 -412084 -619023 -165253 89000 40595 -10200 -289305 -264263 -315663 -311155 -179401
1506 -179401 -109787 30231 116045 106334 102610 -42146 -263304 -198021 228020 351438 143228
1495 143228 114602 88489 234438 -17773 -217299 -179586 -91810 -129283 -46750 -421557 -147954
1484 -147954 -59874 -144501 -431659 -90425 28004 -27549 -178312 -165354 -303877 -181544
1474 -181544 -377707 -482233 -54166 -19982 -100696 -98782 166016 -28606 -239148 -92277
1464 -92277 228029 119901 -382763 -597824 -426810 -373157 -21762 -88358 -148780 -121977 -204896
1453 -204896 -258611 -560055 -659261 -662526 -739156 -326200 -247130 -106220 -191172 -74905 -397848
1442 -397848 -572490 -391632 -398518 -221184 -31082 -420582 -632698 -302776 -590960 -462988
1432 -462988 87398 -237733 -227645 -103896 35481 205780 268892 33443 182787 45788
1422 45788 -104682 -166992 -435936 -67468 -224665 -290190 -448971 -159779 99339 79383
1412 79383 -230400 -140987 -168141 -264119 -150096 53757 -164020 -344077 -27183 46717 -278391
1401 -278391 -204577 -261889 -520181 -247205 43103 -45264 -452758 -644722 -438592 -427543
1391 -427543 -519102 -127519 -404688 -538287 -355675 -377367 -234290 46538 180808 6566
1381 6566 -300940 -212142 -46156 -498173 -575130 -299143 -326896 -146138 -210352 -132704 -156749
1370 -156749 208372 -7840 53489 270040 -20767 -92881 -197591 -220120 -83155 129438
1360 129438 179820 31640 -134155 -186279 -5596 70801 -114986 -182684 -27044 -381076
1350 -381076 -665346 -361987 38123 15860 -132462 -400932 -292543 24633 -60690 -437140
1340 -437140 -554240 -625004 -705182 -480771 -270692 -171781 -271040 -408165 -181428 -161026 -185840
1329 -185840 154638 110081 -410602 -224393 -43072 -408039 -282113 -10260 112154 36914
1319 36914 -19283 -56536 -52310 -30320 -161928 -507071 -399935 -203851 -121546 -156213 -300991
1308 -300991 -387916 -351761 -473106 -354104 -162367 11383 -191468 -299314 -204462 -163669
1298 -163669 -318904 -420006 82883 -191543 -346461 -313745 -373220 -460613 -402993 135971
1288 135971 -293912 -128030 50301 55367 373444 86073 -182299 -8552 -192346 -212851
1278 -212851 -283208 -25431 -294616 -254785 -473735 -212946 22433 -38251 146276 120459
1268 120459 126113 -89302 140884 -156079 -355446 -17511 116327 -292799 -625350 -456325
1258 -456325 39192 47799 -266253 -535228 -609571 -646435 -290222 -224902 16979 131786 35507
1247 35507 -108745 -209392 -139860 -339209 -235700 -466425 -614880 -550227 -469630 -320861
1237 -320861 -404879 -730064 -6184 97700 -421809 -413261 -359750 -358806 -252336 -209875 -15360
1226 -15360 -126029 -279943 86032 -155430 -362571 -148028 -312861 -65078 -346020 -398377
1216 -398377 14025 -274399 -261911 -196196 -75194 134848 -106726 146755 488544 308994
1206 308994 243548 -34167 1664 -219895 -185892 241360 -106314 -318072 41448 244399
1196 244399 205057 -237330 -60326 -306886 -253047 -120087 -136108 -360255 -154341 -232950
1186 -232950 -263161 -218967 -241456 -176208 -118647 -361092 -501199 -400393 -200446 -270810 -553751
1175 -553751 -541503 -510554 -438874 -320654 -155378 -425818 -630301 -325906 98050 -34989
1165 -34989 -350750 -346439 -170892 -422974 -468181 -98003 -26489 224421 -132167 -189494 -137319
1154 -137319 -362334 -441444 -503853 -363054 -271488 -310168 -482107 -581998 -367631 -214513 -28686
1143 -28686 -166039 -389057 -200175 -289807 -98706 122560 85994 -5505 -61225 -57555 -45576
1132 -45576 -184362 -49779 -119260 -133476 115378 -24493 -275846 -153802 -82693 -425772
1122 -425772 -455776 -309436 -411270 -331614 -185488 -105414 7250 55186 -9854 241940 193947
1111 193947 64949 -142705 -276811 -133979 -265553 16321 -40606 -89189 134092 -92596
1101 -92596 -99263 -112195 -53302 153040 -10329 136790 12272 -193122 -207995 -159627 24733
1090 24733 -323 8095 -203774 -97134 -12905 -32628 -142046 -83416 -283661 -400926 -216798
1079 -216798 52587 -12358 -13315 22941 17922 -139960 -81292 -331441 -458080 -482979 -318027
1068 -318027 -163287 17936 -363870 -510804 -263159 57755 148840 -103581 -346821 -302380
1058 -302380 -250585 -553195 -360175 -139580 -280627 -237789 -128182 21745 -38306 -278585
1048 -278585 -146634 -281631 -247472 -207911 -456301 -355480 -242849 -132034 -448078 -557724
1038 -557724 -197095 26890 364916 322268 -11166 -200209 -153039 -267943 102417 143388
1028 143388 105452 101916 -211786 -90271 -112689 -88234 -93781 -230151 96323 40093 206490
1017 206490 110254 -56468 -68906 -39512 -43457 -214115 -39512 -39997 24259 -445191 -285705
1006 -285705 -163865 -219792 82715 17826 -262038 -264121 124887 107523 162439 84320 245122
995 245122 289943 140141 -47080 70580 -20248 -155887 -66206 -195260 -114469 -35891 -436050
984 -436050 -211016 -407398 -38893 -75620 -108584 -91940 -68839 -210583 -207695 -131058 -387165
973 -387165 -231486 -135901 -84450 131315 240217 323754 246355 -306216 -254714 -41506 183567
962 183567 104695 -152885 106007 56620 -83355 -439425 -441766 140851 328201 -132783 2636
951 2636 -55724 -113241 -111641 78672 235825 -38915 64889 132838 -168918 -163179 -265430
940 -265430 -557180 -421631 -223334 -274704 -180510 -133149 -508242 -313899 -385305 -371642 -445698
929 -445698 -841 14624 -211858 -445002 -204446 -300013 -225387 -44924 23661 19729 187159
918 187159 240624 -85910 -77601 -238839 81449 -167780 -195868 -341596 -554778 -162410 -562860
907 -562860 -276806 -288753 -232298 -292690 -274420 133530 52573 138435 387112 123896 222118
896 222118 39000 138694 445458 267004 130922 229642 176662 -69845 -206926 -15099
886 -15099 166022 -27901 -243436 -242150 1272 -121628 -137185 -144163 55220 195457 -93868
875 -93868 -220156 -230340 -184282 -127565 -36551 -306540 -356843 -63158 -105158 -425958 -468346
864 -468346 -342296 6863 -34052 -301224 -410946 -144218 -18063 -221238 -175839 -44454
854 -44454 61394 -257852 -251589 21138 -79224 47211 98226 -153374 -459337 -320679 -67354
843 -67354 -286335 -176812 220408 142884 -183248 -65210 -45528 -174440 -177640 174831 120167
832 120167 -184157 -183923 -143543 -216042 -210277 -257790 -21520 159189 319480 265260 -70878
821 -70878 -34234 140241 -66464 -74998 -52012 -69173 -105061 222170 37133 -64596 20871
810 20871 130512 116792 106783 -76093 -64183 -169174 -21082 33923 -19784 -70633 -42888
799 -42888 123467 153551 133717 32691 -276198 -223384 -44581 -60448 123785 96062 33249
788 33249 187444 9773 -64604 -181334 -12856 -25813 -112280 27892 186419 17662 -12633
777 -12633 166506 83216 -84159 157989 244766 247977 332736 -51100 -97625 -286597 -46933
766 -46933 92498 323137 236183 -75571 -47038 197100 181550 132563 70967 -154873 103765
755 103765 -108678 63347 -10779 -319281 -110986 -211960 -32652 -79504 100906 59410
745 59410 346287 61835 114420 -215089 -214702 32993 -28936 -2661 135816 48436 212241
734 212241 43427 113152 249173 282735 230873 247564 558223 472617 333832 375481 248233
723 248233 25191 -207842 -44545 124426 -7861 -65470 170372 254422 5329 109378
713 109378 147202 -8873 -58846 70413 -121258 -201151 -143490 -68058 -5894 171392 -10691
702 -10691 27363 128381 142939 116518 196447 107695 347492 358421 83668 219154 251153
691 251153 206311 -215660 -153473 -162475 -62906 169594 193976 9635 -17458 -69869 -246676
680 -246676 -170137 -114443 -214469 -51457 41275 95522 328050 54322 217696 52146 150801
669 150801 314577 170682 69494 -7473 -41213 -138655 -249544 47948 -145476 198768
659 198768 21549 21855 55858 -34769 -298299 -217687 -70500 -18655 -120272 -94324 296095
648 296095 3843 -159683 337062 174598 51756 261740 146049 52589 16065 159714
638 159714 152773 3686 -61424 73974 -22127 9212 -73148 -173986 -172582 -68845 -301630
627 -301630 -282517 -223960 -27487 -203696 -213837 16044 228181 47031 -29355 222700 335877
616 335877 255103 419557 314061 40414 67877 58547 153722 89009 149330 388671 377752
605 377752 252028 150365 510472 395301 179042 427195 354059 23227 -147245 -10177
595 -10177 -37443 62584 162360 217530 222072 -51175 -108134 -96953 95127 89273 -49309 -169153
583 -169153 7604 -105765 15409 158007 -137598 -82504 76337 184744 124853 -194479
573 -194479 -549364 -179333 186750 209244 38006 78156 -13960 -82087 12117 -203323 -85247
562 -85247 219261 156756 213756 -106936 22115 160154 63554 477381 521490 585319 508398
551 508398 425634 194408 231115 416549 490709 568123 223114 -4339 -383847 -359402 -309010
540 -309010 -174207 279776 135052 -82286 -45822 249445 172164 87375 210990 173540 214220
529 214220 269304 506939 85977 5519 -85270 87671 183677 21963 36196 54506 26065
518 26065 295857 338702 5722 195554 45505 233011 173014 156969 -211928 -282316 -10822
507 -10822 197520 46210 -95667 149955 221372 66463 -49652 321150 75447 34225
497 34225 -509 -22634 210858 412297 327449 442229 449836 319895 389059 226133 131075
486 131075 24240 -7360 -19624 381380 291960 74345 91274 15888 -114651 -145640 -175490
475 -175490 -228700 273520 343306 237784 238106 108608 133300 306469 215467 318507 89703
464 89703 -26108 57695 -1437 172237 222935 368732 -120755 246909 193537 113731 50871
453 50871 -16567 252763 -73299 77914 160274 162390 427083 405523 -12911 -353033 -7528
442 -7528 212991 184587 318212 269822 70079 260816 87296 69744 205015 416130 522387
431 522387 266430 172849 233874 479368 47038 227420 341718 238380 213311 214671 112241
420 112241 364098 71604 -331264 -308217 -43046 -98126 -91113 64239 101229 218343 316510
409 316510 389466 84930 199753 -77184 -58423 133407 196468 218758 240856 275608 67532
398 67532 -39798 142196 244671 273833 154314 38288 127916 130882 258626 266886 386139
387 386139 448371 522945 543642 405404 315241 18593 115324 181530 262707 650560 496014
376 496014 393111 655951 625743 565268 568733 181173 233401 192636 223312 5652 -11607
365 -11607 48679 211843 80279 377920 143216 -216994 -305871 -182626 81504 -86170
355 -86170 207200 343823 241185 38879 56761 255330 339130 52222 56186 278126 155389
344 155389 69829 210638 -21910 -12051 122665 446189 368011 62820 335561 407067 -25151
333 -25151 175491 177728 187233 66319 170147 430962 477940 396727 91149 362073 210974
322 210974 -164662 -111239 244839 318414 422926 646219 197147 203060 163654 199511 267832
311 267832 338791 376057 508990 387598 551307 340587 494623 290534 106407 241949
301 241949 361257 392631 219150 390061 242931 323302 190918 286860 398270 115190
291 115190 228450 372186 208074 262737 275020 381537 559522 402989 537566 599907
281 599907 333700 280965 617601 587613 269267 9227 322582 369510 74440 56907 198827
270 198827 341169 201496 251489 267810 266398 474499 731050 850113 663500 371298 278629
259 278629 237026 215385 485195 400559 -46221 236402 145233 361893 254392 342591 91046
248 91046 194998 347798 398457 113439 198665 547944 711083 530247 616131 631673 857608
237 857608 850729 500150 176049 309635 401125 294196 504707 424481 187351 160301 288166
226 288166 631190 439823 191577 392094 704424 823839 710675 468421 555772 631243
216 631243 435122 571370 336586 365007 335810 70592 172837 454582 362114 614116
206 614116 424770 183223 48200 38757 271476 433905 278381 120983 64161 914 -20182
195 -20182 117882 69935 326730 494397 410414 108940 280758 249389 -34526 334577 658194
184 658194 585900 647063 248758 -149052 -187393 285625 433654 323572 240112 241696 459665
173 459665 521737 496047 456228 300298 10094 199109 300325 152080 163497 -224183 -93748
162 -93748 29836 222940 -19414 -63683 297560 180954 -47430 -82599 -243539 -300171 -180524
151 -180524 -116120 -79324 141371 120389 -12060 32345 198289 322708 108260 196503 214598
140 214598 284818 179621 244826 104224 191127 240712 240793 13777 151705 43365 -112339
129 -112339 -107548 110347 180480 191587 127550 137200 427189 259048 127709 290082 167142
118 167142 187358 224214 113452 114836 73750 85429 127694 62160 265611 180675 38358
107 38358 49283 -42856 45726 -5638 -157798 52031 83258 -9935 -50159 52263 104999
96 104999 28469 1922 -83775 45768 -93883 221152 224522 34192 95947 215585 372043
85 372043 222864 131663 40005 12440 -111182 80069 156441 -51059 70672 62642 -39318
74 -39318 18736 -67238 -165203 61166 159558 -123103 -301876 -180980 -376950 -181210 -81231
63 -81231 -298411 -240031 -48078 14574 -102159 -98955 -138478 -240458 -433227 -391368 -304769
52 -304769 -369546 -144551 -141686 -263841 -459016 -442263 -425959 -283190 -199290 -288970 -307196
41 -307196 -106702 -144747 -259914 -530967 -489001 -427807 -508624 -374790 -405308 -506324 -367340
30 -367340 -225403 -290300 -344561 -300549 -433255 -324490 -198911 -435948 -371654 -308851 -271641
19 -271641 -317096 -234330 -280488 -453538 -513403 -209155 -367471 -560907 -612730 -608686 -514464
8 -514464 -504848 -482270 -400561 -623870 -548368 -389155 -489970 -527968
0 -527968
$$ Imaginary data points
##PAGE= N=2
##DATA TABLE= (X++(I..I)), XYDATA
16383 -1764146 -1796474 -1815572 -1835219 -1769167 -1671031 -1499166 -1545064 -1564865 -1451393 -1306292 -1348617
16372 -1348617 -1469814 -1279546 -1327223 -1328030 -1105242 -1040598 -936560 -737752 -722364 -778190 -1080076
16361 -1080076 -952676 -851537 -785330 -636917 -506597 -669727 -829618 -568538 -293583 -52247
16351 -52247 -303050 -295809 -90535 -12693 -52847 -42623 -59656 -10976 41901 37003 83625 225226
16339 225226 202639 377276 488374 443692 552539 557135 604111 515303 561803 772902 878613
16328 878613 910713 750046 736655 940118 819782 782090 1112450 1081700 1038339 1144393
16318 1144393 1179387 1199680 1218571 1113242 1211386 1498290 1756094 1594450 1757998 1835513
16308 1835513 1731981 1619096 1642145 1871442 1949549 1864431 2012769 1839605 1676946 1830216
16298 1830216 1766442 1866548 2081073 2269460 2523363 2534152 2530573 2529154 2328019 2406001 2581862
16287 2581862 2699578 2610300 2714791 2586689 3041675 2944996 2905553 3043873 2946833 2980562
16277 2980562 2926603 3221500 3075813 3023219 2976667 3201617 3316891 3267844 3406961 3467491
16267 3467491 3451863 3382178 3538700 3615642 3569577 3425512 3335201 3576832 3807369 3962730
16257 3962730 3819833 3797459 3846726 3803352 3801361 3952042 3903908 3736290 3740647 4006005 3978223
16246 3978223 3670229 3880558 3980132 4064245 4058335 4200114 4426499 4440760 4185512 4238242
16236 4238242 4404272 4492338 4406697 4518940 4314018 4215709 4400776 4495186 4517266 4615439
16226 4615439 4664189 4729112 4468509 4502819 4544456 4585287 4647399 4738097 5071168 4767249 4872079
16215 4872079 4668582 4438888 4728602 4769647 4650863 4587522 4867544 5157268 4959671 5289538
16205 5289538 5432295 5496182 5386084 5261600 5127599 5298501 5238619 5035351 5330315 5361252
16195 5361252 5415855 5595336 5251867 5302782 5314244 5450196 5561080 5533531 5593421 5566508
16185 5566508 5644026 5728257 5686311 5455564 5683942 5674455 5575991 5229048 5674700 5563840
16175 5563840 5377901 5301160 5674614 5740278 5746238 5681784 5624666 5790532 5766462 5857978 5710229
16164 5710229 5346945 5402333 5951891 6119271 6024346 6229372 6161586 5811295 5982691 6122371
16154 6122371 5804215 5934924 6011445 6334477 6096006 5836707 6262339 6123186 6118659 6037739
$$ [...]
##END NTUPLES=NMR SPECTRUM
##END=
