##TITLE=1H_CA-9369-2
 200.13MHz, CDCl3,
 8 sc
 
 12.8.2025
##JCAMPDX= 6.0         $$ Bruker NMR JCAMP-DX V2.0
##DATA TYPE= NMR SPECTRUM
##DATA CLASS= NTUPLES
##ORIGIN= UXNMR, Bruker Analytische Messtechnik GmbH
##OWNER= pz
$$ XWIN-NMR		Version 3.5
$$ Tue Aug 12 14:57:06 2025 Russian Standard Time (UT+4h)  she@DPX200
##.OBSERVE FREQUENCY= 200.1313
##.OBSERVE NUCLEUS= ^1H
##.ACQUISITION MODE= SIMULTANEOUS
##.ACQUISITION SCHEME= undefined
##.AVERAGES= 8
##.DIGITISER RES= 18
##SPECTROMETER/DATA SYSTEM= spect
##.PULSE SEQUENCE= zg30
##.SOLVENT NAME= CDCl3
##.SHIFT REFERENCE= (INTERNAL, CDCl3, 0, 15.5078)
##AUDIT TRAIL= $$ (NUMBER, WHEN, WHO, WHERE, WHAT)
$$ ##TITLE= Audit trail, XWIN-NMR		Version 3.5
$$ ##JCAMPDX= 5.01
$$ ##ORIGIN= Bruker BioSpin GmbH
$$ ##OWNER= she
$$ F:/spectra/data/she/nmr/H-C/1/pdata/1/auditp.txt
$$ ##AUDIT TRAIL=  $$ (NUMBER, WHEN, WHO, WHERE, WHAT)
(   1,<2025-08-12 14:55:24.68 +0400>,<she>,<DPX200>,
      <created by zg, POWCHK disabled, PULCHK disabled
       configuration hash MD5:
       00 E9 B6 7A A2 85 ED C7 34 08 36 98 17 FE 4E 26
       data hash MD5: 16K
       F5 9A 01 5C 56 54 95 43 5C 9B 99 EA 90 C6 ED 42>)
(   2,<2025-08-12 14:55:27.14 +0400>,<she>,<DPX200>,
      <Start of raw data processing
       efp BC_mod = 2 LB = 0.25 FT_mod = 6 PKNL = 1 PHC0 = -1568.631 PHC1 = 22.59228 SI = 16K 
       data hash MD5: 16K
       87 96 14 FC D1 5B 2C FF 0B 36 87 9C D5 5D 3B 51>)
(   3,<2025-08-12 14:55:45.23 +0400>,<she>,<DPX200>,
      <pk PHC0 = -0.2108022 PHC1 = 0 
       data hash MD5: 16K
       A3 55 1A DD BE 7E 40 FF EF 44 DF E3 11 B9 6C 6B>)
(   4,<2025-08-12 14:55:48.95 +0400>,<she>,<DPX200>,
      <abs ABSG = 5 
       data hash MD5: 16K
       C5 F8 B1 43 D5 52 2F AB 74 94 BE 64 CF 89 E7 70>)
(   5,<2025-08-12 14:56:09.26 +0400>,<she>,<DPX200>,
      <pk PHC0 = 0.6513359 PHC1 = -1.8 
       data hash MD5: 16K
       6B 6C 60 3D 8F CA 94 23 E5 BC 21 95 5B CD 7B EA>)
(   6,<2025-08-12 14:56:12.64 +0400>,<she>,<DPX200>,
      <abs ABSG = 5 
       data hash MD5: 16K
       9F 2A 1F AC 9D 9D 92 4E B4 56 C7 D1 9A 29 C7 EF>)
$$ ##END=
$$ 
$$ hash MD5
$$ EB 05 5D EC 75 7A 32 48 02 63 4E 03 6F B8 39 33
##$RELAX= 
##$RELAX= 
##$RELAX= 
##$RELAX= 
##$RELAX= 
##$RELAX= 
$$ Bruker specific parameters
$$ --------------------------
##$DU= <F:/spectra>
##$EXPNO= 1
##$NAME= <H-C>
##$PROCNO= 1
##$TYPE= <nmr>
##$USER= <she>
##$AMP= (0..31)
100 100 100 100 100 100 100 100 100 100 100 100 100 100 100 100 100 100 
100 100 100 100 100 100 100 100 100 100 100 100 100 100 
##$AQSEQ= 0
##$AQ_mod= 1
##$AUNM= <au_zg>
##$AUTOPOS= <>
##$BF1= 200.13
##$BF2= 200.13
##$BF3= 200.13
##$BF4= 200.13
##$BF5= 200.13
##$BF6= 200.13
##$BF7= 200.13
##$BF8= 200.13
##$BYTORDA= 1
##$CFDGTYP= 0
##$CFRGTYP= 5
##$CHEMSTR= <none>
##$CNST= (0..31)
1 1 145 1 1 1 1 1 1 1 1 1 1 1 1 1 1 1 1 1 1 1 1 1 1 1 1 1 1 1 1 1 
##$CPDPRG= <>
##$CPDPRG1= <>
##$CPDPRG2= <>
##$CPDPRG3= <>
##$CPDPRG4= <mlev>
##$CPDPRG5= <mlev>
##$CPDPRG6= <mlev>
##$CPDPRG7= <mlev>
$$ [...]
##$SUBNAM3= <"">
##$SUBNAM4= <"">
##$SUBNAM5= <"">
##$SUBNAM6= <"">
##$SUBNAM7= <"">
##$SUBNAM8= <"">
##$SUBNAM9= <"">
##$SW= 18.0517328524113
##$SWIBOX= (0..15)
0 0 2 0 0 0 0 0 0 0 0 0 0 0 0 0 
##$SW_h= 3612.71676300578
##$TD= 16384
##$TD0= 1
##$TE= 0
##$TE2= 300
##$TE3= 300
##$TEG= 300
##$TL= (0..7)
0 120 120 120 120 120 120 120 
##$TP= (0..7)
150 150 150 150 150 150 150 150 
##$TP07= 0
##$TPNAME0= <>
##$TPNAME1= <>
##$TPNAME2= <>
##$TPNAME3= <>
##$TPNAME4= <>
##$TPNAME5= <>
##$TPNAME6= <>
##$TPNAME7= <>
##$TPOAL= (0..7)
0.5 0.5 0.5 0.5 0.5 0.5 0.5 0.5 
##$TPOFFS= (0..7)
0 0 0 0 0 0 0 0 
##$TUNHIN= 0
##$TUNHOUT= 0
##$TUNXOUT= 0
##$USERA1= <user>
##$USERA2= <user>
##$USERA3= <user>
##$USERA4= <user>
##$USERA5= <user>
##$V9= 5
##$VALIST= <valist>
##$VCLIST= <CCCCCCCCCCCCCCC>
##$VD= 0
##$VDLIST= <DDDDDDDDDDDDDDD>
##$VPLIST= <PPPPPPPPPPPPPPP>
##$VTLIST= <TTTTTTTTTTTTTTT>
##$WBST= 1024
##$WBSW= 4
##$XGAIN= (0..3)
0 0 0 0 
##$XL= 0
##$YL= 0
##$YMAX_a= 558760
##$YMIN_a= -843409
##$ZGOPTNS= <>
##$ZL1= 120
##$ZL2= 120
##$ZL3= 120
##$ZL4= 120
##$ABSF1= 15.52984
##$ABSF2= -2.522009
##$ABSG= 5
##$ABSL= 3
##$ALPHA= 0
##$AQORDER= 0
##$ASSFAC= 0
##$ASSFACI= 0
##$ASSFACX= 0
##$ASSWID= 0
##$AUNMP= <proc_1d>
##$AZFE= 0.1
##$AZFW= 0.1
##$BCFW= 0
##$BC_mod= 2
##$BYTORDP= 0
##$COROFFS= 0
##$CY= -3
##$DATMOD= 1
##$DC= 0
##$DFILT= <>
##$DTYPP= 0
##$F1P= 0
##$F2P= 0
##$FCOR= 1
##$FTSIZE= 16384
##$FT_mod= 6
##$GAMMA= 0
##$GB= 0
##$INTBC= 1
##$INTSCL= 3.241238e-09
##$ISEN= 128
##$LB= 0.25
##$LEV0= 0
##$LPBIN= 0
##$MAXI= 10000
##$MC2= 0
##$MEAN= 0
##$ME_mod= 0
##$MI= 1.114404
##$NCOEF= 0
##$NC_proc= -5
##$NLEV= 6
##$NOISF1= 3.799351
##$NOISF2= 2.8
##$NSP= 0
##$NTH_PI= 0
##$NZP= 0
##$OFFSET= 15.5078
##$PC= 1
##$PHC0= -1568.191
##$PHC1= 20.79228
##$PH_mod= 1
##$PKNL= yes
##$PPARMOD= 0
##$PSCAL= 0
##$PSIGN= 0
##$REVERSE= no
##$SF= 200.130002782438
##$SI= 16384
##$SIGF1= 3
##$SIGF2= 2
##$SINO= 0.751879
##$SIOLD= 32768
##$SREGLST= <19F.Aceton>
##$SSB= 0
##$STSI= 16384
##$STSR= 0
##$SW_p= 3612.71676300578
##$SYMM= 0
##$S_DEV= 0
##$TDeff= 16384
##$TDoff= 0
##$TI= <>
##$TILT= no
##$TM1= 0
##$TM2= 0
##$TOPLEV= 0
##$USERP1= <user>
##$USERP2= <user>
##$USERP3= <user>
##$USERP4= <user>
##$USERP5= <user>
##$WDW= 1
##$XDIM= 16384
##$YMAX_p= 305932915
##$YMIN_p= -501317
$$ End of Bruker specific parameters
$$ ---------------------------------
##NTUPLES= NMR SPECTRUM
##VAR_NAME=  FREQUENCY,     SPECTRUM/REAL,   SPECTRUM/IMAG
##SYMBOL=    X,             R,               I
##VAR_TYPE=  INDEPENDENT,   DEPENDENT,       DEPENDENT
##VAR_FORM=  AFFN,          ASDF,            ASDF
##VAR_DIM=   16384,         16384,           16384
##UNITS=     HZ,            ARBITRARY UNITS, ARBITRARY UNITS
##FACTOR=    0.220516191357247, 1,           1
##FIRST=     3103.57607760956, 0,            0
##LAST=      -509.14068539622, 0,            0
##MIN=       -509.14068539622, -501317,      0
##MAX=       3103.57607760956, 305932915,    0
$$ Real data points
##PAGE= N=1
##DATA TABLE= (X++(R..R)), XYDATA
$$ [...]
$$ plain form
8035 2785847 2985246 3072553 3179611 3351883 3472937 3625868 3743529 3922999 4070936 4206263
8025 4206263 4299702 4361597 4367042 4308721 4336797 4209976 4099244 4067449 3937709 3793092 3556895
8014 3556895 3395545 3297426 3173840 3084249 2987887 2821501 2702604 2613804 2602921 2562533 2495695
8003 2495695 2434248 2311046 2240384 2180235 2123950 2085040 2178011 2183360 2147529 2116397 2087319
7992 2087319 2077970 2159850 2190006 2198238 2196793 2173760 2224959 2294068 2314541 2353346 2530838 2522405
7980 2522405 2658429 2786673 2936865 3071532 3182412 3362516 3676517 3934869 4208857 4419281
7970 4419281 4716781 4983692 5160962 5468553 5685281 5851961 6016250 6101758 6082989 6002567
7960 6002567 5907995 5775602 5609821 5477126 5215682 4916901 4755215 4470486 4227646 3966531
$$ packed form
8035B785847J99399Q7307J07058J72272J21054J52931J17661J79470J47937J35327
8025D206263R3439O1895N445n8321K8076j26821j10732l1795j29740j44617k36197
8014C556895j61350r8119j23586q9591r6362j66386j18897q8800j0883m0388o6838
8003B495695o1447j23202p0662o0149n6285l8910R2971N349l5831l1132k9078
7992B087319r349Q1880L0156Q232j445k3033N1199O9109K0473L8805J77492q433
7980B522405J36024J28244J50192J34667J10880J80104L14001K58352K73988K10424
7970D419281K97500K66911J77270L07591K16728J66680J64289Q5508j8769q0422
7960F002567r4572j32393j65781j32695k61444k98781j61686k84729k42840k61115
$$ plain form
7950 3966531 3782236 3601159 3410318 3213433 3065897 2974306 2790144 2701296 2564600 2554844
7940 2554844 2455202 2372644 2266186 2228919 2236745 2148375 2034313 1970242 1891836 1757540 1653173
7929 1653173 1657271 1650146 1574825 1555710 1535541 1514671 1434751 1374836 1333011 1274963 1232313 1218406
7917 1218406 1164741 1169928 1224916 1230189 1200668 1132049 1188301 1114965 1079992 1090603 1182502 1180496
7905 1180496 1153579 1148430 1105130 1073274 1044319 926032 933380 1077520 1068800 964203 842266
7894 842266 868343 924418 918079 894918 890492 849132 852561 888294 891263 812389 746244 742068 803607
7881 803607 788563 732942 785791 747203 763515 679304 621865 687593 702453 717036 680775 656349
7869 656349 568656 544436 642682 667516 584621 579221 684216 652161 682479 688511 623860 603570
$$ packed form
7950C966531j84295j81077j90841j96885j47536r1591j84162q8848j36696r756
7940B554844r9642q2558j06458l7267P826q8370j14062o4071p8406j34296j04367
7929A653173M098p125p5321j9115k0169k0870p9920n9915m1825n8048m2650j3907
7917A218406n3665N187N4988N273k9521o8619N6252p3336l4973J0611R1899k006
7905A180496k6917n149m3300l1856k8955j18287P348J44140q720j04597j21937
7894H42266K6077N6075o339k3161m426m1360L429L5733K969p8874o6145m176O1539
7881H03607j5044n5621N2849l8588J6312q4211n7439O5728J4860J4583l6261k4426
7869F56349q7693k4220R8246K4834q2895n400J04995l2055L0318O032o4651k0290
$$ plain form
7857 603570 706377 746703 719477 702035 687093 700651 809325 795879 846068 866170 881732
7846 881732 833287 873207 933365 877861 941974 1000917 1069090 1081886 1167584 1204246 1225156 1266491
7834 1266491 1311788 1451609 1494587 1633933 1754859 1859847 1950892 2018385 2076379 2186441
7824 2186441 2253467 2230482 2198563 2194983 2174518 2180284 2136771 2067432 2120036 2200861 2202160 2139430
7812 2139430 2221789 2275362 2246863 2323800 2469277 2534430 2583219 2679813 2901924 2927973 3012431
7801 3012431 3172118 3598339 3760672 3791014 3934606 3964771 3972761 3938818 3853862 3649987 3496817
7790 3496817 3495343 3395378 3290237 3161497 3169205 3100242 3042639 2984195 2961520 2971220 3046088 3068201
7778 3068201 3069283 3131825 3169105 3182514 3239980 3339607 3467979 3519025 3530235 3537360 3604261 3516285
$$ packed form
7857F03570J02807M0326k7226j7442j4942J3558J08674j3446N0189K0102J5562
7846H81732m8445L9920O0158n5504O4113N8943O8173J2796Q5698L6662K0910M1335
7834A266491M5297J39821M2978J39346J20926J04988R1045O7493N7994J10062
7824B186441O7026k2985l1919l580k0465N766m3513o9339N2604Q0825J299o2730
7812B139430Q2359N3573k8499P6937J45477O5153M8789R6594K22111K6049Q4458
7801C012431J59687M26221J62333L0342J43592L0165P990l3943q4956k03875j53170
7790C496817j474r9965j05141j28740P708o8963n7603n8444k2675R700P4868K2113
7778C068201J082O2542L7280J3409N7466R9627J28372N1046J1210P125O6901q7976
$$ plain form
7766 3516285 3487591 3402469 3252681 3066145 2938427 2905056 2744013 2688544 2638336 2543363 2479742
7755 2479742 2364786 2321437 2279483 2223295 2176325 2161692 2049263 2060558 2085217 2005878 2046214
7744 2046214 2103844 2163834 2151852 2252577 2358244 2409881 2481060 2436027 2435057 2506661 2427893
7733 2427893 2336435 2269267 2246081 2110725 2007287 1976801 1966520 1939336 1858437 1771347 1639556
7722 1639556 1521706 1534599 1508671 1533509 1526470 1546612 1517988 1561138 1563598 1502018 1465874 1498771
7710 1498771 1493656 1508723 1432439 1395498 1376401 1305984 1258889 1218024 1106323 1135735 1072608
7699 1072608 991053 935263 855340 827112 819619 777804 771584 710600 745905 693393 525408 502259
7687 502259 562756 479584 441955 409387 329731 429610 349109 310889 265829 174081 256218 254730
$$ packed form
7766C516285k8694q5122j49788j86536j27718l3371j61043n5469n0208r4973o3621
7755B479742j14956m3349m1954n6188m6970j4633j12429J1295K4659p9339M0336
7744B046214N7630N9990j1982J00725J05667N1637P1179m5033r70P1604p8768
7733B427893r1458o7168k3186j35356j03438l0486j0281k7184q0899q7090j31791
7722A639556j17850J2893k5928K4838p039K0142k8624M3150K460o1580l6144L2897
7710A498771n115J5067p6284l6941j9097p0417m7095m0865j11701K9412o3127
7699A072608q1555n5790p9923k8228p493m1815o220o0984L5305n2512j67985k3149
7687E02259O0497q3172l7629l2568p9656R9879q0501l8220m5060r1748Q2137j488
$$ plain form
7675 254730 319211 299764 177573 169043 219714 237310 250919 247347 244197 266909 289827 271749
7663 271749 229760 164898 121959 148397 172136 119379 126034 179202 140634 115753 107925 30227
7651 30227 42733 54824 31709 37913 90686 129876 125313 99254 59602 64214 84372 27281
7639 27281 63223 137167 121565 88813 69682 77390 68529 47989 -14081 -20087 -66587 -11324
7627 -11324 38495 8080 -34219 -59276 -86506 -43818 -105914 -151528 -53946 -7285 16425 39223
7615 39223 -90079 -87974 -66837 14662 -37443 -30897 8257 3800 -96760 -114725 3759 -9817
7603 -9817 -45652 39338 32867 -48544 -78253 -41531 -16922 -4931 -57363 -131857 -86528 -66972
7591 -66972 -13261 14117 -51058 -59668 -51895 -116635 -81877 -6736 -71960 -130740 3301 61226
$$ packed form
7675B54730O4481j9447j22191q530N0671J7596J3609l572l150K2712K2918j8078
7663B71749m1989o4862m2939K6438K3739n2757O655N3168l8568k4881p828p7698
7651C0227J2506J2091k3115O204N2773L9190m563k6059l9652M612K0158n7091
7639B7281L5942P3944j5602l2752j9131P708q861k0540o2070o006m6500N5263
7627a1324M9819l0415m2299k5057k7230M2688o2096m5614R7582M6661K3710K2798
7615C9223j29302K105K1137Q1499n2105O546L9154m457j00560j7965J18484j3576
7603i817l5835Q4990o471q1411k9709L6722K4609J1991n2432p4494M5329J9556
7591f6972N3711K7378o5175q610P773o4740L4758P5141o5224n8780J34041N7925
$$ plain form
7579 61226 5020 -4177 -99821 -67958 -92748 -66240 -95593 -91907 -95584 -33222 -86636 -99551
7567 -99551 -53783 -43390 -1466 -34159 -61927 -104264 -76043 -47342 -33035 -110535 -119096 -67730
7555 -67730 -10232 -4220 -24325 -42509 -18163 20190 21991 51669 50119 47697 41368 -14456 -59536
7542 -59536 -63788 -21690 -15988 -22337 -27962 -58829 -35582 34307 19267 20154 -15779 -19890 46770
7529 46770 65055 65173 -40384 -19623 -4819 -78569 -24297 -4322 3869 45264 31353 15596
7517 15596 -6859 -53867 -16614 41174 -48316 -99429 23331 -39973 -97081 -79961 -31227 -77695
7505 -77695 -130363 -70084 -38265 -23949 -61161 -98807 -44174 -67203 -50212 -131974 -137261 -109055
7493 -109055 -90671 -183728 -151404 -117178 -78409 -121525 -192521 -231876 -163241 -220594 -146528 -111590
$$ packed form
7579F1226n6206r197r5644L1863k4790K6508k9353L686l677O2362n3414j2915
7567i9551M5768J0393M1924l2693k7768m2337K8221K8701J4307p7500q561N1366
7555f7730N7498O012k0105j8184K4346L8353J801K9678j550k422o329n5824m5080
7542e9536m252M2098N702o349n625l0867K3247O9889j5040Q87l5933m111O6660
7529D6770J8285J18j05557K0761J4804p3750N4272J9975Q191M1395j3911j5757
7517A5596k2455m7008L7253N7788q9490n1113J22760o3304n7108J7120M8734m6468
7505g7695n2668O0279L1819J4316l7212l7646N4633k3029J6991q1762n287K8206
7493a09055J8384r3057L2324L4226L8769m3116p0996l9355O8635n7353P4066L4938
$$ plain form
7481 -111590 -129354 -101548 -114386 -111825 -158073 -129521 -155970 -123643 -180037 -135249 -105881 -133714
7469 -133714 -119620 -107509 -100011 -58575 -42520 -97583 -109985 -53937 -100488 -58677 22392 -27140
7457 -27140 -95198 -139024 -104681 -71739 -61426 -73670 -68065 -59924 -100979 -168025 -150696 -18064
7445 -18064 21023 -56241 -92955 -95938 -55442 -101677 -104034 -153150 -140535 -129067 -143269 -60266
7433 -60266 -72934 -52201 -42744 -51121 -116736 -139715 -120092 -103173 -104649 -74147 -103809 -84202
7421 -84202 -160057 -118641 -84257 -117822 -53713 -55175 -127691 -155694 -184833 -189661 -164056 -114530
7409 -114530 -114138 -130711 -86116 -59972 -56048 -53917 -63926 -2917 19618 82304 31762 -39603
7397 -39603 -5239 -73729 -110191 -126083 -65832 -16411 -4509 -17051 -55280 -50103 -1307 697
$$ packed form
7481a11590j7764K7806j2838K561m6248K8552k6449L2327n6394M4788K9368k7833
7469a33714J4094J2111P498M1436J6055n5063j2402N6048m6551M1811Q1069m9532
7457b7140o8058m3826L4343L2942J0313j2244N605Q141m1055o7046J7329J32632
7445a8064L9087p7264l6714k983M0496m6235k357m9116J2615J1468j4202Q3003
7433f0266j2668K0733R457q377o5615k2979J9623J6919j476L0502k9662J9607
7421h4202p5855M1416L4384l3565O4109j462p2516k8003k9139m828K5605M9526
7409a14530L92j6573M4595K6144L924K131j0009O1009K2535O2686n0542p1365
7397c9603L4364o8490l6462j5892O0251M9421J1902j2542l8229N177M8796K004
$$ plain form
7385 697 -59469 -105498 -98590 -45379 -80280 13938 67818 62811 -57482 4198 8457 6228 37973
7372 37973 23116 72848 -5341 54805 81950 68787 11075 -8940 -68601 -59795 57344 47546
7360 47546 36333 -35968 -5042 15516 -28797 -9911 -31881 -32385 42300 61490 104094 80108
7348 80108 112303 156290 128457 99348 162183 166447 96399 126303 205043 239901 198024 175370
7336 175370 168961 247076 262908 311685 270609 290788 247430 304099 256975 300152 316073 369328
7324 369328 540699 572232 509200 497473 560151 644360 681063 603112 648999 588513 625827
7313 625827 585406 638899 681672 608980 566324 527831 483025 474307 524000 483071 458913 409858
7301 409858 356776 395602 431340 359529 240318 319851 331022 310226 320055 271907 265717 235425
$$ packed form
7385F97o0166m6029O908N3211l4901R4218N3880n007j20293O1680M259k229L1745
7372C7973j4857M9732p8189O0146K7145j3163n7712k0015n9661Q806J17139r798
7360D7546j1213p2301L0926K0558m4313J8886k1970n04P4685J9190M2604k3986
7348H0108L2195M3987k7833k9109O2835M264p0048K9904P8740L4858m1877k2654
7336A75370o409P8115J5832M8777m1076K0179m3358N6669m7124M3177J5921N3255
7324C69328J71371L1533o3032j1727O2678Q4209L6703p7951M5887o0486L7314
7313F25827m0421N3493M2773p2692m2656l8493m4806q718M9693m0929k4158m9055
7301D09858n3082L8826L5738p1811j19211P9533J1171k0796R829m8148o190l0292
$$ plain form
7289 235425 255358 247070 210131 101619 221478 213978 136489 106878 140897 107206 138957 131259
7277 131259 97140 106419 101244 202469 168739 125900 100142 42038 27915 86016 97980 111410
7265 111410 61213 33604 31361 -65769 -52973 -55837 -34457 -37134 -13541 -2329 -94373 -61525
7253 -61525 -41397 -38964 30869 46605 -5915 -18571 9103 -33945 -51484 -10959 75753 82459
7241 82459 49827 61620 21726 101017 78662 -49660 -31318 43797 -6456 51871 51459 -6895
7229 -6895 -5627 44334 95848 27032 8954 49245 18720 68871 161151 152391 112079 107198 75170
7216 75170 44116 86388 210669 169235 134466 110999 128246 206373 222778 245823 289981 258292
7204 258292 198595 260043 323677 348138 258418 319222 384436 540144 568007 584128 530744
$$ packed form
7289B35425J9933q288l6939j08512J19859p500p7489k9611L4019l3691L1751p698
7277A31259l4119R279n175J01225l3730m2839k5758n8104j4123N8101J1964J3430
7265A11410n0197k7609k243r7130J2796k864K1380k677K3593J1212r2044L2848
7253f1525K0128K433O9833J5736n2520j2656K7674m3048j7539M0525Q6712O706
7241H2459l2632J1793l9894P9291k2355j28322J8342P5115n0253N8327m12n8354
7229f895J268M9961N1514o8816j8078M0291l0525N0151R2280q760m0312m881l2028
7216G5170l1054M2272J24281m1434l4769k3467J7247P8127J6405K3045M4158l1689
7204B58292n9697O1448O3634K4461q9720O0804O5214J55708K7863J6121n3384
$$ plain form
7193 530744 473460 531828 580894 554512 495579 433916 456455 534763 509603 583294 573317 528314
7181 528314 524505 579701 570488 551880 582046 553678 441474 461640 532455 523688 529710 499315
7169 499315 552956 560862 516657 552259 543916 557462 545946 615202 671732 649311 621217 702669
7157 702669 764574 751504 685130 607116 662107 803560 761803 835866 881847 927978 1010850
7146 1010850 1045538 1095025 1096365 1175085 1288962 1361695 1373388 1397432 1493456 1627040 1829607
7135 1829607 1957927 2063882 2284116 2553313 2791421 3030536 3439784 3720541 4112182 4615957
7125 4615957 5156734 5746777 6529995 7404390 8293606 9142044 9816666 10239769 10390399 10188013
7115 10188013 9676132 9059718 8361194 7593112 7017701 6462247 5921528 5537578 5101017
$$ packed form
7193E30744n7284N8368M9066k6382n8933o1663K2539P8308k5160P3691r977m5003
7181E28314l809N5196r213j8608L0166k8368j12204K0166P0815q767O022l0395
7169D99315N3641P906m4205L5602q343J3546j1516O9256N6530k2421k8094Q1452
7157G02669O1905j3070o6374p8014N4991J41453m1757P4063M5981M6131Q2872
7146A010850L4688M9487J340P8720J13877P2733J1693K4044R6024J33584K02567
7135A829607J28320J05955K20234K69197K38108K39115M09248K80757L91641N03775
7125D615957N40777N90043P83218Q74395Q89216Q48438O74622M23103J50630k02386
7115A0188013n11881o16414o98524p68082n75411n55454n40719l83950m36561
$$ plain form
7106 5101017 4559764 4113267 3831243 3419886 3088712 2839207 2600389 2407583 2310002 2123202
7096 2123202 1943817 1771208 1637535 1494287 1469178 1380520 1257537 1253123 1235172 1111503
7086 1111503 1047165 963828 834901 843067 818125 781475 750980 696971 597349 577646 552008
7075 552008 550265 538418 520244 479127 485190 453688 389270 366800 328373 381095 358008 306414
7063 306414 356297 328108 349050 273298 352236 365666 323371 376250 328021 276661 248559 302756
7051 302756 294110 198787 157898 167654 187028 184883 190940 120909 87944 189877 183722 207079
7039 207079 156837 61484 4749 29575 109370 137791 156647 86386 93003 14152 15400 113584
7027 113584 121661 187206 179146 177354 166438 223025 185314 207171 198198 123351 140365 73034
$$ packed form
7106E101017n41253m46497k82024m11357l31174k49505k38818j92806r7581j86800
7096B123202j79385j72609j33673j43248k5109q8658j22983m414j7951j23669
7086A111503o4338q3337j28927Q166k4942l6650l0495n4009r9622j9703k5638
7075E52008j743j1847j8174m1117O063l1502o4418k2470l8427N2722k3087n1594
7063C06414M9883k8189K0942p5752P8938J3430m2295N2879m8229n1360k8102N4197
7051C02756q646r5323m0889R756J9374k145O057p0031l2965J01933o155K3357
7039B07079n0242r5353n6735K4826P9795K8421J8856p0261O617p8851J248R8184
7027A13584Q077O5545q060j792j0916N6587l7711K1857q973p4847J7014o7331
$$ plain form
7015 73034 111179 179345 93610 116259 120205 101075 82730 35295 139280 191631 216152 120240
7003 120240 88298 91886 121269 210455 196120 158424 129110 161286 243293 230020 161142 204312
6991 204312 256018 213028 166216 146334 163961 156016 216121 153851 154457 105707 102571 41668
6979 41668 77662 109235 134479 90873 85237 181945 95678 17443 -72107 -77953 -80509 -50388
6967 -50388 2739 -35636 -81085 -65636 -49854 -6452 -18043 -21085 20844 23077 8987 20011
6955 20011 36907 105630 29587 28975 46119 67418 103450 120690 10019 -42627 -78956 6392
6943 6392 70724 38571 77924 107546 43139 52354 70636 89522 14320 -2994 -25086 34099
6931 34099 129309 155894 124432 80448 66498 81399 107857 90675 56968 10773 17692 47352
$$ packed form
7015G3034L8145O8166q5735K2649L946j9130j8345m7435J03985N2351K4521r5912
7003A20240l1942L588K9383Q9186j4335l7696k9314L2176Q2007j3273o8878M3170
6991B04312N1706m2990m6812j9882J7627p945O0105o2270O06m8750l136o0903
6979D1668L5994L1573K5244m3606n636R6708q6267p8235q9550n846k556L0121
6967e0388N3127l8375m5449J5449J5782M3402j1591l042M1929K233j4090J1024
6955B0011J6896O8723p6043o12J7144K1299L6032J7240j10671n2646l6329Q5348
6943F392O4332l2153L9353K9622o4407R215J8282J8886p5202j7314k2092N9185
6931C4099R5210K6585l1462m3984j3950J4901K6458j7182l3707m6195O919K9660
$$ plain form
6919 47352 59633 48973 65522 38503 825 -51908 103550 150792 123714 138450 198163 198665
6907 198665 158394 116099 123526 116624 148213 143521 74904 122610 152817 165170 189494 277441
6895 277441 359607 303171 218627 250388 217115 234956 254434 277365 288702 319907 376005 367351
6883 367351 438779 390050 401438 441595 461004 432200 456077 409588 439128 405893 444326 447885
6871 447885 384010 365382 285595 282071 323440 271747 192096 296467 330308 329172 303527 312125
6859 312125 298633 273883 315352 309416 197837 142610 118945 127012 123059 150715 138804 202458
6847 202458 228794 176494 183616 176197 120449 125797 160647 219868 216930 167855 123691 117519 230621
6834 230621 206703 182319 125693 90559 79991 106572 96505 126175 138154 185395 168107 148594
$$ packed form
6919D7352J2281j0660J6549k7019l7678n2733J55458M7242k7078J4736N9713N02
6907A98665m0271m2295P427o902L1589m692o8617M7706L0207J2353K4324Q7947
6895B77441Q2166n6436q4544L1761l3273J7841J9478K2931J1337L1205N6098q654
6883C67351P1428m8729J1388M0157J9409k8804K3877m6489K9540l3235L8433L559
6871D47885o3875j8628p9787l524M1369n1693p9651J04371L3841j136k5645Q598
6859C12125j3492k4750M1469n936j11579n5227k3665Q067l953K7656j1911O3654
6847B02458K6336n2300P122p419n5748N348L4850N9221k938m9075m4164o172J13102
6834B30621k3918k4384n6626l5134j0568K6581j0067K9670J1979M7241j7288j9513
$$ plain form
6822 148594 156614 127259 179246 56953 47332 67864 64659 91815 140838 182878 103240 56759
6810 56759 75637 -19838 -29598 -4933 58212 85580 3366 -11993 42544 73719 57242 -15564
6798 -15564 79004 69773 59356 -14804 -119609 -50485 -58687 1280 74804 105152 124628 55109
6786 55109 73993 23992 -29062 14940 33420 -24325 -55576 -47299 4603 45223 23503 -76679
6774 -76679 -103634 -33612 1413 55351 -9080 51159 41238 12398 -44737 1111 62179 20629
6762 20629 -56535 -39606 19912 55684 30914 27466 -94473 -130959 -95567 -16178 -30718 17430
6750 17430 -25477 -2686 -13921 48124 38577 15332 -337 61605 37159 -84873 -25669 16709
6738 16709 -22470 -74961 59648 -5676 -25550 -35496 -140 -19193 -49827 20318 -4632 -9391
$$ packed form
6822A48594Q020k9355N1987j22293r621K0532l205K7156M9023M2040p9638m6481
6810E6759J8878r5475r760K4665O3145K7368q2214j5359N4537L1175j6477p2806
6798a5564R4568r231j0417p4160j04805O9124q202N9967P3524L0348J9476o9519
6786E5109J8884n0001n3054M4002J8480n7745l1251Q277N1902M0620k1720j00182
6774g6679k6955P0022L5025N3938o4431O0239r921k8840n7135M5848O1068m1550
6762B0629p7164J6929N9518L5772k4770l448j21939l6486L5392P9389j4540M8148
6750A7430m2907K2791j1235O2045r547k3245j5669O1942k4446j22032N9204M2378
6738A6709l9179n2491J34609o5324j9874r946L5356j9053l0634P0145k4950m759
$$ plain form
6726 -9391 18528 22948 97903 76655 7660 -6390 58320 113310 44032 77353 66622 27270
6714 27270 85984 128818 64792 43054 29030 -5821 58942 74334 75900 53726 85266 19891
6702 19891 23750 47069 56762 44513 53264 55592 59859 21258 56656 -37506 -910 50262 39015
6689 39015 105996 106171 29041 34851 -618 -19422 -52794 54297 99961 126216 129211 88117
6677 88117 93740 96021 65853 73605 18445 66639 109753 99435 36908 6308 63284 -13765
6665 -13765 -58696 -80 84827 21029 -17957 7774 84516 66943 100861 35665 5647 6500
6653 6500 18071 23399 76711 -28113 -61465 -37474 -61788 -55580 -23594 -56368 -7262 -8996
6641 -8996 -17149 63437 25347 -12531 23678 43944 49629 64689 114667 109952 124170 83077 25972
$$ packed form
6726i391K7919M420P4955k1248o8995j4050O4710N4990o9278L3321j0731l9352
6714B7270N8714M2834o4026k1738j4024l4851O4763J5392J566k2174L1540o5375
6702A9891L859K3319R693j2249Q751K328M267l8601L5398r4162L6596N1172j1247
6689C9015O6981J75p7130N810l5469j8804l3372J07091M5664K6255K995m1094
6677H8117N623K281l0168P752n5160M8194M3114j0318o2527l0600N6976p7049
6665a3765m4931N8616Q4907o3798l8986K5731P6742j7573L3918o5196l0018Q53
6653F500J1571N328N3312j04824l3352K3991k4314O208L1986l2774M9106j734
6641h996q153Q0586l8090l7878L6209K0266N685J5060M9978m715J4218m1093n7105
$$ plain form
6628 25972 -9719 -48470 6506 80827 127713 -45718 -20315 59999 86184 131257 34705 37615
6616 37615 33621 82407 81458 51844 44028 177 -43036 15523 24517 -56397 19423 7352 22370
6603 22370 41270 142099 117722 5813 42845 122325 107716 54057 74956 54873 23145
6592 23145 100833 40457 4480 51095 48474 118085 170577 125318 96894 123680 60460 27370
6580 27370 78542 152792 133122 203289 250266 190954 160580 174441 183300 170405 220011 226165
6568 226165 183663 191884 170734 255106 201114 208720 208797 152812 175760 154804 261482 261885 235103
6555 235103 240394 206295 279258 364090 332918 184659 163036 206970 195721 166590 209563 226306
6543 226306 146552 113962 155461 202395 179368 227687 275887 239680 200834 183359 219365 244257
$$ packed form
6628B5972l5691l8751N4976P4321M6886j73431K5403Q0314K6185M5073r6552K910
6616C7615l994M8786r49k9614p816m3851m3213N8559Q994q0914P5820j2071J5018
6603B2370J8900J00829k4377j11909L7032P9480j4609n3659K0899k0083l1728
6592B3145P7688o0376l5977M6615k621O9611N2492m5259k8424K6786o3220l3090
6580B7370N1172P4250j9670P0167M6977n9312l0374J3861Q859j2895M9606O154
6568B26165m2502Q221k1150Q4372n3992P606P7n5985K2948k0956J06678M03k6782
6555B35103N291l4099P2963Q4832l1172j48259k1623M3934j1249k9131M2973J6743
6543B26306p9754l2590M1499M6934k3027M8319M8200l6207l8846j7475L6006K4892
$$ plain form
6531 244257 195487 113480 137283 120046 98260 121612 162544 198768 232596 288124 268994 189664
6519 189664 164795 247931 235739 234666 273108 280395 299021 350239 367422 292354 274600 338964
6507 338964 348284 318579 335980 314101 280549 342044 339874 317616 383512 409312 383405 322025
6495 322025 356990 353752 346592 393205 380561 363216 382644 355912 350646 408329 467463 385101
6483 385101 270324 440500 485392 456746 427313 365487 332129 346213 263410 324337 375259
6472 375259 370063 323160 329935 349885 346768 382773 318082 327645 333633 391236 382504 401249 432966
6459 432966 472519 425220 387931 466568 488502 494076 487090 415916 387967 481471 497538 496577
6447 496577 423985 389133 386121 445689 387267 351820 330019 360217 365395 347192 369561 378972
$$ packed form
6531B44257m8770q2007K3803j7237k1786K3352M0932L6224L3828N5528j9130p9330
6519A89664k4869Q3136j2192j073L8442P287J8626N1218J7183p5068j7754O4364
6507C38964R320k9705J7401k1879l3552O1495k170k2258O5896K5800k5907o1380
6495C22025L4965l238p160M6613j2644j7345J9428k6732n266N7683N9134q2362
6483C85101j14777J70176M4892k8646k9433o1826l3358J4084q2803O0927N0922
6472C75259n196m6903O775J9950l117L6005o4691R563N988N7603q732J8745L1717
6459D32966L9553m7299l7289P8637K1934N574o986p1174k7949R3504J6067r61
6447D96577p2592l4852l012N9568n8422l5447k1801L0198N178j8203K2369R411
$$ plain form
6435 378972 410533 412050 430073 334766 327070 375081 363280 354646 349329 477543 438811 282001
6423 282001 292667 369440 383404 428746 442072 376173 362792 381177 342736 367866 352232 395431
6411 395431 418015 414691 363053 348507 430499 427791 376353 383562 438699 457506 397573 370744
6399 370744 459801 427312 372378 378650 404820 392460 335199 358787 421365 338298 268887 277656
6387 277656 380663 425016 493282 484312 441929 344565 353434 410359 421981 390577 402102 362942
6375 362942 431679 411410 453809 440207 509687 527938 395011 348828 293595 282865 355419
6364 355419 453276 465315 440992 528563 498178 466801 480179 454066 313161 398737 525345
6353 525345 514942 456935 362258 371396 478521 519193 434305 477191 494855 515588 563200 438980
$$ packed form
6435C78972L1561J517J8023r5307p696M8011j1801q634n317J28214l8732j56810
6423B82001J0666P6773J3964M5342J3326o5899j3381J8385l8441K5130j5634M3199
6411C95431K2584l324n1638j4546Q1992k708n1438P209N5137J8807n9933k6829
6399C70744Q9057l2489n4934O272K6170j2360n7261K3588O2578q3067o9411Q769
6387B77656J03007M4353O8266q970m2383r7364Q869N6925J1622l1404J1525l9160
6375C62942O8737k0269M2399j3602O9480J8251j32927m6183n5233j0730P2554
6364C55419R7857J2039k4323Q7571l0385l1377J3378k6113j40905Q5576J26608
6353E25345j0403n8007r4677R138J07125M0672q4888M2886J7664K0733M7612j24220
$$ plain form
6341 438980 474437 518094 507777 541254 602317 618467 595099 573065 571014 662209 683945 623809
6329 623809 578853 696833 660049 665458 680135 658541 601120 635486 628811 689531 629665 665096
6317 665096 708963 725643 685920 734170 727950 713196 733608 766734 838835 805145 786392 845182
6305 845182 746086 680478 685168 734299 730598 768977 771333 770044 892911 879516 895730 915430
6293 915430 877884 836991 814441 822341 920174 905325 829233 770544 779686 848558 854638 839986
6281 839986 861512 879922 864817 945897 827348 774307 851279 968074 938436 821239 791726
6270 791726 808596 839638 809609 859451 802722 806607 786671 810937 860544 811785 785516 865585
6258 865585 867639 892841 914957 934740 902678 904664 867166 862137 874250 939180 882566 833045
$$ packed form
6341D38980L5457M3657j0317L3477O1063J6150k3368k2034k051R1195K1736o0136
6329F23809m4956J17980l6784N409J4677k1594n7421L4366o675O0720n9866L5431
6317F65096M3867J6680l9723M8250o220j4754K0412L3126P2101l3690j8753N8790
6305H45182r9096o5608M690M9131l701L8379K356j289J22867j3395J6214J9700
6293I15430l7546m0893k2550P900R7833j4849p6092n8689R142O8872O080j4652
6281H39986K1526J8410j5105Q1080j18549n3041P6972J16795k9638j17197k9513
6270G91726J6870L1042l0029M9842n6729L885j9936K4266M9607m8759k6269Q0069
6258H65585K054K5202K2116J9783l2062J986l7498n029J2113O4930n6614m9521
$$ plain form
6246 833045 900481 859498 881428 941531 940543 918534 964613 1098018 1078038 1087171 1089697 1092898
6234 1092898 1112226 1125502 1152210 1114788 1189089 1265088 1300747 1309366 1398551 1357935 1390368 1429014
6222 1429014 1455123 1454303 1380680 1452069 1453739 1412042 1480982 1471839 1523088 1583019 1529997 1489049
6210 1489049 1530880 1552009 1486242 1457286 1538960 1550014 1505145 1591902 1610468 1575239 1514923
6199 1514923 1536952 1555463 1573448 1591382 1540680 1590066 1576266 1582712 1599031 1610350 1663450 1589434
6187 1589434 1505479 1563223 1574911 1539027 1488560 1508975 1532156 1514628 1512981 1533471 1471860 1400314
6175 1400314 1486834 1584803 1584947 1576969 1593830 1597644 1620457 1570476 1516042 1591776 1598299 1532799
6163 1532799 1619082 1578446 1642530 1670360 1668429 1676347 1707064 1669023 1623206 1557173 1574787 1659316
$$ packed form
6246H33045O7436m0983K1930O0103r88k2009M6079J33405j9980R133K526L201
6234A092898J9328J3276K6708l7422P4301P5999L5659Q619Q9185m0616L2433L8646
6222A429014K6109q20p3623P1389J670m1697O8940r143N1249N9931n3022m0948
6210A489049M1831K1129o5767k8956Q1674J1054m4869Q6757J8566l5229o0316
6199A514923K2029J8511J7985J7934n0702M9386j3800O446J6319J1319N3100p4016
6187A589434q3955N7744J1688l5884n0467K0415K3181j7528j647K0490o1611p1546
6175A400314Q6520R7969J44p978J6861L814K2813m9981n4434P5734O523o5500
6163A532799Q6283m0636O4084K7830j931P918L0717l8041m5817o6033J7614Q4529
$$ plain form
6151 1659316 1671375 1685987 1634408 1636985 1642711 1685629 1710258 1805490 1844786 1795491 1861439 1905447
6139 1905447 1947146 1995958 2015604 1991764 1971741 1927951 1929609 1844547 1843217 1951231 1929448 1816642
6127 1816642 1769793 1725803 1678796 1693909 1705804 1686706 1654735 1663153 1584628 1568955 1570309 1469709
6115 1469709 1418744 1362488 1324397 1327288 1263475 1245541 1287323 1322550 1328977 1374823 1410570 1331348
6103 1331348 1239447 1339928 1350554 1336714 1360217 1349035 1335019 1355791 1368537 1390804 1383850
6092 1383850 1348590 1324082 1416770 1415197 1381560 1356718 1435852 1450465 1420136 1324681 1312841 1305059
6080 1305059 1299534 1347341 1457116 1464402 1491442 1529442 1508106 1514633 1531439 1480166 1556816 1679475
6068 1679475 1665886 1683414 1667685 1711154 1777830 1842775 1774359 1690883 1764135 1888421 1900893
$$ packed form
6151A659316J2059J4612n1579K577N726M2918K4629R5232L9296m9295O5948M4008
6139A905447M1699M8812J9646k3840k0023m3790J658q5062j330J08014k1783j12806
6127A816642m6849m3990m7007J5113J1895j9098l1971Q418p8525j5673J354j00600
6115A469709n0965n6256l8091K891o3813j7934M1782L5227O427M5846L5747p9222
6103A331348r1901J00481J0626j3840K3503j1182j4016K0772J2746K2267o954
6092A383850l5260k4508R2688j573l3637k4842P9134J4613l0329r5455j1840p782
6080A305059n525M7807J09775P286K7040L8000k1336O527J6806n1273P6650J22659
6068A679475j3589J7528j5729M3469O6676O4945o8416q3476P3252J24286J2472
$$ plain form
6057 1900893 1938070 1949817 1989833 1978141 2098265 2150807 2243827 2229264 2253834 2312277 2405017
6046 2405017 2476175 2538451 2505346 2629441 2745271 2805915 2890420 2894433 2988598 3121593 3147977
6035 3147977 3170277 3226335 3414837 3526642 3630477 3663963 3689561 3821857 3923847 4047401
6025 4047401 4145988 4223031 4248639 4328396 4356044 4416415 4453094 4564303 4677641 4708183 4709000
6014 4709000 4736411 4762905 4755661 4709352 4755972 4743534 4787079 4727722 4733715 4731639 4763118 4792305
6002 4792305 4805294 4808586 4840758 4931962 5069283 5217373 5383187 5589631 5820107 6068524
5992 6068524 6334386 6696324 6905835 7217068 7623284 8020387 8547136 8947685 9258592 9672871
5982 9672871 9958565 10257222 10641910 10788811 11070070 11236177 11230210 11252520 11300068 11363973
$$ packed form
6057A900893L7177J1747M0016j1692J20124N2542R3020j4563K4570N8443R2740
6046B405017P1158O2276l3105J24095J15830O0644Q4505M013R4165J32995K6384
6035C147977K2300N6058J88502J11805J03835L3486K5598J32296J01990J23554
6025D047401R8587P7043K5608P9757K7648O0371L6679J11209J13338L0542Q17
6014D709000K7411K6494p244m6309M6620j2438M3545n9357N993k076L1479K9187
6002D792305J2989L292L2172R1204J37321J48090J65814K06444K30476K48417
5992F068524K65862L61938K09511L11233M06216L97103N26749M00549L10907M14279
5982I672871K85694K98657L84688J46901K81259J66107n967K2310M7548O3905
$$ plain form
5972 11363973 11331025 11312726 11342988 11370394 11385349 11416680 11456360 11480594 11606101 11745408 11926220
5961 11926220 12119181 12287018 12557656 12734636 12982911 13159972 13274945 13408174 13470564 13518332
5951 13518332 13553373 13512388 13396307 13227618 13070788 12861013 12514593 12187395 11801067 11363331
5941 11363331 10896140 10476440 10110757 9605143 9111938 8691657 8351265 7919133 7478812
5932 7478812 7172081 6760931 6450815 6141046 5902033 5659319 5405175 5217173 4978495 4904963
5922 4904963 4770669 4633933 4499732 4367233 4231267 4148998 4056179 4021376 3910381 3813863
5912 3813863 3660118 3684254 3641751 3536247 3431483 3355590 3277462 3233606 3237569 3126932 3105327
5901 3105327 3100309 3107268 3035047 2969439 2895422 2867932 2937822 3014950 3069011 2952461 2872467 2829259
$$ packed form
5972A1363973l2948j8299L0262K7406J4955L1331L9680K4234J25507J39307J80812
5961A1926220J92961J67837K70638J76980K48275J77061J14973J33229O2390M7768
5951A3518332L5041m0985j16081j68689j56830k09775l46420l27198l86328m37736
5941A1363331m67191m19700l65683n05614m93205m20281l40392m32132m40321
5932G478812l06731m11150l10116l09769k39013k42714k54144j88002k38678p3532
5922D904963j34294j36736j34201j32499j35966q2269r2819l4803j10995r6518
5912C813863j53745K4136m2503j05504j04764p5893p8128m3856L963j10637k1605
5901C105327n018O959p2221o5608p4017k7490O9890P7128N4061j16550p9994m3208
$$ plain form
5889 2829259 2830308 2799932 2716835 2714990 2753339 2693530 2635155 2559817 2571104 2592041 2547821 2617768
5877 2617768 2517984 2457544 2469586 2406053 2335109 2372485 2318997 2283441 2319933 2358260 2289708
5866 2289708 2268219 2257660 2275501 2282135 2272906 2257188 2247346 2244401 2212332 2217883 2277438 2275198 2331708
5853 2331708 2282483 2197815 2263090 2366846 2374101 2335092 2372476 2456544 2468039 2457386 2476092
5842 2476092 2489035 2478963 2400828 2404110 2439235 2507163 2635059 2596825 2551610 2592064 2689134
5831 2689134 2735492 2740135 2725602 2763454 2896767 2930150 2867558 2941269 2944999 2975471 3005579 3040944
5819 3040944 3129507 3165845 3240927 3374043 3367730 3379969 3451315 3523830 3645667 3701797 3732938
5808 3732938 3857867 3986061 4038657 4164125 4267569 4399395 4541308 4657213 4818676 4914559
$$ packed form
5889B829259J049l0376q3097j845L8349n9809n8375p5338J1287K0937m4220O9947
5877B617768r9784o0440J2042o3533p0944L7376n3488l5556L6492L8327o8552
5866B289708k1489j0559J7841O634r229j5718r842k945l2069N551N9555k240N6510
5853B331708m9225q4668O5275J03756P255l9009L7384Q4068J1495j0653J8706
5842B476092J2943j0072p8135L282L5125O7928J27896l8234m5215M0454R7070
5831B689134M6358M643j4533L7852J33313L3383o2592P3711L730L0472L0108L5365
5819C040944Q8563L6338P5082J33116o313J2239P1346P2515J21837N6130L1141
5808C732938J24929J28194N2596J25468J03444J31826J41913J15905J61463R5883
$$ plain form
5798 4914559 5004892 5207838 5409122 5603213 5618841 5740724 5824571 6087203 6130190 6115941
5788 6115941 6238617 6268420 6266241 6244258 6313322 6399882 6449472 6465354 6504358 6638951 6669672
5777 6669672 6730670 6795570 6788402 6871865 6841085 6918642 6980903 7010218 6899199 6806471 6758696
5766 6758696 6784964 6762872 6694517 6697293 6692993 6744941 6849637 6905935 6833561 6891875 6974515 7095151
5754 7095151 7146634 7183279 7154413 7117279 7090550 7114156 7182044 7103158 7072117 7027147 7025740 7086278
5742 7086278 7038059 6986698 6797651 6600130 6562127 6512048 6395434 6288339 6119549 6119775 6151781
5731 6151781 6036871 5993024 5963375 5877040 5957745 5910644 5936665 5974515 5911387 5943863 5958714
5720 5958714 5914769 5936118 5971398 6067395 6152416 6158243 6264904 6347259 6557585 6705668 6805010
$$ packed form
5798D914559R0333K02946K01284J94091J5628J21883Q3847K62632M2987j4249
5788F115941J22676K9803k179k1983O9064Q6560M9590J5882L9004J34593L0721
5777F669672O0998O4900p168Q3463l0780P7557O2261K9315j11019r2728m7775
5766F758696K6268k2092o8355K776m300N1948J04696N6298p2374N8314Q2640J20636
5754G095151N1483L6645k8866l7134k6729K3606O7888p8886l1041m4970j407O0538
5742G086278m8219n1361j89047j97521l8003n0079j16614j07095j68790K26L2006
5731F151781j14910m3847k9649q6335Q0705m7101K6021L7850o3128L2476J4851
5720E958714m3945K1349L5280R5997Q5021N827J06661Q2355K10326J48083R9342
$$ plain form
5709 6805010 6930452 7196894 7409901 7558650 7701171 7908855 8084024 8219029 8250823 8260704
5699 8260704 8265880 8202863 8147589 8092593 8058724 7988091 7909608 7848924 7799103 7656520 7384437
5688 7384437 7140133 6927932 6741049 6534478 6329019 6133131 5928487 5678894 5524474 5392199
5678 5392199 5191726 5122738 5023166 4809707 4641382 4578726 4552106 4523152 4348224 4292550 4302573
5667 4302573 4206396 4130014 4110226 4136436 4076321 4038730 4065095 4056544 4087272 4052063 3982781 4035399
5655 4035399 4038486 4011489 3956225 4003442 3992044 3986666 4059441 4114142 4123093 4154592 4223454 4247679
5643 4247679 4230516 4273011 4379679 4523222 4568937 4669826 4781700 4880258 4928527 5036512
5633 5036512 5259022 5467499 5637376 5872009 6156732 6414231 6625369 6807958 7020617 7249975
$$ packed form
5709F805010J25442K66442K13007J48749J42521K07684J75169J35005L1794R881
5699H260704N176o3017n5274n4996l3869p0633p8483o0684m9821j42583k72083
5688G384437k44304k12201j86883k06571k05459j95888k04644k49593j54420j32275
5678E392199k00473o8988r9572k13459j68325o2656k6620k8954j74928n5674J0023
5667D302573r6177p6382j9788K6210o0115l7591K6365q551L0728l5209o9282N2618
5655D035399L087k6997n5264M7217j1398n378P2775N4701Q951L1499O8862K4225
5643D247679j7163M2495J06668J43543M5715J00889J11874R8558M8269J07985
5633E036512K22510K08477J69877K34633K84723K57499K11138J82589K12659K29358
$$ plain form
5623 7249975 7288522 7279391 7288022 7205910 7159362 7121666 7135723 7188532 7278443 7299644 7357704 7468421
5611 7468421 7573861 7780674 7983342 8218972 8447883 8707738 9085807 9315847 9640373 9883521
5601 9883521 10032028 10176100 10304905 10240864 10296398 10345549 10317638 10330341 10615196 10703585 10827305
5590 10827305 11168426 11426638 11839914 12300202 12817768 13344129 14054167 14822362 15606344
5581 15606344 16613033 17666518 18893461 20356489 21925117 23717574 25602696 27479532
5573 27479532 29219612 30810378 32331335 33473180 34213660 34698356 35117893 35561256 36127332
5564 36127332 36705240 37446195 38452496 39604786 40881439 42171885 43505380 44736770
5556 44736770 45804148 46779904 47568093 48227590 48643984 48867304 49013828 48922099 48572261
$$ packed form
5623G249975L8547r131Q631q2112m6548l7696J4057N2809Q9911K1201N8060J10717
5611G468421J05440K06813K02668K35630K28911K59855L78069K30040L24526K43148
5601I883521J48507J44072J28805o4041N5534M9151k7911J2703K84855Q8389J23720
5590A0827305L41121K58212M13276M60288N17566N26361P10038P68195P83982
5581A5606344J006689J053485J226943J463028J568628J792457J885122J876836
5573B7479532J740080J590766J520957J141845P40480M84696M19537M43363N66076
5564C6127332N77908P40955J006301J152290J276653J290446J333495J231390
5556D4736770J067378R75756P88189O59497M16394K23320J46524r1729l49838
$$ plain form
5547 48572261 47796450 46797826 45564454 44265969 42980205 41846712 40736916 39759719 39099624
5538 39099624 38585701 38172508 38073464 38119147 38043696 37962309 37775631 37389973 36803457 35871717
5528 35871717 34641993 33092027 31428563 29742311 28045587 26468978 24942328 23446415
5520 23446415 22149728 20965851 19748402 18649144 17613791 16700284 15932200 15134078 14482654
5511 14482654 13938640 13385797 12987244 12689143 12401835 12170437 11974487 11715798 11525652
5502 11525652 11331649 11066060 10699026 10490218 10214766 9920182 9654934 9318487 9083985
5493 9083985 8901808 8791175 8610586 8469770 8382245 8317717 8295680 8168291 8205146 8357892
5483 8357892 8409025 8519972 8640200 8730803 8803972 8904035 8956902 8794199 8679058 8492754
$$ packed form
5547D8572261p75811r98624j233372j298485j285764j133493j109796r77197o60095
5538C9099624n13923m13193r9044M5683p5451q1387j86678l85658n86516r31740
5528C5871717j229724j549966j663464j686252j696724j576609j526650j495913
5520B3446415j296687j183877j217449j099258j035353r13507p68084p98122o51424
5511A4482654n44014n52843l98553k98101k87308k31398j95950k58689j90146
5502A1525652j94003k65589l67034k08808k75452k94584k65248l36447k34502
5493I083985j82177j10633j80589j40816q7525o4528k2037j27389L6855J52746
5483H357892N1133J10947J20228R0603P3169J00063N2867j62703j15141j86304
$$ plain form
5473 8492754 8161597 7911311 7638958 7380659 7141629 6944293 6669808 6528486 6327023 6050170
5463 6050170 5910138 5725782 5549044 5416744 5324149 5210905 5063899 4972311 4833603 4744224
5453 4744224 4599606 4614375 4599606 4575494 4535143 4422852 4443972 4441966 4372649 4279290 4309903
5442 4309903 4235448 4246880 4219983 4092092 4139963 4099466 4106636 4081892 3971687 4031045 3948179
5431 3948179 3919670 3999841 3981238 4063168 4112371 4058978 4079648 4028168 4031386 4007213 3950184 4045031
5419 4045031 4048294 3986384 3996303 4001062 3964001 3995601 4040501 3973693 4046613 4061022 4061561 4083022
5407 4083022 4117054 4208170 4258540 4290984 4326005 4335412 4353698 4445871 4527592 4554525 4615991 4774878
5395 4774878 4878663 5037342 5074194 5080595 5144950 5326396 5475756 5596557 5734325 5738092 5848823
$$ packed form
5473H492754l31157k50286k72353k58299k39030j97336k74485j41322k01463k76853
5463F050170j40032j84356j76738j32300r2595j13244j47006r1588j38708q9379
5453D744224j44618J4769j4769k4112m0351j12291K1120k006o9317r3359L0613
5442D309903p4455J1432k6897j27891M7871m0497P170k4744j10205N9358q2866
5431C948179k8509Q0171j8603Q1930M9203n3393K0670n1480L218k4173n7029R4847
5419D045031L263o1910R919M759l7061L1600M4900o6808P2920J4409N39K1461
5407D083022L4032R1116N0370L2444L5021R407J8286R2173Q1721K6933O1466J58887
5395D774878J03785J58679L6852O401O4355J81446J49360J20801J37768L767J10731
$$ plain form
5384 5848823 5912381 5932045 5909567 5835445 5808129 5756702 5690522 5647190 5597408 5595459 5549827 5572744
5372 5572744 5627045 5634876 5562578 5596954 5721225 5751699 5946948 6059053 6165161 6405563 6496756
5361 6496756 6586873 6700663 6902205 7015455 7013357 6982090 6955304 6843679 6704481 6662523 6604947
5350 6604947 6583441 6527681 6379046 6393082 6411005 6349566 6358105 6290987 6341230 6430912 6417687
5339 6417687 6471997 6556275 6610213 6762076 6849701 6973731 6973099 6891152 6895050 6910513 6918744 6780252
5327 6780252 6776801 6755602 6769285 6724524 6648474 6688097 6769794 6911698 7004340 7111923 7213884
5316 7213884 7283612 7357758 7534358 7729866 7980957 8234997 8446779 8679782 8916672 9143718
5306 9143718 9322113 9421531 9631493 9810033 9928904 10169167 10412908 10615240 10839334 11119100
$$ packed form
5384E848823O3558J9664k2478p4122k7316n1427o6180m3332m9782j949m5632K2917
5372E572744N4301P831p2298L4376J24271L0474J95249J12105J06108K40402R1193
5361F496756R0117J13790K01542J13250k098l1267k6786j11625j39198m1958n7576
5350F604947k1506n5760j48635J4036J7923o1439Q539o7118N0243Q9682j3225
5339F417687N4310Q4278N3938J51863Q7625J24030o32q1947L898J5463Q231j38492
5327F780252l451k1199J3683m4761p6050L9623Q1697J41904R2642J07583J01961
5316G213884O9728P4146J76600J95508K51091K54040K11782K33003K36890K27046
5306I143718J78395R9418K09962J78540J18871K40263K43741K02332K24094K79766
$$ plain form
5296 11119100 11433825 11762157 12316957 12790775 13235615 13652584 14188897 14727611 15298835
5287 15298835 15823583 16218967 16637321 17086561 17469911 17885652 18300529 18768630 19295023
5278 19295023 19759408 20283396 20775093 21276429 21777728 22374328 22874780 23396315 23874653
5269 23874653 24333548 24798451 25285134 25689430 26127288 26578316 27087957 27485984 27788568
5260 27788568 28040200 28280357 28438986 28541869 28595052 28690485 28739644 28757073 28782427 28788261 28845051
5249 28845051 28723782 28688530 28676870 28581999 28391281 28194145 28071682 27853279 27617428 27367885
5239 27367885 27077351 26825558 26558502 26372595 26195088 25945423 25649860 25338792 24915139
5230 24915139 24418437 24022923 23485907 22908006 22427709 21940925 21509459 20957614 20297888
$$ packed form
5296A1119100L14725L28332N54800M73818M44840M16969N36313N38714N71224
5287A5298835N24748L95384M18354M49240L83350M15741M14877M68101N26393
5278A9295023M64385N23988M91697N01336N01299N96600N00452N21535M78338
5269B3874653M58895M64903M86683M04296M37858M51028N09641L98027L02584
5260B7788568K51632K40157J58629J02883N3183R5433M9159J7429K5354N834N6790
5249B8845051j21269l5252j1660r4871j90718j97136j22463k18403k35851k49543
5239B7367885k90534k51793k67056j85907j77507k49665k95563l11068m23653
5230B4915139m96702l95514n37016n77901m80297m86784m31466n51845o59726
$$ plain form
5221 20297888 19726711 19324889 18937810 18509271 18041596 17671870 17293098 16853999 16511436
5212 16511436 16289113 16145651 15820772 15503244 15190907 14979938 14794628 14453421 14117272
5203 14117272 13838975 13664338 13515396 13311807 13083891 12944500 12831023 12772802 12601589 12492563
5193 12492563 12417192 12353152 12349148 12401382 12522388 12510887 12532985 12564001 12536027 12703688 12793599
5182 12793599 12820470 12773078 12865233 12973147 13053610 13140463 13155191 13181114 13325891 13421862 13460733
5171 13460733 13515777 13563520 13584567 13466417 13528211 13539661 13596983 13540427 13497028 13421635 13418015
5160 13418015 13357663 13150546 13065867 12959068 12791524 12688893 12565950 12397293 12346915 12234488
5150 12234488 12068122 11913515 11812914 11735354 11618571 11605147 11518965 11339683 11243946 11176543
$$ packed form
5221B0297888n71177m01822l87079m28539m67675l69726l78772m39099l42563
5212A6511436k22323j43462l24879l17528l12337k10969j85310l41207l36149
5203A4117272k78297j74637j48942k03589k27916j39391j13477n8221j71213j09026
5193A2492563p5371o4040m004N2234J21006j1501K2098L1016k7974J67661Q9911
5182A2793599K6871m7392R2155J07914Q0463Q6853J4728K5923J44777R5971L8871
5171A3460733N5044M7743K1047j18150O1794J1450N7322n6556m3399p5393l620
5160A3418015o0352k07117q4679j06799j67544j02631j22943j68657n0378j12427
5150A2234488j66366j54607j00601p7560j16783j3424q6182j79282r5737o7403
$$ plain form
5140 11176543 11043096 10967958 10909790 10847048 10673261 10632040 10604245 10517085 10450955 10438976 10365431
5129 10365431 10332670 10378908 10382646 10312053 10272440 10330631 10236343 10276853 10173747 10037299 10048033
5118 10048033 10043898 10068671 10066766 10076898 10097394 10061975 10119689 10126389 10196964 10216344 10311705 10409080
5106 10409080 10399265 10430968 10454275 10563421 10691213 10844823 10959525 11110361 11284964 11463394
5096 11463394 11624471 11797501 12026160 12278806 12569550 12855537 13071129 13357683 13630366
5087 13630366 13843895 14169211 14409890 14602252 14662618 14681197 14766624 14798468 14776014 14698399
5077 14698399 14599781 14481307 14455742 14289155 14085234 13955393 13892395 13802333 13711123 13626949
5067 13626949 13594698 13560988 13543045 13540465 13526133 13571945 13643335 13678665 13641413 13770891 13880986
$$ packed form
5140A1176543j33447p5138n8168o2742j73787m1221k7795q7160o6130j1979p3545
5129A0365431l2761M6238L738p0593l9613N8191r4288M0510j03106j36448J0734
5118A0048033m135K4773j905J0132K0496l5419N7714O700P0575J9380R5361R7375
5106A0409080r815L1703K3307J09146J27792J53610J14702J50836J74603J78430
5096A1463394J61077J73030K28659K52646K90744K85987K15592K86554K72683
5087A3630366K13529L25316K40679J92362O0366J8579Q5427L1844k2454p7615
5077A4698399r8618j18474k5565j66587k03921j29841o2998r0062r1210q4174
5067A3626949l2251l3710j7943k580j4332M5812P1390L5330l7252J29478J10095
$$ plain form
5056 13880986 13947955 14117363 14324194 14440205 14590861 14757523 14886133 14988800 15230871 15427434
5046 15427434 15600398 15811749 16016322 16324183 16560463 16814188 17045421 17316066 17564934
5037 17564934 17855017 18149963 18413149 18698590 19111568 19501659 19784073 20171911 20652540
5028 20652540 21102394 21487018 22009461 22462551 23039071 23591228 24184776 24787610 25424066
5019 25424066 26228096 26962685 27723501 28496838 29391983 30358806 31266064 32369754 33538001
5010 33538001 34828116 36138768 37469901 38965528 40612945 42449661 44498397 46702469
5002 46702469 49160980 51805055 54738937 58051380 61794818 65984789 70708972 75860322
4994 75860322 81597038 87977479 95015527 102958045 111933350 122232757 133978552 147543650
$$ packed form
5056A3880986O6969J69408K06831J16011J50656J66662J28610J02667K42071J96563
5046A5427434J72964K11351K04573L07861K36280K53725K31233K70645K48868
5037A7564934K90083K94946K63186K85441M12978L90091K82414L87838M80629
5028B0652540M49854L84624N22443M53090N76520N52157N93548O02834O36456
5019B5424066Q04030P34589P60816P73337Q95145R66823R07258J103690J168247
5010C3538001J290115J310652J331133J495627J647417J836716K048736K204072
5002D6702469K458511K644075K933882L312443L743438M189971M724183N151350
4994G5860322N736716O380441P038048P942518Q975305J0299407J1745795J3565098
$$ plain form
4986 147543650 162697291 178845826 195197845 210355891 222658463 231070114 234762064
4979 234762064 233247698 226823039 216799802 204937463 192938268 181646351 171357956
4972 171357956 161723124 152711529 144203384 136161287 128574935 121611916 115609785 110381879
4964 110381879 105959375 102393604 99334992 96921058 95087685 93599018 92448101 91675516
4956 91675516 91268163 90976969 90777140 90618286 90402208 90400586 90448572 90528452 90856430 91480434
4946 91480434 92257318 93379567 94958986 96832588 99052877 101585597 104454617 107597453
4938 107597453 110866161 114189143 117528986 120903641 124323532 127814777 131432197 135383061
4930 135383061 139863224 144787856 150400976 156819400 164408912 173326747 184182054 197061498
$$ packed form
4986A47543650J5153641J6148535J6352019J5158046J2302572Q411651L691950
4979B34762064j514366o424659j0023237j1862339j1999195j1291917j0288395
4972A71357956r634832r011595q508145q042097p586352o963019o002131n227906
4964A10381879m422504l565771l058612k413934j833373j488667j150917p72585
4956I1675516m07353k91194j99829j58854k16078j622M7986P9880L27978O24004
4946I1480434P76884J122249J579419J873602K220289K532720K869020L142836
4938A07597453L268708L322982L339843L374655L419891L491245L617420L950864
4930A35383061M480163M924632N613120O418424P589512Q917835J0855307J2879444
$$ plain form
4922 197061498 212092227 229097399 247331058 265491795 281973906 295013989 303244957
4915 303244957 305932915 302882144 294955574 283776574 271179048 258937417 247964377
4908 247964377 238221433 229899146 222465200 216006508 210628809 206325326 203364129 201895042
4900 201895042 201986083 203162071 204775368 206105600 206443581 205221836 202121873 197013980
4892 197013980 190178511 182330887 174215687 166374449 158848266 151884539 145451225 139387770
4884 139387770 133626196 128146971 123058923 118325398 113901268 109833179 106024531 102301898
4876 102301898 98758296 95221842 91731884 88376976 85087138 81832793 78779318 75795664
4868 75795664 72888235 70157301 67621067 65295131 63041727 60937200 59042633 57273758
$$ packed form
4922A97061498J5030729J7005172J8233659J8160737J6482111J3040083Q230968
4915C03244957K687958l050771p926570j1179000j2597526j2241631j0973040
4908B47964377r742944q322287p433946o458692n377699m303483k961197j469087
4900B01895042R1041J175988J613297J330232L37981j221745l099963n107893
4892A97013980o835469p847624q115200p841238p526183o963727o433314o063455
4884A39387770n761574n479225n088048m733525m424130m068089l808648l722633
4876A02301898l543602l536454l489958l354908l289838l254345l053475k983654
4868G5795664k907429k730934k536234k325936k253404k104527j894567j768875
$$ plain form
4860 57273758 55723172 54307089 52932724 51710223 50531343 49416832 48276779 47274654
4852 47274654 46282361 45193857 44217316 43193783 42075506 40980187 40022832 39019334 38151664
4843 38151664 37352749 36630893 35903498 35200290 34626225 34165241 33679425 33225110 32778524
4834 32778524 32233592 31752867 31278909 30768359 30184487 29525033 28960398 28423983 27846816
4825 27846816 27397011 26946786 26492018 25993359 25680739 25317085 24973048 24714667 24469520
4816 24469520 24265503 24024591 23865714 23799058 23689071 23582741 23430936 23297293 23274047 23175626
4806 23175626 23049739 23026194 23010071 23032668 23011082 23041539 23090723 23192512 23390724 23489320 23565835
4795 23565835 23663505 23904489 24149031 24445544 24814346 25151685 25405514 25519587 25667122 25579504
$$ packed form
4860E7273758j550586j416083j374365j222501j178880j114511j140053j002125
4852D7274654r92293j088504r76541j023533j118277j095319r57355j003498q67670
4843C8151664p98915p21856p27395p03208n74065m60984m85816m54315m46586
4834C2778524n44932m80725m73958n10550n83872o59454n64635n36415n77167
4825B7846816m49805m50225m54768m98659l12620l63654l44037k58381k45147
4816B4469520k04017k40912j58877o6656j09987j06330j51805j33643k3246r8421
4806B3175626j25887k3545j6123K2597k1586L0457M9184J01789J98212R8596P6515
4795B3565835R7670K40984K44542K96513L68802L37339K53829J14073J47535q7618
$$ plain form
4785 25579504 25409976 25184884 24921743 24749564 24584711 24475885 24489998 24515414 24578660 24698125
4775 24698125 24824011 25189923 25574167 26024829 26730067 27604504 28567880 29634434 30744140
4766 30744140 31820036 32740411 33454114 33966080 34437989 34690824 34951762 35201353 35551541
4757 35551541 36027749 36390419 36655692 36852946 36813078 36627604 36261265 35793736 35332446 34981836
4747 34981836 34722165 34601487 34573066 34556239 34317219 33962304 33574778 33066241 32403635 31749131
4737 31749131 31270087 30807947 30386991 29953330 29474994 28793886 28020675 27036225 25895248
4728 25895248 24587434 23321520 22151779 21030501 20047670 19162496 18296626 17421861 16624083
4719 16624083 15939458 15251300 14720592 14242978 13754929 13251221 12880745 12661117 12403486
$$ packed form
4785B5579504j69528k25092k63141j72179j64853j08826J4113K5416O3246J19465
4775B4698125J25886L65912L84244M50662P05238Q74437R63376J066554J109706
4766C0744140J075896R20375P13703N11966M71909K52835K60938K49591L50188
4757C5551541M76208L62670K65273J97254l9868j85474l66339m67529m61290l50610
4747C4981836k59671j20678k8421j6827k39020l54915l87526n08537o62606o54504
4737C1749131m79044m62140m20956m33661m78336o81108p73211r84450j140977
4728B5895248j307814j265914j169741j121278r82831q85174q65870q74765p97778
4719A6624083o84625o88158n30708m77614m88049n03708l70476k19628k57631
$$ plain form
4710 12403486 12176131 11958631 11697048 11621603 11551558 11533650 11431798 11443715 11481636 11531715
4700 11531715 11571587 11694619 11908656 12030252 12064188 12180656 12328114 12344225 12267354 12205319
4690 12205319 12228303 12272890 12288017 12226589 12188613 12220573 12224891 12289588 12232377 12145282 12089266
4679 12089266 12012405 11851749 11744155 11663045 11537583 11478083 11429412 11413871 11317922 11161384
4669 11161384 11044638 11026456 10918812 10794319 10625149 10409673 10112815 9904433 9681168 9453625
4659 9453625 9211041 9009728 8621114 8341345 8064264 7740472 7425699 7155273 6963566 6828839
4649 6828839 6666521 6499468 6265494 6108041 5966961 5784915 5685690 5578210 5408779 5336329
4639 5336329 5234429 5122497 5106780 5141761 5022084 4969060 4878733 4783196 4776133 4730531 4706012
$$ packed form
4710A2403486k27355k17500k61583p5445p0045j7908j01852J1917L7921N0079
4700A1531715L9872J23032K14037J21596L3936J16468J47458J6111p6871o2035
4690A2205319K2984M4587J5127o1428l7976L1960M318O4697n7211q7095n6016
4679A2089266p6861j60656j07594q1110j25462n9500m8671j5541r5949j56538
4669A1161384j16746j8182j07644j24493j69170k15476k96858k08382k23265k27543
4659I453625k42584k01313l88614k79769k77081l23792l14773k70426j91707j34727
4649F828839j62318j67053k33974j57453j41080j82046r9225j07480j69431p2450
4639E336329j01900j11932j5717L4981j19677n3024r0327r5537p063m5602k4519
$$ plain form
4628 4706012 4689581 4610792 4562541 4584437 4451082 4385292 4375545 4306317 4232215 4215472 4194918
4617 4194918 4174932 4190919 4146076 4125313 4158730 4156590 4212208 4223280 4288569 4238885 4273070 4439721
4605 4439721 4468807 4542027 4541366 4624198 4754374 4706220 4752580 4740024 4702220 4691788 4704385 4618400
4593 4618400 4563825 4535238 4499361 4529281 4527993 4455804 4484518 4510619 4481515 4456548 4384950 4367325
4581 4367325 4321079 4252842 4173762 4098093 4120705 4128223 4073207 4090285 4077920 4075189 4084591 4056845
4569 4056845 3994423 3946248 4012214 3926850 3893780 3878566 3964002 3884588 3896837 3915187 3919146 3888652
4557 3888652 3892984 3872654 3737162 3705402 3697408 3647695 3596736 3607221 3572006 3526296 3497869 3526143
4545 3526143 3463847 3400344 3276570 3260170 3238190 3170397 3115845 3123404 3137753 3090760 3128277
$$ packed form
4628D706012j6431p8789m8251K1896j33355o5790r747o9228p4102j6743k0554
4617D194918j9986J5987m4843k0763L3417k140N5618J1072O5289m9684L4185J66651
4605D439721K9086P3220o61Q2832J30176m8154M6360j2556l7804j0432J2597q5985
4593D618400n4575k8587l5877K9920j288p2189K8714K6101k9104k4967p1598j7625
4581D367325m6246o8237p9080p5669K2612P518n5016J7078j2365k731R402k7746
4569D056845o2422m8175O5966q5364l3070j5214Q5436p9414J2249J8350L959l0494
4557C888652M332k0330j35492l1760p994m9713n0959J0485l5215m5710k8427K8274
4545C526143o2296o3503j23774j6400k1980o7793n4552P559J4349m6993L7517
$$ plain form
4534 3128277 3126282 3143277 3157458 3232273 3220951 3157554 3271836 3255430 3261464 3313768 3249046 3138921
4522 3138921 3118285 3059528 2964239 2932200 2853805 2766771 2725534 2657701 2541824 2470826 2490708
4511 2490708 2452303 2412197 2356948 2345570 2360297 2359176 2394567 2341324 2304111 2281608 2306375 2236843
4499 2236843 2174246 2170284 2101083 2097057 2157741 2119009 2121576 2116691 2199749 2186971 2176579 2254236
4487 2254236 2178573 2167439 2123673 2193657 2248529 2347353 2333334 2331135 2328977 2347740 2311871 2342119
4475 2342119 2376769 2295653 2262262 2293365 2264634 2272322 2293554 2397236 2409310 2337296 2327954 2361158
4463 2361158 2320529 2309084 2302396 2326810 2384318 2366626 2357361 2398072 2447809 2452995 2447291 2479654
4451 2479654 2465525 2426568 2560989 2559741 2520057 2640660 2654206 2624152 2640431 2766883 2983966
$$ packed form
4534C128277j995J6995J4181P4815j1322o3397J14282j6406O034N2304o4722j10125
4522C138921k0636n8757r5289l2039p8395q7034m1237o7833j15877p0998J9882
4511B490708l8405m0106n5249j1378J4727j121L5391n3243l7213k2503K4767o9532
4499B236843o2597l962o9201m026O0684l8732K567m885Q3058j2778j0392P7657
4487B254236p5663j1134m3766O9984N4872R8824j4019k199k158J8763l5869L0248
4475B342119L4650q1116l3391L1103k8731P688K1232J03682J2074p2014r342L3204
4463B361158m0629j1445o688K4414N7508j7692r265M0711M9737N186n704L2363
4451B479654j4129l8957J34421j248l9684J20603J3546l0054J6279J26452K17083
$$ plain form
4440 2983966 3026994 3059994 3161400 3265994 3389374 3468058 3545659 3759350 4018820 4212190
4430 4212190 4509690 4887697 5230575 5512532 5824347 6263891 6726057 7432404 8105745 8874249
4420 8874249 9753159 10827712 11790175 12531671 13068649 13422950 13406808 13107506 12500546 11802411
4410 11802411 11066118 10414378 9936149 9523617 9127439 8731836 8293026 7963191 7574289
4401 7574289 7235274 7147767 6874592 6749420 6612835 6644802 6685373 6654796 6679052 6842767
4391 6842767 6968304 7122750 7271218 7363733 7565580 7610549 7742569 7723302 7633174 7601268
4381 7601268 7651949 7747464 7776664 7836555 7859592 7800413 7716922 7679628 7502793 7228058 6962491
4370 6962491 6735523 6555636 6315659 6061637 5758549 5537601 5365476 5142524 5026444 4781695
$$ packed form
4440B983966M3028L3000J01406J04594J23380P8684P7601K13691K59470J93370
4430D212190K97500L78007L42878K81957L11815M39544M62166P06347O73341P68504
4420H874249Q78910J074553R62463P41496N36978L54301j6142k99302o06960o98135
4410A1802411p36293o51740m78229m12532l96178l95603m38810l29835l88902
4401G574289l39015q7507k73175j25172j36585L1967M0571l0577K4256J63715
4391F842767J25537J54446J48468R2515K01847M4969J32020j9267r0128l1906
4381G601268N0681R5515K9200N9891K3037n9179q3491l7294j76835k74735k65567
4370F962491k26968j79887k39977k54022l03088k20948j72125k22952j16080k44749
$$ plain form
4360 4781695 4607335 4511121 4362673 4209805 4103962 3978719 3794500 3613264 3512029 3490634
4350 3490634 3421590 3384847 3246243 3162212 3106137 3026809 2948215 2974597 3008963 2960032 2946476
4339 2946476 2956108 3042707 2972434 2925923 2892690 2808039 2774401 2801312 2693180 2595123 2600767 2580171
4327 2580171 2480309 2397263 2318156 2260603 2194526 2209382 2195317 2128034 2165827 2054101 1953294
4316 1953294 1954410 1927475 1929632 1940560 1951527 2013633 2009914 1945103 2032667 2022768 1888357 1848852
4304 1848852 1773707 1775581 1755752 1647622 1614268 1633134 1575124 1529782 1559521 1523419 1530284 1568413
4292 1568413 1490306 1448028 1487997 1448905 1441656 1478969 1430077 1383041 1394373 1329244 1301882 1313727
4280 1313727 1329929 1399339 1411204 1379842 1411884 1356610 1347219 1347098 1294497 1341252 1265162 1175803
$$ packed form
4360D781695j74360r6214j48448j52868j05843j25243j84219j81236j01235k1395
4350C490634o9044l6743j38604q4031n6075p9328p8594K6382L4366m8931j3556
4339B946476R632Q6599p0273m6511l3233q4651l3638K6911j08132r8057N644k0596
4327B580171r9862q3046p9107n7553o6077J4856j4065o7283L7793j11726j00807
4316A953294J116k6935K157J0928J0967O2106l719o4811Q7564r899j34411l9505
4304A848852p5145J874j9829j08130l3354J8866n8010m5342K9739l6102O865L8129
4292A568413p8107m2278L9969l9092p249L7313m8892m7036J1332o5129k7362J1845
4280A313727J6202O9410J1865l1362L2042n5274r391j21n2601M6755p6090q9359
$$ plain form
4268 1175803 1199669 1133249 1059431 986308 951652 948686 1076042 1040499 954170 869540 894170
4257 894170 841847 866137 921449 899743 885824 825603 808844 708390 817465 792942 724040
4246 724040 645974 676627 704805 676586 628369 587927 584571 593396 622852 709634 636106 622659
4234 622659 662581 627905 531172 566504 624733 576225 683411 640953 676436 746627 649340
4223 649340 665505 680153 649182 591033 638475 710924 659209 623454 610402 569349 546692 508097
4211 508097 587530 673283 721113 712065 649316 618408 680389 635837 606402 616941 634942 732065
4199 732065 718952 748558 739165 637919 682878 686139 612124 602889 628637 632198 684906 695152
4187 695152 718453 717071 701388 701078 710050 663204 629385 644008 586529 632097 636729 684195 670569
$$ packed form
4268A175803K3866o6420p3818p3123l4656k966J27356l5543q6329q4630K4630
4257H94170n2323K4290N5312k1706j3919o0221j6759j00454J09075k4523o8902
4246G24040p8066L0653K8178k8219m8217m0442l356Q825K9456Q6782p3528j3447
4234F22659L9922l4676r6733L5332N8229m8508J07186m2458L5483P0191r7287
4223F49340J6165J4648l0971n8149M7442P2449n1715l5755j3052m1053k2657l8595
4211E08097P9433Q5753M7830r048o2749l0908O1981m4552k9435J0539J8001R7123
4199G32065j3113K9606r393j01246M4959L261p4015r235K5748L561N2708J0246
4187F95152K3301j382j5683l10Q972m6846l3819J4623n7479M5568M632M7466j3626
$$ plain form
4174 670569 548104 555593 573100 624438 607529 495830 583735 586028 594589 584295 566545 533835
4162 533835 431537 463743 564259 511115 456732 476237 563649 500950 471690 379137 407903
4151 407903 452951 468000 467514 502443 531341 427727 448732 454699 418868 500742 544847 525101
4139 525101 547053 545961 527154 434939 487724 425259 378267 423340 480270 460183 481448 455302
4127 455302 436637 494588 456637 475003 439759 437109 482915 491625 526404 554449 561528 475262
4115 475262 513016 552196 490244 474304 533123 547707 514023 491819 422212 488676 486136 486803
4103 486803 429118 432029 451121 431344 410271 446314 480753 452031 440767 447964 456807 478032
4091 478032 431604 398791 465926 454110 465107 467757 491354 517343 389748 440185 449736 363051
$$ packed form
4174F70569j22465P489J7507N1338j6909j11699Q7905K293Q561j0294j7750l2710
4162E33835j02298L2206J00516n3144n4383J9505Q7412o2699k9260r2553K8766
4151D07903M5048J5049m86L4929K8898j03614K1005N967l5831Q1874M4105j9746
4139E25101K1952j092j8807r2215N2785o2465m6992M5073N6930k0087K1265k6146
4127D55302j8665N7951l7951J8366l5244k650M5806Q710L4779K8045P079q6266
4115D75262L7754L9180o1952j5940N8819J4584l3684k2204o9607O6464k540O67
4103D86803n7685K911J9092j9777k1073L6043L4439k8722j1264P197Q843K1225
4091D78032m6428l2813O7135j1816J0997K650K3597K5989j27595N0437R551q6685
$$ plain form
4079 363051 438024 449824 477870 451790 388150 462744 483492 455402 454367 493841 518594 423565
4067 423565 332098 388404 449445 426026 441888 543302 567980 461046 463886 394590 338962
4056 338962 363354 460268 416664 450997 530828 467149 471909 542716 536612 533522 497772 492849
4044 492849 532425 554428 570905 417468 412055 479661 433155 515373 526977 568270 550562 533436
4032 533436 503356 491250 463578 434063 484604 461002 459047 513150 536749 526251 489494 438555
4020 438555 450524 446331 468572 474809 452055 525371 541329 492872 429621 432958 496621 464044
4008 464044 506989 516698 497307 517642 579821 524760 527838 560879 529926 448622 418770 509474
3996 509474 597857 554852 524736 507446 493187 512377 501574 514569 520445 598400 547082 464763
$$ packed form
4079C63051P4973J1800K8046k6080o3640P4594K0748k8090j035L9474K4753r5029
4067D23565r1467N6306O1041k3419J5862J01414K4678j06934K840o9296n5628
4056C38962K4392R6914m3604L4333P9831o3679M760P0807o104l090l5750m923
4044D92849L9576K2003J6477j53437n413O7606m6506Q2218J1604M1293j7708j7126
4032E33436l0080j2106k7672k9515N0541k3602j955N4103K3599j0498l6757n0939
4020D38555J1969m193K2241O237k2754P3316J5958m8457o3251L337O3663l2577
4008D64044M2945R709j9391K0335O2179n5061L078L3041l0953q1304k9852R0704
3996E09474Q8383m3005l0116j7290j4259J9190j0803J2995N876P7955n1318q2319
$$ plain form
3984 464763 494347 548337 600341 553200 471719 496353 568508 585941 654695 674254 647263 635221
3972 635221 656067 593770 571845 602075 633311 578066 458826 481604 489460 538014 523054 550126
3960 550126 628195 608725 557404 597463 631020 619655 584852 613495 655376 614433 630014 621498
3948 621498 637420 607626 664576 660403 664494 756670 768040 700930 686770 630623 559948 631968
3936 631968 647631 670724 634319 625361 669116 730635 771101 742847 742049 695290 668544 733280
3924 733280 778234 737833 671476 746864 700401 710248 803787 811428 746938 704895 765906 808397
3912 808397 831816 885896 909564 825883 813592 883319 932572 892552 880503 920763 978200 1096128
3900 1096128 1078798 1030394 958895 950259 997821 1012947 1081333 1050221 1026876 1028428 1027470 1002770
$$ packed form
3984D64763K9584N3990N2004m7141q1481K4634P2155J7433O8754J9559k6991j2042
3972F35221K0846o2297k1925L0230L1236n5245j19240K2778P856M8554j4960K7072
3960E50126P8069j9470n1321M0059L3557j1365l4803K8643M1881m0943J5581q516
3948F21498J5922k9794N6950m173M091R2176J1370o7110j4160n6147p0675P2020
3936F31968J5663K3093l6405q958M3755O1519M0466k8254p98m6759k6746O4736
3924G33280M4954m0401o6357P5388m6463R847R3539P641o4490m2043O1011M2491
3912H08397K3419N4080K3668q3681j2291O9727M9253m0020j2049M0260N7437J17928
3900A096128j7330m8404p1499q636M7562J5126O8386l1112k3345J552r58k4700
$$ plain form
3888 1002770 1014027 1068987 1111457 1148168 1160204 1157826 1142914 1126940 1195871 1167616 1175292 1243482
3876 1243482 1298594 1304879 1335560 1358318 1265212 1290639 1334793 1354439 1319858 1321427 1283618 1275865
3864 1275865 1382515 1393925 1404039 1393012 1313633 1360431 1475171 1538948 1580069 1574329 1463670
3853 1463670 1525423 1558991 1588217 1576724 1606429 1625111 1617962 1606630 1657167 1684683 1634741 1654072
3841 1654072 1679880 1768431 1729058 1717305 1673138 1762588 1823257 1874227 1848599 1827012 1865938
3830 1865938 1856191 1953046 1969847 1893359 1843493 1761996 1804500 1721650 1758581 1812215 1743434 1711155
3818 1711155 1736943 1782830 1740198 1799736 1814714 1702327 1711324 1731774 1704128 1692953 1661395
3807 1661395 1639170 1731465 1685230 1607724 1637289 1724287 1655973 1571911 1567763 1523406 1570607 1541632
$$ packed form
3888A002770J1257N4960M2470L6711J2036k378j4912j5974O8931k8255P676O8190
3876A243482N5112O285L0681K2758r3106K5427M4154J9646l4581J569l7809p753
3864A275865J06650J1410J0114j1027p9379M6798J14740O3777M1121n740j10659
3853A463670O1753L3568K9226j1493K9705J8682p149j1332N0537K7516m9942J9331
3841A654072K5808Q8551l9373j1753m4167Q9450O0669N0970k5628k1587L8926
3830A865938r747R6855J6801p6488m9866q1497M2504q2850L6931N3634o8781l2279
3818A711155K5788M5887m2632N9538J4978j12387Q997K0450k7646j1175l1558
3807A661395k2225R2295m6235p7506K9565Q6998o8314q4062m148m4357M7201k8975
$$ plain form
3795 1541632 1602131 1604088 1589418 1517560 1460375 1507891 1496656 1488799 1524819 1449590 1431908 1493524
3783 1493524 1517364 1500093 1447041 1483510 1555142 1460176 1519916 1453377 1401346 1377172 1448166
3772 1448166 1423427 1461475 1427404 1470401 1540089 1461798 1436742 1467223 1416736 1342895 1425822
3761 1425822 1469984 1499330 1500324 1512760 1497159 1448592 1423141 1464461 1438489 1463908 1436291 1507586
3749 1507586 1528140 1537709 1534310 1541076 1595839 1526866 1516745 1555369 1609908 1635155 1508784 1515876
3737 1515876 1583663 1528387 1572348 1626535 1635897 1681282 1572771 1526895 1540720 1590281 1622609
3726 1622609 1576641 1582996 1642163 1636480 1632926 1638031 1602103 1563277 1643601 1629128 1610633 1573553
3714 1573553 1540896 1565627 1634288 1587172 1593563 1679852 1707888 1627000 1663302 1758093 1727407 1701828
$$ packed form
3795A541632O0499J957j4670p1858n7185M7516j1235p857L6020p5229j7682O1616
3783A493524K3840j7271n3052L6469P1632r4966N9740o6539n2031k4174P0994
3772A448166k4739L8048l4071M2997O9688p8291k5056L0481n0487p3841Q2927
3761A425822M4162K9346R94J2436j5601m8567k5451M1320k5972K5419k7617P1295
3749A507586K0554R569l399O766N4763o8973j0121L8624N4539K5247j26371P092
3737A515876O7787n5276M3961N4187R362M5385j08511m5876J3825M9561L2328
3726A622609m5968O355N9167n683l554N105l5928l8826Q0324j4473j8495l7080
3714A573553l2657K4731O8661m7116O391Q6289K8036q0888L6302R4791l0686k5579
$$ plain form
3702 1701828 1660653 1675103 1677301 1711314 1719695 1638954 1678808 1786854 1729910 1808822 1772153 1748907
3690 1748907 1707714 1711075 1672253 1566710 1610902 1659158 1630775 1660537 1702254 1657745 1645893
3679 1645893 1645160 1585585 1620349 1686473 1662576 1613569 1697595 1687071 1661156 1682538 1566725 1561904
3667 1561904 1641960 1611835 1586640 1624919 1666714 1680723 1762305 1779144 1718458 1643357 1660611
3656 1660611 1721821 1649348 1662548 1702094 1693665 1697909 1713029 1659203 1680840 1738921 1732007 1766353
3644 1766353 1731722 1733727 1796454 1752431 1769406 1771695 1849564 1864939 1822985 1850123 1899776 1887940
3632 1887940 1842349 1806957 1821837 1825748 1891992 1895058 1914342 1887972 1883263 1907675 1918409 1902686
3620 1902686 1850267 1840001 1893761 1905522 2010919 2029494 1970638 1976217 1997117 2077528 2102477
$$ packed form
3702A701828m1175J4450K198L4013Q381q0741L9854J08046n6944P8912l6669k3246
3690A748907m1193L361l8822j05543M4192M8256k8383K9762M1717m4509j1852
3679A645893p33n9575L4764O6124k3897m9007Q4026j0524k5915K1382j15813m821
3667A561904Q0056l0125k5195L8279M1795J4009Q1582J6839o0686p5101J7254
3656A660611O1210p2473J3200L9546q429M244J5120n3826K1637N8081o914L4346
3644A766353l4631K005O2727m4023J6975K289P7869J5375m1954K7138M9653j1836
3632A887940m5591l5392J4880L911O6244L066J9284k6370m709K4412J0734j5723
3620A902686n2419j0266N3760J1761J05397J8575n8856N579K0900Q0411K4949
$$ plain form
3609 2102477 2086279 2071357 2047657 2033955 2100953 2098479 2126568 2102261 2084464 2090033 2090881 2087816
3597 2087816 2127102 2161011 2230299 2214878 2147827 2178457 2143045 2155890 2170691 2202677 2291327
3586 2291327 2262416 2315873 2311520 2354980 2350711 2307217 2368390 2412936 2408092 2480768 2477209 2482944
3574 2482944 2509036 2517688 2536788 2610190 2635979 2652698 2670631 2694254 2665349 2674960 2722625 2751777
3562 2751777 2788649 2867387 2864092 2874169 2921903 2945202 3002413 3033561 3063732 3083406 3148242 3227020
3550 3227020 3246039 3210026 3191359 3189147 3328514 3511544 3545959 3488095 3493316 3511776 3510900 3603222
3538 3603222 3678551 3724329 3821950 3857642 3960075 4004393 4072298 4109697 4204674 4301524 4384040
3527 4384040 4361737 4463048 4591353 4735399 4807119 4820714 4914066 4937861 5048119 5049560 5146306
$$ packed form
3609B102477j6198j4922k3700j3702O6998k474K8089k4307j7797N569Q48l065
3597B087816L9286L3909O9288j5421o7051L0630l5412J2845J4801L1986Q8650
3586B291327k8911N3457m353M3460m269m3494O1173M4546m844P2676l559N735
3574B482944K6092Q652J9100P3402K5789J6719J7933K3623k8905R611M7665K9152
3562B751777L6872P8738l295J0077M7734K3299N7211L1148L0171J9674O4836P8778
3550C227020J9019l6013j8667k212J39367J83030L4415n7864N221J8460q76R2322
3538C603222P5329M5778R7621L5692J02433M4318O7905L7399R4977R6850Q2516
3527D384040k2303J01311J28305J44046P1720J3595R3352K3795J10258J441R6746
$$ plain form
3516 5146306 5295700 5403049 5441995 5502752 5542551 5631892 5715138 5825363 5956258 5983307 6090096
3505 6090096 6155556 6334964 6434406 6536506 6653807 6803740 6922000 7024514 7100048 7190632
3495 7190632 7382824 7510279 7645531 7745407 7797678 7974284 8189296 8348930 8513834 8645649
3485 8645649 8795516 9015628 9268666 9466837 9600055 9864065 10123934 10315777 10537543 10855413
3475 10855413 11220436 11549844 11883957 12258756 12727191 13208615 13604506 14089628 14634251
3466 14634251 15223045 15875820 16625047 17380990 18157326 18943507 19812116 20780825 21777882
3457 21777882 22818395 23825500 24858783 25973035 26977550 27827225 28641318 29134487 29505737
3448 29505737 29757334 29751432 29459261 29064883 28477075 27858439 27169456 26337757 25567945 24845099
$$ packed form
3516E146306J49394J07349L8946O0757L9799Q9341Q3246J10225J30895K7049J06789
3505F090096O5460J79408R9442J02100J17301J49933J18260J02514P5534R0584
3495G190632J92192J27455J35252R9876N2271J76606K15012J59634J64904J31815
3485H645649J49867K20112K53038J98171J33218K64010K59869J91843K21766L17870
3475A0855413L65023L29408L34113L74799M68435M81424L95891M85122N44623
3466A4634251N88794O52775P49227P55943P76336P86181Q68609R68709R97057
3457B1777882J040513J007105J033283J114252J004515Q49675Q14093M93169L71250
3448B9505737K51597n902k92171l94378n87808o18636o88983q31699p69812p22846
$$ plain form
3438 24845099 23967849 23273576 22552682 21881735 21268855 20668927 20031436 19334369 18771017
3429 18771017 18289019 17843639 17370793 16958650 16579520 16142084 15682257 15232691 14841543
3420 14841543 14548471 14100557 13755523 13412956 13077191 12710600 12357768 11964828 11694948
3411 11694948 11451604 11187722 10894178 10629641 10425729 10093878 9892688 9720295 9465162
3402 9465162 9238494 9092597 8973112 8750981 8505040 8384467 8209418 8050954 7901284 7772735
3392 7772735 7586276 7420847 7315030 7210434 7121794 6948767 6901305 6780753 6633035 6532710
3382 6532710 6402563 6366382 6349485 6217365 6123229 6130216 6029833 5972404 5947701 5898847 5855116
3371 5855116 5914950 5834729 5723219 5602937 5586338 5537349 5408760 5388552 5391193 5230210 5229733
$$ packed form
3438B4845099q77250o94273p20894o70947o12880n99928o37491o97067n63352
3429A8771017m81998m45380m72846m12143l79130m37436m59827m49566l91148
3420A4841543k93072m47914l45034l42567l35765l66591l52832l92940k69880
3411A1694948k43344k63882k93544k64537k03912l31851k01190j72393k55133
3402I465162k26668j45897j19485k22131k45941j20573j75049j58464j49670j28549
3392G772735j86459j65429j05817j04596q8640j73027m7462j20552j47718j00325
3382F532710j30147l6181j6897j32120r4136O987j00383n7429k4703m8854m3731
3371E855116N9834q0221j11510j20282j6599m8989j28589k0208K641j60983m77
$$ plain form
3360 5229733 5231520 5188988 5230021 5102585 5092778 5012348 4992724 4911865 4911356 4997019 4916306 4772172
3348 4772172 4658887 4693861 4734678 4706893 4652995 4499268 4468501 4443658 4384484 4356096 4387676
3337 4387676 4340521 4262611 4231228 4130141 4149305 4226829 4164837 4004180 4059650 4048171 4048641
3326 4048641 4154055 4109749 4105359 4108759 4031644 3981515 3966747 3930067 3916342 3896724 3934194 3950605
3314 3950605 4040483 3980050 3959780 3897030 3864224 3873462 3888976 3861365 3742916 3750355 3836942 3811702
3302 3811702 3848345 3874296 3839774 3758167 3744651 3818675 3781607 3772800 3765819 3779501 3709164 3777710
3290 3777710 3812243 3812153 3857158 3793946 3790247 3819483 3822759 3867748 3789517 3737563 3790743 3831698
3278 3831698 3770416 3796817 3868216 3907568 3957266 4014852 3962936 3874927 3823587 3883596 3965603
$$ packed form
3360E229733J787m2532M1033j27436r807q0430j9624q0859n09Q5663q0713j44134
3348D772172j13285L4974M0817k7785n3898j53727l0767k4843n9174k8388L1580
3337D387676m7155p7910l1383j01087J9164P7524o1992j60657N5470j1479M70
3326D048641J05414m4306m390L400p7115n0129j4768l6680j3725j9618L7470J6411
3314C950605Q9878o0433k0270o2750l2806R238J5514k7611j18449P439Q6587k5240
3302C811702L6643K5951l4522q1607j3516P4024l7068q807o981J3682p0337O8546
3290C777710L4533r0M5005o3212l699K9236L276M4989p8231n1954N3180M0955
3278C831698o1282K6401P1399L9352M9698N7586n1916q8009n1340O0009Q2007
$$ plain form
3267 3965603 4092429 4108667 4230268 4333544 4302047 4316647 4415490 4508353 4562693 4571597 4671066
3256 4671066 4708745 4763651 4878876 4964947 5109594 5137648 5249220 5461373 5614870 5674106
3246 5674106 5853261 5995320 6140475 6310668 6549998 6749137 6989431 7225553 7524195 7804341
3236 7804341 8032252 8264141 8586831 8875830 9207069 9652352 9959922 10396234 10927284 11393674
3226 11393674 11985204 12497556 13101344 13842784 14580065 15356116 16278499 17201731 18175263
3217 18175263 19165916 20280105 21530940 22755432 23963392 25026952 26139154 27037988
3209 27037988 27929820 28634288 29209111 29587741 29963211 30226961 30423858 30561392 30666849
3200 30666849 30783196 30728460 30707475 30602891 30479318 30432022 30495778 30467969 30589523 30856873
$$ packed form
3267C965603J26826J6238J21601J03276l1497J4600R8843R2863N4340Q904R9469
3256D671066L7679N4906J15225Q6071J44647K8054J11572K12153J53497N9236
3246E674106J79155J42059J45155J70193K39330J99139K40294K36122K98642K80146
3236G804341K27911K31889L22690K88999L31239M45283L07570M36312N31050M66390
3226A1393674N91530N12352O03788P41440P37281P76051R22383R23232R73532
3217A8175263R90653J114189J250835J224492J207960J063560J112202Q98834
3209B7037988Q91832P04468N74823L78630L75470K63750J96897J37534J05457
3200C0666849J16347n4736k0985j04584j23573m7296O3756k7809J21554K67350
$$ plain form
3190 30856873 31276996 31863140 32563488 33511608 34463480 35492908 36800871 38307136 39978623
3181 39978623 41799785 43811979 45803410 48081474 50289987 52451684 54477299 56089826
3173 56089826 57343052 58075154 58398079 58293376 57813930 57099670 56323613 55523902 54539340
3164 54539340 53379930 52115139 50705034 49160089 47381682 45559978 43775718 42231130
3156 42231130 40845538 39605546 38656735 37874300 37229139 36794735 36530891 36379994 36359448
3147 36359448 36566857 36903703 37450297 38103123 38908091 39616788 40338669 40988439 41475607
3138 41475607 41839122 41894126 41772340 41449677 40879581 40234797 39500334 38646984 37742968 36736685
3128 36736685 35680381 34634818 33331968 31984606 30678235 29282179 28001859 26901564
$$ packed form
3190C0856873M20123N86144P00348R48120R51872J029428J307963J506265J671487
3181C9978623J821162K012194J991431K278064K208513K161697K025615J612527
3173E6089826J253226P32102L22925j04703m79446p14260p76057p99711r84562
3164E4539340j159410j264791j410105j544945j778407j821704j784260j544588
3156D2231130j385592j239992r48811p82435o45161m34404k63844j50897k0546
3147C6359448K07409L36846N46594O52826Q04968P08697P21881O49770M87168
3138D1475607L63515N5004j21786l22663n70096o44784p34463q53350r04016j006283
3128C6736685j056304j045563j302850j347362j306371j396056j280320j100295
$$ plain form
3120 26901564 25865037 24784546 23857019 23040216 22352970 21648852 21033583 20570345 20117752
3111 20117752 19666441 19265393 18902375 18561097 18174051 17782195 17436370 17111953 16803542
3102 16803542 16557283 16296187 15948359 15623989 15336835 15092156 14947668 14723076 14449787
3093 14449787 14268630 14248510 14125031 13950507 13762258 13682775 13566796 13453805 13427062 13362217
3083 13362217 13290504 13199228 13081619 12894378 12686715 12541455 12435832 12261838 12106888 11987179
3073 11987179 11811995 11620451 11339088 11246164 11086759 10856130 10683939 10505973 10388885 10261114
3063 10261114 10107970 9887532 9873258 9792361 9535378 9363882 9201358 9003588 8827702 8606252
3053 8606252 8423153 8344706 8068930 7786767 7636642 7441541 7244495 7002586 6909408 6671401
$$ packed form
3120B6901564j036527j080491r27527q16803o87246p04118o15269m63238m52593
3111B0117752m51311m01048l63018l41278l87046l91856l45825l24417l08411
3102A6803542k46259k61096l47828l24370k87154k44679j44488k24592k73289
3093A4449787j81157k0120j23479j74524j88249p9483j15979j12991k6743o4845
3083A3362217p1713r1276j17609j87241k07663j45260j05623j73994j54950j19709
3073A1987179j75184j91544k81363r2924j59405k30629j72191j77966j17088j27771
3063A0261114j53144k20438j4274q0897k56983j71496j62524j97770j75886k21450
3053H606252j83099p8447k75776k82163j50125j95101j97046k41909r3178k38007
$$ plain form
3043 6671401 6440351 6416328 6232493 6114066 5955612 5821414 5572733 5405889 5375329 5275676
3033 5275676 5303857 5144005 4977481 4902942 4789783 4661967 4522566 4411746 4452065 4354475
3023 4354475 4180549 4109444 4078045 4025076 3978844 3915512 3919635 3826077 3661043 3544061 3461037
3012 3461037 3350687 3339275 3320138 3308154 3261005 3202743 3194267 3159104 3077721 3008438 2931084
3001 2931084 2939833 2919910 2844989 2800615 2716407 2711770 2639119 2593524 2597575 2589065 2521579 2489713
2989 2489713 2426711 2427574 2407067 2340240 2324322 2208186 2193252 2148560 2151506 2215477 2213202 2177350
2977 2177350 2044965 1981588 2001928 2025188 2015302 1979509 1992308 1939213 1920603 1830347 1859112
2966 1859112 1923719 1876987 1880702 1839959 1797672 1768171 1806369 1852222 1774038 1786331 1852764 1793579
$$ packed form
3043F671401k31050k4023j83835j18427j58454j34198k48681j66844l0560r9653
3033E275676K8181j59852j66524p4539j13159j27816j39401j10820M0319r7590
3023D354475j73926p1105l1399n2969m6232o3332M123r3558j65034j16982q3024
3012C461037j10350j1412j9137j1984m7149n8262q476l5163q1383o9283p7354
3001B931084Q749j9923p4921m4374q4208m637p2651m5595M051q510o7486l1866
2989B489713o3002Q63k0507o6827j5918j16136j4934m4692K946O3971k275l5852
2977B177350j32385o3377K0340K3260r886l5793J2799n3095j8610r0256K8765
2966A859112O4607m6732L715m0743m2287k9501L8198M5853p8184J2293O6433n9185
$$ plain form
2954 1793579 1804822 1746420 1708420 1645550 1636763 1684992 1695571 1673349 1724750 1725675 1651049 1641606
2942 1641606 1562332 1515581 1469947 1629609 1610512 1554945 1625273 1621944 1623784 1544244 1613374 1604391
2930 1604391 1568267 1564901 1618984 1579377 1612622 1635082 1618966 1647233 1691607 1687392 1656682 1693258
2918 1693258 1715623 1712945 1730120 1778133 1882929 1905994 1894568 1861122 1940534 2019671 2012375 1938621
2906 1938621 1953366 1978021 2061922 2160751 2195361 2301290 2365738 2384813 2385153 2486631 2589091
2895 2589091 2566099 2657890 2758635 2767916 2840249 2880178 3008520 3088476 3111867 3184304 3196255
2884 3196255 3301982 3509769 3601388 3639361 3722080 3820773 3955459 4094641 4218728 4379539
2874 4379539 4502731 4555605 4633325 4810927 5007281 5224005 5445510 5662101 5838062 6042554
$$ packed form
2954A793579J1243n8402l8000o2870q787M8229J0579k2222N1401R25p4626r443
2942A641606p9274m6751m5634J59662j9097n5567P0328l329J840p9540O9130q983
2930A604391l6124l366N4083l9607L3245K2460j6116K8267M4374m215l0710L6576
2918A693258K2365k678J7175M8013J04796K3065j1426l3446P9412P9137p296p3754
2906A938621J4745K4655Q3901R8829L4610J05929O4448J9075L40J01478J02460
2895B589091k2992R1791J00745R281P2333L9929J28342P9956K3391P2437J1951
2884C196255J05727K07787R1619L7973Q2719R8693J34686J39182J24087J60811
2874D379539J23192N2874P7720J77602J96354K16724K21505K16591J75961K04492
$$ plain form
2864 6042554 6239543 6519982 6788243 7086416 7423359 7688767 7939281 8312346 8690076 9043266
2854 9043266 9269890 9513478 9765156 9981534 10194707 10464178 10627858 10811647 11009992 11213122
2844 11213122 11441456 11709171 11982151 12357202 12697179 13023464 13410802 13766214 14231273
2835 14231273 14644757 15048763 15378714 15797982 16306190 16700236 17050914 17404653 17719912
2826 17719912 18067858 18489651 18862216 19097186 19472494 19842637 20026517 20323328 20573389
2817 20573389 20705014 20788250 20868746 20971255 21037602 21215211 21438980 21667475 21845314 22033599
2807 22033599 22169601 22432626 22684911 23051660 23489586 23927542 24442903 24882078 25289741
2798 25289741 25704711 26061125 26357512 26446842 26379931 26269330 26205552 26022459 25731910 25419986
$$ packed form
2864F042554J96989K80439K68261K98173L36943K65408K50514L73065L77730L53190
2854I043266K26624K43588K51678K16378K13173K69471J63680J83789J98345K03130
2844A1213122K28334K67715K72980L75051L39977L26285L87338L55412M65059
2835A4231273M13484M04006L29951M19268N08208L94046L50678L53739L15259
2826A7719912L47946M21793L72565K34970L75308L70143J83880K96811K50061
2817B0573389J31625Q3236Q0496J02509O6347J77609K23769K28495J77839J88285
2807B2033599J36002K63025K52285L66749M37926M37956N15361M39175M07663
2798B5289741M14970L56414K96387Q9330o6911j10601o3778j83093k90549l11924
$$ plain form
2788 25419986 25186910 25024079 24844057 24581077 24347924 24260416 23962273 23737311 23483571 23348397
2778 23348397 23144919 22924286 22780924 22566078 22438530 22280749 22107349 21878369 21677002
2769 21677002 21637331 21547669 21515072 21480296 21551709 21707688 21762022 21766607 21678614 21575255 21304217
2758 21304217 21005088 20621227 20075466 19537839 18974703 18354543 17777329 17186810 16664458
2749 16664458 16194407 15775895 15372820 14894792 14527094 14155460 13816968 13607507 13297015
2740 13297015 12991312 12747267 12494690 12157701 11811444 11459415 11096212 10865417 10613406
2731 10613406 10356938 10121477 9887044 9704972 9448669 9260865 9128927 8920043 8670881
2722 8670881 8456932 8210762 7909964 7605432 7356049 7106280 6815391 6609045 6336027 5946783
$$ packed form
2788B5419986k33076j62831j80022k62980k33153q7508k98143k24962k53740j35174
2778B3348397k03478k20633j43362k14846j27548j57781j73400k28980k01367
2769B1677002l9671q9662l2597l4776P1413J55979N4334M585q7993j03359k71038
2758B1304217k99129l83861n45761n37627n63136o20160n77214n90519n22352
2749A6664458m70051m18512m03075m78028l67698l71634l38492k09461l10492
2740A3297015l05703k44045k52577l36989l46257l52029l63203k30795k52011
2731A0613406k56468k35461k34433j82072k56303j87804j31938k08884k49162
2722H670881k13949k46170l00798l04532k49383k49769k90889k06346k73018l89244
$$ plain form
2712 5946783 5691666 5512146 5346081 5175166 4978032 4826048 4659724 4507400 4333643 4209284
2702 4209284 4101278 4069086 3916630 3782943 3524521 3348416 3322308 3253858 3068146 2940230
2692 2940230 2919454 2764387 2709854 2582023 2403892 2285566 2252842 2191792 2175044 2122007 2069269
2681 2069269 1960516 1865818 1862614 1869347 1841903 1785024 1763742 1711790 1729712 1617353 1635324
2670 1635324 1661153 1568250 1472033 1414535 1407408 1289922 1251442 1226038 1274307 1250606 1211390
2659 1211390 1185840 1136185 1183884 1148984 1090920 1050102 1060816 1036521 1088370 1150847 1031106
2648 1031106 970835 953115 971571 979132 1056710 953655 958897 964441 964321 931932 890073 795672
2636 795672 734222 779872 772107 719909 772768 822931 769724 779316 727110 702604 802230 768884
$$ packed form
2712E946783k55117j79520j66065j70915j97134j51984j66324j52324j73757j24359
2702D209284j08006l2192j52456j33687k58422j76105k6108o8450j85712j27916
2692B940230k0776j55067n4533j27831j78131j18326l2724o1050j6748n3037n2738
2681B069269j08753r4698l204O733k7444n6879k1282n1952J7922j12359J7971
2670A635324K5829r2903r6217n7498p127j17486l8480k5404M8269k3701l9216
2659A211390k5550m9655M7699l4900n8064m0818J0714k4295N1849O2477j19741
2648A031106o0271j7720J8456P561P7578j03055N242N544j20l2389m1859r4401
2636G95672o1450M5650p765n2198N2859N0163n3207R592n2206k4506R9626l3346
$$ plain form
2624 768884 692530 707033 687497 651298 631427 657074 553464 540466 506552 591900 570576
2613 570576 547444 548169 560705 556410 531170 508979 512600 502141 407976 419311 415780 420440 465142
2600 465142 416093 401105 436194 440141 447909 457005 424442 491728 465750 332058 339371 484219
2588 484219 487870 403849 381275 386434 373193 382910 374176 388928 407546 388400 372854 338463
2576 338463 337108 405324 357677 312323 380464 351692 364017 337964 308957 382100 421479 386743
2564 386743 327518 351866 378695 289293 253958 353066 432136 420860 355627 420704 433923 378164
2552 378164 410140 409258 435961 405967 340105 351618 400517 355597 371079 383349 321941 293068
2540 293068 431121 428056 307643 277510 316312 268526 221160 209292 264809 239498 259662
$$ packed form
2624G68884p6354J4503j9536l6199j9871K5647j03610j2998l3914Q5348k1324
2613E70576k3132P25J2536m295k5240k2191L621j0459r4165J1335l531M660M4702
2600D65142m9049j4988L5089L947P768R096l2563O7286k5978j33692P313J44848
2588D84219L651q4021k2574N159j3241R717q734J4752J8618j9146j5546l4391
2576C38463j355O8216m7647m5354O8141k8772J2325k6053k9007P3143L9379l4736
2564C86743n9225K4348K6829q9402l5335R9108P9070j1276o5233O5077J3219n5759
2552C78164L1976q82K6703k9994o5862J1513M8899m4920J5482J2270o1408k8873
2540B93068J38053l065j20413l0133L8802m7786m7366j1868N5517k5311K0164
$$ plain form
2529 259662 326966 351391 370502 289797 318550 350866 311027 273600 247057 229381 238027 221217
2517 221217 266359 333279 297119 290496 298915 264702 257873 211081 221401 223694 155889 170255
2505 170255 201445 246813 238371 151999 144342 131643 209189 290696 199049 125189 132778 187353
2493 187353 213587 178747 68378 1925 73346 132254 158934 223693 128569 197710 235608
2482 235608 185593 158871 144431 179643 193241 147102 76143 177656 142645 102109 146591
2471 146591 129889 59258 42280 116826 105637 114640 130437 70197 66295 5015 21450 78836
2459 78836 89138 48118 12800 15509 51444 31115 36493 105025 91027 131458 165729 136512
2447 136512 57553 60836 97569 149121 137519 124913 120176 85557 103491 98829 67595 73489
$$ packed form
2529B59662O7304K4425J9111q0705K8753L2316l9839l7427k6543j7676Q646j6810
2517B21217M5142O6920l6160o623Q419l4213o829m6792J0320K293o7805J4366
2505A70255L1190M5368q442q6372p657j2699P7546Q1507r1647p3860P589N4575
2493A87353K6234l4840j10369o6453P1421N8908K6680O4759r5124O9141L7898
2482B35608n0015k6722j4440L5212J3598m6139p0959J01513l5011m0536M4482
2471A46591j6702p0631j6978P4546j1189R003J5797o0240l902o1280J6435N7386
2459G8836J0302m1020l5318K709L5935k0329N378O8532j3998M0431L4271k9217
2447A36512p8959L283L6733N1552j1602j2606m737l4619J7934m662l1234N894
$$ plain form
2435 73489 56112 2765 109618 70074 120370 153562 75221 61431 104820 65461 47003 -9850
2423 -9850 8610 39811 -45243 49789 43508 -25847 -19722 26838 79885 52943 24010 32374 50652
2410 50652 64672 52262 36834 -12447 19508 58856 121197 21649 39872 14168 -29635 33988
2398 33988 -15417 -4406 8992 62648 67264 70895 49092 47460 49087 44475 118434 112659 23184
2385 23184 21348 38704 84480 96155 110107 133583 65104 64734 90375 133028 137038 69734 74144
2372 74144 121401 98138 145600 80963 32367 102007 68322 75421 138700 116924 86250 115809
2360 115809 129877 135671 66095 86054 86975 97095 140313 127469 158204 165576 228735 134799
2348 134799 110629 206262 165676 165265 146816 181263 236242 267904 237726 304836 265314 224650
$$ packed form
2435G3489j7377n3347J06853l9544N0296L3192p8341j3790M3389l9359j8458n6853
2423i850J8460L1201q5054R5032o281o9355O125M6560N3047k6942k8933Q364J8278
2410E0652J4020j2410j5428m9281L1955L9348O2341r9548J8223k5704m3803O3623
2398C3988m9405J1011J3398N3656M616L631k1803j632J627m612P3959n775q9475
2385B3184j836J7356M5776J1675J3952K3476o8479l70K5641M2653M010o7304M410
2372G4144M7257k3263M7462o4637m8596O9640l3685P099O3279k1776l0674K9559
2360A15809J4068N794o9576J9959R21J0120M3218j2844L0735P372O3159r3936
2348A34799k4170R5633m0586m11j8449L4447N4979L1662l0178O7110l9522m0664
$$ plain form
2336 224650 314152 355161 315536 390428 428171 421509 477347 601885 714859 755967 775138
2325 775138 812319 955118 1187257 1275326 1261853 1419893 1553644 1714352 1961720 2267461
2315 2267461 2529175 2944180 3388891 3838832 4140925 4422012 4527176 4477874 4393800 4081734
2305 4081734 3662736 3340147 3076587 2821099 2542716 2401222 2169146 1972772 1884261 1756520
2295 1756520 1620382 1509825 1347476 1176708 1143572 1006590 965722 917694 882452 804956
2285 804956 738337 680048 605743 555499 449899 463736 507842 407710 404857 471992 495414
2274 495414 363499 358835 317877 305320 316730 376414 363602 263867 289006 216530 273832 286008
2262 286008 251325 202647 239756 218979 137329 102797 156456 90175 -18730 84395 72967
$$ packed form
2336B24650Q9502M1009l9625P4892L7743o662N5838J24538J12974M1108J9171
2325G75138L7181J42799K32139Q8069j3473J58040J33751J60708K47368L05741
2315B267461K61714M15005M44711M49941L02093K81087J05164m9302q4074l12066
2305D081734m18998l22589k63560k55488k78383j41494k32076j96374q8511j27741
2295A756520j36138j10557j62349j70768l3136j36982m0868m8028l5242p7496
2285H04956o6619n8289p4305n0244j05600J3837M4106j00132k853O7135K3422
2274D95414j31915m664m0958j2557J1410N9684j2812r9735K5139p2476N7302J2176
2262B86008l4683m8678L7109k0777q1650l4532N3659o6281j08905J03125j1428
$$ plain form
2251 72967 47391 111841 109302 102540 58416 37937 43949 54974 45919 63517 113501 109169 68891
2238 68891 52697 76546 144457 137971 58025 66878 54394 73769 56729 16382 15694 23574 57971
2225 57971 76178 96820 40105 37069 -6248 -8622 -2993 -74281 -40116 6507 -9162 19890
2213 19890 -13418 970 18246 -128040 -51136 20427 18059 4331 5072 -66744 -67563 -47569 -40385
2200 -40385 -12492 13015 13836 24056 19780 -80971 -92717 10801 -42152 14568 31997 -85598
2188 -85598 -35162 518 -13466 -18564 -59646 -111230 -154285 -93667 -72645 -73272 -49703 -84004
2176 -84004 -72248 -83570 -99553 -117268 -90478 -25676 21467 62503 81210 -51631 -24078 -30706
2164 -30706 -38056 -46486 -96090 -57850 -30117 -102445 -69281 21275 4508 -13713 36890 53687
$$ packed form
2251G2967k5576O4450k539o762m4124k0479O012J1025r055J7598M9984m332m0278
2238F8891j6194K3849O7911o486p9946Q853j2484J9375j7040m0347o88P880L4397
2225E7971J8207K0642n6715l036m3317k374N629p1288L4165M6623j5669K9052
2213A9890l3308J4388J7276j46286P6904P1563k368j3728P41p1816q19J9994P184
2200d0385K7893K5507Q21J0220m276j00751j1746J03518n2953N6720J7429j17595
2188h5598N0436L5680j3984n098m1082n1584m3055O0618K1022o27K3569l4301
2176h4004J1756j1322j5983j7715K6790O4802M7143M1036J8707j32841K7553o628
2164c0706p350q430m9604L8240K7733p2328L3164R0556j6767j8221N0603J6797
$$ plain form
2152 53687 514 -71038 -91198 -24299 -31586 -70426 -49748 7056 -8082 31347 5852 -95217
2140 -95217 -61159 -59056 -43846 -92294 -57696 -62130 -89383 -62429 10841 89831 79291 50250
2128 50250 -60380 -105532 -127807 -107692 -99660 -41546 -34090 -101626 -6180 6430 -101637 -77441
2116 -77441 -61908 -30088 2534 -1248 -95006 -81046 -99814 -76392 -39380 66971 -16928 -57399
2104 -57399 -55230 -9452 -64188 -24793 47 -83791 38054 -30133 -54472 -55883 42431 63942
2092 63942 -43784 -63696 -80229 -68481 -80540 -201478 -95388 -112557 -128783 -10365 -75148
2081 -75148 -126052 -107050 -127745 -72356 -3114 53787 -37459 -34577 -43349 -99916 -133987 -103207
2069 -103207 -56208 -74602 -180977 -125968 -73039 -161797 -122090 -116768 -87246 -27984 -112861 -52645
$$ packed form
2152E3687n3173p1552k0160O6899p287l8840K0678N6804j5138L9429k5495j01069
2140i5217L4058K103J5210m8448L4598m434k7253K6954P3270P8990j0540k9041
2128E0250j10630m5152k2275K0115Q032N8114P456o7536R5446J2610j08067K4196
2116g7441J5533L1820L2622l782r3758J3960j8768K3422L7012J06351q3899m0471
2104e7399K169M5778n4736L9395K4840q3838J21845o8187k4339j411R8314K1511
2092F3942j07726j9912j6533J1748j2059j20938J06090j7169j6226J18418o4783
2081g5148n0904J9002k0695N5389O9242N6901r1246K882q772n6567l4071L0780
2069a03207M6999j8394j06375N5009N2929q8758L9707N322K9522N9262q4877O0216
$$ plain form
2057 -52645 3056 -1285 4972 -50998 -119578 -158872 -159505 -68482 -35781 -68148 -10529 -44650 -36858
2044 -36858 -30417 -62016 -115765 -45531 -56223 -64897 -109391 -62524 -24695 -19729 7744 -32362
2032 -32362 -56128 39542 38215 32564 29601 -46920 -18023 -1144 -26031 -34968 -27165 -35527 27445
2019 27445 -59219 -28486 28934 -50243 -40451 -8880 -15234 -44030 -103998 -107695 -71831 -79311 -126633
2006 -126633 -107202 -84845 59436 3665 -80715 -49856 16182 -13720 -44333 -114934 -121639 11773
1994 11773 2827 -37018 -66376 -47298 -21408 -23616 -149699 -76495 -80355 -72412 -99585 -68307
1982 -68307 -83840 -97535 -30020 4093 -48122 -47412 -54160 -72998 -89954 -93032 -67520 -58072 -29529
1969 -29529 -56994 3678 -32190 -129024 -180756 -112241 -132080 -180465 -116216 -124255 -14463 -25753
$$ packed form
2057e2645N5701m341O257n5970o8580l9294o33R1023L2701l2367N7619l4121P792
2044c6858O441l1599n3749P0234j0692q674m4494M6867L7829M966K7473m0106
2032c2362k3766R5670j327n651k963p6521K8897J6879k4887q937P803q362O2972
2019B7445q6664L0733N7420p9177R792L1571o354k8796n9968l697L5864p480m7322
2006a26633J9431K2357J44281n5771q4380L0859O6038k9902l0613p0601o705J33412
1994A1773q946l9845k9358J9078K5890k208j26083P3204l860P943k7173L1278
1982f8307j5533j3695O7515L4113n2215P10o748j8838j6956l078K5512R448K8543
1969b9529k7465O0672l5868r6834n1732O8515j9839m8385O4249q039J09792j1290
$$ plain form
1957 -25753 -49045 -11446 -13385 -27658 -72842 -106149 -148464 -91278 -71469 -128786 -68873 -8003
1945 -8003 -23628 -34782 -5343 -1998 -17327 14315 -81536 -135444 -125864 -43695 -76129 -95714
1933 -95714 -114030 -124266 -99876 -101039 -140998 -163177 -123288 -23471 -34776 -58292 -61849 -97323
1921 -97323 -118727 -88579 -83691 -124064 -142217 -21776 42413 26783 -112411 -136606 -92374 -173105
1909 -173105 -118359 -137607 -53758 -46911 -38898 -12839 -77203 -123991 -157111 -145082 -123809 -94389
1897 -94389 -6514 -45968 -159621 -112089 -73302 -115612 -99679 -99203 -44223 -32176 -32173 -74670 -98
1884 -98 71366 -65964 -67924 -5182 -16654 4509 -12432 -75521 -82278 -58507 -54226 -69673 -92347
1871 -92347 -46250 -9082 43385 -8858 -57147 -35859 -38092 -72111 -14444 -18476 -22298 -72207
$$ packed form
1957b5753k3292L7599j939j4273m5184l3307m2315N7186J9809n7317N9913O0870
1945h003j5625j1154K9439L345j5329L1642r5851n3908R580Q2169l2434j9585
1933i5714j8316j0236K4390j163l9959k2179L9889R9817j1305k3516l557l5474
1921i7323k1404L0148M888m0373j8153J20441O4189j5630j39194k4195M4232q0731
1909a73105N4746j9248Q3849O847Q013K6059o4364m6788l3120J2029K1273K9420
1897i4389Q7875l9454j13653M7532L8787m2310J5933M76N4980J2047Lm2497P4572
1884i8P1464j37330j960O2742j1472K1163j6941o3089o757K3771M281j5447k2674
1871i2347M6097L7168N2467n2243m8289K1288k233l4019N7667m032l822m9909
$$ plain form
1859 -72207 -125456 -59326 -67182 -63173 -82244 -86847 -67191 -70924 -60566 -114171 -124453 -80087 -81155
1846 -81155 -86241 -60625 -22066 -37410 -69335 -29782 -23374 -147866 -9166 66252 42317 15061
1834 15061 -71814 -68004 -20371 -15724 -22472 -45829 -67741 -5673 12234 -38184 -42637 -11590 51254
$$ packed form
1859g2207n3249O6130p856M009j9071m603J9656l733J0358n3605j0282M4366j068
1846h1155n086K5616L8559j5344l1925L9553O408j24492J38700P5418k3935k7256
1834A5061q6875L810M7633M647o748k3357k1912O2068J7907n0418m453L1047O2844
$$ [...]
##END NTUPLES=NMR SPECTRUM
##END=
