##TITLE=1H_CA-9369-1
 200.13MHz, DMSO-d6,
 8 sc
 
 12.8.2025
##JCAMPDX= 6.0         $$ Bruker NMR JCAMP-DX V2.0
##DATA TYPE= NMR SPECTRUM
##DATA CLASS= NTUPLES
##ORIGIN= UXNMR, Bruker Analytische Messtechnik GmbH
##OWNER= pz
$$ XWIN-NMR		Version 3.5
$$ Tue Aug 12 15:24:32 2025 Russian Standard Time (UT+4h)  she@DPX200
##.OBSERVE FREQUENCY= 200.1313
##.OBSERVE NUCLEUS= ^1H
##.ACQUISITION MODE= SIMULTANEOUS
##.ACQUISITION SCHEME= undefined
##.AVERAGES= 8
##.DIGITISER RES= 18
##SPECTROMETER/DATA SYSTEM= spect
##.PULSE SEQUENCE= zg30
##.SOLVENT NAME= DMSO
##.SHIFT REFERENCE= (INTERNAL, DMSO, 0, 15.5078)
##AUDIT TRAIL= $$ (NUMBER, WHEN, WHO, WHERE, WHAT)
$$ ##TITLE= Audit trail, XWIN-NMR		Version 3.5
$$ ##JCAMPDX= 5.01
$$ ##ORIGIN= Bruker BioSpin GmbH
$$ ##OWNER= she
$$ F:/spectra/data/she/nmr/H-C/1/pdata/1/auditp.txt
$$ ##AUDIT TRAIL=  $$ (NUMBER, WHEN, WHO, WHERE, WHAT)
(   1,<2025-08-12 15:23:30.84 +0400>,<she>,<DPX200>,
      <created by zg, POWCHK disabled, PULCHK disabled
       configuration hash MD5:
       00 E9 B6 7A A2 85 ED C7 34 08 36 98 17 FE 4E 26
       data hash MD5: 16K
       AB 4B BF 61 6D 19 96 CA 37 C1 29 39 A7 1F 09 93>)
(   2,<2025-08-12 15:23:33.20 +0400>,<she>,<DPX200>,
      <Start of raw data processing
       efp BC_mod = 2 LB = 0.25 FT_mod = 6 PKNL = 1 PHC0 = -1568.191 PHC1 = 20.79228 SI = 16K 
       data hash MD5: 16K
       BC F8 CC 92 9D EA 71 65 09 79 8A E5 24 26 2C C6>)
(   3,<2025-08-12 15:23:51.15 +0400>,<she>,<DPX200>,
      <pk PHC0 = -1.030052 PHC1 = -2.399999 
       data hash MD5: 16K
       40 9D 23 C5 19 36 D1 E9 20 40 E2 42 74 5E FC 90>)
(   4,<2025-08-12 15:23:55.57 +0400>,<she>,<DPX200>,
      <abs ABSG = 5 
       data hash MD5: 16K
       4A 0C EB C7 1A 5A 2D AC 44 1C 67 E9 E4 78 72 8A>)
$$ ##END=
$$ 
$$ hash MD5
$$ 62 73 3D 27 2B C2 5B 75 6C BC F8 09 A7 2D 2C 5B
##$RELAX= 
##$RELAX= 
##$RELAX= 
##$RELAX= 
##$RELAX= 
##$RELAX= 
$$ Bruker specific parameters
$$ --------------------------
##$DU= <F:/spectra>
##$EXPNO= 1
##$NAME= <H-C>
##$PROCNO= 1
##$TYPE= <nmr>
##$USER= <she>
##$AMP= (0..31)
100 100 100 100 100 100 100 100 100 100 100 100 100 100 100 100 100 100 
100 100 100 100 100 100 100 100 100 100 100 100 100 100 
##$AQSEQ= 0
##$AQ_mod= 1
##$AUNM= <au_zg>
##$AUTOPOS= <>
##$BF1= 200.13
##$BF2= 200.13
##$BF3= 200.13
##$BF4= 200.13
##$BF5= 200.13
##$BF6= 200.13
##$BF7= 200.13
##$BF8= 200.13
##$BYTORDA= 1
##$CFDGTYP= 0
##$CFRGTYP= 5
##$CHEMSTR= <none>
##$CNST= (0..31)
1 1 145 1 1 1 1 1 1 1 1 1 1 1 1 1 1 1 1 1 1 1 1 1 1 1 1 1 1 1 1 1 
##$CPDPRG= <>
##$CPDPRG1= <>
##$CPDPRG2= <>
##$CPDPRG3= <>
##$CPDPRG4= <mlev>
##$CPDPRG5= <mlev>
##$CPDPRG6= <mlev>
##$CPDPRG7= <mlev>
##$CPDPRG8= <mlev>
##$CPDPRGB= <>
##$CPDPRGT= <>
##$D= (0..31)
0 0.7 0 0 0 0 0 0 0 0 0 0.03 0 0 0 0 0 0 0 0 0 0 0 0 0 0 0 0 0 0 0 0 
##$DATE= 1754997810
##$DBL= (0..7)
120 120 120 120 120 120 120 120 
##$DBP= (0..7)
150 150 150 150 150 150 150 150 
##$DBP07= 0
##$DBPNAM0= <>
##$DBPNAM1= <>
##$DBPNAM2= <>
##$DBPNAM3= <>
##$DBPNAM4= <>
$$ [...]
##$SUBNAM3= <"">
##$SUBNAM4= <"">
##$SUBNAM5= <"">
##$SUBNAM6= <"">
##$SUBNAM7= <"">
##$SUBNAM8= <"">
##$SUBNAM9= <"">
##$SW= 18.0517328524113
##$SWIBOX= (0..15)
0 0 2 0 0 0 0 0 0 0 0 0 0 0 0 0 
##$SW_h= 3612.71676300578
##$TD= 16384
##$TD0= 1
##$TE= 0
##$TE2= 300
##$TE3= 300
##$TEG= 300
##$TL= (0..7)
0 120 120 120 120 120 120 120 
##$TP= (0..7)
150 150 150 150 150 150 150 150 
##$TP07= 0
##$TPNAME0= <>
##$TPNAME1= <>
##$TPNAME2= <>
##$TPNAME3= <>
##$TPNAME4= <>
##$TPNAME5= <>
##$TPNAME6= <>
##$TPNAME7= <>
##$TPOAL= (0..7)
0.5 0.5 0.5 0.5 0.5 0.5 0.5 0.5 
##$TPOFFS= (0..7)
0 0 0 0 0 0 0 0 
##$TUNHIN= 0
##$TUNHOUT= 0
##$TUNXOUT= 0
##$USERA1= <user>
##$USERA2= <user>
##$USERA3= <user>
##$USERA4= <user>
##$USERA5= <user>
##$V9= 5
##$VALIST= <valist>
##$VCLIST= <CCCCCCCCCCCCCCC>
##$VD= 0
##$VDLIST= <DDDDDDDDDDDDDDD>
##$VPLIST= <PPPPPPPPPPPPPPP>
##$VTLIST= <TTTTTTTTTTTTTTT>
##$WBST= 1024
##$WBSW= 4
##$XGAIN= (0..3)
0 0 0 0 
##$XL= 0
##$YL= 0
##$YMAX_a= 699638
##$YMIN_a= -1031490
##$ZGOPTNS= <>
##$ZL1= 120
##$ZL2= 120
##$ZL3= 120
##$ZL4= 120
##$ABSF1= 15.5078
##$ABSF2= -2.544049
##$ABSG= 5
##$ABSL= 3
##$ALPHA= 0
##$AQORDER= 0
##$ASSFAC= 0
##$ASSFACI= 0
##$ASSFACX= 0
##$ASSWID= 0
##$AUNMP= <proc_1d>
##$AZFE= 0.1
##$AZFW= 0.1
##$BCFW= 0
##$BC_mod= 2
##$BYTORDP= 0
##$COROFFS= 0
##$CY= -3
##$DATMOD= 1
##$DC= 0
##$DFILT= <>
##$DTYPP= 0
##$F1P= 0
##$F2P= 0
##$FCOR= 1
##$FTSIZE= 16384
##$FT_mod= 6
##$GAMMA= 0
##$GB= 0
##$INTBC= 1
##$INTSCL= 3.241238e-09
##$ISEN= 128
##$LB= 0.25
##$LEV0= 0
##$LPBIN= 0
##$MAXI= 10000
##$MC2= 0
##$MEAN= 0
##$ME_mod= 0
##$MI= 1.114404
##$NCOEF= 0
##$NC_proc= -7
##$NLEV= 6
##$NOISF1= 3.799351
##$NOISF2= 2.8
##$NSP= 0
##$NTH_PI= 0
##$NZP= 0
##$OFFSET= 15.5078
##$PC= 1
##$PHC0= -1569.221
##$PHC1= 18.39228
##$PH_mod= 1
##$PKNL= yes
##$PPARMOD= 0
##$PSCAL= 0
##$PSIGN= 0
##$REVERSE= no
##$SF= 200.130002782438
##$SI= 16384
##$SIGF1= 3
##$SIGF2= 2
##$SINO= 0.751879
##$SIOLD= 32768
##$SREGLST= <19F.Aceton>
##$SSB= 0
##$STSI= 16384
##$STSR= 0
##$SW_p= 3612.71676300578
##$SYMM= 0
##$S_DEV= 0
##$TDeff= 16384
##$TDoff= 0
##$TI= <>
##$TILT= no
##$TM1= 0
##$TM2= 0
##$TOPLEV= 0
##$USERP1= <user>
##$USERP2= <user>
##$USERP3= <user>
##$USERP4= <user>
##$USERP5= <user>
##$WDW= 1
##$XDIM= 16384
##$YMAX_p= 477627024
##$YMIN_p= -1098045
$$ End of Bruker specific parameters
$$ ---------------------------------
##NTUPLES= NMR SPECTRUM
##VAR_NAME=  FREQUENCY,     SPECTRUM/REAL,   SPECTRUM/IMAG
##SYMBOL=    X,             R,               I
##VAR_TYPE=  INDEPENDENT,   DEPENDENT,       DEPENDENT
##VAR_FORM=  AFFN,          ASDF,            ASDF
##VAR_DIM=   16384,         16384,           16384
##UNITS=     HZ,            ARBITRARY UNITS, ARBITRARY UNITS
##FACTOR=    0.220516191357247, 1,           1
##FIRST=     3103.57607760956, 0,            0
##LAST=      -509.14068539622, 0,            0
##MIN=       -509.14068539622, -1098045,     0
##MAX=       3103.57607760956, 477627024,    0
$$ Real data points
##PAGE= N=1
##DATA TABLE= (X++(R..R)), XYDATA
$$ [...]
$$ plain form
8660 6825011 7041394 6725290 6923117 7176018 6864307 6917419 7485779 7406752 7143494 6782658
8650 6782658 6788025 7093833 7189971 7213408 6992510 7015427 7024940 7131708 6908370 7188077 7209227
8639 7209227 7558032 7465985 7450170 7207051 6794188 6774479 6852971 6873347 6910006 6973041 7147950
8628 7147950 7154162 7012938 7107424 6978685 7008955 7579181 7550508 7510957 7622786 7220625 7242126
8617 7242126 7361760 7371133 7416645 7755605 7678534 7274289 7165843 6802394 7050161 7246594
8607 7246594 7429832 7201932 7237379 7253405 7472999 7484342 7740823 7638808 7274992 7593050
8597 7593050 7336205 7475583 7254446 7499932 7791837 7640878 7651726 7310155 7096792 7410918
8587 7410918 7185285 7285091 7405361 7418549 7390908 7499075 7794380 7850975 7841345 7683272 7646518
$$ packed form
8660F825011K16383l16104J97827K52901l11711N3112N68360p9027k63258l60836
8650F782658N367L05808R6138K3437k20898K2917R513J06768k23338K79707K1150
8639G209227L48805r2047j5815k43119m12863j9709P8492K0376L6659O3035J74909
8628G147950O212j41224R4486j28739L0270N70226k8673l9551J11829m02161K1501
8617G242126J19634R373M5512L38960p7071m04245j08446l63449K47767J96433
8607G246594J83238k27900L5447J6026K19594J1343K56481j02015l63816L18058
8597G593050k56845J39378k21137K45486K91905j50959J0848l41571k13363L14126
8587G410918k25633R9806J20270J3188k7641J08167K95305N6595r630j58073l6754
$$ plain form
8576 7646518 7801189 7842597 7375317 7298145 7555748 7705069 7757906 7746548 7995499 7507215
8566 7507215 7677170 7819552 7803298 7965785 8145869 7663618 7497718 7417370 7561197 7618437
8556 7618437 7510576 7766744 7873819 7676417 7588890 7864536 8078726 7927844 8149693 8153101
8546 8153101 8002472 8044955 8101593 7989787 8037353 8175894 8302996 8239585 8273932 8186940 8111751
8535 8111751 8232413 8376091 8368660 8230630 8047367 7890805 8063113 8390918 8125443 8296185
8525 8296185 8829317 8645800 8416932 8451689 8325558 8099479 8255996 8691117 8527605 8436267
8515 8436267 8804847 8641570 8808932 9064692 9069526 8777122 8658342 8429164 8626594 8846798
8505 8846798 8818379 8944623 8855720 9076740 9447904 9287360 9300932 8868379 8852032 9224242
$$ packed form
8576G646518J54671M1408m67280p7172K57603J49321N2837j1358K48951m88284
8566G507215J69955J42382j6254J62487J80084m82251j65900q0348J43827N7240
8556G618437j07861K56168J07075j97402q7527K75646K14190j50882K21849L408
8546H153101j50629M2483N6638j11806M7566J38541J27102o3411L4347q6992p5189
8535H111751J20662J43678p431j38030j83263j56562J72308L27805k65475J70742
8525H296185N33132j83517k28868L4757j26131k26079J56517M35121j63512r1338
8515H436267L68580j63277J67362K55760M834k92404j18780k29178J97430K20204
8505H846798k8419J26244q8903K21020L71164j60544J3572m32553j6347L72210
$$ plain form
8495 9224242 9423524 9576952 9351889 8950044 9120599 9141243 9332573 9398178 9304789 9728396
8485 9728396 9651578 9065286 9463451 9429648 9541779 9623699 9142665 9312220 9211134 9662174
8475 9662174 9565803 9622010 9634849 9562827 9539689 9483137 9661797 9630044 9794111 9960308 9686181
8464 9686181 9943537 10320616 9892312 9924944 10057574 9945175 10020714 10048057 10250357 10426763
8454 10426763 10259162 10452917 10298402 10454511 10271819 10212923 9989053 10265016 10146755 10231188
8444 10231188 10350147 10863963 10882272 10686563 10943519 10641834 10498150 10861254 10978357 10747651
8434 10747651 10879767 10939044 11025514 11304319 11403637 11307926 11028897 11075471 11112470 11072268 11070910
8423 11070910 10855531 11097510 11022548 11155882 11275420 11177976 11257154 10819879 11022785 11297444
$$ packed form
8495I224242J99282J53428k25063m01845J70555K0644J91330O5605r3389M23607
8485I728396p6818n86292L98165l3803J12131Q1920m81034J69555j01086M51040
8475I662174r6371N6207J2839p2022k3138n6552J78660l1753J64067J66197k74127
8464I686181K57356L77079m28304L2632J32630j12399P5539K7343K02300J76406
8454A0426763j67601J93755j54515J56109j82692n8896k23870K75963j18261Q4433
8444A0231188J18959N13816J8309j95709K56956l01685j43684L63104J17103k30706
8434A0747651J32116N9277Q6470K78805R9318r5711k79029M6574L6999m0202j358
8423A1070910k15379K41979p4962J33334J19538r7444P9178m37275K02906K74659
$$ plain form
8413 11297444 11141636 11242192 11121120 11365120 11474092 11499314 11547512 11738881 11489964 11103747
8403 11103747 11004589 11038772 10876310 11158310 11201831 11441651 11375591 11504774 11473369 11367456
8393 11367456 11345212 11394767 11594209 11620510 11288167 11457180 11541384 11585207 11502424 11051782
8383 11051782 11102669 11260005 11413317 11223525 11179786 11258763 11111086 11140155 11538624 11559870
8373 11559870 11239539 11448784 11493611 11087056 11256012 11341822 11415098 11960934 11669500 11318374
8363 11318374 11200886 11225390 10999953 10965309 11171681 11063207 10834139 11050892 11419451 11042056
8353 11042056 11048554 11205234 10907190 10955072 11208853 11255590 10933301 10964869 10932896 10508328
8343 10508328 11016240 10905744 10930348 11092798 10808686 10633268 10772309 10665245 10499138 10200274
$$ packed form
8413A1297444j55808J00556j21072K44000J08972K5222M8198J91369k48917l86217
8403A1103747r9158L4183j62462K82000M3521K39820o6060J29183l1405j05913
8393A1367456k2244M9555J99442K6301l32343J69013Q4204M3823q2783m50642
8383A1051782N0887J57336J53312j89792m3739P8977j47677K9069L98469K1246
8373A1559870l20331K09245M4827m06555J68956Q5810P3276N45836k91434l51126
8363A1318374j17488K4504k25437l4644K06372j08474k29068K16753L68559l77395
8353A1042056O498J56680k98044M7882K53781M6737l22289L1568l1973m24568
8343A0508328N07912j10496K4604J62450k84112j75418J39041j07064j66107k98864
$$ plain form
8333 10200274 10308864 10338984 10268228 10418646 10401563 10749845 10623323 10416298 10254233 10398357
8323 10398357 10587194 10385405 10188221 10058419 10084938 9994823 9986039 9968666 9987626 10055913 10001856
8312 10001856 9717232 9576414 9752425 9628635 10015294 9821443 9700761 9614231 9539441 9687720
8302 9687720 9674654 9805991 9639426 9637736 9373982 9197044 9025381 9021480 9063007 8957989 8851793
8291 8851793 8609159 8692747 8535744 8645177 8703816 8421839 8280844 8418111 8606803 8060259
8281 8060259 8140633 8323850 8529550 8514402 8320571 8363133 8160298 7939238 8161731 8228052
8271 8228052 7926151 7974377 8190291 8005673 8139235 8114182 7716082 7863135 7668451 7495761
8261 7495761 7372117 7300317 7555794 7528333 7524723 7466202 7332234 7368736 7563092 7700177 7493773
$$ packed form
8333A0200274J08590L0120p0756J50418j7083L48282j26522k07025j62065J44124
8323A0398357J88837k01789j97184j29802K6519r0115q784j7373J8960O8287n4057
8312A0001856k84624j40818J76011j23790L86659j93851j20682q6530p4790J48279
8302I687720j3066J31337j66565j690k63754j76938j71663l901M1527j05018j06196
8291H851793k42634Q3588j57003J09433N8639k81977j40995J37267J88692n46544
8281H060259Q0374J83217K05700j5148j93831M2562k02835k21060K22493O6321
8271H228052l01901M8226K15914j84618J33562k5053l98100J47053j94684j72690
8261G495761j23644p1800K55477k7461l610n8521j33968L6502J94356J37085k06404
$$ plain form
8250 7493773 7054232 6655960 6543672 6489850 6763837 7081170 6977003 6684519 6833484 6970477
8240 6970477 6914019 6777750 6731830 6663511 6576776 6475074 6458957 6594381 6534894 6551078 6430983
8229 6430983 6581504 6428556 6443684 6204734 6214981 6160142 6000575 6181155 6015687 6127071
8219 6127071 6063174 5881667 6106998 6170574 5726161 5516849 5794610 6098660 5983121 5948090
8209 5948090 5562805 5419985 5526194 5493789 5348761 5419525 5587790 5328645 5278231 5289056
8199 5289056 5355607 5121980 5178136 5536871 5783257 5719719 6361500 5080021 3656118 4282100
8189 4282100 4487705 4786443 4793212 4906019 4822689 4703561 4571567 4550210 4466804 4611264
8179 4611264 4659335 4611923 4673418 4521297 4304430 4272783 4432351 4432381 4304112 4425249 4469998
$$ packed form
8250G493773m39541l98272j12288n3822K73987L17333j04167k92484J48965J36993
8240F970477n6458j36269m5920o8319q6735j01702j6117J35424n9487J6184j20095
8229F430983J50521j52948J5128k38950J0247n4839j59567J80580j65468J11384
8219F127071o3897j81507K25331O3576m44413k09312K77761L04050j15539l5031
8209E948090l85285j42820J06209l2405j45028P0764J68265k59145n0414J0825
8199E289056O6551k33627N6156L58735K46386o3538O41781j281479j423903O25982
8189D282100K05605K98738O769J12807q3330j19128j31994k1357q3406J44460
8179D611264M8071m7412O1495j52121k16867l1647J59568L0j28269J21137M4749
$$ plain form
8168 4469998 4434310 4716154 4414911 4415042 4305824 4227314 4348958 4055350 3999427 4034892 4171202
8157 4171202 4197524 3911128 3922240 4124636 4089256 3817590 3775374 3822923 3997249 4041282 3508611
8146 3508611 3726225 3985845 4036247 3886850 3614003 3674524 3648613 3791846 3949198 4013079
8136 4013079 3715421 3810207 3836523 3959130 4090837 3998796 3653732 3251095 3754628 3859528
8126 3859528 3392351 3429451 3454180 2989924 2751591 2831361 3118469 3025408 3420631 3500120
8116 3500120 3561863 3322002 3232193 3102344 3188717 3119677 3011715 3069493 3187508 3453418
8106 3453418 3313950 3323857 3209328 3357157 3058334 2633469 2636356 2889902 2872112 2571019
8096 2571019 2585918 2795193 2721924 2903939 2939304 2863435 2936486 2804038 2645695 2852297
$$ packed form
8168D469998l5688K81844l01243J31j09218p8510J21644k93608n5923L5465J36310
8157D171202K6322k86396J1112K02396l5380k71666m2216M7549J74326M4033n32671
8146C508611K17614K59620N0402j49397k72847O0521k5911J43233J57352O3881
8136D013079k97658R4786K6316J22607J31707r2041l45064m02637N03533J04900
8126C859528m67177L7100K4729m64256k38333P9770K87108r3061L95223P9489
8116C500120O1743k39861q9809j29849Q6373o9040j07962N7778J18015K65910
8106C453418j39468R907j14529J47829k98823m24865K887K53546j7790l01093
8096B571019J4899K09275p3269J82015L5365p5869P3051j32448j58343K06602
$$ plain form
8086 2852297 3000352 2902254 2767226 3015168 3070156 2952037 3028491 2736141 2649399 2434034
8076 2434034 2838453 2870682 2720596 2635629 2439396 2423811 2592281 2745606 2707248 2761744
8066 2761744 2343467 2335708 2699084 2586420 2562398 2742209 2894729 2464976 2202499 2330919
8056 2330919 2405449 2427148 2445924 2415510 2565675 2549403 2635333 3002162 2881681 2853406 2478455
8045 2478455 2382338 2431060 2486818 2412459 2119485 1886971 1872021 1699987 1789802 2087068 1864617
8034 1864617 1814998 1969736 1861536 1753576 1618002 1862191 1943154 2216719 2309555 2116701
8024 2116701 2324281 2671515 2211735 1802084 1980593 2058969 2000098 1680696 1671306 1709521
8014 1709521 1610275 1723935 1886500 1968597 1806683 2072469 1677701 1549285 1414570 1576097
$$ packed form
8086B852297J48055r8098j35028K47942N4988j18119P6454k92350q6742k15365
8076B434034M04419L2229j50086q4967j96233j5585J68470J53325l8358N4496
8066B761744m18277p759L63376j12664k4022J79811J52520m29753k62477J28420
8056B330919P4530K1699J8776l0414J50165j6272Q5930L66829j20481k8275l74951
8045B478455r6117M8722N5758p4359k92974k32514j4950j72034Q9815K97266k22451
8034A864617m9619J54738j08200j07960j35574K44189Q0963K73565R2836j92854
8024B116701K07580L47234m59780m09651J78509P8376n8871l19402r390L8215
8014A709521r9246J13660J62565Q2097j61914K65786l94768j28416j34715J61527
$$ plain form
8004 1576097 1525221 1705308 1673990 1648950 1789780 1846560 1922168 1761962 1665649 1740784 1686996
7993 1686996 1682186 1874888 1918249 1979849 1839560 2057248 2065052 1854830 1810044 1979076 1635682
7982 1635682 1520857 1666187 1744991 1507402 1321090 1274921 1908843 1887451 1678041 1925740
7972 1925740 1962677 1747739 1601245 1553448 1446989 1624171 1635805 1856765 2075278 1807478
7962 1807478 1647033 1632551 1680953 1697579 1741544 1352824 1452966 1770301 1427545 1374210
7952 1374210 1441845 1492761 1547199 1466685 1326168 1573998 1746491 1559973 1404152 1355496
7942 1355496 1337006 979899 1033812 1239452 1619004 1361182 1349984 1548184 1278452 1090765
7932 1090765 1292515 1429673 1257130 1211551 1467496 1515626 1271599 846199 1000165 760065
$$ packed form
8004A576097n0876J80087l1318k5040J40830N6780P5608j60206r6313P5135n3788
7993A686996m810J92702M3361O1600j40289K17688P804k10222m4786J69032l43394
7982A635682j14825J45330P8804k37589j86312m6169O33922k1392k09410K47699
7972A925740L6937k14938j46494m7797j06459J77182J1634K20960K18513k67800
7962A807478j60445j4482M8402J6626M3965l88720J00142L17335l42756n3335
7952A374210O7635N0916N4438q0514j40517K47830J72493j86518j55821m8656
7942A355496j8490l57107N3913K05640L79552k57822j1198J98200k69732j87687
7932A090765K01750J37158j72543m5579K55945M8130k44027m25400J53966k40100
$$ plain form
7922 760065 854407 1025893 1135696 813716 1013546 897164 1038708 1343775 1332188 1300756
7912 1300756 1301144 1508060 1294770 968824 987173 921456 780333 1028090 948912 886586 745201
7901 745201 611000 909134 913016 920930 1401780 1419901 1113061 1148415 1002059 833460 921946
7890 921946 953169 1464755 1341876 1234571 1177882 1200876 1052270 1401383 1399597 1465515 1089213
7879 1089213 1151867 966277 776714 689944 1160012 1283510 909293 912246 1161361 1097579
7869 1097579 928979 925662 1233924 1273360 1352001 1204164 1094057 978533 1179820 1170108 943540
7858 943540 955605 786709 906128 1177277 936362 1065406 1236424 766258 630580 261399
7848 261399 449914 791371 620240 494673 477183 656340 1103148 1060358 1009652 983616
$$ packed form
7922G60065R4342J71486J09803l21980J99830j16382J41544L05067j1587l1432
7912A300756L88K06916k13290l25946J8349o5717j41123K47757p9178o2326j41385
7901G45201j34201K98134L882P914M80850J8121l06840L5354j46356j68599Q8486
7890I21946L1223N11586j22879j07305n6689K2994j48606L49113j786O5918l76302
7879A089213O2654j85590j89563q6770M70068J23498l74217K953K49115o3782
7869A097579j68600l317L08262L9436P8641j47837j10107j15524K01287r712k26568
7858I43540J2065j68896J19419K71149k40915J29044J71018m70166j35678l69181
7848B61399J88515L41457j71131j25567j7490J79157M46808m2790n0706k6036
$$ plain form
7838 983616 942964 922409 862504 1075282 1148146 869936 895591 940152 973975 991733 1235617
7827 1235617 1166787 1012950 972519 955711 856310 1083325 908113 937216 945164 623554 771773
7816 771773 645765 524258 589546 954900 1032858 1070882 880289 664892 741571 715030 810442
7805 810442 665704 569679 631691 910900 702697 533463 816171 569864 707787 1456044
7795 1456044 1374590 1138025 1056996 889893 711277 541142 552716 808098 672167 852454
7785 852454 1113175 1108568 1033812 924836 1140826 1157341 994437 771894 650217 903113
7775 903113 1048357 1086000 889725 947590 1001274 858584 542457 799195 889382 762192
7765 762192 644464 907458 1114199 1191935 991886 898653 709199 666226 944436 662765
$$ packed form
7838I83616m0652k0555n9905K12778P2864k78210K5655M4561L3823J7758K43884
7827A235617o8830j53837m0431j6808r9401K27015j75212K9103P948l21610J48219
7816G71773j26008j21507O5288L65354P7958L8024j90593k15397P6679k6541R5412
7805H10442j44738r6025O2012K79209k08203j69234K82708k46307J37923P48257
7795A456044q1454k36565q1029j67103j78616j70135J1574K55382j35931J80287
7785H52454K60721m607p4756j08976K15990J6515j62904k22543j21677K52896
7775I03113J45244L7643j96275N7865N3684j42690l16127K56738R0187j27190
7765G62192j17728K62994K06741P7736k00049r3233j89454m2973K78210k81671
$$ plain form
7755 662765 661395 721488 798226 832187 995046 858860 684896 586833 428067 599690 693099
7744 693099 902347 1185148 1085303 807662 722549 789714 520767 568551 559049 850778 1067895
7733 1067895 1014369 794826 605718 797596 594432 528743 782402 760244 650432 406909
7723 406909 515561 520876 715527 666195 736501 582141 701133 724170 700944 920383 962904
7712 962904 1174685 1290414 869255 648956 760906 592205 832786 715096 942377 1014149
7702 1014149 872516 933276 872262 745620 775656 731511 719269 1106345 986517 822667
7692 822667 822294 944927 577281 839882 943163 905457 709604 602508 485416 704461
7682 704461 834511 672434 897664 670736 572637 666510 555283 584079 589035 691394 1173042
$$ packed form
7755F62765j370O0093P6738L3961J62859j36186j73964r8063j58766J71623R3409
7744F93099K09248K82801r9845k77641q5113O7165k68947M7784r502K91729K17117
7733A067895n3526k19543j89108J91878k03164o5689K53659k2158j09812k43523
7723D06909J08652N315J94651m9332P0306j54360J18992K3037k3226K19439M2521
7712I62904K11781J15729m21159k20299J11950j68701K40581j17690K27281P1772
7702A014149j41633O0760o1014j26642L0036m4145j2242L87076j19828j63850
7692H22667l73J22633l67646K62601J03281l7706j95853j07096j17092K19045
7682G04461J30050j62077K25230k26928r8099R3873j11227K8796M956J02359M81648
$$ plain form
7671 1173042 1077465 766339 591649 866481 854158 831673 664051 716655 293836 433934
7661 433934 638551 729902 608418 200847 316403 643938 602929 390559 698516 796084
7651 796084 619962 700692 662899 617349 790125 835335 475912 396768 675642 955570 899253
7640 899253 982730 942740 958955 939585 909116 818188 688125 1030581 635541 760098 681023
7629 681023 1073096 1065159 795285 774665 705881 747943 842662 796736 693295 935033 870331
7618 870331 616234 490486 827981 812387 776171 546198 320415 664692 941763 729241
7608 729241 669634 625117 471789 772111 761130 832793 866318 631513 735550 639807 651407
7597 651407 674766 876369 935581 948171 1021190 1393084 1271917 1151996 1102596 1097022 1124055
$$ packed form
7671A173042r5577l11126j74690K74832j2323k2485j67622N2604m22819J40098
7661D33934K04617R1351j21484m07571J15556L27535m1009k12370L07957R7568
7651G96084j76122Q0730l7793m5550J72776M5210l59423p9144K78874K79928n6317
7640H99253Q3477l9990J6215j9370l0469r0928j30063L42456l95040J24557p9075
7629F81023L92073p937k69874k0620o8784M2062R4719m5926j03441K41738o4702
7618H70331k54097j25748L37495j5594l6216k29973k25783L44277K77071k12522
7608G29241n9607m4517j53328L00322j0981P1663L3525k34805J04037r5743J1600
7597F51407K3359K01603N9212J2590P3019L71894j21167j19921m9400n574K7033
$$ plain form
7586 1124055 943159 1047858 995856 943333 998618 959228 518786 457059 430248 645501 665615
7575 665615 850183 967269 1083466 1031885 826201 812624 942697 1145919 1044788 989501
7565 989501 921636 732736 1136046 1226328 1096706 1115386 1181742 1175805 1042553 1172805 1069677
7554 1069677 920521 1068066 1058004 1081412 1238432 1206564 1092794 831556 1036443 1125241
7544 1125241 930645 1277533 1124318 1150004 1252249 1138985 939996 943946 1157649 1060141
7534 1060141 1096463 865630 977726 1212110 1094771 856040 959238 581917 843955 1136079
7524 1136079 927329 548700 995377 1261287 1144473 983126 862580 1139511 1391750 1216602
7514 1216602 1294383 1193114 600328 677585 929070 1267995 1464590 1246850 950417 726817
$$ packed form
7586A124055j80896J04699n2002n2523N5285l9390m40442o1727k6811K15253K0114
7575F65615J84568J17086J16197n1581k05684j3577J30073K03222j01131n5287
7565I89501o7865j88900M03310R0282j29622J8680O6356n937j33252J30252j03128
7554A069677j49156J47545j0062K3408J57020l1868j13770k61238K04887Q8798
7544A125241j94596L46888j53215K5686J02245j13264j98989L950K13703r7508
7534A060141L6322k30833J12096K34384j17339k38731J03198l77321K62038K92124
7524A136079k08750l78629M46677K65910j16814j61347j20546K76931K52239j75148
7514A216602P7781j01269n92786P7257K51485L38925J96595k17740k96433k23600
$$ plain form
7504 726817 784161 977305 905571 1086585 1244024 1006386 1004599 1136553 1046811 1075389 821473
7493 821473 862494 1229097 1367027 1062755 1124605 964626 987252 968995 855588 1130246
7483 1130246 1331504 1020547 946864 1155160 1474031 1331512 1275460 1225714 1191196 1393437
7473 1393437 1371243 1250966 1220001 1241016 1042461 959948 977436 738635 858881 1044316
7463 1044316 1052950 1412792 1289254 1324535 952457 766925 1164244 1445639 1097243 1064870
7453 1064870 1005460 937500 1193439 1435430 1284867 1466366 1582362 1523637 1497490 1319626
7443 1319626 1368782 1333977 1226137 1130076 1115465 1148246 1154564 1339421 1126057 867642 1239656
7432 1239656 1185573 1260389 1355779 973263 1065920 1291186 1182883 1315293 1362318 1504445
$$ packed form
7504G26817N7344J93144p1734J81014J57439k37638j787J31954q9742K8578k53916
7493H21473M1021L66603J37930l04272O1850j59979K2626j8257j13407K74658
7483A130246K01258l10957p3683K08296L18871j42519n6052m9746l4518K02241
7473A393437k2194j20277l0965K1015j98555q2513J7488k38801J20246J85435
7463A044316Q634L59842j23538L5281l72078j85532L97319K81395l48396l2373
7453A064870n9410o7960K55939K41991j50563J81499J15996n8725k6147j77864
7443A319626M9156l4805j07840r6061j4611L2781O318J84857k13364k58415L72014
7432A239656n4083P4816R5390l82516R2657K25266j08303J32410M7025J42127
$$ plain form
7422 1504445 1169419 1226811 1163617 1093397 1283108 1219898 1062294 1211459 1799621 1744678
7412 1744678 1533661 1332359 1182777 1260187 1304200 1356175 1340835 1286745 943842 1186773
7402 1186773 1425681 1507398 1538467 1517006 1529191 1251641 1203196 1292704 1454957 1710569 1588104
7391 1588104 1245837 1115463 1302675 1348341 1767173 1810707 1472585 1867751 1611706 1262409
7381 1262409 1540614 1437240 1548182 1650338 1649991 1850630 1683231 1755732 1642449 1554777
7371 1554777 1630186 1708003 1626817 1465127 1728743 1873890 1972698 1714575 1534615 1121517
7361 1121517 844537 1344921 1657826 1721326 1612588 1705187 1602823 1480747 1538184 1720027
7351 1720027 1497042 1672027 1862008 1983906 1851678 1673039 1762564 1782188 1866050 1848168
$$ packed form
7422A504445l35026N7392o3194p0220J89711o3210j57604J49165N88162n4943
7412A744678k11017k01302j49582P7410M4013N1975j5340n4090l42903K42931
7402A186773K38908Q1717L1069k1461J2185k77550m8445Q9508J62253K55612j22465
7391A588104l42267j30374J87212M5666M18832M3534l38122L95166k56045l49297
7381A262409K78205j03374J10942J02156l47K00639j67399P2501j13283q7672
7371A554777P5409P7817q1186j61690K63616J45147R8808k58123j79960m13098
7361A121517k76980N00384L12905O3500j08738R2599j02364j22076N7437J81843
7351A720027k22985J74985J89981J21898j32228j78639Q9525J9624Q3862j7882
$$ plain form
7341 1848168 1616509 1749454 1821674 2029195 1943942 1592781 1313422 1559144 1877379 1887149
7331 1887149 2084165 1812099 1462007 1577299 1974528 2161038 2149346 1762515 1727708 1702688
7321 1702688 1439985 1414115 1586378 1567485 1497772 1609239 1844610 1718124 1730888 2163168
7311 2163168 2023573 1942575 2033450 1705122 1655254 1894562 1654133 1580883 1692624 1774688
7301 1774688 1981893 1953158 2120780 2436665 2419245 2252291 2303891 2347570 2407977 2306010
7291 2306010 2125515 2033031 1951702 1846387 2148168 2222606 2444352 1967408 2088539 2424985
7281 2424985 2130032 2533509 2546215 2429228 1933948 1862131 2039204 1947813 1902730 2242197
7271 2242197 2136809 2175860 2200508 2091652 1874431 2176363 2144013 2105776 2092960 2126496 2181079
$$ packed form
7341A848168k31659J32945P2220K07521q5253l51161k79359K45722L18235R770
7331A887149J97016k72066l50092J15292L97229J86510j1692l86831l4807k5020
7321A702688k62703k5870J72263j8893o9713J11467K35371j26486J2764M32280
7311B163168j39595q0998R0875l28328m9868K39308k40429p3250J11741Q2064
7301A774688K07205k8735J67622L15885j7420j66954N1600M3679O0407j01967
7291B306010j80495r2484q1329j05315L01781P4438K21746m76944J21131L36446
7281B424985k94953M03477J2706j16987m95280p1817J77073r1391m5083L39467
7271B242197j05388L9051K4648j08856k17221L01932l2350l8237j2816L3536N4583
$$ plain form
7260 2181079 2159554 2239818 2085328 2205433 2248670 2380251 2461506 2650185 2420527 2223951
7250 2223951 2064984 2155992 2118223 2342907 2156581 2028657 2420076 2428979 2503522 2380289
7240 2380289 2491729 2546684 2417367 2375581 2212184 2210004 2234291 2290326 2340201 2510465 2327385
7229 2327385 2241606 2291995 2703427 2591695 2477545 2626368 2503703 2299381 2532486 2579779
7219 2579779 2826498 2842783 3007748 3162755 2728984 2578907 2746296 2695832 2748985 2852563
7209 2852563 2931352 2991885 2898831 2788509 2838391 2830377 2919969 2826742 2761656 2492680 2456919
7198 2456919 2791288 2885739 2883477 2867701 3130475 2802117 2617969 2694326 2763089 2775269 2647654
7187 2647654 2820379 2881801 3104840 3298383 2993701 3162071 2920047 2780455 2940107 3058822
$$ packed form
7260B181079k1525Q0264j54490J20105M3237J31581Q1255J88679k29658j96576
7250B223951j58967R1008l7769K24684j86326j27924L91419Q903P4543j23233
7240B380289J11440N4955j29317m1786j63397k180K4287N6035M9875J70264j83080
7229B327385q5779N0389M11432j11732j14150J48823j22665k04322K33105M7293
7219B579779K46719J6285J64965J55007m33771j50077J67389n0464N3153J03578
7209B852563P8789O0533r3054j10322M9882q014Q9592r3227o5086k68976l5761
7198B456919L34369R4451k262j5776K62774l28358j84148P6357O8763J2180j27615
7187B647654J72725O1422K23039J93543l04682J68370k42024j39592J59652J18715
$$ plain form
7177 3058822 3171685 3456406 3364722 3349088 3095827 2966664 2946914 3154151 3052648 3048474
7167 3048474 2835684 2873928 2764259 2601333 2898229 2994031 2967154 3054789 2867656 2972543
7157 2972543 3243190 3222628 3427869 3402841 3314940 3113655 2796154 2918811 3085428 3099369
7147 3099369 2796725 3260183 3174213 3253394 3457545 3132528 3146108 3404354 3516368 3395708
7137 3395708 3584936 3199601 3248584 3481008 3198792 3126194 3267611 3369079 3724857 3718106
7127 3718106 3831315 3825278 3585572 3572275 3332096 3404328 3737467 3708171 3520016 3634484
7117 3634484 3509234 3459376 3797138 3740842 3503914 3367763 3347618 3351517 3446331 3584178 3857369
7106 3857369 3893481 3992873 3845731 4033265 4051952 4022983 4193293 4267978 4043362 3933712
$$ packed form
7177C058822J12863K84721r1684j5634k53261j29163j9750K07237j01503m174
7167C048474k12790L8244j09669j62926K96896R5802k6877Q7635j87133J04887
7157B972543K70647k0562K05241k5028q7901k01285l17501J22657J66617J3941
7147C099369l02644M63458q5970P9181K04151l25017J3580K58246J12014j20660
7137C395708J89228l85335M8983K32424k82216p2598J41417J01468L55778o751
7127C718106J13209o037k39706j3297k40179P2232L33139k9296j88155J14468
7117C634484j25250m9858L37762n6296k36928j36151k0145L899R4814J37847K73191
7106C857369L6112R9392j47142J87534J8687k8969J70310P4685k24616j09650
$$ plain form
7096 3933712 3891549 4057833 4309044 4249070 4082763 4063579 3836848 3875854 3846803 4126449
7086 4126449 3936601 3848413 3885050 4199412 4218202 3958874 3970775 4064291 3946642 3734476
7076 3734476 3961535 4050848 3882209 3773578 3727519 3767850 4126791 4034155 3741084 4060387
7066 4060387 4021766 4096148 4080066 4122340 4405738 4368768 4655787 4790002 4754300 4591472 4510316
7055 4510316 4087861 4211262 4369775 4382501 4156891 4407349 4253303 4040441 4267822 4384430
7045 4384430 4082693 4474145 4834236 4674338 4301269 4275377 4301747 4460224 4526545 4745061
7035 4745061 4624519 4631441 4737980 4985756 5149265 5186542 4944471 4930066 4919610 4690043
7025 4690043 5071224 4670225 4602351 4874864 5101190 5137303 4962984 4944630 4912745 4805779
$$ packed form
7096C933712m2163J66284K51211n9974j66307j9184k26731L9006k9051K79646
7086D126449j89848q8188L6637L14362J8790k59328J1901R3516j17649k12166
7076C734476K27059Q9313j68639j08631m6059M0331L58941r2636k93071L19303
7066D060387l8621P4382j6082M2274K83398l6970K87019J34215l5702j62828q1156
7055D510316m22455J23401J58513J2726k25610K50458j54046k12862K27381J16608
7045D384430l01737L91452L60091j59898l73069k5892K6370J58477O6321K18516
7035D745061j20542O922J06539K47776J63509L7277k42071j4405j0456k29567
7025D690043L81181m00999o7874K72513K26326L6113j74319j8354l1885j06966
$$ plain form
7015 4805779 4917347 4962609 5103512 4979050 4859474 5011228 5367423 5336628 4971762 4785103
7005 4785103 5176939 5348900 5196057 4735520 5009388 5154642 5141496 5364880 5353498 4972527
6995 4972527 5108836 5175301 4961468 5226450 5345912 5584720 5663764 5558051 5480407 5507998
6985 5507998 5313113 5120735 5121109 5353574 5630749 5590450 5664770 5267456 5190647 5499763 5687420
6974 5687420 5454536 5474283 5538709 5775103 5767983 5645261 5557369 5576795 5857060 5847818 6308008
6963 6308008 6188528 6042945 5742749 5476348 5792551 5599536 5668566 5880476 5548333 5672795
6953 5672795 5452608 5675054 5804549 5906810 5637998 5791682 5968169 6184550 5943786 5995136
6943 5995136 5745526 5988838 6381536 6305299 6414878 6135361 6147285 6095254 6362145 6303966
$$ packed form
7015D805779J11568M5262J40903j24462j19576J51754L56195l0795l64866j86659
7005D785103L91836J71961j52843m60537K73868J45254j3146K23384j1382l80971
6995D972527J36309O6465k13833K64982J19462K38808P9044j05713p7644K7591
6985E507998j94885j92378L74K32465K77175m0299P4320l97314p6809L09116J87657
6974E687420k32884J9747O4426K36394p120j22722q7892J9426K80265r242M60190
6963F308008j19480j45583l00196k66401L16203j93015O9030K11910l32143J24462
6953E672795k20187K22446J29495J02261k68812J53684J76487K16381k40764N1350
6943E995136k49610K43312L92698p6237J09579k79517J1924n2031K66891n8179
$$ plain form
6933 6303966 6336884 6411029 6520407 6493227 6428909 6314668 6520695 6357476 6651913 6867709
6923 6867709 6501349 6292659 6533322 6535243 6618705 6733686 6819708 6951250 6910965 6763279
6913 6763279 6702218 6821266 6640111 6365107 6613205 6683343 6724228 6900531 6946799 6899973
6903 6899973 6933737 7093425 7053917 7082622 6919850 7043135 6949353 6903650 6976596 6972252 7056234
6892 7056234 7022051 6840702 6907942 6946094 6807690 7151028 7257853 6977534 7086190 7197526
6882 7197526 7052047 7235231 7540527 7560618 7572756 7271697 7223653 7643316 7670740 7496846
6872 7496846 7512360 7674063 7866108 7892408 8026262 7988349 8020008 8037631 8164073 8067518 7967801
6861 7967801 7930759 7645497 7584259 7776996 7938244 7840895 7940317 8053919 8016596 8061596 8104119
$$ packed form
6933F303966L2918P4145J09378k7180o4318j14241K06027j63219K94437K15796
6923F867709l66360k08690K40663J921Q3462J14981Q6022J31542m0285j47686
6913F763279o1061J19048j81155k75004K48098P0138M0885J76303M6268m6826
6903F899973L3764J59688l9508K8705j62772J23285r3782m5703P2946m344Q3982
6892G056234l4183j81349O7240L8152j38404L43338J06825k80319J08656J11336
6882G197526j45479J83184L05296K0091J2138l01059m8044M19663K7424j73894
6872G496846J5514J61703J92045K6300J33854l7913L1659J7623J26442r6555r9717
6861G967801l7042k85262o1238J92737J61248r7349R9422J13602l7323M5000M2523
$$ plain form
6850 8104119 7951649 8091257 8268975 8280827 7986709 8131133 8350095 8205349 8212993 8290264
6840 8290264 8278186 8291987 8379602 8273326 8395256 8324335 8359775 8368812 8495262 8348624 8379584
6829 8379584 8734645 8724380 8883634 8732648 8416669 8486144 8383854 8519097 8956098 8783382
6819 8783382 8740726 8968920 8896203 8770919 8716693 8921155 9330373 9368303 9157792 9075165
6809 9075165 9203846 9036429 9009372 9267647 9437977 9454633 9263041 9614031 9654886 9596881
6799 9596881 9731694 9445021 9163699 9139489 9607308 9717925 9629915 9405082 9685282 9729167
6789 9729167 9684047 9770615 9733718 9843017 9805306 9871680 9631306 9750978 9784012 9619037 9694429
6778 9694429 10146426 10201216 10242095 10269171 10388125 10553857 10280091 10366641 10173106 10187695
$$ packed form
6850H104119j52470J39608J77718J1852k94118J44424K18962j44746P644P7271
6840H290264j2078J3801Q7615j06276J21930p0921L5440R037J26450j46638L0960
6829H379584L55061j0265J59254j50986l15979O9475j02290J35243M37001j72716
6819H783382m2656K28194p2717j25284n4226K04462M09218L7930k10511q2627
6809I075165J28681j67417k7057K58275J70330J6656j91592L50990M0855n8005
6799I596881J34813k86673k81322k4210M67819J10617q8010k24833K80200M3885
6789I729167m5120Q6568l6897J09299l7711O6374k40374J19672L3034j64975P5392
6778I694429M51997N4790M0879K7076J18954J65732k73766Q6550j93535J4589
$$ plain form
6768 10187695 10073760 10114054 10203667 10355699 10471464 10435524 10707777 10859702 10846235 10908509
6758 10908509 10752868 10460780 10640272 10767991 10666120 11043331 11045577 10891900 10932075 11054130
6748 11054130 11061609 11125279 11141254 11042744 11201075 11323260 11223937 11088364 11227994 11318351 11206058
6737 11206058 11340981 11123162 11058409 11258507 11275908 11389289 11568470 11699771 11722850 11702985
6727 11702985 11762827 12097772 12243491 12297009 12148434 12033765 12097798 12008387 12131139 12023014
6717 12023014 11947419 12213188 12368341 12296359 12057578 12307434 12260217 11921943 12172363 12311255
6707 12311255 12415841 12554997 12383174 12486044 12424764 12383592 12497488 12538204 12617975 12698736
6697 12698736 12649279 12884470 12959550 12873911 12873075 12874573 13029279 13360056 13067953 13222360 13297777
$$ packed form
6768A0187695j13935M0294Q9613J52032J15765l5940K72253J51925j3467O2274
6758A0908509j55641k92088J79492J27719j01871L77211K246j53677M0175J22055
6748A1054130P479O3670J5975r8510J58331J22185r9323j35573J39630R0357j12293
6737A1206058J34923k17819o4753K00098J7401J13381J79181J31301K3079j9865
6727A1702985N9842L34945J45719N3518j48575j14669O4033q9411J22752j08125
6717A2023014p5595K65769J55153p1982k38781K49856m7217l38274K50420J38892
6707A2311255J04586J39156j71823J02870o1280m1172J13896M0716P9771Q0761
6697A2698736m9457K35191P5080q5639q36J498J54706L30777k92103J54407P5417
$$ plain form
6686 13297777 13054799 13150311 13312229 13410495 13593841 13490039 13546431 13320832 13299646 13424686
6676 13424686 13464854 13655528 13661534 13748773 14050128 13673937 13510738 13808451 14274446 14389119
6666 14389119 14401127 14332579 14316600 14549815 14746965 14519453 14405468 14671214 14788674 14886948
6656 14886948 14813770 15083435 15068212 15244953 14886698 15068815 15167604 15220582 15004152 14595126
6646 14595126 14704433 14859039 14730982 14927734 15012021 15024610 15126829 15024159 15308399 15319970
6636 15319970 15497978 15314577 15359560 15423144 15870824 16147868 15786499 15503841 15595152 15989320
6626 15989320 15795104 16013408 16119510 16049004 16131265 16027761 15940808 16548422 16377169 16476310
6616 16476310 16674111 16667176 16547388 16506324 16732364 16738413 16514547 16620505 16844885 16837195 17232774
$$ packed form
6686A3297777k42978R5512J61918R8266J83346j03802N6392k25599k1186J25040
6676A3424686M0168J90674O006Q7239L01355l76191j63199K97713M65995J14673
6666A4389119J2008o8548j5979K33215J97150k27512j13985K65746J17460R8274
6656A4886948p3178K69665j5223J76741l58255J82117R8789N2978k16430m09026
6646A4595126J09307J54606j28057J96752Q4287J2589J02219j02670K84240J1571
6636A5319970J78008j83401M4983O3584M47680K77044l61369k82658R1311L94168
6626A5989320j94216K18304J06102p0506Q2261j03504q6953O07614j71253R9141
6616A6476310J97801o935j19788m1064K26040O049k23866J05958K24380p690L95579
$$ plain form
6605 17232774 17433222 17365013 17209226 17310484 17555982 17600620 17460749 17162683 17178606 17375720
6595 17375720 18067671 17809606 17893108 17540918 17462386 17807779 17740055 17817181 17700843 17980246
6585 17980246 17812423 18029855 18216118 18069811 18252597 18509091 18624419 18450256 18249503
6576 18249503 18581950 18312178 18349854 18748970 19068244 18935151 18748771 18793994 19095890 19029553
6566 19029553 19136406 19109549 19145672 19380872 19462611 19567126 19856383 19674888 19791204 19999383
6556 19999383 20056735 19879070 19814303 20128057 20532659 20280878 20051309 20258998 20224544 20577593
6546 20577593 20506820 20767859 20677440 20830688 20711759 20964043 21130780 21135780 21210984 21181969
6536 21181969 21421299 21366121 21315863 21424586 21390921 21607390 22058887 21945794 21790298 21775297
$$ packed form
6605A7232774K00448o8209j55787J01258K45498M4638j39871k98066J5923J97114
6595A7375720O91951k58065Q3502l52190p8532L45393o7724P7126j16338K79403
6585A7980246j67823K17432J86263j46307J82786K56494J15328j74163k00753
6576A8249503L32447k69772L7676L99116L19274j33093j86380M5223L01896o6337
6566A9029553J06853k6857L6123K35200Q1739J04515K89257j81495J16316K08179
6556A9999383N7352j77665o4767L13754M04602k51781k29569K07689l4454L53049
6546B0577593p0773K61039r0419J53248j18929K52284J66737N000P5204k9015
6536B1181969K39330n5178n0258J08723l3665K16469M51497j13093j55496j5001
$$ plain form
6526 21775297 22228062 22183215 22144967 22477419 22702060 22722417 22636911 22754441 22774883 22936477
6516 22936477 23098856 22949586 22905315 23084577 23124562 23360679 23400681 23256236 23530157 23551011
6506 23551011 23464458 23563666 23628164 23760035 23691115 23560807 23598928 23681974 23759130 24168751 24312152
6495 24312152 24401309 24700460 24810882 24832731 24941777 25029812 24893091 24846576 24892794 25200177
6485 25200177 25625348 25454861 25360035 25314918 25373407 25351251 25614713 25941921 25921911 25895154
6475 25895154 26231342 25951020 26004618 26616179 26711191 26918462 26985450 27041416 26662548 27185754
6465 27185754 27293465 27293624 27179907 27312243 27777808 27736900 27792730 27706002 27445981 27665739
6455 27665739 27899078 27971384 27975557 28277838 28261221 28417906 28691203 28699002 28819810 28578943
$$ packed form
6526B1775297M52765m4847l8248L32452K24641K0357q5506J17530K0442J61594
6516B2936477J62379j49270m4271J79262L9985K36117M0002j44445K73921K0854
6506B3551011q6553R9208O4498J31871o8920j30308L8121Q3046P7156M09621J43401
6495B4312152Q9157K99151J10422K1849J09046Q8035j36721m6515M6218L07383
6485B5200177M25171j70487r4826m5117N8489k2156K63462L27208k0010k6757
6475B5895154L36188k80322N3598O11561R5012K07271O6988N5966l78868N23206
6465B7185754J07711J59j13717J32336M65565m0908N5830q6728k60021K19758
6455B7665739K33339P2306M173L02281j6617J56685K73297P799J20808k40867
$$ plain form
6445 28578943 28561194 29049383 29174740 29337416 29338700 29165986 29329800 29441755 29323780 29400317
6435 29400317 29798707 30089194 30132523 29929620 30018397 30225773 30330539 30609375 30403190 29937672
6425 29937672 30272752 30657956 30931558 31155552 31301999 31550740 31559641 31423184 31647777 31814561
6415 31814561 32166399 32059566 32190732 32273241 32256593 32034415 32001639 32329503 32822759 32927009
6405 32927009 32894344 33004484 33316185 33730749 33592934 33723942 33671118 33732652 33842980 33870232
6395 33870232 33771979 34091121 34365631 34494170 34678401 34959082 35110615 34987280 35053405 35269504
6385 35269504 35464143 35512764 35547559 35686698 35786548 35849798 36183519 36427407 36587214 36751610
6375 36751610 36952032 36664397 37163372 37439738 37573967 37410571 37350822 37589443 37546623 37739630
$$ packed form
6445B8578943j7749M88189J25357J62676J284j72714J63814J11955j17975P6537
6435B9400317L98390K90487M3329k02903Q8777K07376J04766K78836k06185m65518
6425B9937672L35080L85204K73602K23994J46447K48741Q901j36457K24593J66784
6415C1814561L51838j06833J31166Q2509j6648k22178l2776L27864M93256J04250
6405C2927009l2665J10140L11701M14564j37815J31008n2824O1534J10328K7252
6395C3870232r8253L19142K74510J28539J84231K80681J51533j23335O6125K16099
6385C5269504J94639M8621L4795J39139R9850O3250L33721K43888J59807J64396
6375C6751610K00422k87635M98975K76366J34229j63396n9749K38621m2820J93007
$$ plain form
6365 37739630 37894020 38117884 38275798 38667487 38906683 38628628 38744820 38732752 39080399 39296232
6355 39296232 39699490 40101880 39773673 39793475 40135219 40131427 40469133 40569406 40398244 40636206
6345 40636206 41385854 41736279 41477454 41532475 41849397 42194340 41914927 42266185 42541266 42657320
6335 42657320 42846739 43139887 43444559 43500196 43752372 43850822 43524066 43944128 44325594 44808511
6325 44808511 44824103 44605234 44709278 44902396 45157320 45420019 45690285 45837732 45856755 46072328
6315 46072328 46499461 46653196 46676493 46833184 47459493 47740808 47700100 48021091 47957162 48114404
6305 48114404 48429190 48604179 48661943 49190706 49417042 49572426 49665569 49878284 49933453 50017986
6295 50017986 50401985 50742476 50821228 50685684 51055708 51448691 51982490 52204562 52439349 52700277
$$ packed form
6365C7739630J54390K23864J57914L91689K39196k78055J16192j2068L47647K15833
6355C9296232M03258M02390l28207J9802L41744l792L37706J00273j71162K37962
6345D0636206P49648L50425k58825N5021L16922L44943k79413L51258K75081J16054
6335D2657320J89419K93148L04672N5637K52176R8450l26756M20062L81466M82917
6325D4808511J5592k18869J04044J93118K54924K62699K70266J47447J9023K15573
6315D6072328M27133J53735K3297J56691O26309K81315m0708L20991o3929J57242
6305D8114404L14786J74989N7764N28763K26336J55384R3143K12715N5169Q4533
6295E0017986L83999L40491P8752j35544L70024L92983N33799K22072K34787K60928
$$ plain form
6285 52700277 52736425 52969217 53163418 53281564 53564135 53941685 54080639 54456949 54722239 55059418
6275 55059418 55439336 55349621 55765688 55938850 56067325 56416768 56639065 56728363 57013855 57112717
6265 57112717 57594669 57960962 58196696 58486176 58886106 58808034 58955641 59049578 59438655 59796439
6255 59796439 59977147 60399329 60651996 60964741 61313381 61759148 61942885 62371591 62563499
6246 62563499 62703056 62979886 63300820 63917686 64106029 64026296 64492870 64738038 65083242 65425320
6236 65425320 66050736 66248619 66364519 66873911 67310703 67693535 67805499 68158633 68730219
6227 68730219 68889377 69220960 69707842 70374111 70668759 70558990 70810820 71193551 71323761
6218 71323761 71545120 71983329 72513367 72943709 73025897 73826527 74551393 74945044 75061501 75090826
$$ packed form
6285E2700277L6148K32792J94201J18146K82571L77550J38954L76310K65290L37179
6275E5059418L79918q9715M16067J73162J28475L49443K22297Q9298K85492R8862
6265E7112717M81952L66293K35734K89480L99930p8072J47607R3937L89077L57784
6255E9796439J80708M22182K52667L12745L48640M45767J83737M28706J91908
6246F2563499J39557K76830L20934O16866J88343p9733M66574K45168L45204L42078
6236F5425320O25416J97883J15900N09392M36792L82832J11964L53134N71586
6227F8730219J59158L31583M86882O66269K94648j09769K51830L82731J30210
6218G1323761K21359M38209N30038M30342Q2188Q00630P24866L93651J16457K9325
$$ plain form
6208 75090826 75411226 76007965 76438064 76590148 77168584 77606565 77878215 78353670 78561682
6199 78561682 79125472 79850131 80026143 80512849 80630553 80944568 81281159 81257268 82153776 82930228
6189 82930228 83507573 83708088 83769280 84312081 84819230 85189915 85695528 85982091 86686169 87505961
6179 87505961 87841425 87959124 88353471 88786741 89243448 89608240 90214152 91205182 91469261
6170 91469261 91638259 92174232 92569378 93058566 93915496 94345611 94935252 95388046 96111161
6161 96111161 96220490 96459178 97166610 97547043 98158763 98593636 99428763 100220452 100664060
6152 100664060 101744508 102043726 102447763 102979740 103409342 104127735 104726567 105473760 106334099
6143 106334099 107283335 107486120 107978876 108625850 109326260 109807035 110275253 111102362 111793059
$$ packed form
6208G5090826L20400N96739M30099J52084N78436M37981K71650M75455K08012
6199G8561682N63790P24659J76012M86706J17704L14015L36591k3891Q96508P76452
6189H2930228N77345K00515O1192N42801N07149L70685N05613K86563P04078Q19792
6179H7505961L35464J17699L94347M33270M56707L64792O05912R91030K64079
6170I1469261J68998N35973L95146M89188Q56930M30115N89641M52794P23115
6161I6111161J09329K38688P07432L80433O11720M34873Q35127P91689M43608
6152A00664060J080448K99218M04037N31977M29602P18393N98832P47193Q60339
6143A06334099R49236K02785M92756O46974P00410M80775M68218Q27109O90697
$$ plain form
6134 111793059 112295980 112934173 113418464 114108209 114855078 115371417 115968778 116621586 117203488
6125 117203488 118017389 118949601 119786437 120496134 120959113 121351733 122066761 122951181 123605909
6116 123605909 124295197 125549955 126444673 126812288 127415706 128051133 128963855 129703200 130231169
6107 130231169 131098068 132095486 133051871 133551824 134194831 135153200 136204044 136825469 137759017
6098 137759017 138616803 139190054 140337844 141005241 141941103 143010558 143433693 144118404 145381037
6089 145381037 146442155 147361623 148279652 149344703 150515517 151382906 152268117 153234623 154199501
6080 154199501 154845566 155909347 156808095 157817006 158842967 160084799 161287968 162204832
6072 162204832 163411131 164052736 164956384 166207243 167166165 168295114 169445987 170397914 171454835
$$ packed form
6134A11793059N02921O38193M84291O89745P46869N16339N97361O52808N81902
6125A17203488Q13901R32212Q36836P09697M62979L92620P15028Q84420O54728
6116A23605909O89288J254758Q94718L67615O03418O35427R12722P39345N27969
6107A30231169Q66899R97418R56385M99953O43007R58369J050844O21425R33548
6098A37759017Q57786N73251J147790O67397R35862J069455M23135O84711J262633
6089A45381037J061118R19468R18029J065051J170814Q67389Q85211R66506R64878
6080A54199501O46065J063781Q98748J008911J025961J241832J203169R16864
6072A62204832J206299O41605R03648J250859R58922J128949J150873R51927J056921
$$ plain form
6063 171454835 172983009 174260152 175277296 176297708 177116350 178057011 179221426 180601278
6055 180601278 181878752 183140364 184436276 185678425 186940985 188086258 189364343 190883347
6047 190883347 191915317 193295063 194744980 196337387 197538087 198550208 199893416 201013647
6039 201013647 202348739 203986322 205217656 206846179 208422886 209656561 211104138 212345900
6031 212345900 213591350 215346866 216694645 218039008 219157407 220498068 222169017 223608636
6023 223608636 225260449 226908132 228889641 230254655 231735608 233257024 234560788 236356977
6015 236356977 237791762 239648808 241158080 242625147 244117361 245842252 247540028 249136514
6007 249136514 250767272 252544165 254531210 256248040 257867538 259740347 261667782 263208504
$$ packed form
6063A71454835J528174J277143J017144J020412Q18642R40661J164415J379852
6055A80601278J277474J261612J295912J242149J262560J145273J278085J519004
6047A90883347J031970J379746J449917J592407J200700J012121J343208J120231
6039B01013647J335092J637583J231334J628523J576707J233675J447577J241762
6031B12345900J245450J755516J347779J344363J118399J340661J670949J439619
6023B23608636J651813J647683J981509J365014J480953J521416J303764J796189
6015B36356977J434785J857046J509272J467067J492214J724891J697776J596486
6007B49136514J630758J776893J987045J716830J619498J872809J927435J540722
$$ plain form
5999 263208504 264669069 266593755 268570924 270184816 272020738 273745261 275686969 277724320
5991 277724320 279631302 281362190 283284623 285291284 287146383 288951874 290761033 292736990
5983 292736990 294927108 296835036 298400237 300177990 302089816 304121867 306107784 308266744
5975 308266744 310150967 312360819 314554072 316765651 318507530 320339806 322170754 324131212
5967 324131212 326771651 328483171 330518501 332724842 334847782 337013179 339022086 340966394
5959 340966394 342874573 344814069 346876467 348785216 351255729 353166018 354963415 357040587
5951 357040587 359434754 361599215 363755189 365618389 367593480 369878984 372053312 374200133
5943 374200133 376197842 378272012 380074255 382226964 384224749 386036181 387948966 390241078
$$ packed form
5999B63208504J460565J924686J977169J613892J835922J724523J941708K037351
5991B77724320J906982J730888J922433K006661J855099J805491J809159J975957
5983B92736990K190118J907928J565201J777753J911826K032051J985917K158960
5975C08266744J884223K209852K193253K211579J741879J832276J830948J960458
5967C24131212K640439J711520K035330K206341K122940K165397K008907J944308
5959C40966394J908179J939496K062398J908749K470513J910289J797397K077172
5951C57040587K394167K164461K155974J863200J975091K285504K174328K146821
5943C74200133J997709K074170J802243K152709J997785J811432J912785K292112
$$ plain form
5935 390241078 392414369 394377873 396108811 397991122 400292814 402197608 403839249 405672206
5927 405672206 408086205 409832103 411820347 413582380 415688454 417590619 419169727 420862474
5919 420862474 422850892 424652940 426271845 428344674 429842448 431522706 433544818 435027550
5911 435027550 436782533 438340630 439786320 441167317 442665134 444192636 445446265 447135648
5903 447135648 448609803 450114001 451492147 452857236 454219546 455238115 456757208 457857961
5895 457857961 459111598 460461074 461474007 462504555 463208452 464206249 465344512 466518978
5887 466518978 467583368 468536080 469288924 469951970 470467966 471356440 472339078 472399533 472843292
5878 472843292 473609779 474073532 474858498 475021993 475476877 476224994 476429044 476670879 476929675
$$ packed form
5935C90241078K173291J963504J730938J882311K301692J904794J641641J832957
5927D05672206K413999J745898J988244J762033K106074J902165J579108J692747
5919D20862474J988418J802048J618905K072829J497774J680258K022112J482732
5911D35027550J754983J558097J445690J380997J497817J527502J253629J689383
5903D47135648J474155J504198J378146J365089J362310J018569J519093J100753
5895D57857961J253637J349476J012933J030548P03897R97797J138263J174466
5887D66518978J064390R52712P52844O63046N15996Q88474R82638O0455M43759
5878D72843292P66487M63753P84966J63495M54884P48117K04050K41835K58796
$$ plain form
5869 476929675 476927875 477080237 477193446 477287485 477260390 477627024 477399146 477254917 477575755 477348131
5859 477348131 477181105 476814078 476136765 475839410 475479456 474991820 474387689 474066410 473461370
5850 473461370 472939096 472378438 471918917 471078468 470128140 469147584 468538755 468107641 467657617
5841 467657617 466507554 465258278 464196035 463384895 461891562 460887205 460126145 459127464
5833 459127464 457911022 456426472 454982469 453779910 452905657 451824770 450397213 448909726
5825 448909726 447376515 445692864 444560290 443116201 441767908 440263689 438725180 437159812
5817 437159812 435156080 433454394 432188409 430151030 428596996 427076345 425344317 423388191
5809 423388191 421713164 420282744 418654942 416780305 415211851 413463911 411134332 409125515
$$ packed form
5869D76929675j800J52362J13209R4039k7095L66634k27878j44229L20838k27624
5859D77348131j67026l67027o77313k97355l59954m87636o04131l21279o05040
5850D73461370n22274n60658m59521q40449r50328r80556o08829m31114m50024
5841D67657617j150063j249276j062243q11140j493333j004357p61060r98681
5833D59127464j216442j484550j444003j202559q74253j080887j427557j487487
5825D48909726j533211j683651j132574j444089j348293j504219j538509j565368
5817D37159812k003732j701686j265985k037379j554034j520651j732028j956126
5809D23388191j675027j430420j627802j874637j568454j747940k329579k008817
$$ plain form
5801 409125515 407514095 405711393 403882614 401992902 400059528 398536093 396523244 394535989
5793 394535989 392728383 390575385 388467378 386536462 384620098 382724071 381031448 378900680
5785 378900680 376663145 374854217 372826749 370849442 368914984 366864701 365031537 362872647
5777 362872647 360943795 359013083 356843795 354787207 352845126 351004276 349255295 347079829
5769 347079829 344957211 342841220 340987464 339505119 337131748 335365734 333650605 331609366
5761 331609366 329643068 327549127 325793814 323717389 321676223 319808583 318269744 316057478
5753 316057478 314180333 312487962 310593436 308476620 306704736 304928023 303169800 301192038
5745 301192038 299179218 297301017 295850796 293939972 292016128 290272189 288372727 286553634
$$ packed form
5801D09125515j611420j802702j828779j889712j933374j523435k012849j987255
5793C94535989j807606k152998k108007j930916j916364j896027j692623k130768
5785C78900680k237535j808928k027468j977307j934458k050283j833164k158890
5777C62872647j928852j930712k169288k056588j942081j840850j748981k175466
5769C47079829k122618k115991j853756j482345k373371j766014j715129k041239
5761C31609366j966298k093941j755313k076425k041166j867640j538839k212266
5753C16057478j877145j692371j894526k116816j771884j776713j758223j977762
5745C01192038k012820j878201j450221j910824j923844j743939j899462j819093
$$ plain form
5737 286553634 284738696 282902052 281278907 279326507 277563936 275920316 274098142 272525820
5729 272525820 270606413 269076593 267320523 265856371 264475526 262650564 260902105 259051571
5721 259051571 257660584 256202699 254489470 252923514 250867494 249050668 247657667 246505942
5713 246505942 244999736 243223750 241394840 240056659 238797609 237467617 235608317 233981395
5705 233981395 232890115 231571353 229770005 228455258 226926103 225661334 224216926 222879968
5697 222879968 221663341 220258295 218588864 217128324 215948094 214722395 213127982 211405226
5689 211405226 210279512 209211827 207920920 206624840 205448669 204104329 202849844 201698480
5681 201698480 200420313 199233266 197916944 196670331 195219653 194007790 192617125 191699157
$$ packed form
5737B86553634j814938j836644j623145j952400j762571j643620j822174j572322
5729B72525820j919407j529820j756070j464152j380845j824962j748459j850534
5721B59051571j390987j457885j713229j565956k056020j816826j393001j151725
5713B46505942j506206j775986j828910j338181j259050j329992j859300j626922
5705B33981395j091280j318762j801348j314747j529155j264769j444408j336958
5697B22879968j216627j405046j669431j460540j180230j225699j594413j722756
5689B11405226j125714j067685j290907j296080j176171j344340j254485j151364
5681B01698480j278167j187047j316322j246613j450678j211863j390665r17968
$$ plain form
5673 191699157 190666286 189169727 188147310 186930677 185873787 184648911 183647801 182734106
5665 182734106 181355876 179901023 179056801 178276842 177193234 175738687 174893193 173844229
5657 173844229 172645732 171614290 170674297 169820206 168501106 167493046 166412033 165484881
5649 165484881 164634216 163411369 162806575 161918313 160825315 159796353 158816250 158118727 157129160
5640 157129160 156081865 154994459 154294114 153365536 152468115 151623173 150455553 149952875 149078140
5631 149078140 148165712 147107473 146055533 145340946 144599519 143884501 143103192 142186818 141236225
5622 141236225 140318323 139537644 138960684 138346652 137396183 136643780 135991365 135023568 134286264
5613 134286264 133698169 133081760 132122938 131280647 130335833 129621991 129298984 128389413 127935513
$$ packed form
5673A91699157j032871j496559j022417j216633j056890j224876j001110r13695
5665A82734106j378230j454853q44222p79959j083608j454547q45494j048964
5657A73844229j198497j031442r39993q54091j319100j008060j081013r27152
5649A65484881q50665j222847o04794q88262j092998j028962r80103o97523r89567
5640A57129160j047295j087406p00345r28578q97421q44942j167620n02678q74735
5631A49078140r12428j058239j051940p14587p41427p15018p81309r16374r50593
5622A41236225r17902p80679n76960o14032r50469p52403o52415r67797p37304
5613A34286264n88095o16409r58822q42291r44814p13842l23007r09571m53900
$$ plain form
5604 127935513 127136321 126252012 125371242 124743725 124213308 123387242 122570798 121885909 121654727
5595 121654727 120799959 120019072 119222997 118691310 118194225 117513384 116770180 116225491 115895506
5586 115895506 115350801 114787335 114374785 113738838 112845160 112087014 111612835 110921827 110304515
5577 110304515 109747858 109119486 108658713 108396282 107694151 106914698 106615032 106195443 105899526
5568 105899526 105259398 104604156 104206142 103453802 102591427 102174941 101536741 101027310 100609429
5559 100609429 100003492 99634134 99225385 98557459 97890659 97579701 96990631 96473036 96052425
5550 96052425 95854668 95498418 94700263 94304663 94025692 93452942 93230651 92619767 91930749
5541 91930749 91815108 91240642 90609366 90130657 89843542 89499161 89316580 88544637 87928673
$$ packed form
5604A27935513p99192q84309q80770o27517n30417q26066q16444o84889k31182
5595A21654727q54768p80887p96075n31687m97085o80841p43204n44689l29985
5586A15895506n44705n63466m12550o35947q93678p58146m74179o91008o17312
5577A10304515n56657o28372m60773k62431p02131p79453k99666m19589k95917
5568A05899526o40128o55242l98014p52340q62375m16486o38200n09431m17881
5559A00609429o05937l69358m08749o67926o66800l10958n89070n17595m20611
5550I6052425j97757l56250p98155l95600k78971n72750k22291o10884o89018
5541I1930749j15641n74466o31276m78709k87115l44381j82581p71943o15964
$$ plain form
5532 87928673 87791395 87066130 86684197 86430440 86103345 85394388 85108476 85078720 84849190 84423870
5522 84423870 83569967 83086970 82864176 82541686 82529596 82056392 81540637 81115714 80677631 80292642
5512 80292642 79340888 79143652 79255307 79008843 78508204 78317423 77765196 77650635 77340013
5503 77340013 76970844 76567121 75993882 75672807 75180553 74954050 74479674 74413858 74105398 73218128
5493 73218128 73205716 72983911 72835154 72625642 72105670 71987368 71670744 71231266 70956823 70656536
5483 70656536 70225847 70107249 69865112 69581027 69249181 69063259 68656512 68350798 68363391 68214606
5473 68214606 67722159 67347148 67088453 66742660 66261872 65852375 65722901 65619907 64933979
5464 64933979 64652065 64950236 64488935 64420556 64090956 63871293 63609540 63177337 63053389 62516479
$$ packed form
5532H7928673j37278p25265l81933k53757l27095p08957k85912k9756k29530m25320
5522H4423870q53903m82997k22794l22490j2090m73204n15755m24923m38083l84989
5512H0292642r51754j97236J11655k46464n00639j90781n52227j14561l10622
5503G7340013l69169m03723n73239l21075m92254k26503m74376o5816l08460q87270
5493G3218128j2412k21805j48757k09512n19972j18302l16624m39478k74443l00287
5483G0656536m30689j18598k42137k84085l31846j85922m06747l05714J2593j48785
5473F8214606m92447l75011k58695l45793m80788m09497j29474j02994o85928
5464F4933979k81914K98171m61301o8379l29600k19663k61753m32203j23948n36910
$$ plain form
5454 62516479 62533973 62374940 62000960 61930027 61517509 61308044 61119433 60896531 60585291 60463930
5444 60463930 60210971 59667912 59453262 59468822 59126639 59271594 59319349 58702697 58635133 58598674
5434 58598674 58381463 57884250 57852976 57639609 57375736 57197645 56903775 56755656 56384940 55801906
5424 55801906 55714023 55710243 55138684 55167515 55158993 55027443 55037111 54606949 54109057 53999436 54074964
5413 54074964 54067184 53869945 53432432 53360653 53152639 52401272 52256476 52361588 52152736 52104956
5403 52104956 51551581 51414674 51364827 51109396 50971570 50938974 50905752 50882692 50792581 50620320
5393 50620320 50323765 50049445 50076184 49684443 49394823 49589782 49363690 48994490 48906285 48787105
5383 48787105 48799982 48469931 48144310 48350986 48071527 47466636 47194868 47340893 47211313 46984323
$$ packed form
5454F2516479J7494j59033l73980p0933m12518k09465j88611k22902l11240j21361
5444F0463930k52959n43059k14650J5560l42183J44955M7755o16652o7564l6459
5434E8598674k17211m97213l1274k13367k63873j78091k93870j48119l70716n83034
5424E5801906q7883l780n71559K8831q522j31550R668m30162m97892j09621P5528
5413E4074964p780j97239m37513p1779k08014p51367j44796J05112k08852m7780
5403E2104956n53375j36907m9847k55431j37826l2596l3222k3060r0111j72261
5393E0620320k96555k74320K6739l91741k89620J94959k26092l69200q8205j19180
5383D8787105J2877l30051l25621K06676k79459o04891k71768J46025j29580k26990
$$ plain form
5373 46984323 46831266 46623575 46502263 46632750 46362090 46262028 46018966 45672898 45627213 45601403
5363 45601403 45603356 45523796 45334554 45334814 45217297 45264437 45169980 44842149 44722990 44407280 43901643
5352 43901643 43743227 43650926 43272462 43284392 43191608 43404919 43539591 43274360 42812707 42889173
5342 42889173 42908219 42986395 42962240 42771755 42596496 42596145 42327130 42204959 42367217 42195240
5332 42195240 42264609 42126287 41926889 41751010 41600146 41402467 41417080 41297032 41082586 41098486
5322 41098486 40793526 40918445 40902190 40421158 40043182 40219665 40057832 39952273 39586803 39887272
5312 39887272 40003002 39860021 39544606 39156341 39138979 39032383 39009205 39006103 39358619 39245384
5302 39245384 38992038 39053255 38876687 38514865 38533130 38598399 38579030 38469055 38094694 37980859
$$ packed form
5373D6984323j53057k07691j21312J30487k70660j00062k43062l46068m5685k5810
5363D5601403J953p9560j89242K60j17517M7140r4457l27831j19159l15710n05637
5352D3901643j58416r2301l78464J1930r2784K13311J34672k65231m61653P6466
5342D2889173J9046P8176k4155j90485j75259l51k69015j22171J62258j71977
5332D2195240O9369j38322j99398j75879j50864j97679J4613j20048k14446J5900
5322D1098486l04960J24919j6255m81032l77976J76483j61833j05559l65470L00469
5312C9887272J15730j42981l15415l88265j7362j06596k3178l102L52516j13235
5302C9245384k53346O1217j76568l61822J8265O5269j9369j09975l74361j13835
$$ plain form
5292 37980859 37934513 37960290 37892693 37861750 37657745 37538409 37713681 37800590 37524401 37220040
5282 37220040 37036996 37052361 37228324 37081539 36816118 36989788 36774228 36584001 36812428 36448976
5272 36448976 36395739 36310660 36413425 36368343 36490832 36253926 35971971 35859395 35703380 35820228
5262 35820228 35758298 36136897 35815038 35708011 35789044 35753485 35706519 35847050 35755017 35488918
5252 35488918 35289010 35101036 35278883 35095818 35148326 35096427 35001716 35059753 34998663 34865836
5242 34865836 34748392 34323766 34596536 34485793 34511270 34376822 34203027 34299556 34353303 34243733
5232 34243733 33972502 33445179 33538629 33897182 34114168 33825052 33866145 33884170 33650664 33524762
5222 33524762 33795488 33901524 33846532 33790752 33526775 33473097 33578344 33470619 33472972 33343292
$$ packed form
5292C7980859m6346K5777o7597l0943k04005j19336J75272Q6909k76189l04361
5282C7220040j83044J5365J75963j46785k65421J73670k15560j90227K28427l63452
5272C6448976n3237q5079J02765m5082J22489k36906k81955j12576j56015J16848
5262C5820228o1930L78599l21859j07027Q1033l5559m6966J40531r2033k66099
5252C5488918j99908j87974J77847j83065N2508n1899r4711N8037o1090j32827
5242C4865836j17444m24626K72770j10743K5477j34448j73795R6529N3747j09570
5232C4243733k71231n27323R3450L58553K16986k89116M1093J8025k33506j25902
5222C3524762K70726J06036n4992n5780k63977n3678J05247j07725K353j29680
$$ plain form
5212 33343292 33069256 33072384 33208545 33109079 32758526 32656844 32869912 32746635 32702565 32812660
5202 32812660 32373379 32533928 32615256 32567827 32486360 32228812 32528704 32702228 32445038 32353675
5192 32353675 32259957 32253968 32054591 31901471 31695575 31893642 32227213 32269613 32059396 32307940
5182 32307940 32295851 31837772 31837620 32017215 31733333 31761219 31685974 31526304 31509151 31451022 31332352
5171 31332352 31311968 31365878 31435872 31285287 31380899 31085014 30893994 31110170 31309722 31211966
5161 31211966 31133064 31227445 31194313 31471492 31457370 31374153 31392711 31327756 31272453 31011642 31009622
5150 31009622 31012387 30700001 30511018 30407502 30897500 30895947 30886345 30482385 30242831 30229984 30247171
5139 30247171 30374839 30281135 30462748 30435880 30557820 30461009 30220882 30206460 30413389 30091613
$$ packed form
5212C3343292k74036L128J36161r9466l50553j01682K13068j23277m4070J10095
5202C2812660m39281J60549Q1328m7429q1467k57548K99892J73524k57190r1363
5192C2353675r3718n989j99377j53120k05896J98067L33571M2400k10217K48544
5182C2307940j2089m58079j52J79595k83882K7886p5245j59670j7153n8129j18670
5171C1332352k0384N3910O9994j50585R5612k95885j91020K16176J99552r7756
5161C1211966p8902R4381l3132K77179j4122q3217J8558o4955n5303k60811k020
5150C1009622K765l12386j88983j03516M89998j553r602m03960k39554j2847J7187
5139C0247171J27668r3704J81613k6868J21940r6811k40127j4422K06929l21776
$$ plain form
5129 30091613 30041356 30235599 30167523 30242230 30239516 30047020 30090549 30250464 30177019 30017160 29950727
5118 29950727 29877158 29818899 30046243 30215754 29887805 29737479 29742617 29880254 29932420 29793917
5108 29793917 30066348 29931875 29698651 29925785 29918283 29971719 29757383 29855016 29633558 29603857
5098 29603857 29551822 29796670 29858389 29450062 29812191 30008259 29716352 29834103 29621001 29952892
5088 29952892 30210915 29922333 29775616 29975130 29961384 30097871 30241170 29981127 29849789 29799648
5078 29799648 30092233 30129384 30396817 29950278 29836954 30086207 30065168 29993114 30121474 30202983
5068 30202983 29988434 29778378 29920891 29887133 29965009 29991024 30184561 30022413 30119324 30040755
5058 30040755 30315771 29994637 29870126 30138792 30129683 30161841 30279357 30167761 30463216 30606007
$$ packed form
5129C0091613n0257J94243o8076P4707k714j92496M3529J59915p3445j59859o6433
5118B9950727p3569n8259K27344J69511l27949j50326N138J37637N2166j38503
5108B9793917K72431j34473k33224K27134p502N3436k14336R7633k21458k9701
5098B9603857n2035K44848O1719m08327L62129J96068k91907J17751k13102L31891
5088B9952892K58023k88582j46717J99514j3746J36487J43299k60043j31338n0141
5078B9799648K92585L7151K67433m46539j13324K49253k1039p2054J28360Q1509
5068C0202983k14549k10056J42513l3758P7876K6015J93537j62148R6911p8569
5058C0040755K75016l21134j24511K68666r109L2158J17516j11596K95455J42791
$$ plain form
5048 30606007 30463167 30585870 30567244 30330103 30253147 30203157 30247586 30346301 30485908 30458449
5038 30458449 30703391 30907531 30574161 30640505 30592722 30659030 30589669 30857919 30810675 31094110
5028 31094110 31457753 31560863 31603962 31623712 31691943 31497339 31325093 31055047 31464080 31599117
5018 31599117 31791546 31679573 31552433 31801165 31811251 31867581 31670430 31647674 32288821 32103869
5008 32103869 32089210 32366861 32324043 32606702 32430263 32693936 32839396 32927147 32850814 33281237
4998 33281237 33181517 33228578 33087048 33010005 33139673 33017523 33218336 33256911 33322071 33371296
4988 33371296 33521734 33779981 33835861 34036647 34008817 33950301 34172918 34136554 34092035 34138121
4978 34138121 33964066 34250002 34623844 34920153 35000501 34941113 34840896 34980605 34880207 34802737
$$ packed form
5048C0606007j42840J22703j8626k37141p6956m9990M4429R8715J39607k7459
5038C0458449K44942K04140l33370O6344m7783O6308o9361K68250m7244K83435
5028C1094110L63643J03110M3099J9750O8231j94604j72246k70046M09033J35037
5018C1599117J92429j11973j27140K48732J0086N6330j97151k2756O41147j84952
5008C2103869j4659K77651m2818K82659j76439K63673J45460Q7751p6333M30423
4998C3281237r9720M7061j41530p7043J29668j22150K00813L8575O5160M9225
4988C3371296J50438K58247N5880K00786k7830n8516K22617l6364m4519M6086
4978C4138121j74055K85936L73842K96309Q0348n9388j00217J39709j00398p7470
$$ plain form
4968 34802737 35379581 35334921 35325106 35418880 35589621 35736834 35883530 35912001 36092624 36205279
4958 36205279 36093796 36247679 36250826 36372677 36453979 36554669 36940350 36884671 37013477 36967124
4948 36967124 36868236 37284162 37516821 37000400 36905879 37177481 37303475 37509812 37508363 37708789
4938 37708789 37721911 37430056 37709563 37982408 37748246 37918256 38274387 38527819 38434138 38187260
4928 38187260 38315207 38454874 38443388 38569302 38617416 38621995 38828971 39059677 38860552 38927899
4918 38927899 38903731 38870568 38785440 38979925 39216181 39091676 39216970 39578487 39551640 39845718
4908 39845718 39517219 39478303 39308577 39230797 39593971 39607131 40070594 39864368 39914984 39811731
4898 39811731 39729891 40068659 39800209 39881652 39995263 40078846 39577735 39672314 39892891 39449011
$$ packed form
4968C4802737N76844m4660r815R3774J70741J47213J46696K8471J80623J12655
4958C6205279j11483J53883L147J21851Q1302J00690L85681n5679J28806m6353
4948C6967124r8888M15926K32659n16421r4521K71602J25994K06337j449K00426
4938C7708789J3122k91855K79507K72845k34162J70010L56131K53432r3681k46878
4928C8187260J27947J39667j1486J25914M8114M579K06976K30706j99125O7347
4918C8927899k4168l3163q5128J94485K36256j24505J25294L61517k6847K94078
4908C9845718l28499l8916j69726p7780L63174J3160M63463k06226N0616j03253
4898C9811731q1840L38768k68450Q1443J13611Q3583n01111R4579K20577m43880
$$ plain form
4888 39449011 39468721 39664193 39863453 40147372 40194660 39902145 39864511 39868394 39909973 39867036 39846035
4877 39846035 39919714 39867743 39684306 39856690 39935268 40048894 39933944 39665667 39607125 39761956
4867 39761956 39474709 39612341 39759248 39828043 39685620 39777168 39674296 39751520 39673043 39656501
4857 39656501 39409122 38956063 38982562 39100390 39170106 39185287 39147506 38990785 39070929 39312879
4847 39312879 39263126 38905392 38924230 38972256 38848495 38865027 38707246 38333987 38318211 38246367
4837 38246367 37899165 38178440 38192122 38197042 38297528 38213826 37856991 38175679 37966966 37670878
4827 37670878 37726697 37460843 37519721 37828083 37885114 37382885 37249199 37195128 37760297 37343322
4817 37343322 37123590 36746773 36638650 37064921 36649310 36903332 36967458 36751340 37059622 36985455
$$ packed form
4888C9449011J9710J95472J99260K83919M7288k92515l7634L883M1579m2937k1001
4877C9846035P3679n1971j83437J72384P8578J13626j14950k68277n8542J54831
4867C9761956k87247J37632J46907O8795j42423R1548j02872P7224p8477j6542
4857C9656501k47379m53059K6499J17828O9716J5181l7781j56721Q0144K41950
4847C9312879m9753l57734J8838M8026j23761J6532j57781l73259j5776p1844
4837C8246367l47202K79275J3682M920J00486q3702l56835L18688k08713k96088
4827C7670878N5819k65854N8878L08362N7031n02229j33686n4071N65169m16975
4817C7343322k19732l76817j08123M26271m15611K54022O4126k16118L08282p4167
$$ plain form
4807 36985455 36810915 36556281 36610790 36898340 36716843 36770767 36422997 36326127 36065175 36462739
4797 36462739 36602540 36347726 36480440 36177348 36150481 36226844 36343331 36112210 36176033 35986942
4787 35986942 35987082 35950301 35932034 35750356 35671969 35579102 35735140 35469671 35695121 35673768 35432201
4776 35432201 35771320 35866280 35543718 35298265 35372071 35500172 35413750 35454411 35829440 35696381
4766 35696381 35654721 35616039 35534595 35042491 34994487 35205042 35075632 34940623 34981382 35306105
4756 35306105 35555690 35327824 35271292 35299406 35082270 34758619 34706403 34476653 34275456 34452582
4746 34452582 35003945 34773425 34760291 34779351 34510547 34617110 34595258 34839636 34511313 34552716
4736 34552716 34358080 34353434 34531030 34442241 34467151 34351090 34668747 34666651 34794804 34907130
$$ packed form
4807C6985455j74540k54634N4509K87550j81497N3924l47770r6870k60952L97564
4797C6462739J39801k54814J32714l03092k6867P6363J16487k31121O3823j89091
4787C5986942J40l6781j8267j81678p8387r2867J56038k65469K25450k1353k41567
4776C5432201L39119R4960l22562k45453P3806J28101q6422M0661L75029j33059
4766C5696381m1660l8682q1444m92104m8004K10555j29410j35009M0759L24723
4756C5306105K49585k27866n6532K8114k17136l23651n2216k29750k01197J77126
4746C4452582N51363k30520j3134J9060k68804J06563k1852K44378l28323M1403
4736C4552716j94636m646J77596q8789K4910j16061L17657k096J28153J12326
$$ plain form
4726 34907130 34464710 34361779 34530293 34472936 34859924 35133367 34954533 34795299 34685672 34489744
4716 34489744 34340639 34593464 34535801 34887169 34918740 34700287 34867669 35090209 34892794 34797399
4706 34797399 34891222 34856692 35232185 35151806 34956125 35049785 35287649 35588924 35482734 35531899
4696 35531899 35315788 35384619 35327739 35285023 35246745 35054248 35393726 35660526 35724214 35843658
4686 35843658 35830522 35925258 35960007 35850211 36035368 36090801 36108598 36037224 36197496 36135892 36086046
4675 36086046 36595759 36912930 36894608 36774711 36630796 36604838 36358279 36526189 36571189 36516773
4665 36516773 36989103 37290270 37100283 37060085 36915857 36994968 37262819 37710326 37942721 38043609
4655 38043609 38126039 37906879 37964620 37897600 37842292 38182444 38499549 38683103 38811282 38786659
$$ packed form
4726C4907130m42420j02931J68514n7357L86988K73443j78834j59234j09627j95928
4716C4489744j49105K52825n7663L51368L1571k18453J67382K22540j97415r5395
4706C4797399R3823l4530L75493q0379j95681R3660K37864L01275j06190M9165
4696C5531899k16111O8831n6880m2716l8278j92497L39478K66800O3688J19444
4686C5843658j3136R4736L4749j09796J85157N5433J7797p1374J60272o1604m9846
4675C6086046N09713L17171j8322j19897j43915k5958k46559J67910M5000n4416
4665C6516773M72330L01167j89987m0198j44228P9111K67851M47507K32395J00888
4655C8043609Q2430k19160N7741o7020n5308L40152L17105J83554J28179k4623
$$ plain form
4645 38786659 39056251 38817355 38937448 39226166 39093056 39101172 39245169 39497313 39492064 39445889
4635 39445889 39696962 39890056 39632337 39638719 39969024 40027552 40209496 40230952 40096867 40172043
4625 40172043 40331371 40289361 40299831 40749407 40771983 40941969 41195823 40982526 40608785 40692679
4615 40692679 40758291 40686552 40800451 40937083 41030120 41157307 41007053 40936036 40920449 40918836 40983691
4604 40983691 41184385 40951448 40986866 40973763 40676233 40827614 41114309 40937201 40813635 40914055
4594 40914055 40867187 41030359 40898606 40615452 40489843 40527350 40652044 40163232 40215976 40040602
4584 40040602 39984178 39904871 39722391 39553076 39620635 39633249 39270588 39167670 38905468 38733924
4574 38733924 38490071 38290080 38381222 38346280 38099117 38349423 38138878 37729085 37492214 37374134
$$ packed form
4645C8786659K69592k38896J20093K88718j33110Q116J43997K52144n249m6175
4635C9445889K51073J93094k57719O382L30305N8528J81944K1456j34085P5176
4625D0172043J59328m2010J0470M49576K2576J69986K53854k13297l73741Q3894
4615D0692679O5612p1739J13899J36632R3037J27187j50254p1017j5587j613O4855
4604D0983691K00694k32937L5418j3103k97530J51381K86695j77108j23566J00420
4594D0914055m6868J63172j31753k83154j25609L7507J24694m88812N2744j75374
4584D0040602n6424p9307j82480j69315O7559J2614l62661j02918k62202j71544
4574C8733924k43853j99991R1142l4942k47163K50306k10545m09793k36871j18080
$$ plain form
4564 37374134 37212109 37141155 36762533 36810161 36661353 36526793 36089813 36097942 36033291 36020286
4554 36020286 35714651 35420937 35248498 35101631 34806706 34425588 34351521 34648062 34336270 34154024
4544 34154024 34154135 33501932 33228329 32936653 32823617 32542148 32298221 31682178 31823772 31698740
4534 31698740 31371883 31509933 31229314 30920660 30932308 30842725 30717369 30463317 30140039 30065314
4524 30065314 29968636 29529634 29114126 28902074 28541657 28402778 28404605 27928277 27642132 27446291
4514 27446291 27307587 27500963 27344615 27168809 26904824 26725318 26534012 26460896 26579721 26654544
4504 26654544 26117189 25450082 25001983 24955278 24917981 24729381 24495423 24558140 24221450 24064576
4494 24064576 23815996 23668597 23874907 23646895 23479945 23247394 23259599 23146023 22981622 22623302
$$ packed form
4564C7374134j62025p0954l78622M7628j48808j34560m36980Q129o4651j3005
4554C6020286l05635k93714j72439j46867k94925l81118p4067K96541l11792j82246
4544C4154024J11o52203k73603k91676j13036k81469k43927o16043J41594j25032
4534C1698740l26857J38050k80619l08654J1648q9583j25356k54052l23278p4725
4524C0065314r6678m39002m15508k12052l60417j38879J827m76328k86145j95841
4514B7446291j38704J93376j56348j75806k63985j79506j91306p3116J18825P4823
4504B6654544n37355o67107m48099m6705l7297j88600k33958O2717l36690j56874
4494B4064576k48580j47399K06310k28012j66950k32551J2205j13576j64401l58320
$$ plain form
4484 22623302 22654445 22209412 21967023 21890480 21908038 21911838 21737566 21708522 21436799 21090951
4474 21090951 20777486 20917140 20760316 20866169 20697816 20638945 20375854 20089289 20010862 19915370
4464 19915370 19875986 19471927 19363867 19486986 19388338 19193956 19068441 18871117 18676595 18496573
4454 18496573 18246353 18185681 18264778 18087264 18069997 18075981 17822567 17837968 17544769 17162828
4444 17162828 17178285 17114733 17237559 16908527 17061886 17110664 16985132 16900668 16754736 16745217
4434 16745217 16597539 16100765 15866165 16198488 16216914 16029150 15821113 15540262 15680105 15477227
4424 15477227 15695824 15655351 15463536 15239967 15124352 14741723 14726602 14913557 14687065 14665623
4414 14665623 14682588 14767696 14791374 14467447 13986740 13787985 13713624 13808502 13746191 14091741
$$ packed form
4484B2623302L1143m45033k42389p6543J7558L800j74272k9044k71723l45848
4474B1090951l13465J39654j56824J05853j68353n8871k63091k86565p8427r5492
4464A9915370l9384m04059j08060J23119r8648j94382j25515j97324j94522j80022
4454A8496573k50220o0672P9097j77514j7267N984k53414J5401k93199l81941
4444A7162828J5457o3552J22826l29032J53359M8778j25532q4464j45932r519
4434A6745217j47678m96774k34600L32323J8426j87764k08037k80851J39843k02878
4424A5477227K18597m0473j91815k23569j15615l82629j5121J86955k26492k1442
4414A4665623J6965Q5108K3678l23927m80707j98755p4361R4878o2311L45550
$$ plain form
4404 14091741 14058391 13690288 13588065 13451194 13607645 13624382 13538385 13454675 13593442 13293547
4394 13293547 13130670 12863908 12510573 12609258 12969917 13297171 13067011 12647508 12664202 12448412
4384 12448412 12263049 12337165 12226164 12355329 12236439 12214560 12184521 12088945 11915604 12037160
4374 12037160 11986834 11911384 11635334 11690840 11700920 11768748 11434273 11634292 11735575 11856405
4364 11856405 11774587 11527772 11825878 11564121 10809117 10757310 10839947 11260977 11231364 10836401
4354 10836401 10629565 10488037 10569865 10338596 10407636 10471696 10664604 10630411 10487490 10170929
4344 10170929 10315572 10386752 10136051 10227032 10212990 10099647 10045538 9988243 10010497 10121771
4334 10121771 9937275 10084932 10270221 9931279 10035451 10186829 10164197 10088154 9837577 9467822
$$ packed form
4404A4091741l3350l68103j02223j36871J56451J6737q5997q3710J38767k99895
4394A3293547j62877k66762l53335R8685L60659L27254k30160m19503J6694k15790
4384A2448412j85363P4116j11001J29165j18890k1879l0039r5576j73341J21556
4374A2037160n0326p5450k76050N5506J0080O7828l34475K00019J01283J20830
4364A1856405q1818k46815K98106k61757p55004n1807Q2637M21030k9613l94963
4354A0836401k06836j41528Q1828k31269O9040O4060J92908l4193j42921l16561
4344A0170929J44643P1180k50701R0981j4042j13343n4109n7295K2254J11274
4334A0121771j84496J47657J85289l38942J04172J51378k2632p6043k50577l69755
$$ plain form
4324 9467822 9437736 9512533 9264665 9390844 9296300 9248193 9451614 9201856 9403853 9172758
4314 9172758 9093544 9354240 8875493 8738960 9017513 9062827 9382304 9493213 9161040 9126634
4304 9126634 9120849 8804720 8727079 8822553 8634453 8720167 8477300 8491445 8820090 8778515 8677072
4293 8677072 8695693 8270142 7927305 7979234 7876355 8063357 8274828 8538707 8452313 8232697
4283 8232697 8205549 8176379 8090040 8127464 7942677 7955664 7911303 7940597 8279852 7834766 7851386
4272 7851386 7681912 7570251 8112991 8066427 7906520 7852121 8017100 7839280 7683242 7604552
4262 7604552 7201271 7115419 7167660 7112991 7176615 7470219 7371002 7227736 7421949 7533764
4252 7533764 7678948 7691680 7387735 7560511 7291592 7146323 7295205 7307091 7274313 7285195
$$ packed form
4324I467822l0086P4797k47868J26179r4544m8107K03421k49758K01997k31095
4314I172758p9214K60696m78747j36533K78553M5314L19477J10909l32173l4406
4304I126634n785l16129p7641R5474j88100Q5714k42867J4145L28645m1575j01443
4293H677072J8621m25551l42837N1929j02879J87002K11471K63879q6394k19616
4283H232697k7148k9170q6339L7424j84787J2987m4361K9294L39255m45086J6620
4272G851386j69474j11661N42740m6564j59907n4399J64979j77820j56038p8690
4262G604552m03281q5852N2241n4669O3624K93604r9217j43266J94213J11815
4252G533764J45184J2732l03945J72776k68919j45269J48882J1886l2778J0882
$$ plain form
4242 7285195 7455391 7073572 7127306 7205062 7264736 6986541 6982562 6994266 7128189 7078216 6993439
4231 6993439 6493344 6385591 6648883 6739178 6687390 6702567 7025451 6928785 7075430 6908247
4221 6908247 6799364 6523820 6611324 6561428 6712075 6937859 7063170 6980100 6907466 6539071
4211 6539071 6422817 6795996 6634483 6326599 6430680 6441524 6461079 6535786 6404679 6544469
4201 6544469 6683388 6613900 6443359 6244060 6327346 6246991 6267963 6394540 6331245 6557162
4191 6557162 6568289 6451332 6417578 6194220 6109144 6363662 6296534 6382043 6171426 6164264 6368411
4180 6368411 6296543 6002349 6093079 6110739 6342531 6231743 5982945 6182621 6015312 6029700
4170 6029700 6021380 6098672 6124824 5924643 5850760 5721200 5859096 5591570 5477117 5836049
$$ packed form
4242G285195J70196l81819N3734P7756N9674k78195l979J1704J33923m9973q4777
4231F993439n00095j07753K63292R0295n1788J5177L22884r6666J46645j67183
4221F908247j08883k75544Q7504m9896J50647K25784J25311q3070p2634l68395
4211F539071j16254L73179j61513l07884J04081J0844J9555P4707j31107J39790
4201F544469J38919o9488j70541j99299Q3286q0355K0972J26577o3295K25917
4191F557162J1127j16957l3754k23358q5076K54518o7128Q5509k10617p162K04147
4180F368411p1868k94194R0730J7660K31792j10788k48798J99676j67309J4388
4170F029700q320P7292K6152k00181p3883j29560J37896k67526j14453L58932
$$ plain form
4160 5836049 5796807 5868974 5774216 5506964 5641748 5803305 5952699 5939162 6326815 6142528
4150 6142528 5815142 5804791 6037869 6138725 5973272 6023891 5859498 5821964 5601041 5639064
4140 5639064 5778049 5801976 5748072 5861839 5862325 5892208 5798277 6075948 6161786 5948467 5982674
4129 5982674 6114321 5828960 5654319 5855303 5735809 6073781 5620321 5743618 6210169 5972936
4119 5972936 5927153 5567966 5491411 5496636 5821949 6007419 5849320 5721314 5867384 5878357
4109 5878357 5632354 5716571 5812396 5782409 5871294 5783438 5852762 5875731 5743235 5639660 5765586
4098 5765586 5890076 6054520 6047522 5924339 5876166 5667819 5654034 5797252 5799188 5951580 6114302
4087 6114302 6327370 6135381 5962417 5759025 5989542 6004586 5931525 5669089 5613816 5677805
$$ packed form
4160E836049l9242P2167r4758k67252J34784J61557J49394j3537L87653j84287
4150F142528l27386j0351K33078J00856j65453N0619j64393l7534k20923L8023
4140E639064J38985K3927n3904J13767M86K9883r3931K77671Q5838k13319L4207
4129E982674J31647k85361j74641K00984j19494L37972m53460J23297M66551k37233
4119E972936m5783l59187p6555N225L25313J85470j58099j28006J46070J0973
4109E878357k46003Q4217R5825k9987Q8885q7856O9324K2969j32496j03575J25926
4098E765586J24490J64444o998j23183m8173k08347j3785J43218J936J52392J62722
4087F114302K13068j91989j72964k03392K30517J5044p3061k62436n5273O3989
$$ plain form
4077 5677805 5851846 6003321 5960250 5767192 5525488 5714339 5782440 5917421 6125406 5952080
4067 5952080 5930685 5979783 5711968 5706404 5543868 5690563 5568140 5713709 5666164 5555959
4057 5555959 5675616 5641255 5803426 5977195 6490070 6365800 6249827 6261749 6169789 6095528
4047 6095528 6034333 6368398 6236433 6026526 5828370 5770274 5616232 6107127 6035784 6033100
4037 6033100 5819652 5768745 6121850 6320654 6062289 5778045 5634598 6021619 5967473 5972023
4027 5972023 5952332 6100179 6257889 5989052 5819837 5850137 5848882 5507522 5180416 5047176
4017 5047176 5416663 5522583 5676977 5466778 5734667 5742535 5667893 5995400 5717835 5709493
4007 5709493 5460425 5356811 5588006 5552886 5341842 5294612 5429851 5262457 5140353 4996288
$$ packed form
4077E677805J74041J51475m3071j93058k41704J88851O8101J34981K07985j73326
4067E952080k1395M9098k67815n564j62536J46695j22423J45569m7545j10205
4057E555959J19657l4361J62171J73769N12875j24270j15973J1922r1960p4261
4047F095528o1195L34065j31965k09907j98156n8096j54042M90895p1343k684
4037F033100k13448n0907L53105J98804k58365k84244j43447L87021n4146M550
4027E972023j9691J47847J57710k68837j69215L0300j255l41360l27106j33240
4017E047176L69487J05920J54394k10199K67889P868p4642L27507k77565q342
4007E709493k49068j03614K31195l5120k11044m7230J35239j67394j22104j44065
$$ plain form
3997 4996288 5407013 5590551 5416111 5358425 5642251 5549257 5371994 5400846 5230820 5271255
3987 5271255 4964902 4801057 5210837 5419016 5324274 4822366 5008656 5042707 5038928 4775160
3977 4775160 4773449 4812233 4824992 5043447 4776834 4943982 4976533 4746623 4818610 4857039 4670888
3966 4670888 4435571 4452621 4298058 4602260 4680675 4675173 4999579 4582532 4541317 4646845
3956 4646845 4225101 4299182 4561765 4506284 4128395 4087603 4202098 4051766 4028095 3988287
3946 3988287 4470609 4587604 4428443 4280098 4099220 3999579 4083030 4023211 3807513 4178341
3936 4178341 4084895 3928862 3799118 3669932 3798388 3840422 3831851 3589085 3800146 3970834
3926 3970834 3871577 3710372 3548026 3704786 3739245 3520492 3566253 3735684 3737114 3561433
$$ packed form
3997D996288M10725J83538j74440n7686K83826r2994j77263K8852j70026M0435
3987E271255l06353j63845M09780K08179r4742n01908J86290L4051l779k63768
3977D775160j711L8784J2759K18455k66613J67148L2551k29910P1987L8429j86151
3966D670888k35317J7050j54563L04202P8415n502L24406m17047m1215J05528
3956D646845m21744P4081K62583n5481l77889m0792J14495j50332k3671l9808
3946C988287M82322J16995j59161j48345j80878r9641Q3451n9819k15698L70828
3936D178341r3446j56033j29744j29186J28456M2034q571k42766K11061J70688
3926C970834r9257j61205j62346J56760L4459k18753M5761J69431J430j75681
$$ plain form
3916 3561433 3792914 3686563 3469262 3361879 3325394 3280080 3102100 3137919 3390627 3547835
3906 3547835 3441308 3387955 3403335 3112177 3067635 2950995 2945796 3086154 3261983 3444449
3896 3444449 3462173 3310496 3387632 3251815 3081526 2829020 3073951 3016940 2811688 3089104
3886 3089104 2887733 3005267 3040845 3025609 3197391 3235182 2965485 3289265 3153593 3029754
3876 3029754 3061841 2813969 3028622 2906741 2620853 2705921 2710402 2901944 2654881 2372058
3866 2372058 2411346 2568127 2531242 2483177 2515323 2577885 2586439 2657251 2726120 2361098 2383539
3855 2383539 2441646 2581508 2702015 2619081 2436279 2606207 2611967 2507123 2202468 1923490
3845 1923490 2204678 2374028 2438704 2664959 2583897 2196639 2233172 2172125 2503136 2644553
$$ packed form
3916C561433K31481j06351k17301j07383l6485m5314j77980L5819K52708J57208
3906C547835j06527n3353J5380k91158m4542j16640n199J40358J75829J82466
3896C444449J7724j51677P7136j35817j70289k52506K44931n7011k05252K77416
3886C089104k01371J17534L5578j5236J71782L7791k69697L23780j35672j23839
3876C029754L2087k47872K14653j21881k85888Q5068M481J91542k47063k82823
3866B372058L9288J56781l6885m8065L2146O2562Q554P0812O8869l65022K2441
3855B383539N8107J39862J20507q2934j82802J69928N760j04844l04655k78978
3845A923490K81188J69350O4676K26255q1062l87258L6533o1047L31011J41417
$$ plain form
3835 2644553 2599121 2538157 2462300 2520861 2331220 2351087 2305363 2147422 2330248 2264329 2291235
3824 2291235 2290575 2051732 2080791 2110863 2111007 2169958 2013628 1834692 1689033 1815958 1904355
3813 1904355 1885436 1801257 1806184 1950984 1917337 1950186 1994911 1961987 2168602 2248385 1982852
3802 1982852 1888638 1864351 1869122 2086999 2178694 1982725 2015791 1637550 1627218 1848647 1980449
3791 1980449 2103810 2134998 2215560 1933215 1853757 1773426 1896996 1787085 1908506 1853738
3781 1853738 1848338 2078394 2182432 2335859 2179018 1658085 1790028 1685290 1604358 1825725
3771 1825725 1713100 1603427 1629916 1627233 1506259 1651611 1687542 1813633 2114530 1827286
3761 1827286 1647874 1846183 1682183 1651704 1487756 1513680 1621182 1592324 1559080 1645848
$$ packed form
3835B644553m5432o0964p5857N8561j89641J9867m5724j57941J82826o5919K6906
3824B291235o60k38843K9059L0072J44N8951j56330j78936j45659J26925Q8397
3813A904355j8919q4179M927J44800l3647L2849M4725l2924K06615P9783k65533
3802A982852r4214k4287M771K17877R1695j95969L3066l78241j0332K21429J31802
3791A980449J23361L1188Q0562k82345p9458q0331J23570j09911J21421n4768
3781A853738n400K30056J04038J53427j56841n20933J31943j04738q0932K21367
3771A825725j12625j09673K6489k683j20974J45352L5931J26091L00897k87244
3761A827286j79412J98309j64000l0479j63948K5924J07502k8858l3244Q6768
$$ plain form
3751 1645848 1669663 1715138 1590124 1898417 1792757 1658310 1488920 1598813 1604251 1924569
3741 1924569 1936315 1704521 1834890 1615977 1670941 2111432 1605122 1934483 1962112 1579114
3731 1579114 1430879 1548340 1974848 1499103 1496333 1564946 1456018 1637195 1502915 1432870
3721 1432870 1329831 1195487 1251478 1392731 1379162 1629418 1694325 1545676 1396755 1457608
3711 1457608 1666077 1206039 1303910 1133199 984503 1182769 1518104 1560744 1782194 1494839
3701 1494839 1433512 1497743 1548269 1253259 1375416 1680708 1655922 1444553 1246229 899717
3691 899717 1128944 1265377 1380082 1489399 1450892 1140658 892898 1270866 1440519 1363608
3681 1363608 1343512 1301225 1230302 1323395 1249716 970849 1022789 1002730 815661 1063387 1270367
$$ packed form
3751A645848K3815M5475j25014L08293j05660j34447j69390J09893N438L20318
3741A924569J1746k31794J30369k18913N4964M40491n06310L29361K7629l82998
3731A579114j48235J17461M26508m75745k770O8613j08928J81177j34280p0045
3721A432870j03039j34344N5991J41253j3569K50256O4907j48649j48921O0853
3711A457608K08469m60038R7871j70711j48696J98266L35335M2640K21450k87355
3701A494839o1327O4231N0526k95010J22157L05292k4786k11369j98324l46512
3691H99717K29227J36433J14705J09317l8507l10234k47760L77968J69653p6911
3681A363608k0096m2287p0923R3093p3679k78867N1940k0059j87069K47726K06980
$$ plain form
3670 1270367 1354548 1171163 1262408 1333880 1534879 1250989 1337015 1495689 1535928 1479940 1404897
3659 1404897 1290918 1497414 1473062 1172579 1059018 1168478 1231420 738433 685267 1280649
3649 1280649 1475892 1377938 1066945 890644 1097104 1069175 1324226 1318271 1427225 1362345
3639 1362345 1173454 1203687 1179108 1240350 1153439 1168975 1245483 925809 666912 930139 1113242
3628 1113242 1332810 1275750 1350092 1240798 849994 1025029 981711 1366251 1269599 980683
3618 980683 1077849 1095082 1106023 1044617 1236851 1027345 1042628 1341740 1277795 1306919 1222080
3607 1222080 1059109 917675 1184610 1367373 1368152 1364691 1339262 1739057 1477182 1128486 1277924
3596 1277924 1502052 1430361 1112743 971239 1252398 1385246 1129864 1220566 1146443 1440106
$$ packed form
3670A270367Q4181j83385R1245P1472K00999k83890Q6026J58674M0239n5988p5043
3659A404897j13979K06496k4352l00483j13561J09460O2942m92987n3166N95382
3649A280649J95243r7954l10993j76301K06460k7929K55051n955J08954o4880
3639A362345j88891L0233k4579O1242q6911J5536P6508l19674k58897K63227J83103
3628A113242K19568n7060P4342j09294l90804J75035m3318L84540r6652k88916
3618I80683R7166J7233J0941o1406J92234k09506J5283K99112o3945K9124q4839
3607A222080j62971j41434K66935J82763P79l461k5429L99795k61875l48696J49438
3596A277924K24128p1691l17618j41504K81159J32848k55382R0702p4123K93663
$$ plain form
3586 1440106 1553237 1191869 991036 878555 910050 1023156 1234796 1188625 1076559 1190378
3576 1190378 1168844 958339 1088384 1079522 956079 1267675 1183969 1291540 1221112 1293185 1251102
3565 1251102 997442 1057113 1071102 1279531 1471363 1189131 1226722 1145411 1176267 815816
3555 815816 787145 1089381 912870 1163582 1076630 861598 630405 864371 1080723 1131530
3545 1131530 1077783 1415509 1270461 1021156 828050 1020213 1150789 1100736 1115409 1222206
3535 1222206 1192542 1291942 986576 796881 889248 837649 877742 1150298 762555 832551 1316573
3524 1316573 1136479 1223629 1051076 1123882 1043600 895183 832724 1045319 817620 1191861
3514 1191861 1573774 1506981 1354646 1191147 1181750 1200499 1109521 970243 1026215 876013 741551
$$ packed form
3586A440106J13131l61368k00833j12481L1495J13106K11640m6171j12066J13819
3576A190378k1534k10505J30045q862j23443L11596q3706J07571p0428P2073m2083
3565A251102k53660N9671J3989K08429J91832k82232L7591q1311L0856l60451
3555H15816k8671L02236j76511K50712q6952k15032k31193K33966K16352N0807
3545A131530n3747L37726j45048k49305j93106J92163J30576n0053J4673J06797
3535A222206k9664R9400l05366j89695R2367n1599M0093K72556l87743O9996M84022
3524A316573j80094Q7150j72553P2806q0282j48417o2459K12595k27699L74241
3514A191861L81913o6793j52335j63499r397J8749r0978j39278N5972j50202j34462
$$ plain form
3503 741551 819999 901957 1062952 1210098 987261 1145473 1184542 1186011 1155050 833624 788221
3492 788221 943604 747823 1001488 1053274 1146678 1124053 1015925 771439 682873 1047478
3482 1047478 979016 986540 985119 637094 828644 1196044 876834 1109875 1015997 876490 1077362
3471 1077362 1016509 1074032 1140704 1051603 1193901 975519 1023679 1014313 866306 906893 1019374
3460 1019374 1128384 1174897 886370 919092 1485095 1316222 1161540 1187810 1251359 1148780
3450 1148780 815720 646752 701206 671573 587354 796491 668389 548756 706604 964702
3440 964702 805180 1116732 1075600 1085916 1217784 1019895 932026 774102 1227598 1225266 897735
3429 897735 992653 933801 973307 1125761 829711 1049137 1100198 1190179 1566092 1424407 1254158
$$ packed form
3503G41551P8448Q1958J60995J47146k22837J58212L9069J469l0961l21426m5403
3492G88221J55383j95781K53665N1786R3404k2625j08128k44486q8566L64605
3482A047478o8462P524j421l48025J91550L67400l19210K33041r3878j39507K00872
3471A077362o0853N7523O6672q9101J42298k18382M8160r366j48007M0587J12481
3460A019374J09010M6513k88527L2722N66003j68873j54682K6270O3549j02579
3450A148780l33060j68968N4454k9633q4219K09137j28102j19633J57848K58098
3440I64702j59522L11552m1132J0316J31868j97889q7869j57924M53496k332l27531
3429H97735R4918n8852L9506J52454k96050K19426N1061Q9981L75913j41685j70249
$$ plain form
3418 1254158 1151391 1106047 1261472 1434534 1197432 1299424 1362371 1085729 852672 642613
3408 642613 891432 917263 887878 984382 1001465 916273 1037340 1355372 1419765 948738 1051135
3397 1051135 959419 749965 896675 939804 1282458 1237244 967211 1235424 1279210 1424925
3387 1424925 1036861 892336 1026494 963085 1090564 724190 627887 851092 746718 528928
3377 528928 829160 907419 868083 1055295 892106 770564 1047612 913381 1011093 1077375
3367 1077375 1159495 902354 882194 791931 1072828 1101387 1503829 1575277 1024101 724869
3357 724869 808448 1056113 1063671 1023403 993259 1171855 1038072 956144 997423 1211186 1249890
3346 1249890 1063475 1047454 815446 649535 1065159 680061 950632 1133531 1018675 1260636
$$ packed form
3418A254158j02767m5344J55425J73062k37102J01992O2947k76642k33057k10059
3408F42613K48819K5831k9385R6504J7083q5192J21067L18032O4393m71027J02397
3397A051135r1716k09454J46710M3129L42654m5214k70033K68213M3786J45715
3387A424925l88064j44525J34158o3409J27479l66374r6303K23205j04374k17790
3377E28928L00232P8259l9336J87212j63189j21542K77048j34231R7712O6282
3367A077375Q2120k57141k0160r0263K80897K8559M02442P1448n51176k99232
3357G24869Q3579K47665P558m0268l0144J78596j33783q1928M1279K13763L8704
3346A249890j86415j6021k32008j65911M15624l85098K70571J82899j14856K41961
$$ plain form
3336 1260636 1091642 1151364 1094437 964240 1092102 1252093 1057341 812311 906579 755303
3326 755303 1105101 1297327 1100789 845211 717402 656279 916692 861837 1095173 1005577
3316 1005577 1125865 1088718 548094 516905 605003 1013973 950247 1088255 918356 835433
3306 835433 1054571 1088441 939397 939490 692498 712307 1143242 1104134 989167 1045164 1109665
3295 1109665 1000254 844814 873011 852235 631920 429541 536429 806787 680141 555126
3285 555126 458232 783545 782619 690554 503821 752690 644281 669412 729296 634359 610697
3274 610697 448836 675444 1005092 837810 710277 702184 429211 418665 566506 724781
3264 724781 341866 545891 762675 754956 969246 854119 777629 781123 706131 813736 811883
$$ packed form
3336A260636j68994N9722n6927j30197J27862J59991j94752k45030R4268j51276
3326G55303L49798J92226j96538k55578j27809o1123K60413n4855K33336q9596
3316A005577J20288l7147n40624l1189Q8098M08970o3726J38008j69899q2923
3306H35433K19138L3870j49044R3k46992J9809M30935l9108j14967N5997O4501
3295A109665j09411j55440K8197k0776k20315k02379J06888K70358j26646j25015
3285E55126r6894L25313r26r2065j86733K48869j08409K5131N9884r4937k3662
3274F10697j61861K26608L29648j67282j27533q093k72973j0546J47841J58275
3264G24781l82915K04025K16784p719K14290j15127p6490L494p4992J07605j853
$$ plain form
3253 811883 824048 692583 571650 465065 414199 532656 470157 274086 435751 426594 241017
3242 241017 69292 294518 289193 492366 607592 752445 819060 1010081 993788 839145
3232 839145 741693 570412 624195 689375 409987 440613 283495 37598 252289 288528 96195
3221 96195 208135 353826 461345 734399 668963 662734 646246 671952 612471 324437 493119
3210 493119 518781 487295 599921 683258 450235 185186 162679 358489 677776 567044
3200 567044 536064 795035 658289 436053 457764 562069 817919 744217 537001 432079
3190 432079 314910 -95023 -91421 -93696 104908 518842 481474 346561 396928 -48530 44963
3179 44963 335266 513796 702940 415674 247298 273992 482002 611786 422378 320796
$$ packed form
3253H11883J2165j31465j20933j06585n0866J18457o2499j96071J61665r157j85577
3242B41017j71725K25226n325K03173J15226J44853O6615J91021j6293j54643
3232H39145r7452j71281N3783O5180k79388L0626j57118k45897K14691L6239j92333
3221I6195J11940J45691J07519K73054o5436o229j6488K5706n9481k88034J68682
3210D93119K5662l1486J12626Q3337k33023k65049k2507J95810L19287j10732
3200E67044l0980K58971j36746k22236K1711J04305K55850p3702k07216j04922
3190D32079j17169m09933L602k275J98604M13934l7368j34913N0367m45458R3493
3179D4963K90303J78530J89144k87266j68376K6694K08010J29784j89408j01582
$$ plain form
3169 320796 77202 185371 496782 476889 355628 187987 234651 130171 67708 384688
3159 384688 318476 243005 375002 416374 689490 651989 106149 37495 284900 485413 324975
3148 324975 589408 339499 115324 267829 315890 391462 472330 297296 175561 215793
3138 215793 636252 680593 284387 54454 29855 108944 -18784 319408 552245 427588
3128 427588 358866 196131 268168 145353 253991 628829 627608 379231 135251 459718
3118 459718 87741 180136 522265 393316 496811 646016 565320 545878 674137 640435
3108 640435 592988 416982 214759 287977 345049 511123 320268 478070 496773 467309 272566
3097 272566 394005 630545 414138 170100 29115 216045 324346 310671 278940 98431
$$ packed form
3169C20796k43594J08169L11411j9893j21261j67641M6664j04480o2463L16980
3159C84688o6212p5471J31997M1372K73116l7501n45840o8654K47405K00513j60438
3148C24975K64433k49909k24175J52505M8061P5572Q0868j75034j21735M0232
3138B15793M20459M4341l96206k29933k4599P9089j27728L38192K32837j24657
3128D27588o8722j62735P2037j22815J08638L74838j221k48377k43980L24467
3118D59718l71977R2395L42129j28949J03495J49205q0696j9442J28259l3702
3108F40435m7447j76006k02223P3218N7072J66074j90855J57802J8703k9464j94743
3097B72566J21439K36540k16407k44038j40985J86930J08301j3675l1731j80509
$$ plain form
3087 98431 216170 161483 197456 590893 922651 799587 559102 333759 379135 548533
3077 548533 436210 588591 310374 399265 546012 374590 482770 551857 632247 496546
3067 496546 364641 698277 513577 218426 356216 485750 733294 634547 540487 314032
3057 314032 71009 216787 210468 203839 216332 337082 593811 970956 879734 204295 502020
$$ packed form
3087I8431J17739n4687L5973L93437L31758j23064k40485k25343M5376J69398
3077E48533j12323J52381k78217Q8891J46747j71422J08180O9087Q0390j35701
3067D96546j31905L33636j84700k95151J37790J29534K47544r8747r4060k26455
3057C14032k43023J45778o319o629J2493J20750K56729L77145r1222o75439K97725
$$ [...]
##END NTUPLES=NMR SPECTRUM
##END=
