##TITLE=1H_CA-9367-2
 200.13MHz, CDCl3,
 8 sc
 
 8.8.2025
##JCAMPDX= 6.0         $$ Bruker NMR JCAMP-DX V2.0
##DATA TYPE= NMR SPECTRUM
##DATA CLASS= NTUPLES
##ORIGIN= UXNMR, Bruker Analytische Messtechnik GmbH
##OWNER= pz
$$ XWIN-NMR		Version 3.5
$$ Fri Aug  8 14:16:42 2025 Russian Standard Time (UT+4h)  she@DPX200
##.OBSERVE FREQUENCY= 200.1313
##.OBSERVE NUCLEUS= ^1H
##.ACQUISITION MODE= SIMULTANEOUS
##.ACQUISITION SCHEME= undefined
##.AVERAGES= 8
##.DIGITISER RES= 18
##SPECTROMETER/DATA SYSTEM= spect
##.PULSE SEQUENCE= zg30
##.SOLVENT NAME= CDCl3
##.SHIFT REFERENCE= (INTERNAL, CDCl3, 0, 15.391)
##AUDIT TRAIL= $$ (NUMBER, WHEN, WHO, WHERE, WHAT)
$$ ##TITLE= Audit trail, XWIN-NMR		Version 3.5
$$ ##JCAMPDX= 5.01
$$ ##ORIGIN= Bruker BioSpin GmbH
$$ ##OWNER= she
$$ F:/spectra/data/she/nmr/H-C/1/pdata/1/auditp.txt
$$ ##AUDIT TRAIL=  $$ (NUMBER, WHEN, WHO, WHERE, WHAT)
(   1,<2025-08-08 14:15:21.21 +0400>,<she>,<DPX200>,
      <created by zg, POWCHK disabled, PULCHK disabled
       configuration hash MD5:
       00 E9 B6 7A A2 85 ED C7 34 08 36 98 17 FE 4E 26
       data hash MD5: 16K
       A5 6A E7 03 C9 1B 78 A1 12 9D A6 E0 15 21 55 D6>)
(   2,<2025-08-08 14:15:23.81 +0400>,<she>,<DPX200>,
      <Start of raw data processing
       efp BC_mod = 2 LB = 0.25 FT_mod = 6 PKNL = 1 PHC0 = -1556.488 PHC1 = 7.9923 SI = 16K 
       data hash MD5: 16K
       CB B1 E6 1D 99 89 67 B1 07 1D D3 C3 8D 25 CF D0>)
(   3,<2025-08-08 14:15:43.34 +0400>,<she>,<DPX200>,
      <pk PHC0 = -3.471108 PHC1 = 2.8 
       data hash MD5: 16K
       F5 FA 31 8D 52 50 7E B0 EF 66 DB B9 CE 26 D4 12>)
(   4,<2025-08-08 14:15:47.35 +0400>,<she>,<DPX200>,
      <abs ABSG = 5 
       data hash MD5: 16K
       DE F3 60 F6 D0 0F D1 33 37 B8 FE 84 E3 CF BF 9E>)
$$ ##END=
$$ 
$$ hash MD5
$$ 7A 1D FA 0A 69 D3 5E 4B 83 37 72 A2 EA 92 D6 CA
##$RELAX= 
##$RELAX= 
##$RELAX= 
##$RELAX= 
##$RELAX= 
##$RELAX= 
$$ Bruker specific parameters
$$ --------------------------
##$DU= <F:/spectra>
##$EXPNO= 1
##$NAME= <H-C>
##$PROCNO= 1
##$TYPE= <nmr>
##$USER= <she>
##$AMP= (0..31)
100 100 100 100 100 100 100 100 100 100 100 100 100 100 100 100 100 100 
100 100 100 100 100 100 100 100 100 100 100 100 100 100 
##$AQSEQ= 0
##$AQ_mod= 1
##$AUNM= <au_zg>
##$AUTOPOS= <>
##$BF1= 200.13
##$BF2= 200.13
##$BF3= 200.13
##$BF4= 200.13
##$BF5= 200.13
##$BF6= 200.13
##$BF7= 200.13
##$BF8= 200.13
##$BYTORDA= 1
##$CFDGTYP= 0
##$CFRGTYP= 5
##$CHEMSTR= <none>
##$CNST= (0..31)
1 1 145 1 1 1 1 1 1 1 1 1 1 1 1 1 1 1 1 1 1 1 1 1 1 1 1 1 1 1 1 1 
##$CPDPRG= <>
##$CPDPRG1= <>
##$CPDPRG2= <>
##$CPDPRG3= <>
##$CPDPRG4= <mlev>
##$CPDPRG5= <mlev>
##$CPDPRG6= <mlev>
##$CPDPRG7= <mlev>
##$CPDPRG8= <mlev>
##$CPDPRGB= <>
##$CPDPRGT= <>
##$D= (0..31)
0 0.7 0 0 0 0 0 0 0 0 0 0.03 0 0 0 0 0 0 0 0 0 0 0 0 0 0 0 0 0 0 0 0 
##$DATE= 1754648120
##$DBL= (0..7)
120 120 120 120 120 120 120 120 
##$DBP= (0..7)
150 150 150 150 150 150 150 150 
##$DBP07= 0
##$DBPNAM0= <>
##$DBPNAM1= <>
##$DBPNAM2= <>
##$DBPNAM3= <>
##$DBPNAM4= <>
##$DBPNAM5= <>
$$ [...]
##$SUBNAM3= <"">
##$SUBNAM4= <"">
##$SUBNAM5= <"">
##$SUBNAM6= <"">
##$SUBNAM7= <"">
##$SUBNAM8= <"">
##$SUBNAM9= <"">
##$SW= 18.0517328524113
##$SWIBOX= (0..15)
0 0 2 0 0 0 0 0 0 0 0 0 0 0 0 0 
##$SW_h= 3612.71676300578
##$TD= 16384
##$TD0= 1
##$TE= 0
##$TE2= 300
##$TE3= 300
##$TEG= 300
##$TL= (0..7)
0 120 120 120 120 120 120 120 
##$TP= (0..7)
150 150 150 150 150 150 150 150 
##$TP07= 0
##$TPNAME0= <>
##$TPNAME1= <>
##$TPNAME2= <>
##$TPNAME3= <>
##$TPNAME4= <>
##$TPNAME5= <>
##$TPNAME6= <>
##$TPNAME7= <>
##$TPOAL= (0..7)
0.5 0.5 0.5 0.5 0.5 0.5 0.5 0.5 
##$TPOFFS= (0..7)
0 0 0 0 0 0 0 0 
##$TUNHIN= 0
##$TUNHOUT= 0
##$TUNXOUT= 0
##$USERA1= <user>
##$USERA2= <user>
##$USERA3= <user>
##$USERA4= <user>
##$USERA5= <user>
##$V9= 5
##$VALIST= <valist>
##$VCLIST= <CCCCCCCCCCCCCCC>
##$VD= 0
##$VDLIST= <DDDDDDDDDDDDDDD>
##$VPLIST= <PPPPPPPPPPPPPPP>
##$VTLIST= <TTTTTTTTTTTTTTT>
##$WBST= 1024
##$WBSW= 4
##$XGAIN= (0..3)
0 0 0 0 
##$XL= 0
##$YL= 0
##$YMAX_a= 613740
##$YMIN_a= -728000
##$ZGOPTNS= <>
##$ZL1= 120
##$ZL2= 120
##$ZL3= 120
##$ZL4= 120
##$ABSF1= 15.48576
##$ABSF2= -2.56609
##$ABSG= 5
##$ABSL= 3
##$ALPHA= 0
##$AQORDER= 0
##$ASSFAC= 0
##$ASSFACI= 0
##$ASSFACX= 0
##$ASSWID= 0
##$AUNMP= <proc_1d>
##$AZFE= 0.1
##$AZFW= 0.1
##$BCFW= 0
##$BC_mod= 2
##$BYTORDP= 0
##$COROFFS= 0
##$CY= -3
##$DATMOD= 1
##$DC= 0
##$DFILT= <>
##$DTYPP= 0
##$F1P= 0
##$F2P= 0
##$FCOR= 1
##$FTSIZE= 16384
##$FT_mod= 6
##$GAMMA= 0
##$GB= 0
##$INTBC= 1
##$INTSCL= 3.241238e-09
##$ISEN= 128
##$LB= 0.25
##$LEV0= 0
##$LPBIN= 0
##$MAXI= 10000
##$MC2= 0
##$MEAN= 0
##$ME_mod= 0
##$MI= 1.114404
##$NCOEF= 0
##$NC_proc= -5
##$NLEV= 6
##$NOISF1= 3.799351
##$NOISF2= 2.8
##$NSP= 0
##$NTH_PI= 0
##$NZP= 0
##$OFFSET= 15.39101
##$PC= 1
##$PHC0= -1559.959
##$PHC1= 10.7923
##$PH_mod= 1
##$PKNL= yes
##$PPARMOD= 0
##$PSCAL= 0
##$PSIGN= 0
##$REVERSE= no
##$SF= 200.130026154893
##$SI= 16384
##$SIGF1= 3
##$SIGF2= 2
##$SINO= 0.751879
##$SIOLD= 32768
##$SREGLST= <19F.Aceton>
##$SSB= 0
##$STSI= 16384
##$STSR= 0
##$SW_p= 3612.71676300578
##$SYMM= 0
##$S_DEV= 0
##$TDeff= 16384
##$TDoff= 0
##$TI= <>
##$TILT= no
##$TM1= 0
##$TM2= 0
##$TOPLEV= 0
##$USERP1= <user>
##$USERP2= <user>
##$USERP3= <user>
##$USERP4= <user>
##$USERP5= <user>
##$WDW= 1
##$XDIM= 16384
##$YMAX_p= 530956360
##$YMIN_p= -185370
$$ End of Bruker specific parameters
$$ ---------------------------------
##NTUPLES= NMR SPECTRUM
##VAR_NAME=  FREQUENCY,     SPECTRUM/REAL,   SPECTRUM/IMAG
##SYMBOL=    X,             R,               I
##VAR_TYPE=  INDEPENDENT,   DEPENDENT,       DEPENDENT
##VAR_FORM=  AFFN,          ASDF,            ASDF
##VAR_DIM=   16384,         16384,           16384
##UNITS=     HZ,            ARBITRARY UNITS, ARBITRARY UNITS
##FACTOR=    0.220516191357247, 1,           1
##FIRST=     3080.20329077197, 0,            0
##LAST=      -532.513472233813, 0,           0
##MIN=       -532.513472233813, -185370,     0
##MAX=       3080.20329077197, 530956360,    0
$$ Real data points
##PAGE= N=1
##DATA TABLE= (X++(R..R)), XYDATA
$$ [...]
7343D0883j4934k146N7348l5471M6255j67J5017p3534l5677K1731k2414K0524
$$ 40883 25949 23803 81151 45680 91935 91768 106785 33251 -2426 19305 -3109 17415
7331A7415P2073K2059K2224L5631k6956o308r612L7947k6759j8984j1997j6960
$$ 17415 89488 111547 133771 169402 142446 136138 126526 164473 137714 118730 106733 89773
7319H9773n6485K3574o700J0298J6133O731m485l1964N0736O756j1762l7629N6442
$$ 89773 33288 56862 50162 60460 76593 83324 78839 46875 97611 104367 92605 54976 111418
7306A11418K8002j9426n7554N7130j6558l3796L9804J5313k481K6881o623j0976
$$ 111418 139420 119994 62440 119570 103012 69216 109020 124333 121852 148733 142110 131134
7294A31134K4545R779K1352o801n041k7395m2511k193j4131M4567L5076k4333
$$ 131134 155679 165458 186810 180009 174968 147573 105062 102869 88738 133305 168381 144048
7282A44048l719L6238J1812l2230J12Q718O482o579j5205L2780j5909n4750K3689
$$ 144048 140329 176567 188379 156149 156261 164979 171461 164882 149677 182457 166548 111798 135487
7269A35487l853K4208L1960j282n1546n3324L4502M4386j0501O686M1309k074
$$ 135487 131634 155842 187802 186520 134974 81650 116152 160538 150037 156723 198032 195958
7257A95958M8726j4700j4516J4744m6456K6986N5699m7986L170J6520K0383K1796
$$ 195958 244684 229984 215468 230212 183756 210742 266441 218455 221625 238145 258528 280324
7245B80324L211k6463l3145L1573j048k6843l2573N1696O0256n658m7322M2890
$$ 280324 283535 257072 223927 255500 254452 227609 195036 246732 306988 301330 254008 296898
7233B96898j520j0255m2094J4122J5820l1593J362N5030P8962k2056p3436K6414
$$ 296898 295378 285123 243029 257151 272971 241378 242740 297770 376732 354676 281240 307654
7221C07654L7442P7268J2458m2914K7203R009j4571k9900J6351Q2778k8175N2059
$$ 307654 345096 422364 434822 391908 419111 428120 413549 383649 400000 482778 454603 506662
7209E06662l946L4981k2045m3199L8296K274J5262j408P822O1280M015j2631M3177
$$ 506662 502716 537697 515652 472453 510749 513023 528285 526877 534699 595979 599994 587363 630540
7196F30540R965L5961O9473o7190L7499R0318J0341P356M6732K5365O6121K5538
$$ 630540 640505 676466 745939 678749 716248 806566 816907 824263 870995 896360 962481 988019
7184I88019P3529O8419P5614O4225O0126R9706j0532M5106R8109M7080K8448J16745
$$ 988019 1061548 1129967 1205581 1269806 1329932 1429638 1419106 1464212 1562321 1609401 1637849 1754594
7172A754594P3940L1794L5988J04395J48744J53126J31973J46506J30117J76982
$$ 1754594 1828534 1860328 1896316 2000711 2149455 2302581 2434554 2581060 2711177 2888159
7162B888159J67467J40204K64972K13651J50410M6027P2606J43429J76609K22888
$$ 2888159 3055626 3195830 3460802 3674453 3824863 3870890 3943496 4086925 4263534 4486422
7152D486422K51765L02836L52018K98408K86899L65200L99333L84714N19732N48057
$$ 4486422 4738187 5041023 5393041 5691449 5978348 6343548 6742881 7127595 7647327 8195384
7142H195384O90135Q58364Q98602R65990J042412J134736J514708J851715K735107
$$ 8195384 8885519 9743883 10642485 11608475 12650887 13785623 15300331 17152046 19887153
7133A9887153L524699M233678K873604q496K59669k016844l815243l468266k880720
$$ 19887153 23411852 27645530 30519134 30510638 30770307 28753463 24938220 21469954 18589234
7124A8589234k158934j902977j987925j684134j224700r85467q24503p90716o00566
$$ 18589234 16430300 14527323 12539398 10855264 9630564 8645097 7820594 7029878 6429312
7115F429312n83511n84814m96104l90538l71331l11163k67635j84917k40977j44590
$$ 6429312 5845801 5260987 4764883 4374345 4003014 3691851 3424216 3239299 2998322 2853732
7105B853732j84748k00559j73110p8311j33715j39120j46630j08777j13542k5262
$$ 2853732 2668984 2468425 2295315 2217004 2083289 1944169 1797539 1688762 1575220 1549958
7095A549958j25372k3473M7827o7040r2971m1865n4234n2748K5806l5938o5497
$$ 1549958 1424586 1401113 1448940 1381900 1288929 1247064 1192830 1140082 1165888 1129950 1064453
7084A064453n8196n8296n4978o7152L9704J1003l1660k699Q797k076n4453n8197
$$ 1064453 1006257 947961 892983 825831 865535 876538 844878 842179 850976 848900 794447 736250
7072G36250l881l2000N992R8m3218p5230m3646L1284J7065l3406M892p4209m6796
$$ 736250 732369 700369 706361 706459 663241 588011 544365 575649 592714 559308 564200 489991 443195
7059D43195M3477o5837j423j6428J4031K1156k9407P722J1489n1642l3434J2974
$$ 443195 486672 420835 419412 402984 417015 438171 408764 416486 427975 376333 342899 355873
7047C55873L0165n047K775L564o1789l8836J5288k6683O7150K0382l8638J7076
$$ 355873 386038 380991 383766 387330 325541 286705 301993 275310 342460 362842 324204 341280
7035C41280j6894l941O35j9764J824m25k425m2406k2788J8735j685K4242k8491
$$ 341280 324386 320445 321080 301316 303140 302715 300290 257884 235096 253831 252146 276388 247897
7022B47897j5133N2504j546n2821N0292J1836J3745p3748K1348L9550q034M417
$$ 247897 232764 285268 283722 230901 281193 293029 306774 233026 254374 293924 285890 290307
7010B90307M9496N587n396p1170j295O3416k582O0426o1846q1647M1502K5058
$$ 290307 339803 345390 339994 268824 267529 330945 328363 388789 326943 245296 286798 311856
6998C11856k9007k8215J5892k9334n8225k2158M7246N6073J0719n4896l7884J7572
$$ 311856 282849 254634 270526 241192 182967 160809 208055 264128 274847 219951 182067 199639
6986A99639j818J5182l6548K6495l5559j3312J7304k453P7882J5067l3260l7743
$$ 199639 197821 213003 176455 202950 167391 154079 171383 168930 246812 261879 228619 190876
6974A90876J7161M9420o4021n2982M8783q266N0742m1998m9180N7741O2764N762
$$ 190876 208037 257457 193436 140454 189237 180971 231713 189715 140535 198276 261040 266802
6962B66802m0705L586n8490k6182J7543K1688K6243p408m3756J7609M7562k8548
$$ 266802 226097 229683 171193 145011 162554 184242 210485 203077 159321 176930 224492 195944
6950A95944M048m1633N555L2440m2766O5502L7612q7581K5890k1748m6026n530
$$ 195944 199992 158359 163914 196354 153588 219090 256702 169121 195011 173263 127237 121707
6938A21707M7482P9886l5934n4632k6736R7625k4287k6015k4050N5326k8885j8514
$$ 121707 169189 249075 213141 158509 131773 229398 205111 179096 155046 210372 181487 162973
6926A62973k3429K8744K6042P415Q993L9137K9678q3761l440M6979K4317j03268
$$ 162973 139544 168288 194330 201745 210738 249875 279553 195792 192352 239331 263648 160380
6914A60380J6185M7830j2145J87j6130p2085l4766P1880O9250k729K0395l8361
$$ 160380 176565 224395 212250 212437 196307 124222 89456 161336 230586 227857 248252 209891
6902B09891k8711p608O0810L2913k8148l1397j8427O6053M223K226K615p3439
$$ 209891 181180 173572 234382 267295 239147 207750 189323 255376 259599 261825 264440 191001
6890A91001k8372N3158L8614L7648M654l7257k1192J0675N102O0266l3100q2227
$$ 191001 162629 215787 254401 292049 296703 259446 238254 248929 254031 314297 281197 198970
6878A98970l0214N3983M8151k9413J4383N0751J493M1549M673R399j6345o0426
$$ 198970 168756 222739 270890 241477 255860 306611 308104 349653 354326 363725 347380 286954
6866B86954J9715O8363K0302n6320K3384N6231M340k0916R1380N2402p7372q620
$$ 286954 306669 375032 395334 339014 362398 418629 422969 402053 493433 545835 468463 459843
6854D59843k4665j1164L8721Q8496j7571n8735l3764k9789L2777M5925k484m9391
$$ 459843 435178 424014 462735 551231 533660 474925 441161 411372 444149 490074 487590 438199
6842D38199N6910k1945L144K76M283O4121K6618P2386L5624O671N1411K2169m139
$$ 438199 495109 473164 476308 476584 480867 544988 571606 643992 679616 686287 737698 759867 755728
6829G55728j1631P6388O7946M0153L9120J2342O9722K4417P6108l6144P990o4876
$$ 755728 744097 820485 888431 928584 967704 980046 1049768 1074185 1150293 1114149 1122139 1057263
6817A057263R875m712j38181m1292k5070o2828j4932o4766n2111P434l9696M9618
$$ 1057263 1067138 1062426 924245 882953 857883 795055 780123 715357 663246 670680 630984 680602
6805F80602P049m4231o2832k3953M064K1260m2398J1867Q339J8035j0536J4898
$$ 680602 687651 643420 580588 556635 560699 581959 539561 551428 559767 577802 567266 582164
6793E82164o4193j5002K2225J3406L8672Q204p007J5810o1641k8460J9956m455
$$ 582164 517971 502969 525194 538600 577272 585476 578469 594279 532638 504178 524134 519679
6781E19679L4840n446l3472k1078j4511Q026M2806o6836J5402q352N4180J8229
$$ 519679 554519 549073 515601 494523 480012 488038 530844 464008 479410 471058 525238 543467
6769E43467j5378j7668n8385K5843l1863P6297L355J1795j1716n6962O8200M3717
$$ 543467 528089 510421 452036 477879 446016 522313 525668 537463 525747 468785 536985 580702
6757E80702j9119m2590q7671K6262O5339L5715p815n2026j275L4311l5113L207
$$ 580702 561583 518993 431322 457584 522923 558638 550823 498797 497522 531833 496720 499927
6745D99927P8516M0671m262k5106m5358j8291K8742K2661Q226M6606k9035k9448
$$ 499927 578443 619114 614852 589746 544388 526097 554839 577500 585726 632332 603297 573849
6733E73849o208P552M6918K9354m9384N6834L7517J906J6390l613K8285j1565
$$ 573849 567641 575193 622111 651465 602081 658915 696432 698338 714728 711115 739400 727835
6721G27835k2673l2708K4639k7672n353j932M1723k3608q6109J6960J3044j5739
$$ 727835 705162 672454 697093 669421 664068 662136 703859 680251 594142 611102 624146 608407
6709F08407j6552k5691n052M0023n685K60M119L5548N191J2650P327K5579k2426
$$ 608407 591855 566164 561112 601135 595450 595710 599829 635377 640568 653218 660545 686124 663698
6696F63698r7858J8637K4309K5566o0367Q3930O3372J9818j9551j82o1390n9859
$$ 663698 565840 584477 608786 634352 573985 657915 721287 741105 721554 721372 659982 600123
6684F00123P352J7842j3497l3510P8323r083k1786L8125J2532M9132m5892o573
$$ 600123 607475 625317 611820 578310 656633 647550 625764 663889 676421 725553 679661 673088
6672F73088m287J7895N1966L2671n122j5976r507m5028Q7677L4119k1374L8629
$$ 673088 668801 686696 738662 771333 766211 750235 740728 695700 783377 817496 796122 834751
6660H34751n4400m3017O805k3090L1830K1654j5027m385K1176J3691J01045m676
$$ 834751 780351 737334 744139 721049 752879 774533 759506 755121 776297 789988 891033 886357
6648H86357j06054O668L9882o706q435J336M448M8151j8371n9477J7285J13645
$$ 886357 780303 786971 826853 820147 811712 813048 817496 865647 847276 787799 805084 918729
6636I18729q916r114k7582K1470p132o923N8394J2149P3338j4147k7211J8094
$$ 918729 909813 900699 873117 894587 887455 880532 938926 951075 1024413 1010266 983055 1001149
6624A001149k2455J2479k2885m27N2279M9349K2409N0777J5779l2306j6051K1539
$$ 1001149 978694 991173 968288 967861 1020140 1069489 1091898 1142675 1158454 1126148 1110097 1131636
6612A131636k3553K8282N3210P4427L6057K4371p428N57J5267J5454M9347M2923
$$ 1131636 1108083 1136365 1189575 1264002 1300059 1324430 1317002 1317559 1332826 1348280 1397627 1440550
6600A440550J8110j5082J16556M1781P883k7620q095R904L8901N583O1212Q270
$$ 1440550 1458660 1443578 1560134 1601915 1609798 1582178 1574083 1583987 1622888 1628471 1689683 1697953
6588A697953J07574l6820l3625k8285k8259k1460k837O8751l7922J7916N520J573
$$ 1697953 1805527 1768707 1735082 1706797 1678538 1657078 1654241 1722992 1685070 1702986 1708506 1710079
6576A710079l8635L7772m005K1872Q235l0184K2480M0059L4241j0186O8988K0859
$$ 1710079 1671444 1709216 1705211 1727083 1735318 1705134 1727614 1767673 1801914 1791728 1860716 1881575
6564A881575M0921l9405K246J3746k5273k908n8354n7849M7073L6570J1570R43
$$ 1881575 1922496 1883091 1885337 1899083 1873810 1870902 1812548 1754699 1801772 1838342 1849912 1850855
6552A850855q2192J0502O6571q0007k0295P9440N7293K6237o243k7825O1245O8950
$$ 1850855 1768663 1779165 1845736 1765729 1745434 1824874 1882167 1908404 1902161 1874336 1935581 2004531
6540B004531k0699R4879J4729J7592M146n0233J4176M6371k285O1678q161R584
$$ 2004531 1983832 2078711 2093440 2111032 2115178 2064945 2079121 2125492 2123207 2184885 2176724 2186308
6528B186308O5628q8485o8397M6318J7427L0992K8730Q862J791l731p158l2432
$$ 2186308 2251936 2163451 2095054 2141372 2158799 2189791 2218521 2227383 2229174 2225443 2218285 2185853
6516B185853J09173k8917L97M5849m9762n3192J0884O6254J950k1780m990L6733
$$ 2185853 2295026 2266109 2266506 2312355 2262593 2209401 2220285 2286539 2288489 2266709 2261719 2298452
6504B298452L2189K2802L349K6585k9389j3561j6304Q423J74k3447k0692N3909
$$ 2298452 2330641 2353443 2356792 2383377 2353988 2340427 2324123 2332546 2332720 2309273 2288581 2342490
6492B342490P2645L4797L9146N07M4377J4487K4988M5471J8619k401K1945j4617
$$ 2342490 2415135 2449932 2489078 2489585 2533962 2548449 2573437 2618908 2637527 2635126 2657071 2642454
6480B642454l618O3289k5827o6672L0129P1890l2187l2858N3183n877m9277j2628
$$ 2642454 2638836 2702125 2676298 2609626 2639755 2711645 2679458 2646600 2699783 2693906 2644629 2632001
6468B632001k6776J7602J15244j6409L4491N5469o648L48m055L6017j962K0303
$$ 2632001 2605225 2622827 2738071 2721662 2756153 2811622 2804974 2805322 2801267 2837284 2835322 2855625
6456B855625L7055j4480L3520M4365Q7297M1267n9546L4199J2757M027P5220Q896
$$ 2855625 2892680 2878200 2911720 2956085 3043382 3084649 3025103 3059302 3072059 3076086 3151306 3160202
6444C160202j5251j2968J3304l0959K3294K1293M5899N1409o9819l5844l2720
$$ 3160202 3144951 3131983 3145287 3114328 3137622 3158915 3204814 3256223 3186404 3150560 3117840
6433C117840Q2148L5606l77l0763R6715M6987L9842K6882M9160L2473j754K5097
$$ 3117840 3199988 3235594 3235217 3204454 3301169 3348156 3387998 3414880 3464040 3496513 3494759 3519856
6421C519856M4142L2426J0391J09991J8528M013L7960Q54k5184P048K8516L3388
$$ 3519856 3563998 3596424 3606815 3716806 3735334 3739347 3777307 3778161 3752977 3760025 3788541 3821929
6409C821929J8778l8524R0391O5996j8059l5027K3321M021R5085K0405n0135K2199
$$ 3821929 3840707 3802183 3892574 3958570 3940511 3905484 3928805 3932826 4027911 4048316 3998181 4020380
6397D020380J23959O2480J0919J9664m4909J02345L2371P4149Q1330M4571O6284
$$ 4020380 4144339 4206819 4217738 4237402 4192493 4294838 4327209 4401358 4482688 4527259 4593543
6386D593543J49848O2714M4865P3222j4196K3826O5412J07039P6145Q0590M6475
$$ 4593543 4743391 4806105 4850970 4924192 4909996 4933822 4999234 5106273 5182418 5263008 5309483
6375E309483P2103N4469P8061R1477L9879J54773J28777J06699N6251O0653J16877
$$ 5309483 5381586 5436055 5514116 5605593 5645472 5800245 5929022 6035721 6091972 6152625 6269502
6364F269502Q7015P4669J33098R9257J88419K33190J59140J69279J67467J95919
$$ 6269502 6356517 6431186 6564284 6663541 6851960 7085150 7244290 7413569 7581036 7776955
6354G776955J77240J66677N5667O2685K263O7039R763M0439P0259l897J02694
$$ 7776955 7954195 8120872 8176539 8239224 8241487 8308526 8318289 8358728 8428987 8425090 8527784
6343H527784J09198J02525J01381Q2006P3994J10961J24350K03710L01109J85389
$$ 8527784 8636982 8739507 8840888 8922894 8996888 9107849 9232199 9435909 9737018 9922407
6333I922407K16838K31654L47532L76378L23910M41534L57720L44363L30365L12451
$$ 9922407 10139245 10370899 10718431 11094809 11418719 11860253 12217973 12562336 12892701 13205152
6323A3205152K92021K91251K74768L71265L47535M79123M20730N22247N23303
$$ 13205152 13497173 13788424 14063192 14434457 14781992 15261115 15681845 16204092 16727395
6314A6727395M98666O00027O79989O66221P38751O84939P90911P94122R03903
$$ 16727395 17226061 17826088 18506077 19172298 19911049 20595988 21386899 22181021 23084924
6305B3084924J064017J058000J074713J140524J379961J490330J600001J832143
$$ 23084924 24148941 25206941 26281654 27422178 28802139 30292469 31892470 33724613
6297C3724613J965634K101594K314345K469028K745529L158135L490655L868338
$$ 33724613 35690247 37791841 40106186 42575214 45320743 48478878 51969533 55837871
6289E5837871M148012M422430M309852L815706L036576K233135J706250J374581
$$ 55837871 59985883 64408313 68718165 72533871 75570447 77803582 79509832 80884413
6281H0884413J187628J378082J413630J067248M77687j65835o38865j248394j393164
$$ 80884413 82072041 83450123 84863753 85931001 86408688 86242853 85603988 84355594 82962430
6272H2962430j211934r77523o26655j55274K91236Q61107J338109J929793K508598
$$ 82962430 81750496 80772973 80146318 79991044 80282280 81143387 82481496 84411289 86919887
6263H6919887L141695L820506M477342M905289N024705M295207K943581J022562
$$ 86919887 90061582 93882088 98359430 103264719 108289424 112584631 115528212 116550774
6255A16550774j197535l371113n128155o184350o676768o691464o357711n988259
$$ 116550774 115353239 111982126 106853971 100669621 93992853 87301389 80943678 74955419
6247G4955419n419836m883429m384436l952856l561820l142458k927860k752598
$$ 74955419 69535583 64652154 60267718 56314862 52753042 49610584 46682724 43930126
6239D3930126k459552k269899k069125j904384j725424j553667j392518j344172
$$ 43930126 41470574 39200675 37131550 35227166 33501742 31948075 30555557 29211385
6231B9211385j285011j149638r84251r68377q33997q17575p89873o79339o57977
$$ 29211385 27926374 26776736 25792485 24824108 23990111 23172536 22382663 21703324 21045347
6222B1045347n22909m65732m16211l60388l18074l33802k55436k42190j93624
$$ 21045347 20522438 20056706 19640495 19280107 18962033 18628231 18372795 18130605 17936981
6213A7936981j17600k4824p0350j20802j07240j75011j16891j30585j75150j49783
$$ 17936981 17819381 17794557 17724207 17603405 17496165 17321154 17204263 17073678 16898528 16748745
6203A6748745j68688j42630n9562p283l0916m9547Q6977P7736j2580J25461J47970
$$ 16748745 16580057 16437427 16377865 16370582 16339666 16290119 16377096 16454832 16442252 16567713 16715683
6192A6715683K26143K10673L48835L26463L18178L16871K83156K89934K64009
$$ 16715683 16941826 17152499 17501334 17827797 18145975 18462846 18746002 19035936 19299945
6183A9299945L02724K73919M34208N73361M51610M19103K99913K07165O0749J3602
$$ 19299945 19602669 19876588 20310796 20884157 21335767 21754870 22054783 22261948 22322697 22336299
6173B2336299j4589p0294o7969q825J15281K02585L29913L44608M78850N85556
$$ 22336299 22321710 22251416 22183447 22174622 22289903 22492488 22822401 23167009 23645859 24231415
6163B4231415O56391N78644N09095M39657L84279K51171K72954J59277L7870R95
$$ 24231415 24887806 25466450 25975545 26415202 26799481 27050652 27323606 27482883 27520753 27521748
6153B7521748k9471j25230j35336o9365n6979N554L939P7269J12330K08516L33751
$$ 27521748 27492277 27367047 27231711 27162346 27105367 27110921 27114860 27192129 27304459 27512975 27846726
6142B7846726M91790N79808N86596N54399M96898N34717N03719L09718K14306
$$ 27846726 28338516 28918324 29504920 30059319 30556217 31090934 31594653 31904371 32118677
6133C2118677R7206n5458j57939k84182n01797m86515m97732m11575l67511k86646
$$ 32118677 32215883 32160425 32002486 31718304 31216507 30729992 30232260 29820685 29453174 29166528
6123B9166528k14476n1764P6221J07550K83055K46963K89372L43976L83015K79764
$$ 29166528 28952052 28900288 28976509 29084059 29367114 29614077 29903449 30247425 30630440 30910204
6113C0910204J97179J73292L1071n7121j76045l81149n09141o43390p00067o29952
$$ 30910204 31107383 31280675 31311746 31254625 31078580 30697431 30188290 29544900 28844833 28214881
6103B8214881n72699m95942m86681m25634l15928j95957l4871o2725j3877k2530
$$ 28214881 27642182 27146240 26659559 26233925 25917997 25722040 25687169 25624444 25610567 25588037
6093B5588037j22881k15629l42047m36203m68306n03028n59234n31202o09559
$$ 25588037 25465156 25249527 24907480 24471277 24002971 23499943 22940709 22409507 21799948
6084B1799948n67779n72169o56946o34936n87738o02857n89639n84558m97066
$$ 21799948 21232169 20660000 20003054 19368118 18780380 18177523 17587884 17003326 16506260
6075A6506260m70451k95910l27028k90377k34564k13200j57110k28806j86021
$$ 16506260 16035809 15739899 15412871 15122494 14887930 14674730 14517620 14288814 14102793
6066A4102793k17771l71542m01321l64560m49832m51699m27699l63924m74309
$$ 14102793 13885022 13513480 13112159 12747599 12297767 11846068 11418369 11054445 10580136
6057A0580136l94334k85501k94766k01742k95992k70127k10492k49601k46909
$$ 10580136 10185802 9900301 9605535 9403793 9107801 8837674 8627182 8377581 8130672
6048H130672j72868j85697j69548o2564j18427j57378j53678j08194n9726j12216
$$ 8130672 7957804 7772107 7602559 7539995 7421568 7264190 7110512 7002318 6942592 6830376
6038F830376j42786l4490n4328n7150r5558j48909k0170o4952n6767q071p7146
$$ 6830376 6687590 6653100 6598772 6541622 6446064 6297155 6276985 6212033 6155266 6147195 6070049
6027F070049r1914o9084R713q0681q9064L6804p9576m3954l4365m1415p1657n7993
$$ 6070049 5978135 5909051 5918764 5838083 5749019 5785823 5706247 5662293 5627928 5586513 5514856 5456863
6015E456863l3075q3824K1528n3572j320l3480p8930o3268K5416o5021L08M781
$$ 5456863 5423788 5339964 5361492 5307920 5306600 5273120 5194190 5130922 5156338 5091317 5091625 5096406
6003E096406L1811j8267r6044K2431K0110O3417n8579l6416n683j11m0334j6954
$$ 5096406 5128217 5109950 5013906 5036337 5056447 5119864 5061285 5024869 5019186 5019075 4978741 4961787
5991D961787N0911p467J936l405K7279L9387k7236p683j6112n1392K5167P9859
$$ 4961787 5012698 5005231 5007167 5003762 5031041 5070428 5043192 5035509 5019397 4968005 4993172 5073031
5979E073031L6542J7616O9691L0117N5271O6479M6221K4367O9423j6700N1012
$$ 5073031 5109573 5127189 5196880 5226997 5282268 5348747 5394968 5419335 5488758 5472058 5523070
5968E523070M8158k1022K4615O4726L6820j6286j9913P8348J04616M6606m6386
$$ 5523070 5571228 5550206 5574821 5639547 5676367 5660081 5640168 5718516 5823132 5869738 5823352
5957E823352l5781K7146L9155L1777Q7197N4159J2621P7197L8572N6044R0489
$$ 5823352 5787571 5814717 5853872 5885649 5972846 6027005 6039626 6116823 6155395 6211439 6301928
5946F301928L2804N6872L2753J4943j1956J4887K2170q0721j3790l4831J8282
$$ 6301928 6334732 6391604 6424357 6439300 6427344 6442231 6464401 6383680 6369890 6335059 6353341
5935F353341O794k4537m36k7763K2204l8681j23699j6812O5679N9827j3078m368
$$ 6353341 6360135 6335598 6335162 6307399 6329603 6290922 6167223 6150411 6216090 6275917 6262839 6258471
5923F258471j5112Q9097L0870M0831N9186n72j68963o260N3133N8951L2090L8189
$$ 6258471 6243359 6332456 6363326 6404157 6463343 6462771 6293808 6287548 6340681 6399632 6431722 6469911
5911F469911N6986J5942K7382M4436L1703k3351K9298M2077M5944J2404K1815
$$ 6469911 6526897 6542839 6570221 6614657 6646360 6623009 6652307 6694384 6740328 6752732 6774547
5900F774547L8318P9632L4495l224K7192q533N250K9573k503r016K32J154l097
$$ 6774547 6812865 6892497 6926992 6923768 6950960 6942427 6947677 6977250 6974747 6965731 6965963 6967117 6964020
5887F964020m6061o3351L5495k6964m9214N8157P421m8034K9146k409j12606P8389
$$ 6964020 6917959 6854608 6890103 6863139 6813925 6872082 6879503 6831469 6860615 6858206 6745600 6823989
5875F823989K2191k9366l6459k1760O4317K5339Q187J0629J4359P5271K1420l0533
$$ 6823989 6846180 6816814 6780355 6758595 6822912 6848251 6856438 6867067 6881426 6956697 6978117 6947584
5863F947584j2435M6808K0574J9965J3757j8281K5930j4401l106P5462P0842l8617
$$ 6947584 6935149 6981957 7002531 7022496 7036253 7017972 7043902 7029501 7026395 7101857 7172699 7134082
5851G134082J04932K2046P5107M1179l3590j8493R7779K6696P0213M2593L5298
$$ 7134082 7239014 7261060 7336167 7377346 7343756 7325263 7423042 7449738 7519951 7562544 7597842
5840G597842P4535L6086N4883Q4491M5903R9077P4070J5405M4746K24R5987M8011
$$ 7597842 7672377 7708463 7763346 7847837 7893740 7992817 8066887 8082292 8127038 8127262 8223249 8271260
5828H271260K9222R4163O4314M0918l626L9072L6190M8699J03625M8505Q3122
$$ 8271260 8300482 8394645 8458959 8499877 8496251 8535323 8571513 8620212 8723837 8772342 8855464
5817H855464N7711J5659L5292O2898Q8146J42164K4212N4833O5618O7368N2537
$$ 8855464 8913175 8928834 8964126 9027024 9115170 9257334 9281546 9336379 9401997 9469365 9521902
5806I521902Q7077P6771P4023N7025N8685P1020L7141M3714J47755Q4238N4416
$$ 9521902 9608979 9685750 9759773 9816798 9875483 9946503 9983644 10027358 10175113 10259351 10313767
5795A0313767Q7221R4366O9333J05212R4792O6992M6426K5383R7098Q2345N2629
$$ 10313767 10400988 10495354 10564687 10669899 10764691 10831683 10878109 10903492 11000590 11082935 11135564
5784A1135564Q8082R4303J0166O5411J869Q3621J13621O9454Q2056L5773O8870
$$ 11135564 11223646 11317949 11328115 11393526 11395395 11479016 11592637 11662091 11744147 11779920 11848790
5773A1848790Q0319Q4133K0748K1650J32608L6356N9576O8759N7620J11224L3630
$$ 11848790 11929109 12013242 12033990 12055640 12188248 12224604 12284180 12352939 12410559 12521783 12555413
5762A2555413J056O1433Q5201O8765J1766N7062J00137J06763K8961P3241M8599
$$ 12555413 12556469 12617902 12703103 12771868 12783634 12840696 12940833 13047596 13076557 13149798 13198397
5751A3198397P0182Q6746J0389M8414K9336r226O0222Q1056J39403J72559N8553
$$ 13198397 13268579 13355325 13365714 13414128 13443464 13434238 13494460 13575516 13714919 13887478 13946031
5740A3946031O5208Q2352L8525J14905L0706Q4240J77016J18020R6264K6356K12022
$$ 13946031 14011239 14093591 14132116 14247021 14277727 14361967 14538983 14657003 14753267 14779623 14991645
5729A4991645J68729J83786J21180J16591M4180j3338r199p3895j3573j7673J2640
$$ 14991645 15160374 15344160 15465340 15581931 15626111 15612773 15603574 15529679 15516106 15498433 15511073
5718A5511073M546q0024L3140O3370J5400Q3093M0414R971L8048K8092J10356
$$ 15511073 15515619 15435595 15468735 15532105 15547505 15630598 15671012 15680983 15719031 15747123 15857479
5707A5857479J06377N4582J19603Q8882J05186J40648J79290J94514K22607L27923
$$ 15857479 15963856 16018438 16138041 16226923 16332109 16472757 16652047 16846561 17069168 17397091
5697A7397091K83562L99983K70221J00233j4496k60740l27640l06100j88780k27623
$$ 17397091 17680653 18080636 18350857 18451090 18436594 18175854 17848214 17542114 17353334 17125711
5687A7125711j54574k19253k07535j30872r8735r3136K6616l7311l1014r0340
$$ 17125711 16971137 16751884 16544349 16413477 16314742 16221606 16248222 16210911 16179897 16089557
5677A6089557K3679N2334l6311J212P3339L3562R3342N6435J95965K20581J57931
$$ 16089557 16113236 16165570 16129259 16130471 16203810 16237372 16330714 16387149 16583114 16803695 16961626
5666A6961626K65737K67677L27290J99897L8656j06211k30687l94941l24583l23467
$$ 16961626 17227363 17495040 17822330 18022227 18060883 17954672 17723985 17329044 17004461 16680994
5656A6680994k48026k53828j47692j31872j57995r8844j41134j39176p906r5433
$$ 16680994 16432968 16179140 16031448 15899576 15741581 15642737 15501603 15362427 15354521 15259088
5646A5259088j4482r2214j19773o7947j01408l0835m3560m303k8330k3169l3718
$$ 15259088 15244606 15152392 15032619 14964672 14863264 14832429 14788869 14784566 14756236 14733067 14699349
5635A4699349j1337J4076K2331K9194j05515q3927j49997k39456k09619k03483
$$ 14699349 14688012 14702088 14724419 14753613 14648098 14564171 14414174 14174718 13965099 13761616
5625A3761616k40278j15324j35466j62973k24697j31995j21444J390l1251r5944
$$ 13761616 13521338 13406014 13270548 13107575 12882878 12750883 12629439 12630829 12599578 12503634
5615A2503634n6821j03677M014j00266o7919l9723n748j6236M3942K1485j1439
$$ 12503634 12446813 12343136 12347150 12246884 12178965 12139242 12133494 12117258 12161200 12182685 12171246
5604A2171246P8126j603M1449J3297l0553L3238k331k108P098j3633m29l6015
$$ 12171246 12249372 12247769 12289218 12302515 12271962 12305200 12302869 12300761 12307859 12294226 12293797 12257782
5592A2257782m8235q0665r0416o7191o9591n1379j22162m2939j29305j21780j30224
$$ 12257782 12209547 12128882 12038466 11971275 11901684 11850305 11728143 11685204 11555899 11434119 11303895
5581A1303895j20539j58506o0866j47261k33953j51431j66871k02792k40014j71960
$$ 11303895 11183356 11024850 10963984 10816723 10582770 10431339 10264468 10061676 9821662 9649702
5571I649702n4123j83680j51075r3323j65776r5197j91890j28944j21746j37876
$$ 9649702 9595579 9411899 9260824 9167501 9001725 8906528 8714638 8585694 8463948 8326072
5561H326072n2630n1792q3225n8920r2323m7963o2619o0634l3875j22464r1526
$$ 8326072 8273442 8221650 8138425 8079505 7987182 7939219 7876600 7815966 7782091 7659627 7568101
5550G568101P841l2209L518m2718m2755J7178q551l3540m2473P107O9541o1117
$$ 7568101 7575942 7543733 7547251 7504533 7461778 7478956 7470405 7436865 7394392 7401499 7471040 7409923
5538G409923m1295R443J3412K6079k1366P0174J9287L1233L8828Q3681N8221R0797
$$ 7409923 7368628 7378071 7391483 7417562 7396196 7466370 7485657 7516890 7555718 7639399 7697620 7788417
5526G788417k2768N8622N1698J20146M2931J6620O6979L8820O2295r924q3650
$$ 7788417 7765649 7824271 7875969 7996115 8039046 8055666 8122645 8161465 8223760 8213836 8130186
5515H130186N542N5201n4868l1548q1275r0501k2954l5137o3010K9857m6432q931
$$ 8130186 8135728 8190929 8136061 8104513 8023238 7932737 7909783 7874646 7811636 7841493 7795061 7786130
5503G786130J8771j1555n9441j8427j3721Q688j9987N358j7512j6121j3893q2843
$$ 7786130 7804901 7793346 7733905 7715478 7701757 7710445 7690458 7695816 7678304 7662183 7648290 7565447
5491G565447l7333p3656j10022o8869j08039j37115r0988j38879p5966n8517n4984
$$ 7565447 7528114 7454458 7344436 7275567 7167528 7030413 6939425 6800546 6724580 6666063 6611079
5480F611079R573l1452j45863k5837k2151n8839n8674L9247K2795m7675N955M3881
$$ 6611079 6620652 6589200 6443337 6417500 6395349 6336510 6277836 6317083 6339878 6292203 6298158 6342039
5468F342039J9862o724j0869m2299l6794o7474J6267J3740j7467q5678j4561m1971
$$ 6342039 6361901 6355177 6344308 6302009 6265215 6197741 6214008 6227748 6210281 6124603 6110042 6068071
5456F068071n9719M8714K0388Q3999j3716Q0249O6207q4931j0122J0912l3330
$$ 6068071 6008352 6057066 6077454 6161453 6147737 6227986 6294193 6209262 6199140 6210052 6176722
5445F176722p8429o742q7913j13386k3554k4151j06156p9583m2455r2750o8281
$$ 6176722 6098293 6091551 6003638 5890252 5866698 5842547 5736391 5656808 5614353 5521603 5453322
5434E453322p0505n4387r6728r6400k5692k5258l7268k6111j6015j617p983n4963
$$ 5453322 5382817 5328430 5231702 5135302 5109610 5084352 5047084 5020973 5004958 5003341 4995358 4940395
5422D940395N437l5473N0488l3184k2698K4358J643m595K4113J4433m9998K6434
$$ 4940395 4945832 4910359 4960847 4927663 4904965 4929323 4930966 4926371 4950484 4964917 4914919 4941353
5410D941353L5759K2974Q3622K2422J1506Q153M8552n6963L5512M0046N9234J1322
$$ 4941353 4977112 5000086 5083708 5106130 5117636 5125789 5174341 5117378 5152890 5192936 5252170 5263492
5398E263492k0831p737R727K4135q2380J9997J1605K9593l1264K90j1637o759
$$ 5263492 5242661 5234924 5244651 5268786 5186406 5206403 5218008 5247601 5216337 5216627 5204990 5198231
5386E198231o2633O854J7148m3104R607l8328p4776k0223m1314j7603m2l1106
$$ 5198231 5135598 5142452 5159600 5116496 5126103 5087775 5012999 4992776 4951462 4933859 4933817 4902711
5374D902711J8504m2831k2847q1286l3094q7466n4005K9515j998Q058p9798n4083
$$ 4902711 4921215 4878384 4855537 4774251 4741157 4653691 4599686 4629201 4627203 4635261 4555463 4501380
5362D501380l2565N040j7130O40n258m2938l1028L6916o6985q997q714k1274l0165
$$ 4501380 4468815 4473855 4456725 4457365 4452107 4409169 4378141 4415057 4348072 4339075 4330361 4309087 4278922
5349D278922O689o4783k3744L4489R105k6174l351K6261p4981q4833o7052J2775
$$ 4278922 4285611 4220828 4197084 4231573 4240678 4214504 4211153 4237414 4162433 4077600 4010548 4023323
5337D023323j0977j4934m6613M5062J6926q2603n1584J8696K1088q5196k1010
$$ 4023323 4012346 3997412 3950799 3995861 4012787 3930184 3878600 3897296 3918384 3833188 3812178
5326C812178m392j15305n6666n718J6753j7145M1554N4233j9343j8507J7139r219
$$ 3812178 3807786 3692481 3635815 3630097 3646850 3629705 3671259 3725492 3706149 3687642 3704781 3695562
5314C695562r339K2446M7577J3804k0837M2309L1765o879p3065J3461m7898j4609
$$ 3695562 3686223 3708669 3756246 3770050 3749213 3791522 3823287 3816408 3743343 3756804 3708906 3694297
5302C694297k024M0974l134K5131L844n2503M5755k6884j6116k2263l185M9964
$$ 3694297 3692273 3733247 3730113 3755244 3759088 3706585 3752340 3725456 3709340 3687077 3683892 3733856
5290C733856j2500o7337L4306R2419J944N1881k635J2838M2578Q565m758p9144
$$ 3733856 3721356 3654019 3688325 3780744 3782688 3834569 3831934 3844772 3887350 3895915 3891157 3812013
5278C812013K0900N0788l9720m326p280k0991k940m9660n1483O0197N2877l2356
$$ 3812013 3832913 3883701 3843981 3839655 3832375 3811384 3808444 3758784 3707301 3767498 3820375 3788019
5266C788019j7130n0523j8908k4195P697J2312n763J1276O939M7690k6619k5952
$$ 3788019 3770889 3720366 3701458 3677263 3684960 3697272 3691509 3702785 3709724 3757414 3730795 3704843
5254C704843L5234p0833K0577K3497J1619J4031o3816m2698m9446J8564L9763
$$ 3704843 3740077 3669244 3689821 3713318 3724937 3738968 3675152 3632454 3583008 3601572 3641335
5243C641335o0829o1641P495r258J6285o0502M1915p199j0713J05774k7845j4966
$$ 3641335 3580506 3518865 3526360 3517102 3533387 3472885 3514800 3507601 3496888 3602662 3574817 3559851
5231C559851j342N1240k4172o596n255J0808n2568P1759N0988k4373j3109m9115
$$ 3559851 3558509 3609749 3585577 3578981 3573726 3584534 3531966 3603725 3654713 3630340 3617231 3568116
5219C568116L5876o2456m2225O6330o585k0097J7212p121J2635k0406k3161k7746
$$ 3568116 3603992 3541536 3499311 3565641 3559056 3538959 3556171 3549050 3561685 3541279 3518118 3490372
5207C490372j6158R547J3955n145J72M816m012K0569l5816J0604P515m4771J7504
$$ 3490372 3474214 3483761 3497716 3492571 3492743 3497559 3493547 3514116 3478300 3488904 3496419 3451648 3469152
5194C469152J17991l585o155k1345M470L4052r3875L40M5272R832K2450q9030
$$ 3469152 3587143 3583558 3577403 3556058 3560528 3594580 3500705 3501045 3546317 3556149 3578599 3489569
5182C489569j8672J7285K2783r847J2150K5830j1098Q3669q468L3136L734N4381
$$ 3489569 3470897 3488182 3510965 3501118 3513268 3539098 3528000 3611669 3603201 3636337 3640071 3694452
5170C694452n2645N6689Q86J1963K1019L5972O5827Q032O9153n175M8052J4134
$$ 3694452 3641807 3698496 3699382 3711345 3732364 3768336 3834163 3842195 3911348 3906173 3954225 3968359
5158C968359Q0631j3622N6143J0663p6083l5377P6632R6380K6040p63M7783O6879
$$ 3968359 4048990 4035368 4091511 4102174 4026091 3990714 4067346 4163726 4189766 4189003 4236786 4303665
5146D303665J793J6862O2985K8376M3378L1248k7233L5906M309J9749P5619L3164
$$ 4303665 4305458 4322320 4385305 4413681 4457059 4488307 4461074 4496980 4501289 4521038 4596657 4629821
5134D629821j926L3421O5263N0794j1443K6681N9321N0962O2465L1799J4353J07077
$$ 4629821 4627895 4661316 4726579 4777373 4765930 4792611 4851932 4902894 4965359 4997158 5011511 5118588
5122E118588O3033K1107K0780R8606M6745J7434O6454R4118L4897P4535Q4234
$$ 5118588 5181621 5202728 5223508 5322114 5368859 5386293 5452747 5546865 5581762 5656297 5740531
5111E740531J71235J06763R7990Q6616J56681J26502J44110Q2464P998J90664
$$ 5740531 5911766 6018529 6116519 6203135 6359816 6486318 6630428 6712892 6720890 6911554
5101F911554K18551J47521J61420K31602J40101K17278J59780J64280P5388L4433
$$ 6911554 7130105 7277626 7439046 7670648 7810749 8028027 8187807 8352087 8427475 8461908
5091H461908l845o9916r5276k6736q6463l9589j1806r9598p9043p3667n9519k5116
$$ 8461908 8458063 8388147 8292871 8266135 8179672 8140083 8128277 8028679 7949636 7875969 7816450 7791334
5079G791334k7290K450l7482j01033n1927J0708k0835k7973j2097N680k8502M8658
$$ 7791334 7764044 7766494 7729012 7627979 7576052 7586760 7565925 7537952 7525855 7531535 7503033 7551691
5067G551691N6826k2282Q5435J8873Q0593M6207M7738m7452k7995K6477k2399
$$ 7551691 7608517 7586235 7671670 7690543 7771136 7817343 7865081 7817629 7789634 7816111 7793712
5056G793712M1521L8930L520j291Q0272Q5709Q5192N7375N4363J44310P4352K3995
$$ 7793712 7835233 7874163 7877683 7876392 7956664 8042373 8127565 8184940 8239303 8383613 8457965 8481960
5044H481960L3455N6864K17225J64264J10344Q2772J72719K71722K38256R4307
$$ 8481960 8515415 8572279 8789504 8953768 9064112 9146884 9319603 9591325 9829581 9923888
5034I923888J86060K42842K08779K36002K12162K58447K38308L00467L16987K22201
$$ 9923888 10109948 10352790 10561569 10797571 11009733 11268180 11506488 11806955 12123942 12346143
5024A2346143K35599L49459K64731K69308L72913L64982L70762L41489L76148
$$ 12346143 12581742 12931201 13195932 13465240 13838153 14203135 14573897 14915386 15291534
5015A5291534L58314L35150L82619L40831K84417K56868K61356L07823L15461
$$ 15291534 15649848 15984998 16367617 16708448 16992865 17249733 17511089 17818912 18134373
5006A8134373L29656M04353L13414K75951K73550L46330L48883L90410L52668
$$ 18134373 18464029 18868382 19181796 19457747 19731297 20077627 20426510 20816920 21169588
4997B1169588L04492L47962L06622K19484K47434K50523K87747K74375L61032
$$ 21169588 21474080 21822042 22128664 22348148 22595582 22846105 23133852 23408227 23769259
4988B3769259N20809N30080N54079O49836Q80672J112988J256513J174034P99068
$$ 23769259 24290068 24820148 25374227 26024063 26904735 28017723 29274236 30448270 31247338
4979C1247338J84119l8868m29432r66630j242791j184595r93893r07724p36366
$$ 31247338 31431457 31392589 30963157 29996527 28753736 27569141 26575248 25667524 24931158
4970B4931158o03988n65018m67996l12407j84836j97551j14333L5499J2821J49510
$$ 24931158 24327170 23762152 23294156 22981749 22796913 22599362 22485029 22520528 22533349 22682859
4960B2682859K52958K69936L02230L55061N45587N94838O84789Q66955R08248
$$ 22682859 22935817 23205753 23507983 23863044 24408631 25003469 25688258 26555213 27463461
4951B7463461P87044N60356N24948M22668J78446p1080k01127k04313l64487n07772
$$ 27463461 28250505 28810861 29335809 29758477 29936923 29865843 29664716 29460403 29095916 28588144
4941B8588144n64787o43059p20598o76582o32682o92954o06583o01787n40563
$$ 28588144 28023357 27380298 26659700 25983118 25350436 24657482 24050899 23449112 22908549
4932B2908549m77113l59175l26962k94720k17234j87631j06994o6256q5928q5936
$$ 22908549 22431436 22072261 21745299 21450579 21233345 21045714 20938720 20872464 20786536 20700600
4922B0700600k3225j36712j32811k22470l41245l18983l16907l50890l54684k93231
$$ 20700600 20677375 20540663 20407852 20185382 19844137 19525154 19208247 18857357 18502673 18209442
4912A8209442j95821l36721k30432j80662k49116k27258k27576k73193j81789
$$ 18209442 18013621 17676900 17446468 17265806 17016690 16789432 16561856 16288663 16106874
4903A6106874j82862j56517j15258j71801j48497n8429N657n2814r8976j06967
$$ 16106874 15924012 15767495 15652237 15480436 15331939 15273510 15279167 15226353 15127377 15020410
4893A5020410o7282l2821j25774l88238k90956k97328l23531k47471k83746k22507
$$ 15020410 14953128 14920307 14794533 14406295 14115339 13818011 13494480 13247009 12963263 12740756
4883A2740756j25567k02767l14124j66069j90038j54121j04787j06888j09084
$$ 12740756 12615189 12412422 12098298 11932229 11742191 11588070 11483283 11376395 11267311
4874A1267311q2893o3322L7357l805k1384m7996l6755R674J4084N9893N5563L2334
$$ 11267311 11184418 11121096 11158453 11154648 11133264 11085268 11048513 11058187 11072271 11132164 11187727 11220061
4862A1220061P2259R4020R5974R1854J52947J57229J43995L45895M34321M28866
$$ 11220061 11292320 11386340 11482314 11574168 11727115 11884344 12028339 12374234 12808555 13237421
4852A3237421L44664J73044j30483j30933j60478l89266o43032o29713o12868
$$ 13237421 13582085 13755129 13624646 13493713 13333235 12943969 12300937 11671224 11058356
4843A1058356m31391m80827l95142l42555l85423l50467k23516k53449k53528
$$ 11058356 10626965 10146138 9750996 9408441 9023018 8672551 8449035 8195586 7942058
4834G942058j60910j22046j37663j89341j61375q8279j57570n9178r9081j16455
$$ 7942058 7781148 7659102 7521439 7332098 7170723 7082444 6924874 6865696 6766615 6650160
4824F650160j08540j28395o9570p5110o6422j16836n1042j00325n2008k4309j00528
$$ 6650160 6541620 6413225 6343655 6268545 6202123 6085287 6034245 5933920 5881912 5857603 5757075
4813E757075o1705o2725m3938l0338o1603q2591o4509m0616o4248J3033n281l4168
$$ 5757075 5695370 5632645 5588707 5558369 5496766 5414175 5349666 5309050 5244802 5257835 5252554 5218386
4801E218386k6347k9784r0423L4142M669P1142n8225o7928k0580k9128K1470O9440
$$ 5218386 5192039 5162255 5071832 5105974 5110643 5181785 5123560 5055632 5035052 5005924 5027394 5096834
4789E096834K2735n3896M827m0440j7849r8486k4938K9421M6294j5942p6347j6311
$$ 5096834 5119569 5065673 5070500 5030060 5012211 4913725 4888787 4918208 4964502 4948560 4872213 4855902
4777D855902L0581J5581l6338k6774K1795P314l0403j15803k0072J7703o0496
$$ 4855902 4886483 4902064 4865726 4838952 4860747 4868061 4837658 4721855 4701783 4719486 4658990
4766D658990k3307j9179k3579n1309l4026K370Q591r0701n4774o3185j5469o2053
$$ 4658990 4635683 4616504 4592925 4541616 4507590 4509960 4518551 4427850 4373076 4309891 4294422 4232369
4754D232369n1589m5644p9691k2978K1389n1100j8989L4904Q253p8753r164J5117
$$ 4232369 4180780 4135136 4055445 4032467 4053856 4002756 3983767 4018671 4026924 3948171 3939007 3954124
4742C954124l4888k8211N599R079m5487J6920k8433j6844L4414k7469n160k9923
$$ 3954124 3919236 3891025 3896624 3905703 3860216 3877136 3848703 3831859 3866273 3838804 3833644 3803721
4730C803721K9916J4209l7957K352O038O7038P387M6414l3104q007L2920k1070
$$ 3803721 3833637 3847846 3809889 3812241 3818279 3885317 3892704 3939118 3906014 3898007 3930927 3909857
4718C909857K8739P73L2436J7556l3865K3601j5354k5000R7889K8813l2691l6221
$$ 3909857 3938596 3939369 3971805 3989361 3955496 3979097 3963743 3938743 4036632 4065445 4032754 3996533
4706C996533k7199J3465m0574p0003L7452j4486k7000n6821n7380P594O699J2418
$$ 3996533 3969334 3982799 3942225 3872222 3909674 3895188 3868188 3811367 3753987 3761581 3768280 3780698
4694C780698K1013k0135m9539M6333k2848j4695J13047J8279m8655j602J4937
$$ 3780698 3801711 3781576 3732037 3778370 3755522 3740827 3853874 3872153 3823498 3821896 3836833
4683C836833N7608N2824Q3896M7863M7233J9210k808M3806J1349Q726L7985k3014
$$ 3836833 3894441 3947265 4031161 4079024 4126257 4145467 4142659 4186465 4197814 4206540 4244525 4221511
4671D221511R4947J38684K7294K3281P2770R1392M4875J49472O0442J1524Q8710
$$ 4221511 4316458 4455142 4482436 4505717 4578487 4669879 4714754 4864226 4924668 4936192 5024902
4660E024902Q6860Q19P1424J45302J55870R5110Q7128J31555J23142J27427J46052
$$ 5024902 5111762 5112581 5184005 5329307 5485177 5580287 5667415 5798970 5922112 6049539 6195591
4649F195591P6976J25018K27167J38845N5441K00376K44450J61625K02216L09817
$$ 6195591 6272567 6397585 6624752 6763597 6819038 7019414 7263864 7425489 7627705 7937522
4639G937522K35765K59684L37078L64484M22896M25930N02022N32111N73418N74275
$$ 7937522 8173287 8432971 8770049 9134533 9557429 9983359 10485381 11017492 11590910 12165185
4629A2165185P28901Q15853R67270J013190J115100J134033J083973Q67490O24685
$$ 12165185 12894086 13709939 14677209 15690399 16805499 17939532 19023505 19890995 20515680
4620B0515680K06295m5905m35273o49625q16447q15289p60438o71151n69866n02531
$$ 20515680 20721975 20676070 20240797 19591172 18774725 17959436 17198998 16527847 15957981 15455450
4610A5455450m41900k80354j87894j11407n3797k9970L3974l2679j01762o2323
$$ 15455450 15013550 14733196 14545302 14433895 14380098 14350128 14384102 14351423 14249661 14187338
4600A4187338k844j9320O3516Q6027J38194J89106K49652J95130K17792L51554
$$ 14187338 14184494 14165174 14228690 14314717 14452911 14642017 14891669 15086799 15304591 15656145
4590A5656145M92650M70950N97236N88902O94790Q20182R16213J037329J178670
$$ 15656145 16148795 16619745 17216981 17805883 18500673 19320855 20237068 21274397 22453067
4581B2453067J352221J459217J533295J423310J320816J064936Q74636O71029
$$ 22453067 23805288 25264505 26797800 28221110 29541926 30606862 31481498 32152527
4573C2152527N14640N69792N93748P18029R50725Q77882P56621K87283k73762
$$ 32152527 32667167 33236959 33830707 34548736 35499461 36377343 37133964 37421247 37147485
4564C7147485o74672j244224j629515j893033j830234j955240j830560j606235
$$ 37147485 36472813 35228589 33599074 31706041 29875807 27920567 26090007 24483772
4556B4483772j469276j257815j116213r55678q02169p17555o43860n21155n28998
$$ 24483772 23014496 21756681 20640468 19684790 18882621 18165066 17521206 17000051 16471053
4547A6471053m62957l02410j92396j28131l7837k4867J817J32813J79591K45929
$$ 16471053 16008096 15705686 15513290 15385159 15347322 15322455 15324272 15457085 15636676 15882605
4537A5882605K80241M23105M77611N10468N96539O95536Q57447J016608J058989
$$ 15882605 16162846 16585951 17063562 17574030 18170569 18866105 19723552 20740160 21799149
4528B1799149J284221J356197J539062J597515J514747J245840Q43321L02573
$$ 21799149 23083370 24439567 25978629 27576144 29090891 30336731 31180052 31482625
4520C1482625l32988r06018j297909j716609j789324j783794j710425j561049
$$ 31482625 31149637 30243619 28945710 27229101 25439777 23655983 21945558 20384509
4512B0384509j496415j270015j168424j017188r60147q58164p52358o32754n65496
$$ 20384509 18888094 17618079 16449655 15432467 14472320 13614156 12861798 12229044 11663548
4503A1663548m91339m63916l92388l56938l16545k49692k34482k85565k47864
$$ 11663548 11172209 10708293 10315905 9958967 9642422 9392730 9158248 8872683 8624819
4494H624819j86216j25591j14832k31532j62624j19378j97582j13752j08337M872
$$ 8624819 8438603 8313012 8198180 7966648 7804024 7684646 7487064 7373312 7264975 7269847
4484G269847m0916p7453p529j474J4812k5093j0427R7347R9962O5567Q6887J26559
$$ 7269847 7228931 7151478 7143949 7142475 7157287 7132194 7121767 7219114 7319076 7384643 7471530 7598089
4472G598089J02284J40092K03788J12837J74857K64170K28791K16632K37180J91214
$$ 7598089 7700373 7840465 8044253 8157090 8331947 8596117 8824908 9041540 9278720 9469934
4462I469934L13355K78469L27601M04532L32146M43393M45763N20762M39757M86090
$$ 9469934 9783289 10061758 10389359 10793891 11126037 11569430 12015193 12535955 12975712 13461802
4452A3461802M86509K95171M27879M24935M16631M15052M19238M66020N10913
$$ 13461802 13948311 14243482 14671361 15096296 15512927 15927979 16347217 16813237 17324150
4443A7324150O27994O95913O78289P44840R20254J027249J108315J177543J352379
$$ 17324150 17952144 18648057 19326346 20071186 20991440 22018689 23127004 24304547 25656926
4434B5656926J353485J601293J827249K087733K242852K311335K255972J893619
$$ 25656926 27010411 28611704 30438953 32526686 34769538 37080873 39336845 41230464
4426D1230464J284703O50424J6041n00783p97208q50323p37783o24998l53269
$$ 41230464 42515167 43165591 43181632 42680849 41883641 41033318 40295535 39670537 39317268
4417C9317268j42337J38722M79806P51596J023997J015067P05396P0305n17174
$$ 39317268 39174931 39313653 39793459 40545055 41569052 42584119 43289515 43359820 42842646
4408D2842646j129873j722416k044679k157182k045915j894373j777168j623589
$$ 42842646 41712773 39990357 37945678 35788496 33742581 31848208 30071040 28447451
4400B8447451j389726j180620r87391q63321p14204o31424n02704l49801k65473
$$ 28447451 27057725 25877105 24889714 24026393 23312189 22680765 22178061 21828260 21562787
4391B1562787j66514j23634N0488Q1246J49398K83562K31637L59145M09712N06710
$$ 21562787 21396273 21272639 21323127 21404373 21553771 21837333 22068970 22428115 22837827 23344537
4381B3344537M89811O30284P97654Q82008J075605J136415J285679J519644J553936
$$ 23344537 23834348 24464632 25262286 26144294 27219899 28356314 29641993 31161637 32715573
4372C2715573J362469J070882N88801K81986r4117l69022m14881l49069j51988
$$ 32715573 34078042 35148924 35737725 36019711 35925594 35556572 35141691 34792622 34640634
4363C4640634m1652K23879L48301O70075Q98467J024872J081087R67050P54082
$$ 34640634 34598982 34822861 35171162 35841237 36739704 37764576 38845663 39812713 40566795
4354D0566795M00242J08241j25804k45986j57949m5644J89987M93052P33258R86368
$$ 40566795 40967037 41075278 40949474 40703488 40545539 40499895 40689882 41182934 41916192 42902560
4344D2902560J304326J420639J693666J979496K103391K375976K592657K811532
$$ 42902560 44206886 45627525 47321191 49300687 51404078 53780054 56372711 59184243
4336E9184243L002271L254803L609912L818615M163093M356472M256532M148482
$$ 59184243 62186514 65441317 69051229 72869844 77032937 81389409 85645941 89794423
4328H9794423L851191L980789M413613M919257N452395N932106O610179P331088
$$ 89794423 93645614 97626403 102040016 106959273 112411668 118343774 124953953 132285041
4320A32285041P912559Q615516R510798J0480684J1784348J3218979J4667180
$$ 132285041 140197600 148813116 158323914 168804598 180588946 193807925 208475105
4313B08475105J5993620J7147624J8644982K1018739K4342198K8708676L3974604
$$ 208475105 224468725 241616349 260261331 281280070 305622268 334330944 368305548
4306C68305548L9357643M2602155M0104785K9136863J1449366p923428k4999081
$$ 368305548 407663191 450265346 490370131 519506994 530956360 523032932 498033851
4299D98033851l5482407l8944819l8547719l6734602l4517462l1825290k8367307
$$ 498033851 462551444 423606625 385058906 348324304 313806842 281981552 253614245
4292B53614245k4695659k1218682j8254569j6114367j4330745j3174741j2118860
$$ 253614245 228918586 207699904 189445335 173330968 159000223 145825482 133706622
4285A33706622j1081747r889889q650359p686941o759961o007868n371331m985182
$$ 133706622 122624875 112734986 104084627 96397686 89637725 83629857 78258526 73273344
4277G3273344m482983m057614l702276l523574l239813k954698k852108k576362
$$ 73273344 68790361 64732747 61030471 57506897 54267084 51312386 48460278 45883916
4269D5883916k389285k219553k052397j925235j714138j573240j374274j320104
$$ 45883916 43494631 41275078 39222681 37297446 35583308 34010068 32635794 31315690
4261C1315690j232395j101503j085274j036435r70264q59093r05674q31746q96008
$$ 31315690 30083295 28981792 27896518 26860083 25889819 25030726 24125052 23293306 22397298
4252B2397298q00422q05278p37429p22015n61933n09057n20347n41796m01842
$$ 22397298 21596876 20791598 20054169 19332154 18770221 18261164 17740817 17199021 16797179
4243A6797179m63895n07070m30255m75614l79108m81575m36279l87034m28506
$$ 16797179 16333284 15826214 15395959 14920345 14541237 14059662 13623383 13236349 12807843
4234A2807843l70261l93115l70566l34361l04850k34559l72625l80468l31922
$$ 12807843 12437582 12044467 11673901 11339540 11034690 10800131 10427506 10047038 9715116
4225I715116k55875k80847k86901l25073k39205k17397l13520k70755j30667j79051
$$ 9715116 9459241 9178394 8891493 8566420 8327215 8109818 7796298 7525543 7394876 7215825
4215G215825j03397j78310k18414j41375j55521j08893j02276j60997j45553j08856
$$ 7215825 7112428 6934118 6715704 6574329 6418808 6309915 6207639 6046642 5901089 5792233
4205E792233j09670r0421n9824j10902p0297j24021j50874j25549p2966j29774
$$ 5792233 5682563 5592142 5532318 5421416 5351119 5227098 5076224 4950675 4877709 4747935
4195D747935k4284K0638j18671m8709p3103j13506k8713q8656j43140r2138o5340
$$ 4747935 4723651 4744289 4625618 4576909 4503806 4390300 4361587 4272931 4129791 4037653 3972313
4184C972313p3713j07797n5071n0349m6178j34022r3485j13635p9878r5040n1488
$$ 3972313 3898600 3790803 3735732 3685383 3639205 3505183 3411698 3298063 3218185 3123145 3071657
4173C071657j01028n3886m5208L4456l8013k1587K8292q0084p0889m216k4565
$$ 3071657 2970629 2916743 2871535 2905991 2867978 2846391 2874683 2794599 2723710 2719494 2694929
4162B694929j8019J5446n3401L109n2506k0449j04560m2241m1207p3513q0554
$$ 2694929 2676910 2692356 2638955 2642064 2589558 2569109 2464549 2422308 2381101 2307588 2227034
4151B227034l4439r2561l1668N8810o4093o5419m0880n2050J6137o5995o15Q326
$$ 2227034 2192595 2100034 2068366 2127176 2063083 1997664 1956784 1904734 1920871 1854876 1854261 1862587
4139A862587P529j6766j7665r0198N075O6305Q489R964N5300L584k4456L2483
$$ 1862587 1870116 1853350 1835685 1745487 1750562 1816867 1825356 1835320 1890620 1894204 1869748 1902231
4127A902231n0886P625L3861k1225k899N110q7822m7842o926n8822l8300o6714
$$ 1902231 1851345 1858970 1892831 1871606 1868707 1873817 1785995 1738153 1731227 1672405 1634105 1567391
4115A567391j45381K930l1146J4123k9262o102n151O5192p6472J3033M0929n0859
$$ 1567391 1422010 1424940 1393794 1407917 1378655 1372553 1367402 1432594 1356122 1369155 1410084 1359225
4103A359225k959J11387O4039Q150M3849j1551m5147N8748L6802J8208P5177K0877
$$ 1359225 1356266 1467653 1531692 1539842 1583691 1572140 1526993 1585741 1622543 1640751 1715928 1736805
4091A736805L4786P4198O4780Q6396P0488L2315J05355O0813L4859P6280K01292
$$ 1736805 1771591 1845789 1910569 1996965 2067453 2099768 2205123 2265936 2300795 2377075 2578367
4080B578367J52587J22779Q8860K34718K36100K34420K90911K97310K02263R8324
$$ 2578367 2730954 2853733 2942593 3177311 3413411 3647831 3938742 4236052 4438315 4536639
4070D536639L2923m7539j70238j90022k90991l75413k51477k43354j44071j83518
$$ 4536639 4569562 4522023 4351785 4161763 3870772 3495359 3243882 3000528 2856457 2672939
4060B672939k00293q0559j43415o5332r4740r1492k2435j04489j18153p134m6946
$$ 2672939 2472646 2392087 2248672 2183340 2088600 1997108 1974673 1870184 1752031 1744897 1697951
4049A697951n9966R441p2610M6037k2207q0748L1639p390m1185K6243p8912n8679
$$ 1697951 1637985 1647426 1574816 1620853 1598646 1517898 1549537 1542147 1500962 1527205 1448293 1389614
4037A389614J8214J07152l4424o11L6216N358r581r6934L5722N0691q099K9859
$$ 1389614 1407828 1514980 1480556 1479945 1516161 1521519 1511938 1415004 1450726 1501417 1493318 1523177
4025A523177J3321j3631L7316K8123N6123J9055Q9864K2070K0775J45648r752
$$ 1523177 1536498 1522867 1560183 1588306 1644429 1663484 1753348 1775418 1796193 1941841 1932089
4014A932089J975O2034P5239N9779N1319J04721P5453Q1425J04592J13957J54471
$$ 1932089 1934064 1996098 2071337 2131116 2182435 2287156 2362609 2444034 2548626 2662583 2817054
4003B817054J16145R9580J21516J72381J75042N2635J0912l3615j76369j40066
$$ 2817054 2933199 3032779 3154295 3326676 3501718 3554353 3565265 3531650 3355281 3215215
3993C215215k16272k04778j54249j31891j09718j53294j15890j25538l0197j63927
$$ 3215215 2998943 2794165 2639916 2508025 2398307 2245013 2129123 2003585 1973388 1809461
3983A809461q5583o6843j30620p7656L7085q7029m1865P202o0302J4735p0962
$$ 1809461 1723878 1657035 1526415 1448759 1485844 1398815 1356950 1364152 1303850 1318585 1247623
3972A247623n6941k7117m5331m9103n6958k8383j1457J8282n391n9093l9780L300
$$ 1247623 1190682 1163565 1118234 1069131 1012173 983790 972333 990615 985224 926131 886351 889651
3960H89651k7554j9944J4200l4680J0419J7604l4859J1096M1911K623L5536j7387
$$ 889651 862097 842153 856353 821673 832092 849696 814837 825933 867844 870467 906003 888616
3948H88616n6258K067l0361m408m4884m2128n0350K9051K2203o7412j3039j5609
$$ 888616 832358 834425 804064 799656 754772 712644 662294 691345 713548 646136 633097 617488
3936F17488m5522j3670L7994J7210o0580l8851L0864K888l621p3259j1031J3467
$$ 617488 571966 558296 596290 613500 552920 514069 544933 547821 544200 470941 459910 473377
3924D73377M514L3076L564J163l7290M6107N0405P7807m8498K139J7792n4710
$$ 473377 477891 510967 514531 515694 478404 524511 574916 652723 604225 606364 624156 569446
3912E69446k3124k2283j6433q925L3833q861J1435k7327K6214J2405L5188p924
$$ 569446 546322 524039 507606 498681 532514 523653 535088 507761 533975 546380 581568 573644
3900E73644q0234L7806j5831l586N2646o0480n6078L310L3563j7375j4204M8758
$$ 573644 493410 531216 515385 511799 564445 503965 447887 451197 484760 467385 453181 501939
3888E01939K402k9021m4167m8771J2883j1757k106M1747k6118j13504K7558Q4980
$$ 501939 504341 475320 431153 382382 395265 383508 381402 423149 397031 283527 311085 396065
3876C96065j1488L4990o758k5523m1614o4700L2945J0488O82l3965k4126L8715
$$ 396065 384577 419567 412809 387286 345672 280972 313917 324405 325087 291122 266996 305711
3864C05711Q9041k6260m2805j6463M8028m5557K4130M6008L359J5130m660n635
$$ 305711 394752 368492 325687 309224 357252 311695 335825 381833 385192 400322 395662 390027
3852C90027Q123N6441J501r4995K8169M150k8247l3954l3505Q4163K8963K3647
$$ 390027 398150 454591 456092 361097 389266 393416 365169 331215 297710 381873 410836 434483
3840D34483n2536N931M4259n3339k0753k981k3327K7670J4983O3671K2014M110
$$ 434483 381947 387878 432137 378798 358045 355064 331737 359407 374390 438061 460075 464185
3828D64185k8611r4428q8P612m196K0407K3018N0319p3118j9104J2601l631m0231
$$ 464185 435574 341146 341058 348670 344474 364881 387899 438218 365100 345996 358597 354966 314735
3815C14735L2599O3104k8259L4032k1084r719K8604P531m5585q056j3571L9967
$$ 314735 347334 410438 382179 416211 395127 385408 414012 421543 375958 367902 354331 394298
3803C94298n3163K6279O1267j6394J0029q508N4962j0454m4135k1719L8311k5454
$$ 394298 341135 367414 428681 412287 422316 413808 468770 458316 414181 392462 430773 405319
3791D05319j6754J5688k3918j5708N3583J7014J6581n0623j4595N7013K2778l2031
$$ 405319 388565 404253 380335 364627 418210 435224 451805 401182 386587 443600 466378 434347
3779D34347K3750j6819m3896N7480M9240m0399r0582Q316J6585K4491L6984P3908
$$ 434347 458097 441278 397382 454862 504102 463703 373121 381437 398022 422513 459497 533405
3767E33405k7134j8184N172o4249j2288K7714K8221k5155j9967n6149O9032N6759
$$ 533405 506271 488087 493259 429010 416722 444436 472657 447502 427535 371386 440418 497177
3755D97177m1173O852K6622Q088L7189J5943M782j0882j4299n6105M367M4771
$$ 497177 456004 462856 489478 497566 534755 550698 555480 544598 530299 474194 478561 523332
3743E23332N7833J7312J8083j7805p010n6919J1355R9509k9366q0351n755k6874
$$ 523332 581165 598477 616560 598755 591745 534826 546181 645690 616324 535973 530218 503344
3731E03344K3909K7579m9913K2215K0052M113j2973K8347m0575l3847Q2658J2047
$$ 503344 527253 554832 504919 527134 547186 551299 538326 566673 526098 492251 574909 586956
3719E86956K7757N297p535K9226L1606K9447j976k905k4132R391n4811Q822o5247
$$ 586956 614713 620010 612475 641701 673307 702754 700778 697873 673741 683132 628321 637143 571896
3706E71896P5396J7433m1224M3690n5494k1905L4360J0285M126j0558q611k6061
$$ 571896 647292 664725 623501 667191 611697 589792 624152 634437 638563 628005 619394 593333
3694E93333L75J495o0895L2946K945K6965L0024p1134O9020l4709k137L5290l5055
$$ 593333 593708 595203 534308 567254 570199 597164 627188 556054 625074 590365 588228 623518 588463
3681E88463N35M0576n2389L743J07923o3355l9967P7283J672J1288O6620M2349
$$ 588463 588998 629574 577185 580928 688851 625496 585529 662812 664484 675772 742392 784741
3669G84741o849m8825m086m4417j3331M99N266L3080P173O478J4316K1661M3580
$$ 784741 777892 729067 724981 680564 667233 667732 672998 706078 713251 719729 734045 755706 799286
3656G99286J2128j0518m5318m2095O8196L8646R249j151N0511P7527n1558l8996
$$ 799286 811414 800896 755578 713483 781679 820325 829574 828423 878934 956461 904903 865907
3644H65907Q1865n8634J009p604k8024M7146L515j9987O8875o290j00015J1312
$$ 865907 947772 889138 890147 882543 854519 901665 905180 885193 954068 947778 847763 859075
3632H59075K9275J0690o6244K1960K4425K9352P2069k1176l1540L9233j0830K0596
$$ 859075 888350 899040 832796 854756 879181 908533 980602 959426 927886 967119 956289 976885
3620I76885O1568j4461L095l5582L109L2766L7459L2338M8511J00507o966N5134
$$ 976885 1038453 1023992 1027087 991505 994614 1027380 1064839 1097177 1145688 1246195 1239229 1294363
3608A294363L3832l3293k3540M6376n168J3608R5899Q0370J152K5402J5394K3409
$$ 1294363 1328195 1294902 1271362 1317738 1312570 1326178 1422077 1502447 1503599 1529001 1544395 1567804
3596A567804N2265L6824M2263J14997k9576J3081l6432L046R1599O2381O5455
$$ 1567804 1620069 1656893 1699156 1814153 1784577 1797658 1761226 1764272 1855871 1918252 1983707
3585A983707O9960Q7315j0174M9904M8195Q042M7413J17164J46252P1783N509
$$ 1983707 2053667 2140982 2130808 2180712 2228907 2236949 2284362 2401526 2547778 2619561 2625070
3574B625070M9313Q3604O9420L3915M3789Q0796J02578J40908J39502J46797J73779
$$ 2625070 2674383 2757987 2827407 2861322 2905111 2985907 3088485 3229393 3368895 3515692 3689471
3563C689471J01858P5839J36739J74809J14841J55934J44514J63854K34469K19833
$$ 3689471 3791329 3867168 4003907 4178716 4293557 4449491 4594005 4757859 4992328 5212161
3553E212161L0913P5663R5810J25954n203m211r671p4785o5303q7238j39187j23116
$$ 5212161 5243074 5318737 5414547 5540501 5535298 5531087 5521416 5446631 5381328 5294090 5154903 5031787
3541E031787j47062j03777r7208r7919j69796k24454j07353j23902n3508j04713
$$ 5031787 4884725 4780948 4683740 4585821 4416025 4191571 4084218 3960316 3906808 3802095
3531C802095j25685o6403o6755o2264p1358r7569p9942k2202k5639o6991o3322
$$ 3802095 3676410 3610007 3543252 3480988 3409630 3312061 3232119 3209917 3184278 3117287 3053965
3520C053965o1309m3396p4631M4098q3721k0223j5595k1151l7981n0706j8320
$$ 3053965 2992656 2949260 2874629 2918727 2835006 2814783 2799188 2778037 2740056 2689350 2671030
3509B671030J57873r412K4554M7740J3037q299k4271Q4654P9174R9229P4989J50171
$$ 2671030 2828903 2819491 2844045 2891785 2904822 2896523 2872252 2956906 3036080 3135309 3210298 3360469
3497C360469N1525J02609J75155K60258L23979L71608M00201K46510k2882M3065
$$ 3360469 3411994 3514603 3689758 3950016 4273995 4645603 5045804 5292314 5269432 5312497
3487E312497k9121k33830l44941l18441k45857j70696j52596j62401j16874p5238
$$ 5312497 5283376 5049546 4704605 4386164 4140307 3969611 3817015 3654614 3537740 3462502
3477C462502j03408m7208J2353l224o2715k9212P8112J55574J23427J90502J93135
$$ 3462502 3359094 3311886 3324239 3321015 3258300 3229088 3307200 3462774 3586201 3776703 3969838
3466C969838J71751K29935K77166L10315L90549N50496P34872P21394L49055O5797
$$ 3969838 4141589 4371524 4648690 4959005 5349554 5900050 6634922 7356316 7705371 7771168
3456G771168N4764j93735n86292o98890o57392m86383l10936l63202l75494k52960
$$ 7771168 7825932 7632197 7045905 6347015 5689623 5203240 4892304 4529102 4153608 3900648
3446C900648k35849j79971j25180j68355j50144j12731j08191k6999k2484R411
$$ 3900648 3664799 3484828 3359648 3191293 3041149 2928418 2820227 2793228 2770744 2780155
3436B780155o033N760P5671J60236L5602J27350J60453J58870K90953L54290J14722
$$ 2780155 2774122 2779882 2855553 3015789 3051391 3178741 3339194 3498064 3789017 4143307 4258029
3425D258029r3534K751j73312l55871l36345k72761l18119k32062j48799j00203
$$ 4258029 4164495 4167246 3993934 3638063 3301718 3028957 2710838 2478776 2329977 2229774
3415B229774j56973j84072j27415j11044r8564p6315p1486n4601o9331l8057m9382
$$ 2229774 2072801 1888729 1761314 1650270 1551706 1475391 1403905 1349304 1279973 1241916 1192534
3404A192534o5602m0383l9252l7864M0573m6468l7911k7826j4337l5260M525k3154
$$ 1192534 1126932 1086549 1047297 1009433 1050006 1003538 965627 937801 923464 888204 892729 869575
3392H69575m3310r634j0513l0024m1882M1545M330n4655r8641M7866n1271j7900
$$ 869575 826265 816631 806118 776094 734212 775757 780087 725432 626791 674657 623386 605486
3380F05486j861o233L2525K2420j6363M6251J1624j0377p1038j8093k1592N2522
$$ 605486 603625 597392 629917 652337 635974 682225 693849 683472 612434 594341 572749 625271
3368F25271N9493m1134l6609j8869l1042O4657P040p8135k4826l5786M3847K6306
$$ 625271 684764 643630 607021 588152 557110 621767 628807 550672 525846 490060 533907 560213
3356E60213K3237m2973q7727j9544N9217l656k170L1778m9834o8302k4099L1433
$$ 560213 583450 540477 452750 433206 492423 488767 486597 518375 468541 400239 376140 407573
3344D07573j5221M2821M7467n4311J3032j6655k052L4333n9346l6574J5888j4197
$$ 407573 392352 435173 482640 428329 441361 424706 422654 456987 397641 361067 376955 362758
3332C62758M6393l1451k7j9990M487m2797l5977N1428M9489p1373L3359N3379
$$ 362758 409151 377700 377673 357683 362170 319373 283396 334824 384313 312940 346299 399678
3320C99678j127p3021l7820K4123n0405L2062L1362M3961j7940j8879R530q463
$$ 399678 398551 325530 287710 311833 261428 293490 324852 368813 350873 331994 341524 333061
3308C33061R091n3528k2880Q6782K976J7668r07j596K4538j5819j1855J6936j9390
$$ 333061 342152 288624 265744 352526 355502 373170 372263 370667 395205 379386 367531 384467 365077
3295C65077M5076Q149j0185o2242j1349J6001N0667P9380k3721J9052m8568j1663
$$ 365077 410153 418302 408117 345875 334526 350527 401194 480574 456853 475905 427337 415674
3283D15674N364L1750l6488K3039M8899l733n717P505o482m0738j7615Q1378K0533
$$ 415674 421038 452788 416300 439339 488238 484505 478788 486293 479811 439073 421458 502836 523369
3270E23369J2233o241l6501o798J6079O3428n914L0893m409N712J292P818L772
$$ 523369 535602 529361 492860 486062 502141 565569 559655 590548 586139 591851 593143 600961 604733
3257F04733j2280N167O4424m066m3613N1093j094M2260M4181k5273K689J6246
$$ 604733 592453 597620 662044 657978 614365 665458 664364 706624 750805 725532 728221 744467
3245G44467K1919J467M0533N7174L0843L3216O315r7455J3547O1739l8925Q8322
$$ 744467 766386 767853 808386 865560 896403 929619 935934 838479 852026 913765 874840 963162
3233I63162L1847L368j4384l9732p59m1157Q7828L4896p707L923P0108O7988J9959
$$ 963162 995009 998377 983993 944261 943502 902345 990173 1025069 1017362 1021285 1091393 1159381 1179340
3220A179340l520J0732P4274l0117n3714J9631J29532K9126o0777P3665r695j19710
$$ 1179340 1175820 1186552 1260826 1230709 1176995 1196626 1326158 1355284 1294507 1368172 1358477 1238767
3208A238767R039O0260M1503J7692j433l5314l8045K1269P2448k794L314J3749
$$ 1238767 1247806 1308066 1349569 1367261 1365828 1330514 1292469 1313738 1386186 1383392 1386706 1400455
3196A400455k8683r077j3431P4847k2786n7378k3182J2431p164R888O5089J1736
$$ 1400455 1371772 1362695 1349264 1424111 1401325 1343947 1320765 1333196 1326032 1335920 1401009 1412745
3184A412745l7965M0691P255m6808j2946l6391J2882O860Q905m8612N962N2334
$$ 1412745 1374780 1415471 1422726 1375918 1362972 1326581 1339463 1346323 1355228 1306616 1312578 1364912
3172A364912j1923j441N1j1577k9092K0754K9614k0176K8625m8352l4389j979
$$ 1364912 1352989 1351548 1351599 1340022 1310930 1331684 1361298 1341122 1369747 1321395 1287006 1285027
3160A285027o5335J8118q4908k8982K711k3056m6115p8480Q212m2721L3960O863
$$ 1285027 1219692 1237810 1152902 1123920 1126631 1103575 1057460 978980 987192 944471 978431 985294
3148I85294j7522M24n584L2857l6820j000j6014K2399O5687M6103l1188K9614
$$ 985294 967772 968196 962612 995469 958649 957649 941635 964034 1029721 1075824 1044636 1074250
3136A074250P2693k3554J1224l2690m0260k4870K4952O0240k2472j01165n9988
$$ 1074250 1146943 1123389 1134613 1101923 1061663 1036793 1061745 1121985 1099513 998348 938360
3125I38360j0997L946m4744j23169p7753k310l960m6369n4228m0022l0766L4266
$$ 938360 927363 931309 886565 763396 685643 683333 679373 633004 578776 538754 507988 542254
3113E42254j277m3774n2731J3362l2692k3960m1195j8149n599L2324j8480l9483
$$ 542254 540977 497203 444472 457834 425142 401182 359987 341838 336239 368563 350083 310600
3101C10600J7395L8055j1863n4966j5775L0493k3232O6338o1251n5863n849J8286
$$ 310600 327995 366050 354187 299221 283446 313939 290707 357045 295794 239931 234082 252368
3089B52368J9286j5856N9210p262M182k1899n427j6571J3223J9186O3793r235
$$ 252368 271654 255798 315008 307746 311928 290029 284602 268031 281254 300440 364233 354998
3077C54998m279k3029O1148m7741J0855K9149N33J0437K4016M0720M7279J9490
$$ 354998 350719 327690 388838 341097 351952 381101 381634 392071 416087 456807 504086 523576
3065E23576j7508P570M8683o7709k6255L1582o7593n4546J7491p5013n1875J0375
$$ 523576 506068 513638 562321 494612 468357 499939 432346 377800 395291 320278 268403 278778
3053B78778l6082n3861l5499L4525J0766l7542n8042j8781l582m652M1646k927
$$ 278778 242696 188835 153336 187861 198627 161085 103043 84262 80680 76028 117674 114747
3041A14747l9616l8451k947M2991n7160L1677l1120r356N3619J7134j6343J2047
$$ 114747 75131 36680 33733 76724 19564 51241 20121 10765 64384 81518 65175 77222
3029G7222m5274j0319m5686L2220k6736K4714N6485m6570k1954K3640p786N5931
$$ 77222 31948 21629 -24057 8163 -18573 6141 62626 16056 -5898 17742 9956 65887
3017F5887P9436p2991o0801K9581l3210o2746J9539L4712k7822o6980M4273K9998
$$ 65887 145323 72332 11531 41112 7902 -54844 -35305 -593 -28415 -95395 -51122 -21124
3005b1124J4594M3419n2675m4319L8402j1289R246L3083p782j7603j2835K6481
$$ -21124 -6530 36889 -15786 -60105 -21703 -32992 -23746 9337 1555 -16048 -28883 -2402
2993b402k1620J5798M2012r84n72j0029o682l1942O907K754J502m639L9987j0748
$$ -2402 -24022 -8224 33788 32804 32232 22203 15521 -16421 -9514 -6760 -5258 -9897 30090 19342
2979A9342L1208N844K738M15n4323O552L2863n0057k4730r126P2134Q637q6024
$$ 19342 50550 56394 59132 59547 5224 11776 44639 -5418 -30148 -39274 32860 41497 -44527
2966d4527k1270R097L517R291K2902k3183J0745J7080o0630m7417J9427K0563
$$ -44527 -65797 -56700 -53183 -43892 -20990 -44173 -33428 -16348 -76978 -124395 -104968 -84405
2954h4405K5130K8931N113m5099j4963Q2497k3258l2879J1787N8341m1494n7341
$$ -84405 -59275 -30344 -25231 -70330 -85293 -2796 -26054 -58933 -47146 11195 -30299 -87640
2942h7640J4301K640L9468j2554j4845p765m638N9295k9551L3390r485k2982O4936
$$ -87640 -73339 -70699 -31231 -43785 -58630 -66395 -71033 -11738 -41289 -7899 -17384 -40366 24570
2929B4570n0379J6110M1168n5150m0648L257j6117l01k2235l1765N9794L0768
$$ 24570 -25809 -9699 31469 -23681 -64329 -61072 -77189 -77490 -99725 -131490 -71696 -40928
2917d0928m3297l0498J2479o227J16861k5170l5364p916K9379m0854J977L3592
$$ -40928 -84225 -114723 -102244 -108471 8390 -16780 -52144 -60060 -30681 -71535 -69558 -35966
2905c5966l7434N7704K7334J1539j01263J9542n2194M2968j615J9839K0109O267
$$ -35966 -73400 -15696 11638 23177 -78086 -58544 -110738 -67770 -69385 -49546 -29437 -23170
2893b3170m2205j0201k268j8909J5940M216q880L934K7507K7933m4713M1138l4941
$$ -23170 -65375 -75576 -77844 -96753 -80813 -76597 -85477 -81543 -54036 -26103 -70816 -29678 -64619
2880f4619n9438J7882m080P6054j2400l4478j4653K5453j1377L8228m505o3344
$$ -64619 -124057 -106175 -110255 -34201 -46601 -81079 -95732 -70279 -81656 -43428 -47933 -111277
2868a11277J5833j1584K2583n164J4438j1353M3833l907K833L8211j588l6391
$$ -111277 -95444 -107028 -84445 -89609 -75171 -86524 -42691 -46598 -43765 -5554 -7142 -43533
2856d3533q499L3048O9182n1135J1539m5902m7737M3526J1734r6m4066k272J607
$$ -43533 -52032 -18984 50198 -937 10602 -35300 -83037 -39511 -27777 -27873 -71939 -74211 -72604
2843g2604j7878K0004m593K1459L4300k1468n999M0475m5041n2049q839j0903
$$ -72604 -90482 -70478 -75071 -53612 -19312 -40780 -46779 -6304 -51345 -103394 -112233 -123136
2831a23136M5791N538k79j2377P1505n4337k1243P4879P506M796P699l4376J4904
$$ -123136 -77345 -71807 -72086 -84463 -12958 -67295 -88538 -13659 -6153 -1357 6342 -28034 -13130
2818a3130m9933N8548k7825L364n6113K4466J2542n4306M5142r0087J7114L019
$$ -13130 -63063 -4515 -32340 -28976 -85089 -60623 -48081 -102387 -57245 -147332 -130218 -127199
2806a27199j4608M0152J8410J4319m859l442J7350J91K198l7936K1105L4087m9027
$$ -127199 -141807 -101655 -83245 -68926 -73785 -77227 -59877 -59686 -57488 -95424 -74319 -40232 -89259
2793h9259j5529j3098O1033k2208k9478n8870M7237K7700j9966j9776R0776K8261
$$ -89259 -104788 -117886 -56853 -79061 -108539 -167409 -120172 -92472 -112438 -132214 -41438 -13177
2781a3177k9932J8943M6649L4626r8687L0025J211J4465m8901J6653p969k7928
$$ -13177 -43109 -24166 22483 57109 -41578 -11553 -10342 4123 -44778 -28125 -36094 -64022
2769f4022L2290l8358M9123k1270L0513m0414P041J5246N86M9166J1236n3385
$$ -64022 -31732 -70090 -20967 -42237 -11724 -52138 -45097 -29851 -29265 19901 31137 -22248
2757b2248R260k79q7077M4825p392l2650J04103J6001n6947n166j471L2629M1806
$$ -22248 -12988 -13267 -100344 -55519 -62911 -95561 8542 24543 -32404 -37570 -39041 -6412 35394
2744C5394l9480n8650k6568L5244j783L3948P937m8179N8498K0160M5484l5302
$$ 35394 -4086 -62736 -89304 -54060 -55843 -21895 -13958 -62137 -3639 16521 62005 26703
2732B6703K2749l4096o4952L64j027j2592j7369j4917j8756R5421l7283k0737
$$ 26703 49452 15356 -49596 -49232 -50259 -62851 -80220 -95137 -113893 -18472 -55755 -76492
2720g6492j0916L2529N3575j1430m5754p301j2287L7858J7927l5228l3887j7938
$$ -76492 -87408 -54879 -1304 -12734 -58488 -65789 -78076 -40218 -22291 -57519 -91406 -109344
2708a09344O8018k2349m602p807K9893k85n9030N756O1584K0386L541o8184l875
$$ -109344 -41326 -63675 -68277 -76084 -46191 -46476 -105506 -99750 -38166 -17780 -14239 -82423 -86298
2695h6298J2619M6570k8596K8733m4093j2172J0304m101j3538L1713j1206L6592
$$ -86298 -73679 -27109 -55705 -26972 -71065 -83237 -72933 -77034 -90572 -58859 -70065 -33473
2683c3473J7570k9999L626L0293J871N7370n2862n0429m2946K2753m37M305J5370
$$ -33473 -15903 -45902 -42276 -11983 -10112 47258 -5604 -56033 -98979 -76226 -76663 -72358 -56988
2670e6988l728M2814K5369l3279J471r684l8707M8291R174j4319K4510J1009j8362
$$ -56988 -60716 -17902 7467 -25812 -24341 -34025 -72732 -24441 -15267 -29586 -5076 5933 -12429
2657a2429k2135L1074k9398j0206L9785J1239m0468M2307K3337K0621K552k9923
$$ -12429 -34564 -3490 -32888 -43094 -3309 7930 -32538 9769 33106 53727 56279 26356
2645B6356p6776m3282M3895j1487K1030K5662J6720o9937l6129J83O7181o1128
$$ 26356 -50420 -93702 -49807 -61294 -40264 -14602 2118 -67819 -103948 -103765 -36584 -97712
2633i7712N3289k3897k5425j9200K3801J3068M3163j6919n7614J5799J1451J992
$$ -97712 -44423 -68320 -93745 -112945 -89144 -76076 -32913 -49832 -107446 -91647 -80196 -78204
2621g8204N4538m2993L1017j5223p6070j8500P0755N0832P598k3594R230o274
$$ -78204 -23666 -66659 -35642 -50865 -126935 -145435 -74680 -23848 -16250 -39844 -30614 -36888
2609c6888L778n3125K1564j6622L0784N2489J8239m5759k4005k2126M168P519
$$ -36888 -33110 -86235 -64671 -81293 -50509 1980 20219 -25540 -49545 -71671 -67503 -59984
2597e9984m3927L2979K2900m2127J875k8104M680O1560K507m273O3577l34o1623
$$ -59984 -103911 -70932 -48032 -90159 -88284 -116388 -111708 -50148 -47641 -51914 11663 11329 -50294
2584e0294J1935K2035l3985n326J2872N0126K9525n9072N0676J2666l1093r0752
$$ -50294 -38359 -16324 -50309 -55635 -42763 7363 36888 -22184 28492 41158 10065 -80687
2572h0687P1027R719m7656p76O98M084J4442J6373k0602O1825j3174n5019O622
$$ -80687 -9660 59 -47597 -48373 -47675 -43591 -29149 -12776 -33378 28447 15273 -39746 -33124
2559c3124K4906J1483o2487J299N6715K544p2401K4042j7410J4471N7189o6315
$$ -33124 -8218 3265 -59222 -57923 -1208 1336 -71065 -47023 -64433 -49962 7227 -59088
2547e9088K6244L0965M0489J8275r5410K1987m1825M2503l2579k1402M3057L4851
$$ -59088 -32844 -1879 38610 56885 -38525 -16538 -58363 -15860 -48439 -69841 -26784 8067
2535H067j03880L4875O0288Q668o160j5358n875M1487m398j1436j6814k6149L0137
$$ 8067 -95813 -60938 -650 8018 1858 -13500 -19375 22112 17714 6278 -10536 -36685 -6548
2522f548l4574j1173P1329R733l2799J4345J3309j9010m5385M4142O9995j0103
$$ -6548 -41122 -52295 19034 28767 -4032 10313 23622 4612 -40773 3369 73364 63261
2510F3261p6667L6527l2238l8379k687M4299N8368k1520n3448L3864m3778j5817
$$ 63261 -13406 23121 -9117 -47496 -50183 -5884 52484 30964 -22484 11380 -32398 -48215
2498d8215K7431M6394m0539j0952J5462m125M865N4164K4694l6585j3683m8806
$$ -48215 -20784 25610 -14929 -25881 -10419 -14544 -9679 44485 69179 32594 18911 -29895
2486b9895N6025K809k7828J0883n318r769K1696j3926L8712l6560n9603M2281
$$ -29895 26130 28939 1111 11994 6676 -3093 18603 4677 43389 6829 -52774 -10493
2474a0493J7204J0201J9481l4787l9631J9597L6185J0722M5809J959k7461p413
$$ -10493 6711 16912 36393 1606 -38025 -18428 17757 28479 74288 76247 48786 41373
2462D1373k1032n525N6150L3216N5341N5318m526L5034O8668j745l7863M9150
$$ 41373 20341 14816 70966 104182 159523 214841 210315 245349 314017 312272 274409 323559
2450C23559R5677l1840o5759r8494M2039P5206M7041M1852K7434M9815n2956L4687
$$ 323559 419236 387396 321637 223143 265182 340388 387429 429281 456715 506530 453574 488261
2438D88261K7503Q392P0920Q7372N8747J9250o130P8149Q0075N373M9497R5726
$$ 488261 515764 524156 595076 682448 741195 760445 754315 832464 912539 917912 967409 1063135
2426A063135J43750J10373P1699J36281K20414K76676L23667M11719M49923N8608
$$ 1063135 1206885 1317258 1388957 1525238 1745652 2022328 2345995 2757714 3207637 3266245
2416C266245k60812k9090n6897m6741n9602j12135l07856k93241k85473k03128
$$ 3266245 3005433 2976343 2919446 2872705 2813103 2700968 2393112 2099871 1814398 1611270
2406A611270j15330j40336j65561j50290j15466j25604q8283m2283j7347p0646
$$ 1611270 1495940 1355604 1190043 1039753 924287 798683 710400 668117 650770 580124
2396E80124p9157j9857m6959j11290l5918j6512m5113j6890K7523L9548o861l5276
$$ 580124 500967 481110 434151 322861 286943 270431 225318 208428 235951 275499 268638 233362
2384B33362n1220J2156k4845m9116J9019K6002L2269o5050n7297o495K3929K9787
$$ 233362 182142 194298 169453 120337 139356 165358 197627 132577 75280 68785 92714 122501
2372A22501n766m4527q295J7499L6127l0798p0087k6548K588N7766J4702J3175
$$ 122501 116735 72208 63913 81412 117539 86741 16654 -9894 -7306 50460 65162 78337
2360G8337K1015k7141j2613J1813J1296J4045m3553k4547J8894k2128n375R008
$$ 78337 99352 72211 59598 71411 82707 96752 53199 28652 47546 25418 20043 29051
2348B9051k7209l329l1505O9791M4525n2879Q128l397r0090O7095l7910l5758
$$ 29051 1842 -1487 -32992 36799 81324 28445 36573 33176 -56914 10181 -27729 -63487
2336f3487L6703L9163n8533m3890P4754k8804K1065l2240P5424l6454K337o0799
$$ -63487 -26784 12379 -46154 -90044 -15290 -44094 -23029 -55269 20155 -16299 -13962 -74761
2324g4761N2764J3005l2246N6991L5398J9674r703J9301k387m1270j3000K7598
$$ -74761 -21997 -8992 -41238 15753 51151 70825 61122 80423 78036 36766 23766 51364
2312E1364j6476L1377M5581o8796k1666k0666O8985q5825n1110j187L7182J1799
$$ 51364 34888 66265 111846 43050 21384 718 69703 -16122 -67232 -68419 -31237 -19438
2300a9438n058N7227j8009Q910P362n7428q8231J5343K3403M0602n8466K3409
$$ -19438 -24496 32731 14722 23632 30994 -26434 -114665 -99322 -75919 -35317 -93783 -70374
2288g0374r863K6644K7338q5039K3439k4028K6994K6559k695Q091N8226N6104
$$ -70374 -80237 -53593 -26255 -111294 -87855 -111883 -84889 -58330 -61025 -52934 5292 61396
2276F1396o745J80j8858p3355l0856J3516J6287Q4018j6288k1536L100K6830R258
$$ 61396 54651 54831 35973 -37382 -68238 -54722 -38435 45583 29295 7759 10859 37689 46947
2263D6947Q724k9629K4343n1308n0842l121r031n465J2353l9017J8424K9349k5371
$$ 46947 55671 26042 50385 -923 -51765 -54886 -63917 -69382 -57029 -96046 -77622 -48273 -73644
2250g3644o2996p867P4835N8925l2804L9046l6896p8456N0667K0651O2710M0557
$$ -73644 -136640 -144507 -69672 -10747 -43551 -4505 -41401 -119857 -69190 -48539 14171 54728
2238E4728j0288k404j1935l5434L171m1667o3542P0560J1041l1186M2044K0191
$$ 54728 44440 42036 30101 -5333 -2162 -43829 -107371 -36811 -25770 -56956 -14912 5279
2226E279n4560j8352M2896l442k8526N847m4745K2268L1467J3513M595j4031M1456
$$ 5279 -49281 -67633 -24737 -28179 -56705 -50858 -95603 -73335 -41868 -28355 -23760 -37791 3665
2213C665m449p4822j1812O9475k2962L9236n467K871L3351m134j6873j2745j5326
$$ 3665 -784 -75606 -87418 -17943 -40905 -1669 -7136 -4265 29086 24952 8079 -4666 -19992
2200a9992K2445J3178k4315l6890P1141L3036n5531q1956L4726J63k3138O13l0835
$$ -19992 2453 15631 -8684 -45574 25567 58603 3072 -78884 -44158 -43995 -67133 -66520 -97355
2187i7355J0867l6489j8859O3145N3234m2841K2508j8275j7149J30414j7065m7090
$$ -97355 -86488 -122977 -141836 -78691 -25457 -68298 -45790 -64065 -81214 49200 32135 -14955
2175a4955J5114k5634K2054L5190k3900L5470j6487j1596N828J620j3112p1020
$$ -14955 159 -25475 -3421 31769 7869 43339 26852 15256 21084 22704 9592 -61428
2163f1428L608O1425M0105p5516K0654N8000P183J2104m2805k0849m4794N5845
$$ -61428 -57820 3605 43710 -31806 -11152 46848 54031 66135 23330 2481 -42313 13532
2151A3532k2320J0456N652M0608J6338k3650N6963N611n6378J7605K3234J4591
$$ 13532 -8788 1668 7320 47928 64266 40616 97579 103190 46812 64417 87651 102242
2139A02242j971l7420l2564q3609N645O5279R087l5409M359L3131K3805n8280
$$ 102242 100271 62851 30287 -53322 -47677 17602 26689 -8720 -4361 28770 52575 -5705
2127e705k3457Q912O6040q2942K9692m087O980J1352k9665o1751J8126o298L4388
$$ -5705 -29162 -20250 45790 -37152 -7460 -11547 -4567 6785 -22880 -84631 -66505 -72803 -38415
2114c8415K1401J8349J7637k8014L062M5348K6740l8888m2259J5067J7642L5429
$$ -38415 -17014 1335 18972 -9042 -5980 39368 66108 27220 -15039 28 17670 53099
2102E3099j146o638Q856r4474N408m8601J4072l3990J6948Q9075l9348j0903M3507
$$ 53099 51953 45315 54171 -40303 -34895 -83496 -69424 -103414 -86466 2609 -36739 -47642 -4135
2089d135M7272o0162L386q928M9755L0909k9728k102n7637L5601l5274r140p847
$$ -4135 43137 -17025 -13639 -22567 27188 58097 28369 26267 -31370 4231 -31043 -40183 -48030
2076d8030K3584J7815j9281M4087l2K5466l1491j0366j8374j8248J6957k0059
$$ -48030 -24446 -6631 -25912 18175 18143 43609 12118 1752 -16622 -34870 -17913 -37972
2064c7972M7875Q5068q076N960m9306l7033p543o6299k6376M7847J8136l6072
$$ -37972 9903 94971 86895 92855 43549 6516 -1027 -67326 -93702 -45855 -27719 -63791
2052f3791k4825N7389M0883q2338K4813L0488M4049l6877K384k1998M2798P3088
$$ -63791 -88616 -31227 9656 -72682 -47869 -17381 26668 -10209 -7825 -29823 12975 86063
2040H6063o1489K341j6765l4772j7839K0659J8325L1688q04n9301l0625M3442
$$ 86063 24574 26915 10150 -24622 -42461 -21802 -3477 28211 27407 -31894 -62519 -19077
2028a9077l56j3190N4036j9243m714L22n694J0525K905l2376M2216p951N943K6196
$$ -19077 -19433 -32623 21413 2170 -2544 -2222 -7916 2609 5514 -26862 15354 7403 13346 39542
2014C9542j8063m6059l6105J5765L6272r73n381o8022K3505K1746J3041J9324
$$ 39542 21479 -24580 -60685 -44920 -8648 -9621 -15002 -83024 -59519 -37773 -24732 -5408
2002e408p94l2911L452q006J3144p5416L6013l6163M1027P8538L1979K1583n4335
$$ -5408 -6202 -39113 -35661 -43667 -30523 -105939 -69926 -106089 -65062 13476 45455 67038 12703
1989A2703k9746K5194M4963J293l1501L3271j2272m9431J7675r599k1423j5742
$$ 12703 -17043 8151 53114 54407 22906 56177 43905 -5526 12149 2550 -18873 -34615
1977c4615O8718P32L6081o2600K94K352K6249J5504m5324l8118K1424M3010k9695
$$ -34615 34103 34835 70916 8316 8610 10962 37211 52715 7391 -30727 -9303 33707 4012
1964D012o14k319M512K1871J0018L2053l1647k1056o7218l9493K1126J2412l4001
$$ 4012 3398 1079 5591 27462 37480 69533 37886 16830 -50388 -89881 -68755 -56343 -90344
1951i0344K5262N975k1569j2509L8522J1715J6299K025J9400j7092J948k181k7330
$$ -90344 -65082 -59107 -80676 -93185 -54663 -42948 -26649 -24624 -5224 -22316 -20368 -22549 -49879
1938d9879R290l511K3804J9197n5578L8095o477M7823k2041m0327k3254q710R738
$$ -49879 -40589 -44100 -20296 -1099 -56677 -18582 -25059 22764 723 -39604 -62858 -71568 -61830
1925f1830j2208J14791N8863l119l2806q8620J5506M1410K4925O853k6113q08
$$ -61830 -74038 40753 99616 96497 63691 -24929 -9423 31987 56912 63765 37652 36844
1913C6844j0151J9171r7609n1220O0674k6737O7966M0380l1650L1350L7202J3755
$$ 36844 26693 45864 -51745 -102965 -42291 -69028 -1062 39318 7668 39018 76220 89975
1901H9975o7503p349O4999k9486n6561p2029L5405N5627J3175O794n907k2840
$$ 89975 22472 15123 80122 50636 -5925 -77954 -42549 13078 26253 33047 27140 4300
1889D300N1771N140k7668n109p8557L8753l1953l3407L4953L4324N2048K2991
$$ 4300 56071 61211 33543 28434 -50123 -11370 -43323 -76730 -41777 -7453 44595 67586
1877F7586q0398n0246P3266K4571L4153j8148k4857L9031j3225m2626M69M8753
$$ 67586 -12812 -63058 10208 34779 68932 50784 25927 64958 51733 9107 9576 58329
1865E8329q400L0966p3371K8350j6869k93l377j9373K4796R798j2833K462r310
$$ 58329 49929 80895 7524 35874 19005 18712 15335 -4038 20758 30556 17723 20185 10875
1852A0875l6220M4607K012l0793l7017Q6318m297m4786n72l6608K6955J8537J1926
$$ 10875 -25345 19262 21274 -9519 -46536 39782 35485 -9301 -9873 -46481 -19526 -989 10937
1839A0937J8496K9692j7138J3053n320o8146l1044L9303j2861j2344l4920M0091
$$ 10937 29433 59125 41987 55040 49720 -18426 -49470 -10167 -23028 -35372 -70292 -30201
1827c0201Q4573l9607O639J0599k8090k3938n2810Q3973K6016o5015j7655M4528
$$ -30201 54372 14765 21404 32003 3913 -20025 -72835 11138 37154 -27861 -45516 -988
1815i88m665M5583k6779J5330p906j6999n6068K9582k3839j1753R7690L9687p799
$$ -988 -5653 39930 13151 28481 20575 3576 -52492 -22910 -46749 -58502 39188 78875 71076
1802G1076o3160p3924j9023J2125L2463O6721q247j4805K3194J513m5061n1601
$$ 71076 7916 -66008 -85031 -72906 -40443 26278 18031 3226 26420 27933 -17128 -68729
1790f8729R051R6417Q835n2511j7173N4156M6L2719J7976l4769m3128p5567Q209
$$ -68729 -59678 36739 45574 -6937 -24110 30046 30092 62811 80787 46018 2890 -72677 -64468
1777f4468O562J011J5773K1714P0958p456j8948K2972n1291j418N045L962J9827
$$ -64468 -57906 -56895 -41122 -19408 51550 44094 25146 48118 -3173 -4591 454 4416 24243
1764B4243p9354N1012k7076L1410n555j0644Q128j5051l5336O3115k8398k9045
$$ 24243 -55111 -4099 -31175 235 -5320 -15964 -7836 -22887 -58223 4892 -23506 -52551
1752e2551M1595L3339o64j2678n2843P1616J3440n2804j5470j3372p331k5820
$$ -52551 -10956 22383 21719 9041 -43802 27814 41254 -11550 -27020 -40392 -47723 -73543
1740g3543k4952O1199M9232k893K3474m6456L1453J1640r0259N4388J2206N4263
$$ -73543 -98495 -37296 11936 9043 32517 -13939 17514 29154 -61105 -6717 5489 59752
1728E9752k6253m2477k2246M1447O9266l7530r2p4116R661O8455K7662J5297l0443
$$ 59752 33499 -8978 -31224 10223 79489 41959 41867 -32249 -22588 45867 73529 88826 58383
1715E8383q8419j0217k1923N7381k5188r661L3341o1015K8859P5042k6464m7058
$$ 58383 -30036 -40253 -62176 -4795 -29983 -39644 -6303 -67318 -38459 36583 10119 -36939
1703c6939K2715Q9337M691o9064K691j9751j2327N625m05j5766l5930K0353K5479
$$ -36939 -14224 75113 79804 10740 13431 -6320 -18647 -13022 -13427 -29193 -65123 -44770 -19291
1690a9291O834K5301M2064j8894K1820K0606j3836l833o5045j2892O9981l7346
$$ -19291 -12457 12844 54908 36014 57834 78440 64604 60771 -4274 -17166 52815 15469
1678A5469k6232m0616J2785j040l5867l3360O3519K8187P5861l6154p976q973
$$ 15469 -10763 -51379 -38594 -39634 -75501 -108861 -45342 -17155 58706 22552 14576 5603
1666E603j1031M5421l815M2427j05966k636R4435o0471l6352K874K2059r950k3342
$$ 5603 -5428 39993 36178 78605 -27361 -29997 64438 3967 -32385 -29511 -7452 -17402 -40744
1653d0744O1882k9301k6638j614N812O4778p546k9698j7568L6618L4604M5368
$$ -40744 21138 -8163 -34801 -36415 -30603 34175 26629 -3069 -20637 15981 50585 95953
1641I5953k9014o0176k0938j3027M6794j5752l87n8524K8320L4081J8858P958
$$ 95953 66939 6763 -14175 -27202 19592 3840 3453 -55071 -26751 7330 26188 34146
1629C4146k8687Q652K5661r176j199K6958l8047l5967N0275N0781J0344p8546
$$ 34146 5459 14111 39772 30596 29397 56355 18308 -17659 32616 83397 93741 15195
1617A5195m780n147J3480M6976l9193k5609K9424j3851k820J1227k1699l3549
$$ 15195 10415 5268 18748 65724 26531 922 30346 16495 13675 24902 3203 -30346
1605c0346J283l249M4633m8592j5082K8592m9043N4200J5913K0453L5153j1591
$$ -30346 -29063 -32312 12321 -36271 -51353 -22761 -71804 -17604 -1691 18762 53915 42324
1593D2324k782p533l9930m092L2654k868k1215K4844k4032P587N817M9216j321
$$ 42324 39542 32009 -7921 -12013 20641 17773 -3442 21402 -2630 4957 10774 59990 58669
1580E8669m1007K4273j5539J8957J0186r1510J6239J7092K5316O260N0002K6696
$$ 58669 17662 41935 26396 45353 55539 -35971 -19732 -2640 22676 28936 78938 105634
1568A05634l9787k002o8352m4650K2157j1618K2387Q1574N189l6987J6131n4767
$$ 105634 65847 63845 -4507 -49157 -27000 -38618 -16231 65343 70532 33545 49676 -5091
1556e091n5565P930R6758L8833o1316k4551J1573o754K4412M2753p3095q637o9584
$$ -5091 -60656 -52726 44032 82865 21549 -3002 8571 1817 26229 68982 -4113 -12750 -82334
1543h2334R298K643R6210J2178m5320L1374k3066l500l5469K1022k9724J1670
$$ -82334 -73036 -70393 25817 37995 -7325 24049 983 -2517 -37986 -16964 -46688 -35018
1531c5018m893l39R0298l2419j54144N397Q7983L2555J611J8886N0652n2281k4227
$$ -35018 -39911 -40250 50048 17629 -136515 -131118 -43135 -10580 -8969 9917 60569 8288 -15939
1518a5939n046O471M8248J5698l745l4015K9568J8561n0614J049K7942k3601p664
$$ -15939 -20985 -14514 33734 49432 45687 11672 41240 59801 9187 10236 38178 14577 6913
1505F913k9827k9540J5791O0469j0380p65M1719m5693k4130L3502k7023J38792
$$ 6913 -22914 -52454 -36663 23806 13426 12661 54380 8687 -15443 18059 -8964 129828
1493A29828J5917j15890l8105J523N3662M2650k711m7245Q997m5638O1295O2393
$$ 129828 145745 29855 -8250 -6727 46935 89585 86874 39629 48626 2988 64283 126676
1481A26676k1717p6687J9006k1505K9606p4630l9374O6685r621N1738K3877k4842
$$ 126676 104959 28272 47278 25773 55379 -19251 -58625 8060 -1561 50177 74054 49212
1469D9212J6033m4761n9639O809J5203j9014o8579j0079J45481O368L847O5960
$$ 49212 65245 20484 -39155 -32346 -17143 -36157 -104736 -114815 30666 37034 40881 106841
1457A06841J758n9424m9625J0058j3155l7870N6862J9414l7695k7807K7176L8844
$$ 106841 108599 49175 -450 9608 -3547 -41417 15445 34859 -2836 -30643 -3467 35377
1445C5377l4690l1097L7501K8766L9105j7119j4599J2102k1718l7259Q3490k6470
$$ 35377 687 -30410 7091 35857 74962 57843 43244 55346 33628 -3631 79859 53389
1433E3389j01695J5954m5542N066P2333j805l3138K9391J6285j3519m6696N2520
$$ 53389 -48306 -32352 -77894 -72828 -495 -2300 -35438 -6047 10238 -3281 -49977 2543
1421B543j5267M9667K493N3306m2451j7735K7099k6136K9808k2014K9206J7596
$$ 2543 -12724 36943 39436 92742 50291 32556 59655 33519 63327 41313 70519 88115
1409H8115k5218J7776p0586M8615J044k5617M761l2705m0822R64M308O0676M2635
$$ 88115 62897 80673 10087 58702 59746 34129 38890 6185 -34637 -33673 -29365 31311 73946
1396G3946J446n4638o4363K6264J8920J4975o169O7622l7889n3984K8977k1013
$$ 73946 75392 20754 -43609 -17345 1575 16550 10381 78003 40114 -13870 15107 -5906
1384e906N9458j5523Q9261q276n1973p2139j3495O064L2232K4550k8239P948l5763
$$ -5906 53552 38029 127290 119014 67041 -5098 -18593 -12529 19703 44253 16014 23962 -11801
1371a1801K5447j1235l1360N2761M773L1849m477q0761N3491m3818J5174M898
$$ -11801 13646 2411 -28949 23812 28585 60434 55957 -24804 28687 -15131 43 4941
1359D941K0366k7590K6870K5111q0835J0316P0358k5438r027L0570p667o98L7842
$$ 4941 25307 -2283 24587 49698 -31137 -20821 49537 24099 15072 45642 37975 37277 75119
1346G5119n9349J103O4241k6214L369l8051L8237O5240p5250m0458M8986Q620
$$ 75119 15770 16873 81114 54900 58269 20218 58455 123695 48445 7987 56973 65593
1334F5593j2187j8663l0419O391j4690N1752j2380m2421N0858P27j0344K688p6977
$$ 65593 53406 34743 4324 10715 -3975 47777 35397 -7024 43834 44561 34217 36905 -40072
1321d0072J3180K2729L7740J1077j2315l6136j6219M705L316P645M3315k4187
$$ -40072 -26892 -4163 33577 44654 32339 -3797 -20016 -15311 -11995 -4350 38965 14778
1309A4778q942j0124P050J7386m9299O2277k8303j816r976J686p051L0791Q088
$$ 14778 5836 -4288 2762 20148 -29151 33126 4823 3007 -6969 -5283 -12334 18457 26545
1296B6545K2339l3330k6846L0044Q414M3546n6308J9645k0557P398L9705N640
$$ 26545 48884 15554 -11292 18752 27166 70712 14404 34049 13492 20890 60595 66235
1284F6235j532k7649l2352P9611k4159l3333J5877N067k6372j6174J3411L5584
$$ 66235 64703 37054 4702 84313 60154 26821 42698 47765 21393 5219 18630 54214
1272E4214m0496n7276J6110K9680K451n298p944k8774L1889K9415J5035J0173
$$ 54214 13718 -43558 -27448 2232 4683 -615 -8559 -37333 -5444 23971 39006 49179
1260D9179J477l2518J7730j6988l1187J348M0899L1757K7803o6979j8258p022
$$ 49179 50656 18138 35868 18880 -12307 -10959 29940 61697 89500 22521 4263 -2759
1248b759j2334O2329L7174J9594r9747q5799O7739j4707K4087K5090M2315j2260
$$ -2759 -15093 47236 84410 104004 4257 -81542 -13803 -28510 -4423 20667 62982 50722
1236E0722p7658Q4048M5828L6151k0060o0560l6691j0049k28j2312n5890o1180
$$ 50722 -26936 57112 102940 139091 119031 58471 21780 11731 11503 -809 -56699 -117879
1224a17879L9641J01759K8148l1759P256o653O0260l475n7236K413K3557p399
$$ -117879 -78238 23521 51669 19910 27166 20513 80773 77298 20062 22475 46032 38633
1212C8633K9345N27o270k5693P885J3116p0488j9322K0774K1694k2471m321K4007
$$ 38633 67978 68505 62235 36542 44427 57543 -12945 -32267 -11493 10201 -12270 -16591 7416
1199G416o675K5378j1187n7807R307L1464K9428m137p03r9490O808M8035n866
$$ 7416 741 26119 14932 -42875 -33568 -2104 27324 23187 22484 -77006 -70198 -22163 -28029
1186b8029L1155Q115P10K9743l3016M5578p4539j8877K7529L5125R9406n1514
$$ -28029 3126 11241 11951 41694 8678 54256 -20283 -39160 -11631 23494 122900 71386
1174G1386J9079k5156J7479k5598l1993j7271P4873l3205l3691j855M634J1742
$$ 71386 90465 65309 82788 57190 25197 7926 82799 49594 15903 14048 18682 30424
1162C0424k250K2028J4960m038M0947o670n9453n1951O2693l0003k1831L8913
$$ 30424 28174 50202 65162 61124 102071 95401 35948 -16003 46690 16687 -5144 33769
1150C3769r580r388p0332L9015P580J1635P142j5282J2003j2088l865K5009l688
$$ 33769 24189 14801 -55531 -16516 -8936 2699 9841 -5441 6562 -5526 -9391 15618 11930
1137A1930l0638P9252n7343j0874L1448o078j14K787K0015o763k464o1363L5206
$$ 11930 -18708 60544 3201 -7673 23775 17697 17583 20370 40385 33622 31158 -30205 5001
1124E001R173l4842P010N6014o437j7990j0255K385O6389j934p3813L819j4949
$$ 5001 14174 -20668 -13658 42356 35919 17929 7674 10059 76448 74514 701 4520 -10429
1111a0429K5584K1274n5780k0128M9484M1686O2844K5546o4583q4563J0534j5231
$$ -10429 15155 36429 -19351 -39479 10005 51691 114535 140081 75498 -9065 1469 -13762
1099a3762O5639L5491l3363k3109o013l6840j0317N7388j8879N98k3077J7632
$$ -13762 51877 87368 54005 30896 24883 -11957 -22274 35114 16235 16833 -6244 11388
1087A1388j1687n7047L7693m103k3304J9857j9469J2465L108L4710J7279K8791
$$ 11388 -299 -57346 -19653 -23756 -47060 -27203 -46672 -34207 -31099 3611 20890 49681
1075D9681J1782o0441O2613J7357n4570n1252O4582J0633l6687j4591p186l5121
$$ 49681 61463 1022 63635 80992 26422 -24830 39752 50385 13698 -893 -8079 -43200
1063d3200M6353L6934r148k4708Q662j9885k2548Q073K941J5757J0860N239l7899
$$ -43200 3153 40087 30939 6231 14893 -4992 -27540 -19467 -16526 -769 10091 15330 -22569
1050b2569K9493O4455R629o6936J7376n121j9991K2550J6044k4796j0320j8391
$$ -22569 6924 71379 81008 14072 31448 26327 6336 28886 44930 20134 9814 -8577
1038h577J3266J1175p0021Q4083L2074p0952K2423J9828k6521Q348o8850J9786
$$ -8577 4689 15864 -54157 29926 62000 -8952 13471 33299 6778 15126 -53724 -33938
1026c3938P6490l4088m7132P5318M4827N052n6307l2621L580j08874L9243P7621
$$ -33938 42552 8464 -38668 36650 81477 86529 30222 -2399 1181 -107693 -68450 9171
1014I171l540l8139O087O4936J2969k0758o0069l8519k0216j3415J08587k1095
$$ 9171 5631 -32508 -26421 38515 51484 30726 -29343 -67862 -88078 -101493 7094 -14001
1002a4001P7363m6121o7995k125m733O9587M7912J2902k4873n2407r438J2184
$$ -14001 63362 17241 -50754 -52879 -57612 11975 59887 72789 47916 -4491 -13929 -1745
990a745L7351l413m3887j3556J3784J0099R71M4530J0875n1472j8143O8724r609
$$ -1745 35606 32193 -11694 -25250 -11466 -1367 -396 44134 55009 3537 -14606 54118 44509
977D4509l0061k885l9423P978q660R1698L0158o6078n2838k1552R8207m7220o9500
$$ 44509 14448 11563 -27860 -19882 -28542 63156 93314 27236 -25602 -47154 51053 3833 -65667
964f5667j1474j6420Q4683k9056j6790L009N0323J0182Q1038m2542k5848j9135
$$ -65667 -77141 -93561 -8878 -37934 -54724 -51715 -1392 8790 89828 47286 21438 2303
952B303o617k6435p1053J09669P0020p241l376o606J445P912k5335n9015j2323
$$ 2303 -4314 -30749 -101802 7867 77887 70646 67270 60664 62109 70021 44686 -14329 -26652
939b6652M7385K225K622m7982L8228N0762J8758o8046n592K805j4289K9478O742
$$ -26652 20733 22958 25580 -22402 15826 66588 85346 17300 11708 14513 224 29702 36444
926C6444r395O2937L0451o7524l5443j8399k027j0937j6800K9101N1354n900n0488
$$ 36444 27049 89986 120437 52913 17470 -929 -2956 -13893 -30693 -1592 49762 43862 -6626
$$ [...]
##END NTUPLES=NMR SPECTRUM
##END=
