##TITLE=1H_CA-9367-1
 200.13MHz, CDCl3,
 8 sc
 
 8.8.2025
##JCAMPDX= 6.0         $$ Bruker NMR JCAMP-DX V2.0
##DATA TYPE= NMR SPECTRUM
##DATA CLASS= NTUPLES
##ORIGIN= UXNMR, Bruker Analytische Messtechnik GmbH
##OWNER= pz
$$ XWIN-NMR		Version 3.5
$$ Fri Aug  8 14:22:41 2025 Russian Standard Time (UT+4h)  she@DPX200
##.OBSERVE FREQUENCY= 200.1313
##.OBSERVE NUCLEUS= ^1H
##.ACQUISITION MODE= SIMULTANEOUS
##.ACQUISITION SCHEME= undefined
##.AVERAGES= 8
##.DIGITISER RES= 18
##SPECTROMETER/DATA SYSTEM= spect
##.PULSE SEQUENCE= zg30
##.SOLVENT NAME= CDCl3
##.SHIFT REFERENCE= (INTERNAL, CDCl3, 0, 15.4538)
##AUDIT TRAIL= $$ (NUMBER, WHEN, WHO, WHERE, WHAT)
$$ ##TITLE= Audit trail, XWIN-NMR		Version 3.5
$$ ##JCAMPDX= 5.01
$$ ##ORIGIN= Bruker BioSpin GmbH
$$ ##OWNER= she
$$ F:/spectra/data/she/nmr/H-C/1/pdata/1/auditp.txt
$$ ##AUDIT TRAIL=  $$ (NUMBER, WHEN, WHO, WHERE, WHAT)
(   1,<2025-08-08 14:21:20.35 +0400>,<she>,<DPX200>,
      <created by zg, POWCHK disabled, PULCHK disabled
       configuration hash MD5:
       00 E9 B6 7A A2 85 ED C7 34 08 36 98 17 FE 4E 26
       data hash MD5: 16K
       81 8C 10 D9 B8 91 A5 98 ED 25 FB 77 1C FE 13 FE>)
(   2,<2025-08-08 14:21:22.81 +0400>,<she>,<DPX200>,
      <Start of raw data processing
       efp BC_mod = 2 LB = 0.25 FT_mod = 6 PKNL = 1 PHC0 = -1559.959 PHC1 = 10.7923 SI = 16K 
       data hash MD5: 16K
       16 A8 B0 65 89 07 F9 45 9A BC 18 04 DE 80 33 70>)
(   3,<2025-08-08 14:21:42.32 +0400>,<she>,<DPX200>,
      <pk PHC0 = 1.547329 PHC1 = 0.6000003 
       data hash MD5: 16K
       F4 57 C7 D8 0A 9E 1D 2C 14 04 30 15 F1 B5 C3 18>)
(   4,<2025-08-08 14:21:46.45 +0400>,<she>,<DPX200>,
      <abs ABSG = 5 
       data hash MD5: 16K
       C1 12 A5 B9 39 94 B7 8E 7A 20 9C F2 1E C8 91 7C>)
$$ ##END=
$$ 
$$ hash MD5
$$ 71 1C AC 91 96 07 C0 FF 18 33 64 F7 2E C9 34 4F
##$RELAX= 
##$RELAX= 
##$RELAX= 
##$RELAX= 
##$RELAX= 
##$RELAX= 
$$ Bruker specific parameters
$$ --------------------------
##$DU= <F:/spectra>
##$EXPNO= 1
##$NAME= <H-C>
##$PROCNO= 1
##$TYPE= <nmr>
##$USER= <she>
##$AMP= (0..31)
100 100 100 100 100 100 100 100 100 100 100 100 100 100 100 100 100 100 
100 100 100 100 100 100 100 100 100 100 100 100 100 100 
##$AQSEQ= 0
##$AQ_mod= 1
##$AUNM= <au_zg>
##$AUTOPOS= <>
##$BF1= 200.13
##$BF2= 200.13
##$BF3= 200.13
##$BF4= 200.13
##$BF5= 200.13
##$BF6= 200.13
##$BF7= 200.13
##$BF8= 200.13
##$BYTORDA= 1
##$CFDGTYP= 0
##$CFRGTYP= 5
##$CHEMSTR= <none>
##$CNST= (0..31)
1 1 145 1 1 1 1 1 1 1 1 1 1 1 1 1 1 1 1 1 1 1 1 1 1 1 1 1 1 1 1 1 
##$CPDPRG= <>
##$CPDPRG1= <>
##$CPDPRG2= <>
##$CPDPRG3= <>
##$CPDPRG4= <mlev>
##$CPDPRG5= <mlev>
##$CPDPRG6= <mlev>
##$CPDPRG7= <mlev>
##$CPDPRG8= <mlev>
##$CPDPRGB= <>
##$CPDPRGT= <>
##$D= (0..31)
0 0.7 0 0 0 0 0 0 0 0 0 0.03 0 0 0 0 0 0 0 0 0 0 0 0 0 0 0 0 0 0 0 0 
##$DATE= 1754648479
##$DBL= (0..7)
120 120 120 120 120 120 120 120 
##$DBP= (0..7)
150 150 150 150 150 150 150 150 
##$DBP07= 0
##$DBPNAM0= <>
##$DBPNAM1= <>
##$DBPNAM2= <>
##$DBPNAM3= <>
##$DBPNAM4= <>
$$ [...]
##$SUBNAM3= <"">
##$SUBNAM4= <"">
##$SUBNAM5= <"">
##$SUBNAM6= <"">
##$SUBNAM7= <"">
##$SUBNAM8= <"">
##$SUBNAM9= <"">
##$SW= 18.0517328524113
##$SWIBOX= (0..15)
0 0 2 0 0 0 0 0 0 0 0 0 0 0 0 0 
##$SW_h= 3612.71676300578
##$TD= 16384
##$TD0= 1
##$TE= 0
##$TE2= 300
##$TE3= 300
##$TEG= 300
##$TL= (0..7)
0 120 120 120 120 120 120 120 
##$TP= (0..7)
150 150 150 150 150 150 150 150 
##$TP07= 0
##$TPNAME0= <>
##$TPNAME1= <>
##$TPNAME2= <>
##$TPNAME3= <>
##$TPNAME4= <>
##$TPNAME5= <>
##$TPNAME6= <>
##$TPNAME7= <>
##$TPOAL= (0..7)
0.5 0.5 0.5 0.5 0.5 0.5 0.5 0.5 
##$TPOFFS= (0..7)
0 0 0 0 0 0 0 0 
##$TUNHIN= 0
##$TUNHOUT= 0
##$TUNXOUT= 0
##$USERA1= <user>
##$USERA2= <user>
##$USERA3= <user>
##$USERA4= <user>
##$USERA5= <user>
##$V9= 5
##$VALIST= <valist>
##$VCLIST= <CCCCCCCCCCCCCCC>
##$VD= 0
##$VDLIST= <DDDDDDDDDDDDDDD>
##$VPLIST= <PPPPPPPPPPPPPPP>
##$VTLIST= <TTTTTTTTTTTTTTT>
##$WBST= 1024
##$WBSW= 4
##$XGAIN= (0..3)
0 0 0 0 
##$XL= 0
##$YL= 0
##$YMAX_a= 152618
##$YMIN_a= -226023
##$ZGOPTNS= <>
##$ZL1= 120
##$ZL2= 120
##$ZL3= 120
##$ZL4= 120
##$ABSF1= 15.39101
##$ABSF2= -2.660837
##$ABSG= 5
##$ABSL= 3
##$ALPHA= 0
##$AQORDER= 0
##$ASSFAC= 0
##$ASSFACI= 0
##$ASSFACX= 0
##$ASSWID= 0
##$AUNMP= <proc_1d>
##$AZFE= 0.1
##$AZFW= 0.1
##$BCFW= 0
##$BC_mod= 2
##$BYTORDP= 0
##$COROFFS= 0
##$CY= -3
##$DATMOD= 1
##$DC= 0
##$DFILT= <>
##$DTYPP= 0
##$F1P= 0
##$F2P= 0
##$FCOR= 1
##$FTSIZE= 16384
##$FT_mod= 6
##$GAMMA= 0
##$GB= 0
##$INTBC= 1
##$INTSCL= 3.241238e-09
##$ISEN= 128
##$LB= 0.25
##$LEV0= 0
##$LPBIN= 0
##$MAXI= 10000
##$MC2= 0
##$MEAN= 0
##$ME_mod= 0
##$MI= 1.114404
##$NCOEF= 0
##$NC_proc= -8
##$NLEV= 6
##$NOISF1= 3.799351
##$NOISF2= 2.8
##$NSP= 0
##$NTH_PI= 0
##$NZP= 0
##$OFFSET= 15.45381
##$PC= 1
##$PHC0= -1558.412
##$PHC1= 11.3923
##$PH_mod= 1
##$PKNL= yes
##$PPARMOD= 0
##$PSCAL= 0
##$PSIGN= 0
##$REVERSE= no
##$SF= 200.130013586863
##$SI= 16384
##$SIGF1= 3
##$SIGF2= 2
##$SINO= 0.751879
##$SIOLD= 32768
##$SREGLST= <19F.Aceton>
##$SSB= 0
##$STSI= 16384
##$STSR= 0
##$SW_p= 3612.71676300578
##$SYMM= 0
##$S_DEV= 0
##$TDeff= 16384
##$TDoff= 0
##$TI= <>
##$TILT= no
##$TM1= 0
##$TM2= 0
##$TOPLEV= 0
##$USERP1= <user>
##$USERP2= <user>
##$USERP3= <user>
##$USERP4= <user>
##$USERP5= <user>
##$WDW= 1
##$XDIM= 16384
##$YMAX_p= 276215235
##$YMIN_p= -2246755
$$ End of Bruker specific parameters
$$ ---------------------------------
##NTUPLES= NMR SPECTRUM
##VAR_NAME=  FREQUENCY,     SPECTRUM/REAL,   SPECTRUM/IMAG
##SYMBOL=    X,             R,               I
##VAR_TYPE=  INDEPENDENT,   DEPENDENT,       DEPENDENT
##VAR_FORM=  AFFN,          ASDF,            ASDF
##VAR_DIM=   16384,         16384,           16384
##UNITS=     HZ,            ARBITRARY UNITS, ARBITRARY UNITS
##FACTOR=    0.220516191357247, 1,           1
##FIRST=     3092.77115286659, 0,            0
##LAST=      -519.945610139188, 0,           0
##MIN=       -519.945610139188, -2246755,    0
##MAX=       3092.77115286659, 276215235,    0
$$ Real data points
##PAGE= N=1
##DATA TABLE= (X++(R..R)), XYDATA
$$ [...]
13892 671888 921339 686234 145307 392782 400076 276958 655876 445802 234957 172421
13882 172421 -44755 -119573 39604 -322517 67161 540586 692258 279446 211013 192902
13872 192902 170531 94351 -162333 79733 574668 816500 -119470 -762889 -802834 -44825
13862 -44825 341576 -201654 -851284 -514533 -392846 276888 568832 378916 44882 -233397
13852 -233397 -24014 -106277 -45474 -403054 -139054 87042 -13423 139629 -95044 -105709
13842 -105709 60871 260982 146918 -27890 355426 529894 816657 165940 -59071 161222
13832 161222 -30678 -236349 -121159 -122096 -405354 82201 31522 -28339 -265173 -347824 -83512
13821 -83512 -102538 48514 -252704 -331748 -313404 -89349 288323 373910 559206 165780
13811 165780 199468 150274 -128997 -159816 253087 -110684 -43234 -69737 8824 26537 -182917
13800 -182917 -46828 -245004 -43967 51272 -116635 -153196 151609 96792 426799 487938
13790 487938 271725 395464 -75405 -238606 -8535 -302410 -330509 -150119 -7328 -4744
13780 -4744 423909 650280 110235 238466 520054 458020 135030 51306 20978 177171
13770 177171 450458 601300 21926 -21269 -261481 -32806 136600 -321275 1984 -398605
13760 -398605 -344192 -171796 86363 146422 390195 388682 847742 721962 733472 336537
13750 336537 -188262 75702 143127 289511 71578 127046 -423927 -123362 -402116 -211114
13740 -211114 156074 -212800 -322694 345 239154 70457 439438 876749 557502 669441
13730 669441 389336 191237 234809 123531 -94160 -388489 215050 645911 573673 -94687
13720 -94687 -59237 -376929 -154372 -63264 -373191 -543426 10903 204473 393559 -168991
13710 -168991 -21150 932752 669526 483995 264411 244093 193077 450727 79141 -27592
13700 -27592 -271028 -83044 540477 758189 166360 -135417 -183361 123737 154921 -222242
13690 -222242 -687056 -406545 -735284 -1009813 -502733 -466553 -210385 -455793 255383 527746
13680 527746 43750 59933 12682 742693 821391 170733 -32752 110228 -19548 -217941
13670 -217941 -51948 407683 479734 515775 562097 332157 688730 367664 393142 -294078
13660 -294078 108665 433126 70978 219885 273394 323287 297969 53049 289444 52081
13650 52081 -116540 93008 250139 -297089 -113030 29722 161915 416864 88349 186706
13640 186706 440090 749983 600939 512388 226894 -28102 216027 263616 566817 501205
13630 501205 159347 -275525 -311865 -84936 -37367 -112988 53631 18268 395169 550198
13620 550198 99752 -347159 -486703 -376049 169148 -55838 -405980 105738 -220896 -172719
13610 -172719 -432537 137702 466152 619714 40149 595256 923427 332046 -38371 -60259
13600 -60259 -194470 -60967 -122160 -239837 -258494 -382008 -811646 -656633 -330772 -138725
13590 -138725 -1682 322971 267964 -388065 -322148 322237 415742 -257502 -409189 -567578
13580 -567578 -647136 -734341 -239965 58621 275226 730638 617237 161679 -362597 -645839
13570 -645839 -590378 -15988 131160 315951 348184 79101 -233537 -520165 -109589 551333
13560 551333 -37357 -149413 -213502 37907 -48190 -415685 -71738 144619 -166588 -184824
13550 -184824 102458 -421044 -43159 261767 -30535 -357035 -288097 -280558 18588 -23809
13540 -23809 285473 280889 43447 134184 284607 31349 403642 77965 -109636 70571
13530 70571 178270 349371 244721 -247613 -63389 -215202 -257698 -498552 -856146 -537613
13520 -537613 -523071 -169120 -217223 174108 216261 180252 -153388 -52867 405414 120280
13510 120280 137852 1574 134063 76259 108402 701200 217192 -94362 -20614 376260
13500 376260 493906 102221 -144956 210374 -9033 41325 -93164 391870 361988 -5324
13490 -5324 140800 116397 -94154 20923 587199 148802 320765 -206093 -330114 46632
13480 46632 305750 348290 397157 481190 134143 430832 111428 -385596 -182608 -313661
13470 -313661 -432149 -432155 -567546 -279306 -114899 -541106 -379360 -257888 -85917 -7027 -23987
13459 -23987 66736 -379583 -640570 -622362 -55819 97067 -254966 -270521 -333730 -148968
13449 -148968 158795 -265329 -363352 92731 116310 268535 -284412 -331097 57778 186910
13439 186910 -9866 -199734 78794 301379 378144 550144 283021 300844 351111 -283600
13429 -283600 -36278 10124 -77932 144602 478346 169482 -62481 225700 677058 -162158
13419 -162158 -292025 -313958 -605411 -63368 108587 8004 -135566 258622 -61846 76877
13409 76877 419091 432436 428101 153797 -176715 -273844 -32639 59148 -270043 -89863 306945
13398 306945 42033 -27714 374019 277570 109347 159482 308584 257889 98749 12503
13388 12503 -101208 -2594 391645 94134 -94415 83688 5977 3148 336668 164544
13378 164544 -329342 90991 -352540 -168623 -424131 -203089 803096 747099 741437 28797
13368 28797 328553 357323 405576 172030 490416 395625 205178 -203708 -171377 19386
13358 19386 -58120 132221 273312 388782 52870 -301489 -372886 -120281 -359973 -508173
13348 -508173 -497937 -25202 -251016 -176576 -119474 -495147 -709280 -149248 5388 164207
13338 164207 323461 378752 -232916 -598766 -408990 -292437 304002 525820 -111174 575048
13328 575048 680998 358605 226615 80164 277196 21616 -67540 132008 -259780 -73192
13318 -73192 346307 325553 52964 117739 696570 391546 -226175 -322665 160556 114414
13308 114414 307989 510561 472595 309634 -48192 302735 -52945 -968655 -613146 -33338
13298 -33338 -83219 -224747 188423 297623 34659 115699 177723 42236 -248765 -210916
13288 -210916 492498 618040 132362 234809 51802 282580 -227730 -285181 -131671 -112414
13278 -112414 417033 528581 -42365 -733031 -422832 350154 -37040 -606761 201257 216638
13268 216638 39812 -114346 178340 380091 909683 898215 685308 471574 497217 76242
13258 76242 -212536 -410639 -265947 -179294 -164232 487561 723859 660432 73595 -45825
13248 -45825 362286 -416283 -565468 284059 350694 262231 -214141 -353427 -226641 51623
13238 51623 138440 -10778 204394 -258647 -423065 -63052 373771 203586 -52305 -37135
13228 -37135 -4107 557354 97674 -155646 384040 715224 827183 705330 106698 -102954
13218 -102954 102408 2503 191405 469414 943911 886915 335925 670868 3217 410910
13208 410910 574845 -130560 -241467 -95867 254694 279305 94931 -108482 -268418 236217
13198 236217 -293020 -525382 -196063 265403 316174 -372402 -128395 290803 692676 22670
13188 22670 180318 372396 500159 283781 574156 921403 360471 28252 579698 249312
13178 249312 55315 -103929 10212 271531 559355 302471 22591 -469680 -270418 -102192
13168 -102192 -487057 -3703 -173477 -257641 -28927 330688 627975 473875 200367 61491
13158 61491 296005 629234 335560 453266 484544 263299 -57037 370668 411613 6067
13148 6067 315845 306626 -191544 -215135 -194157 38644 260784 318378 606534 643875 348149
13137 348149 324165 286053 -110208 -154188 -280349 -207106 310649 192984 -468650 -489919
13127 -489919 -23360 51871 34702 212235 -141476 -76902 237767 145335 164429 -127545
13117 -127545 -133465 -710160 -726003 -193146 -268907 -418782 -120735 -450309 -519633 8872
13107 8872 443821 298314 615106 -41087 -72535 -18515 -82838 -111812 -301209 -363271 -430595
13096 -430595 113796 447947 688137 508514 404465 359588 242008 526131 507105 318389
13086 318389 -381689 -439767 35060 139344 -327314 -318787 236528 10517 -188244 111567
13076 111567 363813 127435 -367005 -800093 -44574 78348 152225 181290 131534 -18647
13066 -18647 56801 -86251 29721 -345639 -552142 -910407 -203256 361949 524261 407554
13056 407554 161476 351906 531574 665882 237207 -84192 -117076 231084 16848 -183274
13046 -183274 -289799 178665 187193 -1314 -236858 429223 510351 18740 330775 651049
13036 651049 277131 -31080 104589 10747 -328356 -250070 185785 627532 645130 397573
13026 397573 -53991 121135 3956 -258495 -277929 -81824 -50584 44534 495177 355741
13016 355741 -91887 16977 226010 -334368 -3128 67278 311749 731794 1180316 296831
13006 296831 -75854 490855 57814 -239938 130802 -114002 -37293 -106863 201923 195132
12996 195132 119560 -306503 -282149 221724 -67205 -351637 189922 145118 -70031 -176466
12986 -176466 400584 208274 -254264 -8852 163870 172685 405431 282718 -341953 -156108
12976 -156108 -432533 -147030 206562 198018 17083 -127546 -248884 -513945 -163468 357485
12966 357485 506985 521507 -37461 -166987 152563 -176871 -208184 200414 -384975 -79229
12956 -79229 357612 429819 523090 421691 -68469 65440 373372 681685 -310924 -540720
12946 -540720 -338964 39959 309999 436059 466896 135658 199183 117814 -341725 -381721
12936 -381721 72874 -8136 -159776 -68372 77997 185015 513767 462421 -115835 100805
12926 100805 109819 44369 -280951 -754541 -550952 -519307 -198921 80812 -171067 146946
12916 146946 -273721 -479252 97915 257756 320299 -164166 -285257 -280169 -369816 99424
12906 99424 315730 72264 114367 -45617 -134784 -178749 122260 -88054 63530 346992
12896 346992 -355497 -367979 8537 36523 -51646 -132182 -7886 -184295 168296 739502
12886 739502 709562 524652 564666 718536 566667 -257635 -259932 -447219 -198605 56846
12876 56846 42898 291900 501927 374800 262109 379787 436919 308923 269069 -26175
12866 -26175 268505 36710 -3419 601418 551551 226935 -171578 -409297 -212368 93989
12856 93989 104705 194217 -239297 -143648 184894 -47373 -292191 -70084 75130 360536
12846 360536 476465 372269 460703 659320 278630 124259 344054 273494 178823 185246
12836 185246 147984 -38409 -368652 -46323 191856 458455 256241 115295 -162664 -352891
12826 -352891 -372454 -102172 -30976 -313077 -134373 -727611 -950260 -619253 -352656 92007
12816 92007 149867 -81784 -168409 292916 289515 525398 449687 9614 -258313 -495501 -339868
12805 -339868 -122125 -326901 -562504 -682775 -470055 -177694 -329177 -169548 -132948 -99268
12795 -99268 117756 -12761 28329 32761 189537 197905 -214547 -46231 195421 89310 452031
12784 452031 933308 410234 456018 477920 307676 -360551 -1031822 -975840 -393584 -102558
12774 -102558 35663 447692 203463 -147905 331591 325681 232471 -210014 -330210 -73463
12764 -73463 -209952 2820 -79540 -293223 -382622 -275946 69159 -115985 19887 106820
12754 106820 -57442 172791 223302 69185 -103351 -63132 280756 -129940 -202031 -211554
12744 -211554 -57928 227245 77070 161752 34185 -39229 -112241 -392120 -252779 362937
12734 362937 457737 730622 623674 510850 295738 274409 89330 109799 -48011 -333964
12724 -333964 -101500 51780 -530578 -110031 30268 301453 537282 20554 -192372 -130132
12714 -130132 -143238 -166085 185694 593587 420849 140245 185608 -171685 138605 -369875
12704 -369875 -174698 -106916 -313467 -494931 -454025 -158051 447762 285899 538256 442852
12694 442852 4589 -156098 77210 183224 191112 40123 -341224 -123137 -82890 -677663
12684 -677663 -281626 144746 -404577 -336791 -397070 -354953 -266664 -305288 185748 218909 119725
12673 119725 605853 209151 51746 -245771 -297382 -176037 98217 -160602 3225 -164548
12663 -164548 78579 178129 -187052 -297216 -308478 200584 36055 -217491 -360308 -828630
12653 -828630 -446439 173831 140196 -369507 -314131 -558915 -306858 -156345 -150565 331903
12643 331903 -3349 255794 -228377 -9578 183005 -192308 360410 194161 668 62948
12633 62948 178767 -35301 -267878 -468328 -572175 -178904 -550535 -407199 53041 327875
12623 327875 637031 557871 267344 328448 313100 35021 -49463 -122053 -27255 -539822 -821926
12612 -821926 -207583 -61750 44903 64189 -262535 60143 184089 176258 51680 351482
12602 351482 12789 -10423 133498 320911 618116 54761 486228 538202 232228 104672
12592 104672 -222158 -229397 -399289 -240338 -316540 -23910 -248490 143632 -71539 -513193
12582 -513193 -354934 -261227 111698 -280162 127871 382196 437474 225295 187464 119271
12572 119271 308572 -287939 -304555 359942 57783 161257 505114 688585 590381 345253
12562 345253 300270 42039 -241308 -166682 105722 167548 -107699 -437837 -283647 -59797
12552 -59797 213865 45134 -211182 2431 181070 -178487 -247148 -107961 68794 -190072
12542 -190072 -116194 172317 -236693 609193 499164 -9096 -520797 -298853 15194 -376644
12532 -376644 -267589 28212 370990 548745 622544 185074 -16659 106955 -86396 -120183
12522 -120183 -308590 -298573 7732 202202 396713 -291547 -54213 24092 137443 16744
12512 16744 -566713 -609 -86513 35554 146156 -355206 -234533 -43468 -64289 161616
12502 161616 -215836 -336128 -44448 -675902 -312011 371440 674993 535355 822022 432362
12492 432362 -171245 -582588 -84927 3493 642713 688353 334118 413402 268690 73161
12482 73161 -459492 -667692 -49907 489768 150609 -334900 -625467 -366679 -3821 30768
12472 30768 -95082 -81792 333792 268691 294944 90509 208466 302037 -1259 79714 543475
12461 543475 -73559 -847847 -439772 -541813 -277753 -373507 96407 204152 440574 494203
12451 494203 53380 383880 313140 -416490 -8198 -83507 -136077 -42907 100764 84372
12441 84372 241123 267328 657798 414646 71628 -196896 -333737 -458940 -124817 188091
12431 188091 224656 -33716 85167 -230205 380516 194190 391636 376180 120117 10554
12421 10554 -212062 68785 222892 -358013 -306887 178445 -301553 26751 261895 -116254
12411 -116254 -492436 -41544 132101 306248 -318460 -276142 -311739 -6489 -7651 -184032
12401 -184032 222658 110852 -339364 -5572 136647 -271509 17058 492009 474445 142083
12391 142083 -107969 43150 60227 116503 197378 -148049 -32346 291756 54433 -6771
12381 -6771 113396 99383 -615083 -525505 -347 57748 -556444 -201436 142665 254911
12371 254911 248482 134596 5348 -14257 176829 -504369 -218751 231037 -91869 -187779
12361 -187779 -31587 -139772 -4045 -272029 -258822 -18302 -208145 -219051 107131 -201219
12351 -201219 46291 150878 -442742 -184725 297281 452870 450025 392924 -86435 47799
12341 47799 -91062 -368323 74850 236408 334851 160004 168314 327258 58315 -20410
12331 -20410 -18015 504040 803045 290606 -258200 -400829 -253172 -110343 -215282 -214867 -756306
12320 -756306 -390974 -227169 -188406 79338 -66134 -411870 -567836 -355834 -51339 514521
12310 514521 -89014 -330289 -149034 -355279 -402534 -164808 267709 112008 255882 -35528
12300 -35528 -412091 407869 428505 -194340 9397 136810 125415 272417 117696 -120281
12290 -120281 -455058 3045 491029 244330 162427 43963 -38141 -330815 -318720 325037
12280 325037 224855 825402 321268 83891 53476 -273286 -97114 -325275 74672 -208593
12270 -208593 150703 837640 605484 -61771 -170204 -351746 -686186 -1165393 -469700 176221
12260 176221 -345611 27227 226633 313966 521523 46169 26608 73782 470655 405593
12250 405593 707535 706551 625118 339691 -411852 477 435897 451268 78853 -514580
12240 -514580 -470605 -422879 -196746 -186155 -148178 12695 -549198 -373552 -342497 198912
12230 198912 472045 32272 -341400 -14597 -246188 30458 120554 -343459 -127563 -259609
12220 -259609 52751 596861 439594 279230 177180 -289096 -362454 -219576 43714 205405
12210 205405 387394 325372 -231688 -344958 88365 32538 -17979 157992 412896 459258
12200 459258 707220 777906 477882 352412 -152015 68258 -201616 -69903 -142054 -919
12190 -919 -290547 -588127 146513 626844 77294 24713 304547 718851 827495 630085
12180 630085 302916 209468 384295 399012 274697 296495 -153000 -260629 -534850 -376930
12170 -376930 -327978 -336149 -259432 100153 426194 249910 534618 290449 68759 -41318
12160 -41318 19655 504116 272058 -201492 -483017 -56712 283470 -237777 185098 -187956
12150 -187956 -140543 -408702 -591394 -603874 -368537 -332899 -436580 -246381 -231627 241881
12140 241881 102291 -145523 -253789 -322544 35577 -274294 322952 80210 -5809 310943
12130 310943 -10257 108137 154198 22201 -462417 -110701 48964 -311759 92573 394786
12120 394786 206280 157946 -7288 -261198 350691 298935 -205527 79713 -336397 -528293
12110 -528293 -316420 102075 349297 256843 -35079 -289985 -373137 -176877 92242 -169183
12100 -169183 -430362 -411122 -71815 97877 205942 110172 93129 -473182 -252207 -438831
12090 -438831 -827896 -946204 -458875 144823 244486 395547 617954 672498 1062920 675365
12080 675365 215390 -236371 -54149 191813 25367 -276492 -75179 300707 163470 63074
12070 63074 299335 344360 -390641 -378733 -65130 28359 324790 -297760 -324191 -523602
12060 -523602 -552603 -83429 -51415 -278613 -75588 462937 271433 -136563 -168577 -54087
12050 -54087 -560691 -270965 -290810 -356468 -407663 297814 342993 311626 589566 586359 218804
12039 218804 169082 -113696 -408547 294695 284779 -339867 -107172 -328603 -717100 -900594
12029 -900594 -495395 -109181 -406351 -758409 -1028652 -1142285 -1346374 -655758 -567571 -436868
12019 -436868 -143436 -160208 -247049 -430762 -400413 -635660 214577 547739 434266 230390
12009 230390 -359113 -463843 -341510 -273647 314984 -317360 -241697 432926 665205 32140
11999 32140 -34384 134548 369117 114655 164502 -111181 -66048 310773 -12007 -112850
11989 -112850 7506 -181523 -163116 -8169 -269878 270517 403511 344302 -236733 -376231
11979 -376231 -25414 -122644 -217817 42111 -225238 205672 24260 -366648 -397025 -309953
11969 -309953 364586 420667 156301 132789 410236 407751 274957 -281907 -498890 -527951
11959 -527951 -623052 -414162 -167363 128758 -19843 -299572 -326152 140294 29560 -428573
11949 -428573 -268715 80479 -115951 60483 9911 -233309 -87271 -114698 489077 865274
11939 865274 335042 280825 373221 -496912 -387908 121547 109919 513591 794868 131643
11929 131643 -389242 200091 341648 166002 -25350 327875 -481161 -304255 -289439 -15850
11919 -15850 -146116 -48808 -59400 -498099 34893 -454293 -1137161 -710556 -99317 39110
11909 39110 -71729 -339578 -255496 -302360 -66749 372368 -247528 -772304 -317495 -255217
11899 -255217 -49868 -104199 -18498 -283176 -390065 -82112 352452 356993 270139 127553
11889 127553 -271537 -612552 -295074 67175 68068 68121 -251514 -241743 -478155 74024 603397
11878 603397 735036 736869 279694 595373 -611320 -832508 101234 251433 -50789 8959
11868 8959 522766 -31213 565708 553875 -69891 -76448 -253954 -785467 -481455 -82483
11858 -82483 94705 371136 154495 496698 348739 349937 86621 -186039 -596180 -95583
11848 -95583 153722 35837 373804 178167 -107449 104296 176471 -14128 79518 -417750
11838 -417750 -393346 -376202 -490610 -168652 23693 -340778 -273037 -835419 -583169 -426105
11828 -426105 -339485 -251082 275820 560776 491477 303447 94124 420670 -255793 -291232
11818 -291232 302966 -218900 -30754 287369 205053 -165311 -970095 -831534 -323771 -290405
11808 -290405 -377175 -316806 -40614 380384 5635 356021 404488 405783 776896 695868 46171
11797 46171 -537493 -254423 -135995 501734 285421 -91588 -456408 -856180 -129101 -268524
11787 -268524 -333292 203869 -188435 -218439 381147 325410 574524 194939 153122 94974
11777 94974 272669 671385 447315 -67837 183629 123073 27790 -317936 -195992 438160
11767 438160 578310 162751 225705 -315383 -354356 -283661 -615591 -677997 -683765 -557416 -180951
11756 -180951 51973 99579 -123103 -519463 -341198 -339535 -223110 -377706 -380143 -452699 -99917
11745 -99917 -586295 -397166 129281 -212442 -439936 -199187 -226508 -608333 -154694 85949
11735 85949 -126869 223617 566516 -99242 -2791 -124720 84494 529767 267590 719489
11725 719489 178964 -16560 -78928 -161177 -143899 -214200 -526752 -724216 -328937 -344380
11715 -344380 -173862 -243946 -328391 -191140 -5145 -115587 226133 -40869 -80717 -195433
11705 -195433 -611682 -319833 -289738 140088 51338 -255669 -281962 -104188 336917 -13402
11695 -13402 -66319 97611 -470175 -278288 121862 -5706 -519642 -588320 -263799 -289320
11685 -289320 -228886 -384664 -665202 -469354 -439882 -482158 -515523 -504028 -830182 -520907
11675 -520907 -290432 -153264 -140189 -110555 -231285 -21837 160099 -54417 -341158 -161407
11665 -161407 38337 23784 358096 87759 -221730 183994 312707 -81309 202553 -156840
11655 -156840 -371388 -4380 336294 247086 -390975 -346417 -515082 -158794 25801 4080
11645 4080 323478 338417 346948 195117 -15880 -294922 -393082 -403248 -519154 -98556 -385502
11634 -385502 -608518 -431716 -149787 -100112 -222581 -59578 -162014 -50865 175771 -551158
11624 -551158 -538778 -603900 -18837 16927 -789964 -315321 -501106 -368872 -294254 -485287
11614 -485287 -331712 -47611 -565711 -26340 -162558 -554656 -510573 -335850 -191634 -372220
11604 -372220 -255035 -59381 208971 375248 364292 77824 -565520 -748086 -802599 13263
11594 13263 5570 -166679 368507 273885 459863 343456 412670 170645 -67902 -108802 -330049
11583 -330049 -684179 -398113 -477958 -156457 -295390 -352496 398228 4483 250883 221638
11573 221638 58447 410792 212272 90999 402754 152075 97473 21360 132877 -92557
11563 -92557 -335210 -598870 -666502 -416231 -168224 -438828 -822748 -517247 -391081 -25761
11553 -25761 -448654 -464544 -837558 -717446 -136040 102969 -134598 -158810 -192559 259055
11543 259055 42 -242243 223496 88611 27694 86887 190207 165408 391979 144117
11533 144117 549804 319014 112734 -161881 -514725 55251 357632 285818 273627 323375
11523 323375 507589 -144496 -281886 -225729 78520 205050 -165662 574 287192 24039
11513 24039 -195030 271033 157031 -217139 -282241 -67412 -468665 -185266 -74786 236858
11503 236858 131710 144342 99658 139553 -51782 -668143 -30936 58190 -44755 -557484
11493 -557484 -623831 -849452 127792 390111 373565 178528 253968 324366 296794 199746 417487
11482 417487 59407 -530969 -219447 -514877 -644542 -125879 313638 393410 32334 108766
11472 108766 -136496 -306625 -611074 -232361 -421107 -690018 -68334 -111744 312567 296998
11462 296998 135570 197644 154417 -211092 -502515 -727026 -396804 -186094 -164417 -120692
11452 -120692 -244471 -867431 -279565 -532676 -284801 46730 281387 -94396 -316095 -118344
11442 -118344 -526633 -833601 -189389 -76958 9123 -61875 -432925 -612426 -419767 -585541
11432 -585541 -353988 -628047 -1015273 -736012 139073 381064 -92929 -243982 182847 182878
11422 182878 428038 496178 286525 140250 92756 263643 100905 -325143 -731357 -542556
11412 -542556 -530685 -196759 193372 469695 240670 273155 48310 251839 130448 -53398
11402 -53398 66742 -313165 40529 595099 194479 197659 -162410 -27175 355396 -577
11392 -577 298731 211520 -296545 -349311 -247082 -302822 25504 594295 295543 -368797 -104214
11381 -104214 -217203 -422415 -252377 -177184 71378 138146 370426 404346 248986 -15435
11371 -15435 -29321 -312397 112785 414638 205814 -207052 -529287 -422306 -160996 -430688
11361 -430688 -254821 -383205 -601077 -893445 -1243112 -1139170 -315319 -72795 -473184 -116917
11351 -116917 145837 -136236 -325328 -368152 -167836 -208506 -280682 -276498 -369390 -227967 298959
11340 298959 113253 -407366 -569058 -279199 -340859 -166239 210785 -131948 214887 414896
11330 414896 122323 -72892 -240074 -87281 103882 457616 297790 -158613 -487904 -444160
11320 -444160 106724 48437 44306 125806 -107406 -161138 45873 12280 187232 -485983 -768112
11309 -768112 -621134 -286322 -497840 -652863 -460291 -387176 -303316 28212 244131 98252
11299 98252 -480791 -54445 -114864 -569226 238072 -93589 -262893 -14811 -388749 -368603
11289 -368603 -185061 -299937 -193884 -188120 -211227 -426978 -66311 301703 239589 248524 289618
11278 289618 -37918 -433149 -94161 183444 355148 123865 68581 497155 520154 288940
11268 288940 -220890 50584 268411 -99845 -87169 207607 -308774 78049 -2433 -241384
11258 -241384 -335131 -569543 -412930 -389953 -615689 -450802 205650 321678 172361 102526
11248 102526 -52803 -46713 -74364 -115281 -254735 -356505 -509244 -550592 85518 -35448
11238 -35448 -300466 -69049 522094 266133 170608 -128808 433516 467014 -182327 -141130
11228 -141130 -128453 12743 228123 -28484 27620 617195 389854 669853 518586 -2658
11218 -2658 -90127 37169 435610 21904 41477 -94602 -603182 -214223 313748 331979
11208 331979 75028 238927 -17620 -51784 505208 639389 1029292 251500 92452 293821
11198 293821 809717 711033 78672 181833 441991 23653 -567132 -182986 116554 57411
11188 57411 261888 415351 517191 -52557 -6445 -226765 177512 720473 907955 961755
11178 961755 986387 1548937 1778077 1500213 1649160 1930257 1737410 2139988 2094009 2260526
11168 2260526 2592436 2785556 2807470 3368662 3550339 4160509 3955220 3594803 3438633 2897494
11158 2897494 3001076 2555158 2351994 2240571 1781400 1155854 1156266 1724628 1465303 1651536
11148 1651536 1519974 1283072 972970 409738 383674 479687 843501 673221 128014 332741
11138 332741 503393 633003 494784 945741 776489 942493 436926 200020 157203 339190
11128 339190 645608 713499 570058 314290 529205 685523 812871 677632 891871 603278
11118 603278 464347 588868 79237 -79818 -37062 -129427 643098 673522 229899 573888
11108 573888 880365 887294 815347 697360 782135 705853 368976 617892 860509 694212
11098 694212 618130 782996 583408 237773 16005 486134 1067754 671719 739722 526567
11088 526567 548554 618790 622202 621877 834205 1249798 638832 906161 912483 1157463 895448
11077 895448 821220 1143942 1002957 943252 648842 1002827 1156775 1057369 1373977 1895834
11067 1895834 1454910 1116823 964776 1097102 1213999 1507680 1600740 1632487 1309017 1404577
11057 1404577 1512308 1433493 1190254 964560 1264043 837114 417133 807431 1066521 770424
11047 770424 1005526 1133430 676868 706687 612963 425071 564099 491982 544807 696250
11037 696250 586342 673651 818500 1032897 889901 770953 754559 571058 536217 466501
11027 466501 454920 242777 112915 27880 -323129 -430753 -206467 -62434 -326245 31603
11017 31603 240009 -68316 544185 718911 -34672 -226319 66188 648478 992231 502640
11007 502640 344340 -133728 268590 233903 -51009 -186035 43145 557539 192183 -165723
10997 -165723 -137443 309197 -76775 -319794 -263713 -458612 -366499 60009 -54464 106027
10987 106027 540467 461130 628245 542012 -307874 -458176 -331135 -26842 -287079 -435958
10977 -435958 -430694 -277597 -349933 -159928 -72733 -169977 312584 761403 389171 24982
10967 24982 51114 113742 -113190 -480913 -908858 -1018244 -426253 121033 -76796 -174002
10957 -174002 -140334 -478213 -369467 -1103 -51955 -256366 -407450 -668690 274 173838
10947 173838 108316 -234946 -59657 -58799 -123341 -246407 -80982 -62784 -124489 -412899 -172261
10936 -172261 116837 186971 -16259 -237248 130287 105787 10362 -49682 -178617 -1037
10926 -1037 291342 41209 -50569 -280876 -612531 -476366 34621 174234 429662 -57207
10916 -57207 -114630 284796 214611 -554252 -1032938 -645034 -539737 -64508 404555 137710
10906 137710 -237712 193086 -188913 -408722 -470552 -672727 -509686 -447284 -95951 -121511
10896 -121511 -125109 -64000 -142992 -51748 -93254 -329352 31595 -62287 -416616 218007 153943
10885 153943 -41332 140231 -56320 43457 244364 -5838 211283 432594 81407 -254811
10875 -254811 -458896 -522819 -679619 -868455 -299305 -391605 -305676 -91371 -426460 -432803
10865 -432803 -310297 -75046 -196025 -350843 -123906 -162327 -478426 -567099 -329484 -136243
10855 -136243 -6770 -184050 -207179 -31308 -661740 -991404 -1145423 -788777 -766166 -355284
10845 -355284 -140009 -374933 -576361 -441806 -339835 -911952 -689860 -546722 94430 -465764
10835 -465764 -524909 -410007 -605220 -308640 -141721 -176470 -564472 -549593 -848470 -443382
10825 -443382 -620939 -78972 123678 -256848 -269810 -395817 -286856 -107659 -147219 29661
10815 29661 148395 21525 187719 -388944 -711864 -390265 -382464 -300396 -199401 -216978
10805 -216978 -712203 -893443 -1057526 -422716 -606 -54955 -278376 -716113 -341210 -806458
10795 -806458 -800284 -165672 -87416 99605 232999 -257990 -97960 -115584 146749 -28733
10785 -28733 201417 245178 98999 173176 -14984 -664807 -554656 -228789 -666167 -436712
10775 -436712 -117593 -254156 -249128 -133405 -496219 -770514 -512025 55491 -410497 -158283
10765 -158283 347705 51322 -118861 440172 305014 284722 30964 -361601 -92021 -380603
10755 -380603 -147087 -100244 -218354 -281676 79927 111542 -564565 -502992 -573266 -331368
10745 -331368 -732207 -319959 -505700 15640 313097 -51435 139335 75279 -120777 -496782
10735 -496782 -735217 185050 84472 -669851 -767052 -476126 352265 9391 -469736 -444879
10725 -444879 -237122 -92961 -317316 -579170 -521690 -314036 -148722 -422515 -209262 -387900
10715 -387900 -422246 -462932 -567709 -274565 12301 64323 -455858 -856145 -266092 -210045
10705 -210045 -382077 -633206 -218087 -501460 -508604 -616635 -623286 -753850 -684063 110316
10695 110316 387107 -263073 -308008 27533 -105950 342323 302196 -37492 -22976 411260
10685 411260 562720 536531 651466 442826 -13043 -165304 12540 -176822 109886 6846
10675 6846 -387925 -313260 -61193 52316 256925 48781 -384588 -154501 -322376 -18792
10665 -18792 -68562 -402639 -598264 -348648 -627116 -794262 -741163 -157822 41057 -159886
10655 -159886 -494634 -563878 -161126 41773 45412 -624683 -928546 -601790 -226246 -163858
10645 -163858 -419497 -480530 -163799 404482 413048 -375014 -512323 3163 501865 46474
10635 46474 -392352 -87441 182919 -338326 -621085 -507449 -589386 -934776 -627335 -232177
10625 -232177 -227399 83732 -26785 -227724 -9397 80399 157398 -148938 -488732 -442709
10615 -442709 -559438 -529733 -382117 201247 36586 -104890 -53976 -66851 -120296 -597369
10605 -597369 -683810 -96189 -128877 -290538 -222311 -198138 39674 31217 -2358 -71137 -140665
10594 -140665 -54434 -113241 -179227 -312652 -564843 14035 -10247 -229553 -254780 -698967
10584 -698967 -36329 205037 -168235 114075 78216 -20199 -552193 -646250 -617070 -754623
10574 -754623 -539927 -254988 -382417 -592426 -550986 -627824 -644868 -456451 -542067 -802334
10564 -802334 -210627 -62330 -496736 -661928 -550931 -562699 -157017 293670 -243666 -1077073
10554 -1077073 -805530 -308692 -284034 -766790 -1006975 -627313 -323043 93273 342067 283771
10544 283771 221653 85708 -121235 -515476 -843574 -956768 -479117 -551312 -593614 -634740
10534 -634740 -315851 -356375 -753940 -837670 -496619 -266427 -369548 -139492 -499457 -281369
10524 -281369 -371856 -854562 -885988 -522771 -511414 -254811 -334688 -694733 -869379 -535775
10514 -535775 -541133 -653932 -986171 -649033 -4886 12918 21421 346652 -95625 -395168
10504 -395168 -218481 -282512 -612671 -721899 -591212 -210173 -81427 -320365 -122063 -289125
10494 -289125 -37010 151045 300324 -187981 -374309 -253830 -251729 -407586 -725028 -254515
10484 -254515 223111 265418 565266 239313 64802 62552 225859 -92076 -841811 -318531
10474 -318531 379739 275780 519209 420515 437564 -359782 -104136 424872 224530 -108483
10464 -108483 -290204 -64363 78942 -405891 -295727 -302539 -12871 380121 -54152 229932
10454 229932 -20580 -166254 -182848 289380 276393 -11401 217167 484758 383586 231387
10444 231387 -193048 -468222 -182590 367952 192232 165003 -35004 221074 156166 -579689
10434 -579689 -254261 186173 -44487 -275039 -80005 -284977 7401 553582 464570 185796
10424 185796 -421184 -251045 -415985 -446285 -211120 -299927 -584369 -415928 -148076 -115115
10414 -115115 101182 121439 127223 6527 295986 213310 -192355 -118287 -278622 613716
10404 613716 437314 -536740 -329496 -42893 -171199 259397 130148 -8087 -167699 -359286
10394 -359286 -40647 42132 -172657 -341974 -551317 -277794 -230418 210934 101657 -100311
10384 -100311 -455557 -149310 555592 604032 363717 103742 464478 270566 69019 -173057
10374 -173057 -294185 -977629 -697465 -717209 -331863 -248677 -192431 -413009 -223385 100185
10364 100185 282492 268803 611415 363941 59559 579785 663365 529042 84144 -226966
10354 -226966 -290965 -185552 405751 -3168 -56608 204865 192971 190073 -24085 -554327
10344 -554327 -505506 -307611 -670555 -234858 7623 -209715 -264525 6717 289355 -4374
10334 -4374 -572278 -702351 -452589 -278236 -423833 -463146 -301293 211326 124396 -226303
10324 -226303 99041 46290 -120448 105194 83171 45524 372133 -151717 165754 525349
10314 525349 -284136 -470403 -651460 -278267 -440509 -228209 -168670 -200431 45970 -298655
10304 -298655 -281985 -244251 -712778 -753673 -260861 -233775 118153 70708 247353 535620
10294 535620 720513 314506 -73253 -98920 92423 85016 -158393 -27635 -489210 -194174
10284 -194174 -418095 -626003 -333330 -57127 -234219 167113 144233 346505 -119097 -337540
10274 -337540 352925 133376 -538556 -51413 -102272 -252671 -127368 -152900 576504 361299
10264 361299 279976 -58975 -47504 537638 656795 225777 -325695 -728948 -1007444 -622188
10254 -622188 -266368 87327 -12177 -662720 -249122 -438502 -626504 -429941 -727285 -413759
10244 -413759 372316 480823 778422 719036 727580 710986 343252 46570 -208836 -394850
10234 -394850 -248328 110243 187875 -101920 44264 681881 557063 324358 252369 313107
10224 313107 305332 -148256 178629 -65350 -219399 -99133 -249651 -510404 -875878 -658048
10214 -658048 -341746 -14290 167777 126073 27703 158305 -58799 -445968 -268365 -373293
10204 -373293 -291686 533831 -39848 -296277 -320117 -341350 169912 -319707 -124315 114298
10194 114298 172256 243222 168755 187087 -58848 93517 354692 351289 478241 788278 750563
10183 750563 227834 -75802 150765 189708 366280 343091 345544 640967 53388 260439
10173 260439 375640 -66953 7331 178738 577339 379324 295956 -6374 164465 342547
10163 342547 753365 592951 269161 244814 327373 552565 607287 593716 999901 343874
10153 343874 18375 279356 358676 -103839 -35186 310304 19445 32000 327687 20103
10143 20103 -87972 -40483 -349977 63468 157692 172204 230218 510470 652000 738847 425310
10132 425310 25157 407208 774444 918579 594428 738551 946996 598829 689281 401621
10122 401621 706786 595212 656792 507161 430386 101435 122230 -88163 399192 984543
10112 984543 821238 407080 562670 728533 236597 671823 1309942 1122377 1299927 894537
10102 894537 1165326 1705007 1305262 952760 864233 1160494 834563 936194 890881 1505895
10092 1505895 1768761 1343390 1746005 1814077 1482635 1747169 1431021 761252 618009 499757
10082 499757 60698 574761 1061035 755729 804497 956609 1204756 969695 994165 766767
10072 766767 877088 1282287 1285968 1721192 1579007 1742266 1751878 1736402 1697461 1461335 1834674
10061 1834674 1672170 1775199 1710857 1224312 1536068 1710268 1677483 1779155 1269030 1310128
10051 1310128 1526913 1528078 1849537 1734771 1717011 1636203 2011774 2276779 2021523 1984403
10041 1984403 2151771 2218916 1718915 1764749 1877248 1487583 1435296 1992378 1863981 1602342
10031 1602342 1708366 1628005 1806442 1918249 1740771 1638870 1917245 2065618 2052763 2094668
10021 2094668 2123389 2214067 1490350 1430063 1900921 1620238 1941395 2157657 2115947 2160380
10011 2160380 2291827 2032530 2079339 2039133 2014476 1699578 1297216 954981 866794 1159078
10001 1159078 1069603 1107698 1546452 1397716 1343428 1575267 1125993 747995 1291246 1656735
9991 1656735 1219694 1348840 1489727 1161970 1794990 1920924 1741418 1354693 1226408 1354398
9981 1354398 1456311 1222799 1337412 990018 1066185 1380701 1416646 1484874 1514400 1189175
9971 1189175 1150391 1634175 1161305 505335 679565 1523035 1160526 1227414 1172085 1015401
9961 1015401 1060364 1083655 954154 1127819 1398706 1436137 1470855 1439151 1528006 1668649 1661817
9950 1661817 1732720 1417849 966009 1287050 1778043 2157912 1479445 1402722 1291374 1085077
9940 1085077 825268 459792 974177 1372267 1483457 1279348 1283774 1411199 1717155 1826437
9930 1826437 1616940 1538639 1797200 1302395 1321007 1364168 1695136 1663125 1623996 1015548
9920 1015548 1001723 1531738 1605475 1286576 1246385 1251353 1151019 1145915 941338 1033947 954244
9909 954244 846329 1145642 1354771 1662483 1362865 1112961 1268925 1645490 1694391 1442066
9899 1442066 1257874 879339 1321215 1927566 2036186 1582579 1375409 1334199 1436649 1418258
9889 1418258 1613864 1540526 1277039 1888490 2454853 2025093 2080174 1670842 1668782 1727590
9879 1727590 1826637 2403472 2505065 1932123 1657640 1734979 1643365 2143474 2771709 2743044
9869 2743044 2022301 1867140 1795423 1925391 1752521 1925135 2036021 2467826 2191240 2274168
9859 2274168 2132165 2012777 2357337 2245742 2616266 2216253 2129740 2395108 3105650 2916860
9849 2916860 2942219 3033012 3046817 2913724 2804852 2787661 3195475 3120847 2560720 2502526 2442105
9838 2442105 2652540 2995367 2922894 2828787 3185589 3733547 3697071 3503656 3119609 3238630
9828 3238630 3628949 3297134 2659099 3335614 3780492 4019630 3683023 3551133 3511528 3416629
9818 3416629 3707247 3660181 4190943 4468717 4618798 4607619 4404177 4478179 4280460 4137162
9808 4137162 4638108 4731723 4834234 5068230 4656649 4694245 5158818 4909513 5027588 5298541
9798 5298541 5501455 5461912 6029109 6299876 6212369 6141555 6339637 6010255 6253413 6762939
9788 6762939 6892198 6818523 6514283 6372336 6088131 6694546 6872796 6923537 6984396 6888658
9778 6888658 7119864 7404269 7808795 7817721 7581495 7494694 8011840 8210262 8124280 8009271
9768 8009271 8820494 9072755 9538362 9977542 9992808 10303505 10379474 10878768 11003506 11983151
9758 11983151 12168997 12332961 12838556 13018723 13750804 14278757 15026306 15244724 15535700
9749 15535700 16190571 17201134 18305135 18307435 18984955 20073964 20958034 21430172 22115529
9740 22115529 23082799 23687585 24478479 25548524 26682496 27655226 28899277 30072144 31562289
9731 31562289 33436781 35436455 36721838 38680252 39926045 41889096 44403165 46412948
9723 46412948 48522004 51619246 54416171 56747066 59718905 63225719 66857635 70019843
9715 70019843 74239175 78887243 83574719 88103303 93096029 97103276 101502079 105445207
9707 105445207 108847620 113212085 117929951 122995280 127202726 130832105 134722584 137700707
9699 137700707 141058177 145337237 149868314 154600677 159721586 163760035 168644721 173831016
9691 173831016 178941649 183405280 186649763 189141126 191113634 192592147 192346082 191414364
9683 191414364 189406695 186794099 183856174 180179527 175609147 171200321 167579691 165017124
9675 165017124 163072179 161600681 160346821 159199282 158421166 158553459 159740432 161827898
9667 161827898 164242663 167583073 170743659 173372600 176082799 177529794 179944020 182906838
9659 182906838 185837439 189125797 192013921 194146897 195713971 196588228 196653813 196022027 194258152
9650 194258152 191109447 187236697 181788270 174232156 166560981 158331429 148854392 139463749
9642 139463749 130942346 123734686 117350702 110984432 104648537 98886081 94077059 89569056
9634 89569056 85676595 81991141 78515245 75508320 73282290 71013205 69324716 68291476
9626 68291476 67160008 66944312 66393053 65553539 64908557 64631975 64104839 63605084 63258018
9617 63258018 62857992 62568807 62352847 61679206 61523180 61726471 61431093 60985424 60278980
9608 60278980 59197565 57958250 56940677 55798573 54259247 52520010 50420143 48139395
9600 48139395 47001080 45094029 43180644 41210504 40313371 39447415 39169011 38805871 38308107
9591 38308107 37533404 36762974 36099754 34505927 33436914 32131956 30978926 30635539 30121594
9582 30121594 29185227 28770392 28387010 27256805 25769435 25135444 24651274 23747022 22834482
9573 22834482 21712967 21321230 21398427 20929008 20087540 19478757 19037907 18812126 18295958
9564 18295958 17292151 16700123 16596827 16519123 16275709 15760480 15480750 15224208 14916712
9555 14916712 15037366 14351575 13944733 13385549 13225567 13097993 12594734 11849104 11417008
9546 11417008 11483417 11756944 11468154 11119078 10589759 10368198 9838785 10238038 10156505 9678550
9536 9678550 9268715 9338546 9243778 8762993 8358751 8403600 8407850 8255577 8937424 8295658
9526 8295658 8267507 8338196 8054314 8173035 8465007 7563369 7098413 7582714 8052924 7876199
9516 7876199 7111998 7361969 6906961 6437443 6399981 5938715 6172990 6472644 6739849 6396584
9506 6396584 6535738 6442125 6044951 6020672 6021896 5845425 5900078 5672861 5818957 6140421
9496 6140421 5728750 5230967 5328386 5346926 5491759 5400082 5575469 5573667 5931559 5518763
9486 5518763 4998067 5876291 5876410 5851801 5676805 5394139 5026557 5277215 5497283 5245860
9476 5245860 5410518 5159300 4500521 4850811 5291456 5351282 5507303 4957471 4979360 4597023
9466 4597023 3993958 3487595 3724553 4340629 3918983 4311619 4847680 5082502 4762100 4723030
9456 4723030 4829989 4635534 4545163 4574679 3799676 3979633 3868848 4192855 4502541 4698408
9446 4698408 4570987 4014369 4279626 4373546 4304576 4343622 4147257 4179157 3858643 3589034
9436 3589034 3454261 3528828 4261799 4980705 4803799 4802667 4712079 4291508 4203874 4352232
9426 4352232 4511088 4191303 3948397 4461604 4674898 4353657 4257909 3998114 4039867 3895300
9416 3895300 4301810 4558216 4733620 4527735 4045929 4160852 4524079 4167480 4413599 4871233
9406 4871233 5035399 4988219 4951795 4683187 4942372 5079160 5334411 5560662 5405276 5482252
9396 5482252 5682768 5548952 5730073 5936251 6305491 6386729 6302064 6084845 6023379 5801847
9386 5801847 5535958 5586092 6045338 5771558 5772210 5744993 5540477 5533067 5872398 6496154 5985233
9375 5985233 5812017 5997547 6512015 7152247 7689664 7714246 7847084 7747855 7863206 7583566
9365 7583566 7394249 7444352 7485659 7700198 8078382 7992174 8259160 8678164 8891892 9125009
9355 9125009 9066126 9022323 9157445 9521949 9786901 10118580 9900316 10080493 10127871 10233385
9345 10233385 10634124 10478775 11291127 11856793 12455191 12531673 12223651 12689494 13438620 13877441
9335 13877441 14071173 14284033 14484217 14740499 15389233 16319785 17123598 17472367 17731413
9326 17731413 18771944 19111445 19528377 19363444 19502139 20290134 21208958 21904901 22506958
9317 22506958 23437298 24419245 25591147 26194518 27218044 27876058 29122930 30244094 31214733
9308 31214733 32850933 34505527 36057936 37969506 40241847 42955626 45923977 48977320
9300 48977320 52097635 56666300 62221645 67868318 73402085 79380524 85576018 90780840
9292 90780840 94639373 97448548 99149229 98986294 97001361 93160603 89585209 85232614
9284 85232614 80312640 76189012 72694246 70075023 68300070 67322982 66036823 65135524
9276 65135524 64547500 63757347 63526884 63505667 63374287 64321479 64261883 64526158 66509657 68250650
9266 68250650 70355053 72662474 75955118 80140516 85616914 91676762 99437955 107939154
9258 107939154 116474291 124307034 131274362 137113225 140578921 142539959 141593618 137963500
9250 137963500 131328930 123982176 115907648 107502209 99585360 91796715 85388045 80081641
9242 80081641 75134242 70476428 66464557 62979227 60014326 56837897 53476915 50537516
9234 50537516 47920959 44716197 41718786 40273108 38309851 36117079 34773428 33010266
9226 33010266 32497724 31726473 31328809 30727290 29922234 29255856 28491301 28715750 28688827 28847053
9216 28847053 28692954 28710283 29412424 30002809 30070652 30220791 30017972 30716577 30633965 30484739
9206 30484739 30380162 29616975 29237904 29398050 29748429 29391114 29758526 29709842 29162108 29210645
9196 29210645 30133391 30866647 31275884 31345697 31465059 31713857 32151371 33024595 33870354 34557704
9186 34557704 35430902 36282083 37810154 38374452 39171515 40496955 41699810 43349103 44382077
9177 44382077 46257795 48267835 50377717 52992613 55325759 57735592 59713873 63337057
9169 63337057 66809433 70557785 74497590 78617530 82949458 87652093 93949664 100038610
9161 100038610 104738525 108746498 111979238 114151248 116658367 119546199 122363777 124209264
9153 124209264 124298374 122556003 120776273 119901797 119782741 120993158 122484058 124122543 126763765
9144 126763765 129457832 132932942 136156475 139251438 141688527 143900134 145980896 147493853
9136 147493853 148134201 150014127 152755940 156542453 162338423 169219115 177126897 184479260
9128 184479260 190561642 194504772 196963388 199616177 202711632 205720833 207416753 207238969
9120 207238969 205334795 202502968 199579424 196527240 192101907 185715113 178913908 173312755
9112 173312755 169061105 164947830 161238002 157459606 154319022 151360530 148664704 147222792
9104 147222792 146291758 145742120 144883356 144593072 144672941 145351785 145878457 147008835 148333221
9095 148333221 149442542 151198589 154092503 156309332 157653293 158355319 157897951 157117965
9087 157117965 157609597 158923220 159205846 158686908 156484457 151855333 147223209 143988410
9079 143988410 141345037 139042560 135849379 131662126 127163074 124033253 121548425 119121803
9071 119121803 118226075 116816618 115553877 114256356 112887640 112049148 110987711 110021714
9063 110021714 108255955 106399018 104470261 102580346 100634518 98537342 96983176 94925586
9055 94925586 93445204 92021567 90253935 89184457 88809515 88770748 88525397 88161680 88085978
9046 88085978 88144891 87871904 88551197 89263202 89636909 89443683 89484511 90087121 90038048 90066807
9036 90066807 90350205 90979708 91916907 92618595 93034619 93030508 92846624 92362335 91972221 91679709
9026 91679709 91987018 92660743 92779367 92460411 91818296 91504135 92319936 92906886 93765516
9017 93765516 94826711 96030996 96743889 98236029 99844204 101996952 104600690 106923504
9009 106923504 109591752 112966384 117580468 122720439 129207947 135883819 142969505 150071158
9001 150071158 156011080 160897163 164538415 167523755 169160366 170424333 171071236 169067751
8993 169067751 165978557 164325146 163874607 164240070 165534784 167648098 170376718 174010733
8985 174010733 177188760 179387150 181523135 183600571 185107760 187158288 190270837 195636207
8977 195636207 201802346 209212099 216417359 223342964 230186685 236880376 244155585 252669363
8969 252669363 261774460 269748756 274422842 275791267 276215235 274526296 270285653 265288935
8961 265288935 259906256 252971767 245646114 238104597 232394355 227947093 224026935 220271041
8953 220271041 216898648 213519729 210478371 206919926 204171830 201650990 198952580 196768117
8945 196768117 195601523 194513566 194406811 195586343 197403087 199120934 202598408 207315593
8937 207315593 212288972 217324706 223048218 228237416 232107193 236010025 238711506 240796992
8929 240796992 243735337 247271346 251841566 258659204 267285634 271901831 273436909 268472498
8921 268472498 255046249 242925437 233774738 225784345 218490228 211449453 204294181 198803869
8913 198803869 194287717 190264866 188137227 186543571 185020048 184453361 183554882 181831973
8905 181831973 181161994 181141422 181028786 180652492 179167643 176689768 173567977 170927571 167380184
8896 167380184 164665341 161671960 157433229 152856637 147831738 143451321 139544882 136296795
8888 136296795 132896228 130124736 128368515 125761814 123128345 120558510 118230399 115677441
8880 115677441 113168279 110923765 109269772 107071436 105101104 102971052 100717695 98953224
8872 98953224 97334035 95913461 93981432 92098252 90558495 89731254 88753522 87341244
8864 87341244 86211985 85181593 83851073 82385616 80703892 79399875 78050502 76543173
8856 76543173 74810035 73316149 72366832 70707022 68972267 67644648 66525276 65367070
8848 65367070 64142268 62736242 62000993 60947218 59782957 59039213 57900344 56954915 55537465
8839 55537465 55262877 54904607 53823108 53049692 51703100 50086513 49632243 49148308 48535467
8830 48535467 47339220 46467398 46047901 45346414 44305034 43452485 42668861 41578181 41607735
8821 41607735 41298839 40826821 40215517 40292978 39786119 38946440 38335895 37826255 37809605 37756246
8811 37756246 37173970 36769895 36674898 36142765 35930866 35955954 35644612 34800841 33580296 32950807
8801 32950807 32812191 32115338 31202778 30614816 30057018 29568554 29222338 28730294 28474316
8792 28474316 28089631 27288354 27595974 27331347 27311066 27210897 26947200 26981467 26046625 25470825
8782 25470825 25755011 25393864 24872259 24842482 24476378 24278560 23683307 23323869 23421259 23701388
8772 23701388 23353940 23325160 23685624 23455002 23885231 23875254 23849099 23788860 23646509 23555987
8762 23555987 23319758 23684913 23747099 23198324 22695794 22174334 22181445 21770614 21792042 21707665
8752 21707665 21079256 21099510 20965646 20260844 19726472 19673964 19041104 19314491 18697877 18573541
8742 18573541 18239958 17972916 17556543 17049633 16821653 16470438 16583226 16616770 15972558 16207817
8732 16207817 16322368 16300602 16562384 16672844 16408206 16583009 16666339 16747311 16666594 16517731
8722 16517731 17210465 17197640 16775450 17391762 17564478 17540870 17836929 18084733 18554122 18514380
8712 18514380 18842652 19354140 19671736 19437010 19403981 19393069 19384975 19265279 20072413 19985096
8702 19985096 20015283 20561649 20877663 20952177 20947029 20369556 20597262 20725197 19862072 19752239
8692 19752239 19001352 18350508 18044368 17556274 17008637 16686872 16556991 16230680 16228338 15992888
8682 15992888 15955159 15986304 16003932 15568978 15685944 16438147 16865677 17060001 16888030 17195004
8672 17195004 17604272 18142735 18780394 19184964 19828936 20253774 20636388 21278829 21861698
8663 21861698 22839988 23379008 24006165 24266777 24594912 25023430 24457189 23934579 23708151
8654 23708151 23205020 22251655 21659649 20682104 20089954 19206729 18346514 17478595 16659343
8645 16659343 16435416 16178455 15758656 15122525 14999031 15371730 15367337 14549869 14142744 14517792
8635 14517792 14673067 14448145 14444883 14796610 15049021 15022943 14921539 14265300 13788284 14274331
8625 14274331 14384955 14362535 14366882 13363040 13469521 13237257 13403079 13026369 12127676 12459370
8615 12459370 12085131 11606826 11192952 10764671 10593854 10462468 10441142 10545640 10435735 10232796
8605 10232796 10169403 9558920 9467537 9526805 9683376 9173733 8915027 9072450 8950081 8840726
8595 8840726 9109844 8570199 7775597 7917829 8303478 8338343 8084616 8029413 8161883 8016284
8585 8016284 7328321 7482353 7683731 7464773 7392369 7546555 7103380 7187046 7142527 6962841
8575 6962841 7083083 7135312 7417514 8031468 7704500 7267167 7360003 7412484 7576015 7952298
8565 7952298 7825946 7660439 7739140 7978430 7825647 8054391 8048611 8237554 8010360 7904277
8555 7904277 8320311 8170023 8758487 9204711 9234862 9544654 9443807 9763235 10136556 10265652
8545 10265652 10269942 10086109 10761174 11230211 11982170 12425023 12786597 13788207 14376789 14747984
8535 14747984 15287231 16698895 18269713 19799088 21038547 21305954 21890425 22911415 24121923
8526 24121923 25763049 26765021 27110850 26665578 25710170 24983856 24331854 24369352 24175518
8517 24175518 23429681 22645109 21183976 19840857 19324573 19060976 18639922 17878324 17061714
8508 17061714 16660448 16658621 16377670 16081552 15989237 15954190 15830345 16179784 17317043 18460155
8498 18460155 19008744 20463425 21938928 22855381 23186144 24040645 24587650 25803325 26787398
8489 26787398 27339204 27679339 27518535 27239705 26714456 25582292 24456673 24391076 24015415
8480 24015415 23204396 21488627 20043834 18902986 17951926 17219890 15920860 15659404 14379895
8471 14379895 13631484 13423249 13055453 13113519 13331968 12632298 11796377 12112951 12263098 12176445
8461 12176445 12155512 11696598 12139832 12120705 11883420 12779883 12718360 12710340 12335758 12983294
8451 12983294 13506371 13640301 13890826 14324782 15171991 15379957 15503741 15839523 16153577
8442 16153577 16440901 17153026 17904175 18138869 18522090 18474507 19435523 19337750 20109474 20578052
8432 20578052 20137337 20767705 22109186 22811534 23301234 23706165 24023831 24607764 25139846
8423 25139846 25330338 25744080 26278131 26458073 26641493 27162712 27657830 27902389 28206686
8414 28206686 28911774 29759493 30224780 30788405 31870906 32875749 33253143 34099022 34899351
8405 34899351 35302784 35634190 35632477 35761296 36667628 37346355 37181354 37622052 38214066 38173518
8395 38173518 37404713 36895541 36667530 36105843 35494194 34252163 33104605 32639752 32306916
8386 32306916 31924084 31550004 30883299 29958666 28819888 28017890 26660000 25621520 25158840
8377 25158840 24481126 23294245 23126891 22381799 21680087 21338957 20825167 20348912 20174056
8368 20174056 19687337 19560545 18895324 18628584 19075164 18703304 18265555 17921250 18170586
8359 18170586 18475642 18015250 17929051 17965334 17832751 18157488 17482010 16853989 16710688 16619007
8349 16619007 17049781 17601870 17373548 17395291 17731726 17585682 17410514 17349189 17472016 17489057
8339 17489057 17639625 17666983 17509899 17359969 17572463 17294078 17009846 16852214 16600210 17124829
8329 17124829 18055157 17991078 17658006 17151418 16984163 17038265 16648411 16300199 15834337 15919148
8319 15919148 16095417 16237590 16504773 16494436 16240542 16721371 16725823 16894192 16926925 17339303
8309 17339303 17356330 18323369 18658821 18706306 18939063 19457433 19757219 19325042 19380475 19972592
8299 19972592 20168774 20664061 21208681 21399292 21295371 22120716 23552114 23721124 24514533
8290 24514533 25061155 25465738 26072119 26949509 27990346 29353718 30512575 31973224 33419366
8281 33419366 34640508 35692847 35753330 36030274 36163741 36109463 36017594 36221800 37051643 38327878
8271 38327878 39834641 40959455 42264021 43491621 43852079 44367948 45140784 44784259 44282843
8262 44282843 44387420 45489493 45989598 46708316 46860296 46349836 44720329 42964768 41179696
8253 41179696 39575722 38356275 37182291 36083257 35501421 34747287 33761772 33710269 32967090
8244 32967090 31847993 30976179 29380622 28399042 27862122 26543393 25362119 24842541 23744822
8235 23744822 22477201 21565336 20942610 20362693 19788490 19150520 18845821 18950408 18234560
8226 18234560 18347502 18169060 17776710 17540134 17257889 17378492 16947849 17208102 17310643
8217 17310643 17200792 18087661 18150062 18437149 18568813 18496715 17987493 18112599 18415552 18931808
8207 18931808 19910269 20139746 19940648 20497068 21234838 21386870 21921912 21673189 22051899
8198 22051899 21856300 21963123 21936639 22610513 23194846 25614543 27077187 22864215 22271591
8189 22271591 22661747 23168253 23131654 22989476 23156194 23234901 23012057 23136494 23033734 22701132
8179 22701132 22470274 22117281 21910426 21588379 21123337 20629852 20732482 19805227 19428671
8170 19428671 19676016 19034850 18829559 18775518 18836749 18589568 18346129 18091570 17989029 17697933
8160 17697933 17442997 17681610 17343667 17246944 16807706 17259848 16799535 16941549 17007283 17079755
8150 17079755 17193751 17533566 17497201 17826188 17713511 17545321 17965970 17826478 17319111 17386254
8140 17386254 17429499 17173344 16982446 16344825 16771017 16977979 16558937 16612418 16928813 17097200
8130 17097200 16150088 15926603 15834719 15475787 15080672 14915981 14744720 14599675 14661784 14496398
8120 14496398 14593290 14396414 14434198 14073959 14137640 13713230 13619882 13461040 13225942 13450052
8110 13450052 13576418 13835787 14307184 14214725 14224847 14503597 14606704 15467904 15897216 16470773
8100 16470773 16799027 17196451 17931992 17832513 18442082 18914594 19301970 20009517 21070561
8091 21070561 22255651 24076882 25229098 26244262 27075399 26802977 25338716 24033911
8083 24033911 23155327 21843855 21220479 20790668 20029211 19253905 17945153 18241087 18394642
8074 18394642 18383244 18479142 18536472 19274223 19747516 20134194 20364051 21218922 22910851 24382288
8064 24382288 25438247 26590904 28620683 31575116 34340225 37066325 38549480 38314024
8056 38314024 36872985 34261427 31163261 29346179 27477904 25806428 24385000 22871788
8048 22871788 21412031 20609737 19661247 19212269 18942587 18900889 18517467 18460153 18799086 19004766
8038 19004766 18907064 19773235 20115033 21030342 22155197 23152619 25155806 26972857 28264598
8029 28264598 29873848 30779516 31199072 31416805 30542506 30379553 30141749 29174493 27895082
8020 27895082 26291705 24155880 22827080 21671352 20282711 19551971 18411089 17596823
8012 17596823 17442613 17154715 16652127 16269440 16514506 16616368 16660656 16379316 17155045 18113344
8002 18113344 18715486 19040242 20332121 21683261 22890080 24824291 27627278 30143568
7994 30143568 31534770 32454533 31873247 29628125 27528161 24985556 22769421 20940118
7986 20940118 18903701 17671771 15800924 14352477 13572200 12883980 12235481 12528243 11981034
7977 11981034 11522158 11491480 10969440 11361694 11175301 11920707 12102886 12245921 12749852 13976909
7967 13976909 15050998 16106411 16976784 17347373 17101942 16247578 14851475 13521529 12625025
7958 12625025 11393486 10673460 9430163 8562124 7470893 6816212 6182259 5886606 5588412
7949 5588412 5330755 5359727 5074942 4708153 4510486 4429321 3853980 3718484 3700975 3776627
7939 3776627 3768874 4060010 3347151 3395791 3233619 3362049 3650339 3767229 3061571 3016075
7929 3016075 2748930 2622084 2614452 2957215 3313181 2557441 2390733 2486943 2842576 2431000
7919 2431000 2385046 2550281 2457603 2023382 2457913 2123377 2242246 2130261 2320927 2451244
7909 2451244 2268374 1882597 2028425 1888615 2373340 2292546 2056557 2576966 3303723 2595014
7899 2595014 2523946 2727299 2801725 2557511 2322680 2547435 2025494 2151563 2352948 2140959
7889 2140959 2002313 2080856 1996351 2393982 2627577 2420013 2055579 2460640 2425997 2677644
7879 2677644 2943032 3398114 3756981 3318670 3599385 4015973 4237105 4491523 4846346 5292976
7869 5292976 5502758 6368722 6366139 6700207 7924080 8514471 8796797 9174906 9568015 8826496
7859 8826496 8058260 7347521 6987445 6717621 6989383 6704529 6742343 6662326 6421632 6529490
7849 6529490 6348661 5978992 6450729 6899955 6802458 7290920 7462328 8589252 9162251 9941528
7839 9941528 10962413 11690890 11940400 13350966 15438752 16881756 17931777 18952083 18959530
7830 18959530 18209806 16932460 16064806 15734765 15523182 14887014 13629859 12454504 11702890
7821 11702890 10755605 10645471 10155327 9515820 9078003 9022659 9007391 8335247 8097842 8056925
7811 8056925 8585880 9098429 9863660 10631974 10835868 12012309 13087254 13618585 13971914
7802 13971914 14632594 14542719 13850885 14662051 15927657 16832468 16920055 16405439 15122066
7793 15122066 13733488 12070386 10983399 9945532 8901423 8773273 7992938 6655633
7785 6655633 6133521 6085271 5525633 5062069 5053918 4839133 4537276 4116157 3959449 3481941
7775 3481941 3763396 4153258 4419132 4703307 5053643 5589604 6141547 6578354 7007968 6751961
7765 6751961 6166395 5710909 5268459 4527747 4100134 3687655 3408294 2709112 1819379 1764293
7755 1764293 1316446 1518114 1379874 1108266 784383 632089 578040 245533 707800 352224
7745 352224 528209 876654 829376 300225 -112399 -98448 508726 540374 582449 352157
7735 352157 389979 611464 -237216 -565521 -26223 228933 -239366 -247301 -158402 412870
7725 412870 164546 -112312 -309938 -333207 -391989 -309789 -357166 -126134 -793418 -729999 -848191
7714 -848191 -805132 -401805 -290789 -524517 -985687 -739014 -572363 -439308 -541571 -494445
7704 -494445 -814078 -837299 -675317 -813843 -851904 -715837 -898252 -764628 -1238687 -1456830
7694 -1456830 -1298654 -1238776 -1170853 -1174469 -685076 -796849 -1327839 -1258291 -1403091 -947350
7684 -947350 -420082 -585909 -178890 -123769 -746047 -764271 -775979 -897531 -951497 -484950
7674 -484950 -604052 -769381 -295246 -752263 -591814 -664223 -647740 -806203 -744131 -580079
7664 -580079 -1059315 -1199056 -993245 -823189 -567060 -752307 -241411 -613734 -985413 -744168
7654 -744168 -835846 -566143 -448953 -1056056 -719746 -135120 8930 183704 -290886 -474112
7644 -474112 -869910 -661356 -527695 50826 57454 -360741 -447561 -322154 106211 6805
7634 6805 -190614 109224 -366546 -92278 -78629 -81635 375859 904697 1098487 839688 763181
7623 763181 627226 476762 60003 -31252 263953 424539 -162992 64960 -201620 -586015
7613 -586015 -368495 -429567 -735063 -1016460 -580968 -699882 -823209 -491255 -172810 -885541
7603 -885541 -702548 -373245 -716513 -1329980 -1333022 -1058748 -735564 -687117 -1137719 -1402658
7593 -1402658 -2095683 -1316713 -894268 -1124341 -1044097 -1024163 -919738 -1075448 -1155941 -1459354
7583 -1459354 -1253379 -1391057 -1714866 -1287220 -1543570 -1676437 -1499062 -1624317 -1653931 -1194566
7573 -1194566 -980523 -1069506 -1303051 -1832281 -1873752 -1684982 -1990317 -1290437 -1200885 -1011239
7563 -1011239 -1164753 -1535373 -1671583 -1257408 -675597 -1045194 -1180318 -1276888 -1423024 -1137902
7553 -1137902 -380214 -646968 -854602 -1235125 -1431341 -1494160 -1376943 -1412745 -1389750 -883589
7543 -883589 -878386 -844580 -830644 -618036 -749591 -973061 -1477246 -1580982 -1271283 -1072581
7533 -1072581 -1218960 -1222640 -822031 -789237 -950746 -1046145 -1016270 -739686 -660619 -736112 -1102198
7522 -1102198 -1386205 -1391952 -1223209 -1055075 -1250628 -1483859 -1703524 -1484556 -1015537 -876596
7512 -876596 -1190227 -1305342 -1222589 -971490 -726715 -537716 -818273 -737776 -1162645 -1534982
7502 -1534982 -1321650 -1190652 -965344 -967382 -772115 -1332352 -1497230 -1603005 -1505407 -1396918
7492 -1396918 -1166922 -758379 -1298601 -1462600 -1679401 -1419865 -1071408 -1140429 -1133858 -1246865
7482 -1246865 -1169065 -1098986 -1092108 -1405939 -1391261 -1526140 -1360623 -1244489 -1255397 -1028072 -1101067
7471 -1101067 -1308057 -1398863 -1536906 -1098659 -1059368 -1447729 -1272990 -1008216 -1479997 -1384669
7461 -1384669 -1245725 -1403548 -1123170 -1560458 -1577811 -1795554 -2008181 -2079856 -2046859 -1645684
7451 -1645684 -1291474 -1464773 -1016809 -1190151 -1214537 -1145071 -1313994 -1324923 -1076639 -703430
7441 -703430 -776539 -992832 -1359569 -1541469 -1240232 -1371042 -1158591 -925944 -1347033 -1255336
7431 -1255336 -1642043 -1595149 -1476491 -1832057 -1778851 -1374721 -1432482 -1728959 -1787047 -1830371
7421 -1830371 -1778388 -1637124 -1683012 -1326348 -1413472 -1433705 -1191777 -880214 -820568 -1042219
7411 -1042219 -1084744 -1655277 -1549123 -1113590 -1180407 -1740079 -1474759 -1140130 -812153 -971765
7401 -971765 -1663340 -1482088 -675258 -1145969 -1645435 -1704848 -2093437 -1955274 -1330753 -1177827
7391 -1177827 -1406215 -1282096 -1298360 -1648287 -1445382 -1183257 -1372162 -1589307 -1554152 -1486517
7381 -1486517 -1349309 -1441509 -1440422 -1433983 -1445490 -1091205 -1384321 -1337952 -1522333 -1269575 -1547151
7370 -1547151 -1533130 -892692 -1278496 -1926222 -1824906 -1957222 -1644572 -1518603 -1551877 -995344
7360 -995344 -1629640 -1237892 -1645553 -1940257 -1917586 -1809724 -1792577 -2169337 -1805581 -1711331
7350 -1711331 -1291823 -1549962 -1691766 -1729152 -1858194 -1441178 -1148344 -1568747 -1379352 -1620118
7340 -1620118 -1757206 -1355458 -1091859 -1455859 -1758921 -1657536 -1956841 -1659058 -1843727 -1988413
7330 -1988413 -1452120 -1589556 -1713452 -1306320 -980052 -1768246 -1616231 -1676459 -1957406 -1734041
7320 -1734041 -1843800 -1516656 -1444806 -1558215 -1160234 -1145897 -1013805 -921748 -758991 -993910
7310 -993910 -1103945 -1528234 -1054839 -1158594 -1184854 -762852 -1162472 -1062335 -1238161 -1173518
7300 -1173518 -1093942 -1246524 -2214723 -1744538 -1727254 -1656043 -1771985 -1564009 -1474261 -1532237
7290 -1532237 -1250293 -1032342 -1205688 -1306607 -1429331 -1130357 -831021 -1533403 -1664524 -1361048
7280 -1361048 -1521258 -1497815 -1255612 -1413291 -1855410 -2064534 -1666134 -1592686 -1700455 -1871770
7270 -1871770 -1635770 -1368336 -1011506 -1133911 -1528471 -1664030 -1379453 -1144217 -1352106 -1453730
7260 -1453730 -1398835 -1511025 -1261124 -1166512 -1224453 -906482 -569757 -1058286 -1066702 -1057259 -704842
7249 -704842 -761457 -870485 -1056512 -1296620 -1302708 -2046063 -1374762 -1112212 -1570237 -1695099
7239 -1695099 -1021945 -996595 -1034277 -575094 -127819 -711191 -1035549 -342636 -305241 -1138566
7229 -1138566 -1002817 -1186287 -1040147 -881350 -1292814 -1366679 -1498653 -933507 -799964 -1240185
7219 -1240185 -1207958 -1594678 -1551310 -1072211 -1109974 -1373719 -1601871 -1561681 -1900180 -1648785
7209 -1648785 -1223205 -1028911 -841170 -548487 -452685 -765703 -740187 -294193 -122733 -429830
7199 -429830 -192776 47563 -196504 489939 573183 362856 -38621 -101303 -50173 167430
7189 167430 2048 314245 279388 192778 310344 822862 1290465 1496589 1761584 1198737
7179 1198737 1181549 1387584 1863502 1585282 1949337 1983615 2295653 2757278 2733171 2452518
7169 2452518 2834181 2502715 2998775 3263315 3713207 4531049 4740075 5032731 5553073 5802271
7159 5802271 6100818 6563154 6844644 7706647 8673735 9864375 10909000 12292393 12965773
7150 12965773 13401237 15079411 17322346 19924419 23636529 27578113 32095440 35049539
7142 35049539 36293845 34715684 29954243 24887646 21948258 19589014 17303258 15246705
7134 15246705 12796884 11004091 10115732 8870329 7522745 6634931 5489426 5249063 4711518
7125 4711518 3949942 3726127 3423888 3119192 2455407 2166020 1697818 1468174 1016115 952972
7115 952972 714264 350452 349687 301335 -281398 217051 400770 431934 305862 -151748 695691
7104 695691 633367 169867 -201604 -78823 20332 -31428 -32706 -507569 -1041067 -915445 -680639
7093 -680639 -866700 -1211872 -1218075 -1096696 -892471 -1072228 -896493 -333069 -614063 -486455
7083 -486455 -661861 -736067 -950788 -790773 -933177 -928776 -1509462 -1751617 -1972714 -1913850
7073 -1913850 -1525834 -1429195 -1298311 -1472063 -1343131 -945793 -1086322 -1452028 -1050378 -1150024
7063 -1150024 -1018096 -1112219 -1219035 -1293806 -1101206 -959639 -885827 -1065936 -1625285 -2246755
7053 -2246755 -1410397 -1249776 -1231973 -1102749 -1300733 -1481006 -1165191 -1680586 -1505406 -1523266
7043 -1523266 -1452745 -895103 -901935 -1336450 -1488960 -1307202 -1377272 -1290171 -1118334 -1128496 -932680
7032 -932680 -671836 -797169 -1108364 -1426908 -1020500 -736615 -882340 -1263195 -757799 -667137
7022 -667137 -1095352 -1275329 -1540062 -1358510 -940304 -593951 -664188 -519827 -164111 -264676
7012 -264676 -697264 -735366 -792333 -1009357 -915249 -859041 -829323 -1406883 -1480167 -1354562 -1618170
7001 -1618170 -1734470 -1465262 -1383399 -1602077 -1855575 -1485849 -1235174 -1256957 -1775878 -1505407
6991 -1505407 -1095632 -1419021 -1584049 -1358254 -1019140 -1769474 -1783761 -1511365 -810841 -1094107
6981 -1094107 -1367668 -1795162 -1730283 -1188737 -661425 -1182999 -1508770 -1162344 -1341710 -808850
6971 -808850 -832293 -1115584 -1556718 -1437969 -1503317 -1458044 -1266030 -776891 -1463131 -1892782
6961 -1892782 -1391843 -1188033 -1503003 -1280865 -1202097 -1433829 -1777538 -1255049 -1047626 -1677953
6951 -1677953 -1601785 -1235064 -854842 -611112 -1000514 -1598651 -1246015 -1466819 -1102054 -849479
6941 -849479 -1042907 -1536946 -1473957 -1395288 -1335261 -1382506 -1220570 -1837497 -1761298 -1181761 -2127510
6930 -2127510 -2208675 -1800608 -1432081 -1333177 -1460809 -1653338 -1094522 -832219 -1058701 -1129344
6920 -1129344 -1539072 -1638867 -1426023 -1404035 -1291795 -788381 -659922 -1141212 -1258840 -1425832
6910 -1425832 -1640973 -1709997 -1335927 -961198 -1098239 -1292185 -1147086 -1124629 -1257448 -1547526
6900 -1547526 -805905 -1003006 -1325704 -1090376 -1066458 -1002830 -469965 -796303 -1357335 -1198401
6890 -1198401 -965223 -1003403 -894639 -954993 -882179 -1189934 -996945 -905106 -970528 -1071650
6880 -1071650 -913047 -1313078 -1063486 -1145093 -1321835 -351044 -280727 -349650 -650865 -680937
6870 -680937 -574673 -531257 -928737 -1128543 -1086712 -712954 -737900 -674529 -703415 -888105 -870427
6859 -870427 -910376 -1272809 -875197 -1128480 -1199343 -885634 -384872 -846344 -1185365 -928003
6849 -928003 -1327497 -1431480 -1521917 -1556576 -1772215 -1944640 -1393130 -1141103 -896161 -608975
6839 -608975 -572573 -661343 -673863 -800769 -340927 -200148 -583853 -596424 -112909 -204857 -984186
6828 -984186 -852160 -1117447 -1416477 -1584137 -1569296 -1007849 -959125 -935151 -1109059 -486744
6818 -486744 -1003304 -747216 -851838 -1371304 -1265908 -1044739 -1195917 -820729 -753624 -1176652
6808 -1176652 -654068 -647002 -1110317 -1158926 -1541823 -1553394 -1045318 -809439 -681501 -481706
6798 -481706 -863540 -597726 -722327 -892661 -1190544 -1740341 -1386673 -1594670 -1822389 -1838736
6788 -1838736 -1285273 -1154026 -830821 -1284034 -1509891 -1811542 -1308915 -617379 -887054 -831719
6778 -831719 -574882 -516294 -759276 -1077531 -748896 -966451 -733000 -1058138 -1232346 -1076832
6768 -1076832 -893708 -833799 -595850 -481399 -508889 -645835 -112111 -486320 -897217 -1042964
6758 -1042964 -976466 -822643 -1083582 -710899 -543612 -686216 -1072667 -775434 -101617 35981
6748 35981 -289759 -418764 -308168 104804 394091 168404 451971 66448 329373 190700
6738 190700 10778 97196 311106 586533 -63091 81670 581816 869851 574158 -43162
6728 -43162 -58974 131442 338789 -124682 -708943 -794052 -751457 -407779 -537952 -400832
6718 -400832 -566414 -204902 -169100 -251594 -328984 -202772 -89346 -393294 -45478 242485
6708 242485 140124 403437 439713 -228706 -212455 -91282 -417896 545205 94942 287020
6698 287020 315942 -143803 -3657 -151006 -255027 -256308 -411564 15179 -241147 -275941
6688 -275941 114133 313222 151001 -327562 -257066 -243483 -9377 142728 89383 300129
6678 300129 302028 469881 413926 199345 469415 201952 278847 373531 572019 862757 1008351
6667 1008351 425950 467669 697913 1018641 576374 434974 348860 -132061 -246306 209658
6657 209658 846053 968972 874889 732338 759927 580327 254500 184257 84010 169503
6647 169503 553528 719006 853310 729474 970242 280303 294817 495052 521701 719726
6637 719726 615201 1076603 615917 997103 1528688 963554 803624 994207 1198099 933858
6627 933858 1059023 1310620 1781031 1864218 1229344 1553474 1575299 1365298 1442494 1224769
6617 1224769 1586990 1786859 1692501 2043756 1824050 2072615 1994431 1755647 1436446 1309193
6607 1309193 900974 1669802 1895595 1422237 1993436 2492688 2119379 1491984 1957276 1996844
6597 1996844 2179683 2569978 2766999 2775144 2918430 2649263 2152248 2121440 2927798 2915546
6587 2915546 2588887 3143208 3155304 3449795 3401961 3318321 3392124 3799589 3991157 4658355
6577 4658355 4335164 3619727 4332229 4804026 4930677 4647686 4310071 4426995 4703548 4590757
6567 4590757 4687889 4628394 4343715 4267576 3748943 4282135 4554684 4337510 4350293 4118646
6557 4118646 4284152 4253871 4142752 3815957 4307394 4485138 4573846 4534622 4607457 4022123
6547 4022123 4366707 4928675 5131790 4930497 4560428 4365873 4763613 4893694 5055039 4943846
6537 4943846 4456063 4554530 4619538 4895869 5095680 4989210 4842096 5048933 5661926 5594751
6527 5594751 5644570 5668976 6272351 6436831 6493175 6663253 6573280 6761339 7018447 7566845
6517 7566845 7586248 8209387 8390357 8013573 8262679 8518258 8500794 8300640 8432690 8778442
6507 8778442 9040450 9059590 8964508 8481484 8509881 8467147 8384419 8304665 8577032 8575590 7930302
6496 7930302 7632371 7561812 7618926 7638741 7433050 7273800 7967076 7863594 8007886 7326427
6486 7326427 7212328 7156878 6856445 7295215 7594171 7408600 7901919 7008222 7239664 8120151
6476 8120151 8014677 7820870 8203325 7748980 7381874 7521203 8312663 8788848 8598377 8894287
6466 8894287 9150674 9159659 9198428 9252409 9635620 9367425 8777742 9342317 9546995 9268780
6456 9268780 8851733 9129317 8848043 9056597 9384717 9134521 9030258 9560589 10124669 10311201
6446 10311201 10299338 10117109 10343342 10688421 11054721 11369111 10954903 11208463 11462968 11404212
6436 11404212 11534733 12070391 12796241 13858812 14407839 14382354 14510461 14446713 14940879 15404777
6426 15404777 15491183 15590137 15664288 15919159 16328204 16706707 17407919 18126404 18755253 19251888
6416 19251888 19795279 20449204 21370650 21850730 22688653 23513138 24286838 25334084 25890351
6407 25890351 27048072 27929831 29041541 29982771 30653686 32614880 34259801 35160245 36242641
6398 36242641 37776128 39538113 40310063 40387040 41017428 42353675 44055984 44731722 46091241
6389 46091241 47599204 49663873 51931933 54906013 58124803 61009691 64848842 68443957
6381 68443957 73160256 78075370 83422844 90213074 98198852 105531838 112123963 117996147
6373 117996147 122119505 124339040 126339759 127522066 128065682 128130855 126133152 121388575
6365 121388575 115280143 110238347 105451490 101232434 98269520 95306273 92711562 90624574
6357 90624574 89705256 89550365 89303807 89912518 90817497 91613560 93165743 95774164 99582020
6348 99582020 103980194 109284839 114406006 118768714 121887896 123040530 122878440 122312871
6340 122312871 120874983 118875591 115073577 109312119 102057074 95297202 89452585 84723756
6332 84723756 80577628 76562242 72156366 68280592 64405448 60749422 57618233 54432178
6324 54432178 52047541 49808025 47920051 45931552 44488491 43084815 41065397 40415559
6316 40415559 39427646 38250448 37606580 37069431 36628835 35820562 35133477 34598875 33946532
6307 33946532 33550686 33775372 33692463 33412880 32909735 32891176 32595668 32405826 32299603 32414884
6297 32414884 31435172 30429493 31133470 30964522 30572160 30787088 30509883 30858817 30402460
6288 30402460 30296200 30567492 30665787 30212248 29418410 29034325 29169792 28986711 29294351 29610290
6278 29610290 29671457 29309414 29675357 29822656 29617254 29991973 29577406 29660783 29925259 29358152
6268 29358152 29850097 29767722 29479476 29777026 29685313 29562004 29282869 29000543 28504212 28247495
6258 28247495 28371789 27928732 28098862 28207484 27900448 27950724 27754620 27711297 28015819 28058815
6248 28058815 28294814 28433356 28870236 28707569 28513642 29055330 28738690 29058756 29794582
6239 29794582 29360708 28912187 29131473 28781866 28490340 28336917 29198525 30289041 30372628
6230 30372628 29987591 29623954 29696223 29659192 29831094 30353140 30290000 30528591 30923371 30606708
6220 30606708 30635063 30653062 30414015 30483016 29987853 29575425 29428309 29564485 29265728 28278365
6210 28278365 27450436 27338192 27064005 26632200 26104072 25657716 25927494 25663292 25206170
6201 25206170 24971902 24917552 24334537 23771265 24083022 24174834 24337831 24672112 24655263 24607189
6191 24607189 24743887 25098127 25250301 24936565 25175361 25060389 25203292 25299953 24620298 24664334
6181 24664334 24657257 24445770 24360344 24155020 24220088 23822066 23974157 24008713 23926355 24420309
6171 24420309 24344975 24514752 24951700 25445533 26223373 25790072 26005330 26795584 27962760
6162 27962760 28891163 29671188 30855303 31877025 32602616 33888818 35806648 37783965 39948271
6153 39948271 43323835 46613336 49495850 51567879 53465400 54220638 53828293 54222660 54858447
6144 54858447 55367947 54448959 53454776 51533395 49007937 46197415 43439088 41301896 39334941
6135 39334941 37450305 36437412 35646652 34806700 34213586 34277971 34425602 34482102 35199280
6126 35199280 35794868 37384485 38695635 40662319 43378517 46240485 48069050 48783412
6118 48783412 49598090 49404046 49496849 48836314 48541349 48149566 46605992 44233558 40648441
6109 40648441 37123855 34409207 32577793 29861017 28478568 27234786 25692749 23769862
6101 23769862 22048515 21202881 20322388 19548009 19261182 18784642 17575549 17685151 16742502
6092 16742502 16248414 15971979 15715790 15561028 15141498 14910512 14829643 14551280 14552130 14291064
6082 14291064 13631801 13630343 14085694 14189164 13952716 13286493 13582988 13766666 13688012 13276204
6072 13276204 13241814 13316958 13626856 14055050 14262169 14072709 14135747 14394599 14275406 14045920
6062 14045920 14150110 13938415 13914077 14319332 14638454 14849923 14268893 14358063 14262553 14598268
6052 14598268 14713994 14644167 14324676 14682950 15276998 14772701 14254470 14314825 15007903 14877064
6042 14877064 15037070 14783315 14801370 15255220 15101115 14741519 14787077 15044520 15010165 16088600
6032 16088600 16250132 15355053 15321275 15731164 15618041 16143637 16604809 16399820 16415001 16272641
6022 16272641 15813188 15513178 16172443 16050166 15619894 15839065 15420161 15943784 16332728
6013 16332728 16136862 15732066 15881518 16291395 15784009 15786988 16001211 16114732 15983883 15762265
6003 15762265 16194961 16390571 16555772 16553517 16737624 17361706 17537026 17199922 17560202 17632653
5993 17632653 17004890 17004798 17254198 17111283 16961407 16465710 16258895 16131865 15990551 15775413
5983 15775413 15676103 15431255 15487530 15441982 15914924 15730838 15238033 15237101 15465190 15944094
5973 15944094 15951142 15955035 16430018 16761692 16708126 17040554 17125997 16910232 17489725 18064191
5963 18064191 17561230 18072283 18132323 18444819 18211269 17404474 17632793 17621908 17515677 17995586
5953 17995586 17978391 17662998 17395740 17984336 18827410 18685215 18391828 18533326 18824885 19091563
5943 19091563 19128673 19385903 19217962 18904252 19368837 19832250 20066610 19729753 20061436 19924674
5933 19924674 19669076 20022022 19910300 19604182 19502217 19265828 19785764 19959144 19963616 19993661
5923 19993661 19727634 20137935 19816990 19448156 19377822 19806194 20174855 19977446 19872482 19747812
5913 19747812 20083062 20811666 21183040 21506622 21488577 21806091 22889830 23836052 25082328
5904 25082328 26408620 26523459 26486355 25409268 24369781 23199279 22342515 21893397 21548977
5895 21548977 21236045 21060350 20611884 20211766 19934267 19338932 18977703 19083999 19103505 18646757
5885 18646757 18639468 18351889 18321931 18632039 18332950 18085662 18450177 18455003 18357650 19014124
5875 19014124 19004485 18674589 18688240 18520665 18385932 18201374 18260676 17749459 17617630 18108461
5865 18108461 18197150 17943430 17488183 17495713 17772173 17691891 17280023 17034238 17768427 17725745
5855 17725745 17389335 17219427 16811628 16642080 16705100 16390788 15846669 15131693 15190106 15123949
5845 15123949 15428065 14977371 14550023 14331385 14724362 14341645 14129000 14589480 15133488
5836 15133488 16029298 16184853 15275444 15617359 15990102 16056558 16349960 16635409 16753032 16856406
5826 16856406 16846712 16818828 17219075 17693275 17810574 17301640 17519174 17311638 17185174 16814686
5816 16814686 16661835 16567521 16887387 16993484 16863491 15938969 15535670 15591632 15423292 15259840
5806 15259840 15032718 14370653 13666832 13013635 13372193 13185358 13051782 12788147 12650945
5797 12650945 12859291 13392168 13276775 13224213 12964814 12828545 12992197 12933987 12924373 12826517
5787 12826517 12565075 12405730 12725043 12897401 12798587 13409292 13525715 13208333 13217992 13518136
5777 13518136 13772127 13751635 14082169 13728624 14171080 14540636 14322759 14308275 14595557 14326329
5767 14326329 13815142 13385646 13209167 13537980 13030265 12903621 12583146 12355556 12187960
5758 12187960 12292215 12507944 12438150 12368718 11695961 11613229 11459623 11185517 10548911 10074796
5748 10074796 9467318 9723661 9672873 9808719 9513113 9365206 9183126 8929987 8814114 8489754
5738 8489754 8514677 8320499 8527089 8579279 8165093 7743433 7423210 7645164 8132401 8189709
5728 8189709 8237042 8762621 8992230 8324171 8191855 8219698 7842905 7981270 8360759 8148641
5718 8148641 8239682 7795573 7797021 8352494 8164549 8312026 8088603 7993369 8470147 8600155
5708 8600155 8427700 8616885 8302252 7845663 7883137 7158442 7548313 7530757 7268896 7865560
5698 7865560 7815311 7924392 7384844 7383032 7314405 7615114 7450730 6908547 6907799 7118448 7374227
5687 7374227 7169242 6776512 6421425 6471160 6391148 6388687 6304497 6289190 6263206 6019943 5672636
5676 5672636 6041928 6120799 6327216 6416748 5719417 5776241 6076605 5708399 5626846 5890587
5666 5890587 6336298 6028717 5345555 5987147 6082898 6370965 6315806 6015255 6361159 6128226
5656 6128226 5903613 6405673 6304411 6228869 5874924 5486039 5877220 5750599 5377805 5546544
5646 5546544 5911036 5815676 5522154 5523717 5613076 5646361 6273828 6338343 5910085 6217861 5687272
5635 5687272 5359817 5688881 5831907 6217218 5591175 5418106 5560465 5543462 5714606 5551628
5625 5551628 5695012 5870822 6316592 5796337 5383670 5503377 5601909 5597106 5601354 5665674 5184280
5614 5184280 5257319 5438044 5315013 5513003 5657466 5238411 5059108 4998332 5360153 5153713
5604 5153713 5351320 5902761 5325196 4747034 4796987 5092205 5015160 5206451 5630645 5447980
5594 5447980 5879087 5912003 6019764 6233724 5561626 5361392 6287956 6415688 6585755 6067112
5584 6067112 6268093 6602359 6860184 6667424 6797605 7373151 7179730 6453256 6454811 6786194
5574 6786194 6836950 7292866 7380160 7704422 7677791 7611813 7631575 7801634 7736534 7690623 8348645
5563 8348645 8500695 8939070 9134202 9011676 9289358 9330480 10010955 10422359 10579467 10297004
5553 10297004 11193957 11673003 12083153 12655611 13043657 13099421 13627350 13591406 13977931 13401504
5543 13401504 13416431 13133290 12550105 12499777 12518769 12338779 12249720 12489763 12481754 12584232
5533 12584232 12655277 13314955 13607944 13723132 13947820 15098124 15846978 16038470 16582210
5524 16582210 17438449 18217636 18714575 19710526 21377863 22724830 24627042 26742966 28120823
5515 28120823 28817401 29145663 29268920 28811758 27722323 26812283 25528427 24736256 23967210
5506 23967210 23733057 23333272 23490781 22971781 23063320 23798716 23842415 23120509 22967739 23340803
5496 23340803 23884157 23345939 23244350 23953361 24324973 24469083 25439024 26857890 27871312
5487 27871312 29508507 31161415 32664199 34393928 35210013 34593589 33619743 32007769 30580453
5478 30580453 28886670 27707477 26268344 25106294 24400670 23942930 22774251 22246439 22128453
5469 22128453 21921272 22034251 22199532 22159228 22620770 22940315 23374477 23728336 24405423 24923962
5459 24923962 26725497 27592989 27861618 28399549 28299008 28222754 28142081 28335472 28325912 27854694
5449 27854694 27125702 26447056 25593426 25222373 24818466 24996906 25036381 25355469 25482039 24846908
5439 24846908 24362197 23340209 22226756 21307711 20555105 20391243 19670323 19171201 18163434
5430 18163434 17454829 17493629 16807702 16428657 16038595 15315194 15339349 15199759 15175203 14836493
5420 14836493 14650683 14508024 14061066 13718332 13938504 14551069 14017658 13512541 13753454
5411 13753454 14337516 14820173 14639644 14486354 13881138 13526334 13943372 13675162 14526677
5402 14526677 14710721 14231286 13905402 13355473 13953239 14728013 14821112 15082283 14654040 14532366
5392 14532366 14643887 14362202 14450464 14548354 14943760 15181884 15390156 15586908 15890765 15948107
5382 15948107 15717174 15904718 16222120 16670158 16683427 16685014 17223136 17320394 18140066 18609681
5372 18609681 18943298 20115407 20698408 21539621 21697288 21831211 21636942 20541588 19712583
5363 19712583 19406290 19129642 18645500 18585304 18281476 17762079 17806063 18228319 17774391 18270414
5353 18270414 18833155 19159385 19840278 20684795 21116787 21984155 22407555 22012739 22016570 21297229
5343 21297229 20239218 19510207 18775262 18272677 17710871 17508932 17548387 17862611 17829603 17362049
5333 17362049 17274027 18001052 17997296 17612913 18162065 18411705 18796965 18946239 18772729 18747481
5323 18747481 18340862 17920306 18004044 18291261 17849047 17196974 17138715 17194083 17163592 16704968
5313 16704968 17179839 16612804 16138587 16883498 16633616 16322959 16275241 16746155 16905112 17271046
5303 17271046 17409307 17357067 17725769 17095709 16015339 15639635 15303698 14791550 14538954
5294 14538954 14540719 14496190 14481109 14461722 13808540 13441706 12991293 12848767 12985545 12694837
5284 12694837 12405899 12647477 12392103 12147205 12024264 11652162 11308060 11193838 11354717
5275 11354717 11091399 10722412 11008775 10847362 10776921 10703451 10421742 10198844 10025345 9958046
5265 9958046 9651258 9724840 9699902 9660881 9620744 9898276 9994781 10080642 9937486 9792591 8998645
5254 8998645 8758780 9567431 9776755 9445742 9300042 9178236 8809730 9457720 9273227 8973496
5244 8973496 9734343 9625785 9313436 9586965 9707087 9588301 9324790 9168535 8513086 8403600
5234 8403600 8820249 8619318 8581461 8195963 8348603 8433110 8285125 8579746 8609642 8745072
5224 8745072 8614879 8046340 8009334 8334699 8639355 8805360 8932607 9042635 8976786 8645375
5214 8645375 8513444 8802991 8449094 8646359 9143027 9457762 9311982 8809690 8598067 8716499
5204 8716499 9088217 9279988 9308493 8826935 8738892 9021839 8994224 9081071 9401801 9418100
5194 9418100 9257324 9593381 9298380 9434980 9404983 9195284 9256062 9076630 8978789 9026364
5184 9026364 8953416 9128805 9169036 9497709 9160085 9394744 9237164 9146404 9216485 9516099
5174 9516099 9885706 10045249 9547531 9212761 9481782 9268842 9435515 9647205 9986605 9374935
5164 9374935 9364326 9893822 9982342 9656527 10044349 10656094 11352612 10872698 10470193 11078612
5154 11078612 11238721 10790881 11026218 11086998 10381678 10435196 10292100 10154951 10438343 10030990
5144 10030990 10267841 9994540 9955820 10027811 10466994 10192385 10297966 10614578 10574257 10820211
5134 10820211 10591197 10706739 10981767 11130564 11176768 11502911 11344968 11871260 12224586 12222589
5124 12222589 11868339 11342648 11670990 11600292 12101873 12197119 12232625 12210702 11875917 11948377
5114 11948377 11924583 11943157 12292229 12534559 12975011 12975634 12296751 12511805 12425359 12268086
5104 12268086 12503990 12638316 12834028 13064098 13251183 12920551 13142547 13410933 13435257 13914033
5094 13914033 13510899 13559691 13234607 13430481 13360772 13970474 14174024 13881896 14360584 14225007
5084 14225007 14606804 15119385 15053294 14932238 14956572 15476008 16201576 15893081 15454341 15658497
5074 15658497 16078041 15778495 15857610 15723909 15673824 16033535 16379145 17075517 17578480 17279733
5064 17279733 17528680 17454964 17583453 17753664 18368318 18333221 18457709 18847181 18569835 18386556
5054 18386556 18573157 19240539 19444716 19642241 19883677 19412090 19966095 20401771 20515351
5045 20515351 21073199 21387042 22315262 22523498 23134045 23147129 23837087 24441820 24919719 25228925
5035 25228925 25525284 26323594 26966021 27175299 27829216 28542047 28772660 28887899 29195464
5026 29195464 29633700 30017756 30020087 30654088 30773330 30746029 30911993 30857984 31625836 31865706
5016 31865706 32547883 33421293 34005863 34205713 34942879 36198488 37061871 38161605 39204692
5007 39204692 40214887 40875452 41359087 41547956 42096828 42348558 42416083 43042359 43642556
4998 43642556 44239280 44286586 44772179 45511554 46925832 47963978 48762019 49707886 50597714
4989 50597714 52551471 53755727 54397070 54369679 54658154 54698882 55195556 55914343 56298233
4980 56298233 56610642 57410156 58119402 58686433 59615800 60366314 61651782 63007534 64706935
4971 64706935 66148243 67186498 68804620 70939812 73723214 75968187 78852336 82968464
4963 82968464 87734848 91605564 93865850 94931012 94986516 94214787 92996505 93029827 93550851
4954 93550851 94254589 94732903 95969553 96528202 98081320 100128452 102364721 104301817 106893614
4945 106893614 109512838 112048922 115109127 118365477 121379328 123292818 124090854 123873508
4937 123873508 122932329 121449475 120968297 121009441 120959881 120988390 121189353 121832190 123144933
4928 123144933 123967086 125122634 126693224 127466412 128765484 130321099 132200129 134002255
4920 134002255 135184848 136612692 138277227 140332865 142337707 144119901 145898065 147191741
4912 147191741 148702267 150519252 151912961 152701481 153499573 154450927 155331128 156288757 156539523
4903 156539523 156869266 157072087 158018396 158419712 159430026 160696509 161255499 161675567 161943864
4894 161943864 161981728 161553009 160389627 159089033 158019945 156048164 154589958 152167552
4886 152167552 150348012 148105264 145230785 142685291 139745731 136684810 133182806 129581731
4878 129581731 126060452 122685178 119051228 115241174 111584544 108015147 104386055 100973545
4870 100973545 97789467 94540738 91900766 88722749 86839726 84805233 82022075 79670320
4862 79670320 77415318 74834552 71612140 70124465 68444358 66888059 64959741 63009415
4854 63009415 61779201 59798439 58228586 57096025 55347328 54118298 52895634 52412140
4846 52412140 51357022 50306526 49805577 48785590 48147008 47600655 46847702 46465486 45947228
4837 45947228 45313953 44839225 44885607 44739930 44886927 45380527 45408070 45484313 45124938 45565765
4827 45565765 46238116 47235903 48324542 50079440 51009554 52337986 53568137 54610328 54771210
4818 54771210 53642498 52125565 49273129 47167666 45125187 43624129 42204486 40785953
4810 40785953 39207414 37910479 36508865 35725006 35607887 34587540 34002908 34144300 33805666
4801 33805666 33767700 34356308 34109769 34596446 34938477 34824607 35024804 34934055 34613481 34882169
4791 34882169 34255751 32949497 32053749 31181607 29721578 28589998 27854357 26729667 25911852
4782 25911852 25040609 24163633 23406312 22705910 21631022 20884984 21055410 20422873 20039437
4773 20039437 19779129 18824841 18607374 18709107 18434176 17761350 17917787 18220962 17635609
4764 17635609 17267997 16868211 16695089 16791438 16413957 16116012 15410424 15136502 15442288 15465876
4754 15465876 15380912 15720506 14652361 14108352 14361194 14255507 14142363 14237200 14056616 14136293
4744 14136293 14274001 13972048 13705419 14113351 13566596 13350408 13556598 13289272 13384819 13385008
4734 13385008 13422729 13220554 12831061 12966675 13016050 13029167 12639228 12818274 12588953 12332632
4724 12332632 12013240 12147034 12177917 11511067 11623755 12006804 11594850 11259177 11268473 10942242
4714 10942242 11353216 11492371 11433237 11122702 11127482 10768507 10559954 10880035 11126827 11006176
4704 11006176 10733485 10905169 10840258 10717913 10950713 10935618 11309522 10689993 10549926 10499702
4694 10499702 10117795 10000743 10308528 10401664 10414706 10432037 10568314 10447589 9912618 9460644
4684 9460644 9267177 9164333 9127792 9093936 9621876 9625420 9418553 9451696 9457580 9188610 9127147
4673 9127147 9375535 9267324 9043247 9176731 8992728 8804076 8631708 8777580 9191745 9206228
4663 9206228 9403478 9743128 9234419 9004384 8560222 8582402 8510928 8484589 8749327 8809532
4653 8809532 8223084 7843446 8025325 7944515 8494436 8085333 8031320 8262862 7901887 7643415
4643 7643415 7714194 7772332 7984186 7637548 7316570 7329317 7939690 8069401 7824622 7840143
4633 7840143 8011129 7853391 7831012 8090550 7629095 7570054 7654234 7788733 7413466 7436208
4623 7436208 7352498 6918167 7392706 7194357 6740570 6874077 7326019 7692062 7706940 7239205
4613 7239205 6802720 6943300 7147506 7342755 7443324 7473298 6773160 6480348 6678897 6417031
4603 6417031 6762264 6564361 6511826 6204407 6708632 6971521 6950391 6870646 6543747 6629349
4593 6629349 6478325 6390738 6270440 6440290 6694846 6609539 6265217 5962429 6020586 5804242
4583 5804242 5982778 5904759 5853985 5815365 5977241 5891051 5742221 5755121 5494233 5798804
4573 5798804 5452299 4817323 5013644 5556986 6251618 6258049 6055007 5586809 5772036 5908602
4563 5908602 5555638 5816475 5447012 5168173 5572484 5869728 5741099 5913467 5656695 5453192
4553 5453192 5084134 4906518 4795898 5028381 5278601 5458382 5279595 4418931 4418755 4493714
4543 4493714 4196371 4094357 4588532 4676742 4283528 4662439 4647931 4239080 4411076 4581561
4533 4581561 5173364 5046491 4919213 5196364 5451016 5123339 4688813 4667832 4840511 4778228
4523 4778228 5107163 5248650 4847368 5263354 5073944 5345741 5496001 5141772 5381383 5134326
4513 5134326 5421540 5439235 4621991 4457119 4793440 5583213 5599303 5301896 4901597 4562030
4503 4562030 4193655 4719827 4561907 4952570 5379344 5418901 5384109 5358122 5676822 5064706
4493 5064706 5243307 5649491 5765690 5875617 5877883 6192771 6214187 6745708 6853970 6736025
4483 6736025 7548940 7907140 7814974 7128066 7125489 7119502 6374011 6096678 6057448 5887612 5936442
4472 5936442 5677132 5711094 5291338 5163327 4831946 4105352 4345716 4243047 4268608 4657043
4462 4657043 4465758 4056395 4415099 4942912 3823633 3536056 3980845 4146284 4407749
4453 4407749 4265077 4632996 4637608 4253006 3965155 4314924 4628460 4118710 3981591 4066445
4443 4066445 4492293 4512678 3936720 3501635 3356175 3458802 3234993 3281885 3682554 3760603
4433 3760603 4025900 4021513 3317590 3191595 4073920 4366245 4250002 4036719 3542054 4113160
4423 4113160 3988562 3237559 3323777 3458535 3955741 3522128 3382216 3747227 3714635 3464689
4413 3464689 3365537 3338546 2839414 3087607 3454207 3564419 3565397 4045619 4360718 4429320 4442270
4402 4442270 4723255 3992893 3973841 3735095 3732586 3618903 4233762 4228681 3830557 3825228 4014334
4391 4014334 3787376 3744523 3658975 3425832 3583223 3690281 3685409 3920699 3855241 3941469 3877951
4380 3877951 3438809 4131411 3784946 3175127 4049463 4490898 3769477 3480156 3563759 3639673
4370 3639673 4691139 4706323 4239187 3973577 3418808 3889611 3646769 3814875 4128853 4123547
4360 4123547 3559910 3002376 3330982 4129219 3988697 4057677 3941584 4380643 3911474 3679933
4350 3679933 3853335 3968398 4073156 4406147 4156283 3995996 3762418 4240529 4729911 4339888
4340 4339888 4430343 4880928 5032171 5367929 5165249 5002566 4956695 4965154 4954498 5172381
4330 5172381 5690556 5633282 5460842 5046299 5469422 5794914 5845790 5671980 5584237 5468153
4320 5468153 5955244 6406834 6265919 5922714 5968422 6228103 6127865 6442180 6028410 6754785
4310 6754785 6864571 6753707 6783903 6855285 7383874 7145615 6612616 6064627 5763750 6108352
4300 6108352 6362580 5862505 6189368 6208237 6026608 6300414 5919438 5560032 5133506 5169284
4290 5169284 5615211 5565692 5937195 5693973 5918682 5880643 5828403 5637051 5517250 4977264
4280 4977264 4790966 4803964 4686124 4907140 5331781 5416352 4761401 4858296 5320456 5274941
4270 5274941 4955804 5429558 5533953 5123978 4953728 4924820 4827534 4937500 5006493 5251010
4260 5251010 4759620 4324186 4572573 4605754 4515347 4781013 4831078 4606035 4572273 4983103
4250 4983103 4545372 4164909 4599789 4450390 4539831 4266112 4471761 4645701 4952530 4569053
4240 4569053 4410679 4597058 4660270 4460407 4528759 4895615 4827472 4693034 4824590 4721232
4230 4721232 4984869 4904800 4998835 5126998 4796457 5091141 5193458 5084415 4983776 4680876
4220 4680876 4749911 4597946 5317424 5470880 5004214 4892329 5249205 5299587 5136847 5405849
4210 5405849 5465421 5863487 5592604 5492013 5913469 5455096 5581293 5876610 5188082 4793372
4200 4793372 5103873 5447545 5807903 5670661 5712791 5413031 5288225 5186410 4721036 5146428
4190 5146428 5236208 5413366 5143928 5649632 6273234 5970464 5419590 5278658 5364272 5323894
4180 5323894 5418836 5951930 5960092 5319255 5800419 6140574 6092986 6121537 6116738 6158760 6458734
4169 6458734 6548370 6055086 6148691 6321196 6222637 5941575 6006187 6131984 5939016 6202894
4159 6202894 6107133 5731303 6052978 5958422 6214110 6565041 6477907 6467578 6563606 6687546
4149 6687546 6427733 5770761 6409430 6731086 6926754 6833274 6733844 6734014 6491591 6990511
4139 6990511 6869733 7057714 7563328 7369252 6954216 6883109 7119861 7123019 7411449 7781404
4129 7781404 7809357 7686190 7716066 7533297 7314848 7024360 7000110 7102997 8079404 8401278
4119 8401278 8172132 7902322 7503901 7434390 8168025 8349286 7781055 7664503 8051582 8594399
4109 8594399 8497725 8485077 8456137 8611712 9098119 9359180 9346446 9353091 9296601 9293967 9007719
4098 9007719 9202840 9036575 9146137 9437435 9305964 9191163 9020389 9175405 9776977 9850113
4088 9850113 9724980 9715824 9888587 10464961 10322692 10353081 10185997 10311274 10861740 10847505
4078 10847505 10597169 10692196 10859059 11212026 11362994 11746035 11568876 11567905 11886740 12112223
4068 12112223 12324651 12105043 12298751 12543561 12610496 12485019 12527488 13266857 13259502 13307263
4058 13307263 13796576 14053161 14095491 14243533 14566978 14233037 14705586 14997547 15842506 15802616
4048 15802616 15898615 16179210 16501627 16933866 17393323 18341889 18320920 18496236 18773688 19238513
4038 19238513 19459500 19811890 20633452 21299438 21353316 21755856 22048682 22116051 22766604 22332296
4028 22332296 22711129 22657293 22972668 23628077 23983829 24165107 24098718 24152295 24160431 24245698
4018 24245698 24647148 24685160 24987377 25309357 25245929 25301806 25375702 24941764 24799919 25460172
$$ [...]
##END NTUPLES=NMR SPECTRUM
##END=
