##TITLE=1H_CA-9364-1
 200.13MHz,CDCl3,
 8 sc
 
 29.7.2025
##JCAMPDX= 6.0         $$ Bruker NMR JCAMP-DX V2.0
##DATA TYPE= NMR SPECTRUM
##DATA CLASS= NTUPLES
##ORIGIN= UXNMR, Bruker Analytische Messtechnik GmbH
##OWNER= pz
$$ XWIN-NMR		Version 3.5
$$ Tue Jul 29 15:14:41 2025 Russian Standard Time (UT+4h)  she@DPX200
##.OBSERVE FREQUENCY= 200.1313
##.OBSERVE NUCLEUS= ^1H
##.ACQUISITION MODE= SIMULTANEOUS
##.ACQUISITION SCHEME= undefined
##.AVERAGES= 8
##.DIGITISER RES= 18
##SPECTROMETER/DATA SYSTEM= spect
##.PULSE SEQUENCE= zg30
##.SOLVENT NAME= CDCl3
##.SHIFT REFERENCE= (INTERNAL, CDCl3, 0, 15.5276)
##AUDIT TRAIL= $$ (NUMBER, WHEN, WHO, WHERE, WHAT)
$$ ##TITLE= Audit trail, XWIN-NMR		Version 3.5
$$ ##JCAMPDX= 5.01
$$ ##ORIGIN= Bruker BioSpin GmbH
$$ ##OWNER= she
$$ F:/spectra/data/she/nmr/H-C/1/pdata/1/auditp.txt
$$ ##AUDIT TRAIL=  $$ (NUMBER, WHEN, WHO, WHERE, WHAT)
(   1,<2025-07-29 15:12:46.53 +0400>,<she>,<DPX200>,
      <created by zg, POWCHK disabled, PULCHK disabled
       configuration hash MD5:
       00 E9 B6 7A A2 85 ED C7 34 08 36 98 17 FE 4E 26
       data hash MD5: 16K
       38 A1 B8 A7 23 33 EB 5F 9B 9E 72 C2 E6 8D 2F 4E>)
(   2,<2025-07-29 15:12:49.28 +0400>,<she>,<DPX200>,
      <Start of raw data processing
       efp BC_mod = 2 LB = 0.25 FT_mod = 6 PKNL = 1 PHC0 = -1199.288 PHC1 = 13.79254 SI = 16K 
       data hash MD5: 16K
       DB D7 72 4D 79 81 AA 09 13 C9 C4 84 1E ED 18 ED>)
(   3,<2025-07-29 15:13:16.73 +0400>,<she>,<DPX200>,
      <pk PHC0 = 1.965631 PHC1 = -5.799999 
       data hash MD5: 16K
       6F FE C7 97 66 35 29 9A 89 97 F3 CD 19 7E 99 41>)
(   4,<2025-07-29 15:13:20.87 +0400>,<she>,<DPX200>,
      <abs ABSG = 5 
       data hash MD5: 16K
       F7 95 7E 87 23 30 A0 9E 88 41 26 7B A7 59 30 E7>)
(   5,<2025-07-29 15:13:38.90 +0400>,<she>,<DPX200>,
      <pk PHC0 = 0.8603609 PHC1 = -1.2 
       data hash MD5: 16K
       C6 04 51 7C C8 C2 60 32 81 6D 2B 03 6C D2 8A 80>)
(   6,<2025-07-29 15:13:42.90 +0400>,<she>,<DPX200>,
      <abs ABSG = 5 
       data hash MD5: 16K
       AB 0A 0B 0F D7 DD A4 0E E6 B6 92 00 86 64 B3 74>)
$$ ##END=
$$ 
$$ hash MD5
$$ 2F E3 E3 F4 84 C4 45 74 0E 21 9D 3D B1 73 01 DE
##$RELAX= 
##$RELAX= 
##$RELAX= 
##$RELAX= 
##$RELAX= 
##$RELAX= 
$$ Bruker specific parameters
$$ --------------------------
##$DU= <F:/spectra>
##$EXPNO= 1
##$NAME= <H-C>
##$PROCNO= 1
##$TYPE= <nmr>
##$USER= <she>
##$AMP= (0..31)
100 100 100 100 100 100 100 100 100 100 100 100 100 100 100 100 100 100 
100 100 100 100 100 100 100 100 100 100 100 100 100 100 
##$AQSEQ= 0
##$AQ_mod= 1
##$AUNM= <au_zg>
##$AUTOPOS= <>
##$BF1= 200.13
##$BF2= 200.13
##$BF3= 200.13
##$BF4= 200.13
##$BF5= 200.13
##$BF6= 200.13
##$BF7= 200.13
##$BF8= 200.13
##$BYTORDA= 1
##$CFDGTYP= 0
##$CFRGTYP= 5
##$CHEMSTR= <none>
##$CNST= (0..31)
1 1 145 1 1 1 1 1 1 1 1 1 1 1 1 1 1 1 1 1 1 1 1 1 1 1 1 1 1 1 1 1 
##$CPDPRG= <>
##$CPDPRG1= <>
##$CPDPRG2= <>
##$CPDPRG3= <>
##$CPDPRG4= <mlev>
##$CPDPRG5= <mlev>
##$CPDPRG6= <mlev>
##$CPDPRG7= <mlev>
$$ [...]
##$SUBNAM3= <"">
##$SUBNAM4= <"">
##$SUBNAM5= <"">
##$SUBNAM6= <"">
##$SUBNAM7= <"">
##$SUBNAM8= <"">
##$SUBNAM9= <"">
##$SW= 18.0517328524113
##$SWIBOX= (0..15)
0 0 2 0 0 0 0 0 0 0 0 0 0 0 0 0 
##$SW_h= 3612.71676300578
##$TD= 16384
##$TD0= 1
##$TE= 0
##$TE2= 300
##$TE3= 300
##$TEG= 300
##$TL= (0..7)
0 120 120 120 120 120 120 120 
##$TP= (0..7)
150 150 150 150 150 150 150 150 
##$TP07= 0
##$TPNAME0= <>
##$TPNAME1= <>
##$TPNAME2= <>
##$TPNAME3= <>
##$TPNAME4= <>
##$TPNAME5= <>
##$TPNAME6= <>
##$TPNAME7= <>
##$TPOAL= (0..7)
0.5 0.5 0.5 0.5 0.5 0.5 0.5 0.5 
##$TPOFFS= (0..7)
0 0 0 0 0 0 0 0 
##$TUNHIN= 0
##$TUNHOUT= 0
##$TUNXOUT= 0
##$USERA1= <user>
##$USERA2= <user>
##$USERA3= <user>
##$USERA4= <user>
##$USERA5= <user>
##$V9= 5
##$VALIST= <valist>
##$VCLIST= <CCCCCCCCCCCCCCC>
##$VD= 0
##$VDLIST= <DDDDDDDDDDDDDDD>
##$VPLIST= <PPPPPPPPPPPPPPP>
##$VTLIST= <TTTTTTTTTTTTTTT>
##$WBST= 1024
##$WBSW= 4
##$XGAIN= (0..3)
0 0 0 0 
##$XL= 0
##$YL= 0
##$YMAX_a= 987472
##$YMIN_a= -1088415
##$ZGOPTNS= <>
##$ZL1= 120
##$ZL2= 120
##$ZL3= 120
##$ZL4= 120
##$ABSF1= 24.88672
##$ABSF2= 6.834702
##$ABSG= 5
##$ABSL= 3
##$ALPHA= 0
##$AQORDER= 0
##$ASSFAC= 0
##$ASSFACI= 0
##$ASSFACX= 0
##$ASSWID= 0
##$AUNMP= <proc_1d>
##$AZFE= 0.1
##$AZFW= 0.1
##$BCFW= 0
##$BC_mod= 2
##$BYTORDP= 0
##$COROFFS= 0
##$CY= -3
##$DATMOD= 1
##$DC= 0
##$DFILT= <>
##$DTYPP= 0
##$F1P= 0
##$F2P= 0
##$FCOR= 1
##$FTSIZE= 16384
##$FT_mod= 6
##$GAMMA= 0
##$GB= 0
##$INTBC= 1
##$INTSCL= 3.241238e-09
##$ISEN= 128
##$LB= 0.25
##$LEV0= 0
##$LPBIN= 0
##$MAXI= 10000
##$MC2= 0
##$MEAN= 0
##$ME_mod= 0
##$MI= 1.114404
##$NCOEF= 0
##$NC_proc= -4
##$NLEV= 6
##$NOISF1= 3.799351
##$NOISF2= 2.8
##$NSP= 0
##$NTH_PI= 0
##$NZP= 0
##$OFFSET= 15.52763
##$PC= 1
##$PHC0= -1196.462
##$PHC1= 6.79254
##$PH_mod= 1
##$PKNL= yes
##$PPARMOD= 0
##$PSCAL= 0
##$PSIGN= 0
##$REVERSE= no
##$SF= 200.129998814298
##$SI= 16384
##$SIGF1= 3
##$SIGF2= 2
##$SINO= 0.751879
##$SIOLD= 32768
##$SREGLST= <19F.Aceton>
##$SSB= 0
##$STSI= 16384
##$STSR= 0
##$SW_p= 3612.71676300578
##$SYMM= 0
##$S_DEV= 0
##$TDeff= 16384
##$TDoff= 0
##$TI= <>
##$TILT= no
##$TM1= 0
##$TM2= 0
##$TOPLEV= 0
##$USERP1= <user>
##$USERP2= <user>
##$USERP3= <user>
##$USERP4= <user>
##$USERP5= <user>
##$WDW= 1
##$XDIM= 16384
##$YMAX_p= 375868588
##$YMIN_p= -358705
$$ End of Bruker specific parameters
$$ ---------------------------------
##NTUPLES= NMR SPECTRUM
##VAR_NAME=  FREQUENCY,     SPECTRUM/REAL,   SPECTRUM/IMAG
##SYMBOL=    X,             R,               I
##VAR_TYPE=  INDEPENDENT,   DEPENDENT,       DEPENDENT
##VAR_FORM=  AFFN,          ASDF,            ASDF
##VAR_DIM=   16384,         16384,           16384
##UNITS=     HZ,            ARBITRARY UNITS, ARBITRARY UNITS
##FACTOR=    0.220516191357247, 1,           1
##FIRST=     3107.54454392864, 0,            0
##LAST=      -505.172219077139, 0,           0
##MIN=       -505.172219077139, -358705,     0
##MAX=       3107.54454392864, 375868588,    0
$$ Real data points
##PAGE= N=1
##DATA TABLE= (X++(R..R)), XYDATA
$$ [...]
7786h6850K667r303j4915j652J4968L744J0472J303j1319r789L0496K0751m3686
7773i3113j4627k890j4150N342j3026J3534K1936q656J07k541l515j453L1556
7760h1496K3198j4952J8671k1711K614q56p78J2651k1018K1383j1775k6796O531
7747i4334L008J0377j0425J3513K1100k63L250m1539R231j661j2627R743K246
7734h8381J918k3956P003J8376J2972q159k0897J615L1686Q524k3383J335p47
7721h2094j7981r015K5300J3694k1099m265j1372J3783J1936L962k270j0521l341
7708i3283q114K2181P099l0320j6797L1033R887l16R194J543Q590J4897l182j3993
7694f1581o066J0512Q918m1575l0686J8926J034q797P527q108L994L6722j2326
$$ plain form
7786 -86850 -84183 -93486 -108401 -110053 -95085 -91341 -80869 -79566 -90885 -100674 -70178 -49427 -93113
7773 -93113 -107740 -110630 -124780 -119438 -132464 -118930 -96994 -105650 -105543 -108084 -111599 -113052 -81496
7760 -81496 -58298 -73250 -54579 -76290 -73676 -74532 -75310 -62659 -83677 -62294 -74069 -100865 -94334
7747 -94334 -91326 -80949 -91374 -77861 -56761 -57024 -53774 -95313 -86082 -87743 -100370 -90627 -88381
7734 -88381 -86463 -110419 -103416 -85040 -72068 -80227 -101124 -99509 -67823 -59299 -82682 -81347 -82094
7721 -82094 -100075 -109090 -83790 -70096 -91195 -95460 -106832 -93049 -81113 -77151 -79421 -89942 -93283
7708 -93283 -101397 -79216 -72117 -102437 -119234 -88201 -78314 -78630 -69436 -67893 -59303 -44406 -47588 -61581
7694 -61581 -67647 -57135 -48217 -89792 -120478 -101552 -100518 -109315 -101788 -109896 -105902 -69180 -81506
7681h1506J1080L2338j3534l9589k1110K2553o266M0591M817m0047j2624L5835
7669f7462M9857J8546l9411j5326J564j6504j6674k6246L197J5253M576l763J5072
7656g7321p297m0918K3793J5685N601j3464Q7M0245J33k6837l8371J1595L5276
7643g1793j0568j8379J5645k1187N298L3912o146j1167j4393M5868p528j0061
7631g0499j6279k616k8683K6882K848j1192J4807L65J594J8220L742j662P339
7618e5134N51n850j8143j3647p595L0083O059J3649j6856j5063L1432j0777l1793
7605i3084O204J190Q345k3353L2344l0175j6813O4476k2761l1598J6379K14J1316
7592g7316K5290j2329P523R35J379o848n6646Q083J5122o395p786J4434K8935
$$ plain form
7681 -81506 -70426 -38088 -51622 -91211 -112321 -89768 -96034 -55443 -50626 -90673 -103297 -67462
7669 -67462 -17605 941 -38470 -53796 -52232 -68736 -85410 -111656 -108459 -93206 -88630 -92393 -77321
7656 -77321 -84618 -125536 -101743 -86058 -80457 -93921 -93834 -53589 -53456 -80293 -118664 -107069 -71793
7643 -71793 -82361 -100740 -85095 -106282 -100984 -67072 -73218 -84385 -98778 -52910 -60438 -70499
7631 -70499 -86778 -89394 -118077 -91195 -88347 -99539 -84732 -84367 -82773 -64553 -60811 -62473 -55134
7618 -55134 -54583 -60433 -78576 -92223 -99818 -69735 -63676 -50027 -66883 -81946 -50514 -61291 -93084
7605 -93084 -86880 -85690 -77345 -100698 -68354 -98529 -115342 -50866 -73627 -105225 -88846 -88632 -77316
7592 -77316 -52026 -64355 -56832 -55897 -54518 -61366 -118012 -109929 -94807 -101202 -108988 -94554 -65619
7579f5619k0548m2126K6650k094j0992K296M0165j115p281r260k949L0124l9253
7566a02002K0670K3022j9581K067J85P469N199r805q657j580J675r440M344N5271
7552c1163M108N250n96m734m6439O010J6660j4563N659k732j7951N100R499Q845
7538e7047R234j930o014l7255R364K9k9652Q835M9430M0225k7071k2016n496o746
7524g6110N340J0817Q450K8985m981L973J4112k5561n236K0121L3430K7503r497
7511C1346j6571L3773K6486M9983K6863N9367L4014N1387L2218l4632m3720o6573
7499A83941m0506k1215J2698o456j5277k1255k2047m0179j2171K1059j3349k2404
7487B839k9587O342O582L30M866R713J2696n3268k0177P952k559J0568k4505J6227
$$ plain form
7579 -65619 -86167 -128293 -101643 -103737 -114729 -112433 -72268 -73383 -80664 -89924 -92873 -62749 -102002
7566 -102002 -81332 -58310 -77891 -75824 -75639 -68170 -62971 -72776 -81433 -83013 -81338 -90778 -86434 -31163
7552 -31163 -27055 -21805 -22401 -27135 -73574 -67564 -50904 -65467 -59808 -62540 -80491 -75391 -65892 -57047
7538 -57047 -47813 -49743 -55757 -93012 -83648 -83619 -113271 -104436 -55006 -14781 -41852 -63868 -69364 -76110
7524 -76110 -70770 -59953 -51503 -22518 -27499 -23526 -9414 -34975 -40211 -20090 13340 40843 31346
7511 31346 14775 48548 75034 125017 151880 211247 245261 296648 328866 294234 250514 183941
7499 183941 143435 122220 134918 128462 113185 91930 69883 29704 17533 38592 25243 2839
7487 2839 -26748 -20406 -13824 -13494 -8628 1085 13781 -39487 -59664 -51712 -54271 -43703 -68208 -51981
7473e1981J0621j4223j3873J9181K0422J9260j1735J747m450R655j6799k5454
7461e7629o164Q553K369Q036k8907J7341j3338Q646J8528j4613K0517q771K947
7448d2485l645l1430J2114J8877J2599Q181j7174Q48J1049j4163K301l133l6256
7435h2317K9726K0532J9255j2035j2944o343k0972N634K1010O546j5913j4526
7423f2347L4261Q156l5063L785M398j9310j67k220K1909q748O645J264j3457r572
7409g0466K4554K2732k9528O076K559l2178J3146q494K6276K7591l5332J6665
7397c6399m031M655m209P000r422j0619J0755j1217L1286o993Q511K1079j7431
7384a7035j131R637j224K306m502k841j6770P027J7555m2530K4983J2105O282
$$ plain form
7473 -51981 -41360 -55583 -69456 -50275 -29853 -10593 -22328 -20581 -25031 -15376 -32175 -57629
7461 -57629 -63793 -55240 -52871 -44835 -73742 -56401 -69739 -61093 -42565 -57178 -36661 -45432 -42485
7448 -42485 -46130 -77560 -65446 -46569 -33970 -25789 -42963 -42115 -31066 -45229 -42928 -46061 -82317
7435 -82317 -52591 -32059 -12804 -24839 -37783 -44126 -65098 -59464 -38454 -31908 -47821 -62347
7423 -62347 -28086 -19930 -54993 -51208 -46810 -66120 -66287 -68507 -46598 -55346 -48701 -47437 -60894 -70466
7409 -70466 -45912 -23180 -52708 -46632 -44073 -76251 -63105 -71599 -45323 -17732 -53064 -36399
7397 -36399 -40430 -35775 -39984 -32984 -42406 -53025 -42270 -53487 -22201 -29194 -20683 396 -17035
7384 -17035 -18166 -8529 -9753 -7447 -11949 -14790 -31560 -24533 -6978 -49508 -24525 -12420 -6138
7371f138J1346r309k679j2717l3793K0265L4391o105j0925l717j2810J0168J8202
7358c821j2076l341j5042O022k3685n326L4364J9828q787r767r410o652o933L0477
7344a4149j0391o928R246j8289m805N694J3297K8817k7348k1684J911L0512K5245
7331A1128j5862j6509k5609o689L8600o203J8290Q971Q498L512k3823M8642N493
7318D8439k9979m459M9019l5888J4545k2861k9131N7244l4325M474L8508j4597
7306D0989q653M191J1657J2156M823m710m66R088K0529k6009l6852L7968K3189
7293H7900n5918r047L1264J5550p553k0704k6824L3865K7572k2353J274l825K0572
7280G1773K529K5599J7000m861P67P673l365o730k2855j6056R958k6034j3529
$$ plain form
7371 -6138 5208 -4101 -6780 -19497 -53290 -33025 1366 -4739 -15664 -19381 -32191 -22023 -3821
7358 -3821 -15897 -19238 -34280 -28258 -51943 -57269 -22905 -3077 -11864 -21631 -31041 -37693 -44626 -14149
7344 -14149 -24540 -31468 -22222 -40511 -45316 -39622 -26325 2492 -24856 -46540 -44629 -14117 11128
7331 11128 -4734 -21243 -46852 -53541 -14941 -21144 -2854 6117 14615 18127 -5696 42946 48439
7318 48439 18460 14001 63020 27132 41677 18816 -10315 46929 12604 17078 55586 40989
7306 40989 32336 36527 48184 60340 65163 60453 59987 69075 89604 63595 26743 64711 87900
7293 87900 31982 22935 54199 69749 62196 41492 14668 48533 76105 53752 55026 51201 71773
7280 71773 74302 99901 116901 112040 112807 120480 117115 110385 87530 71474 81432 55398 41869
7267D1869J6217L890M1624k8376j5552L8823J4854K603j8089l3502P093L702K0366
7254I5522L021J560L0186R114j8674J9377K6858p231k4910j5627J6770J5683j1432
7241A40217n091M093J9561K4248k1688j1776q304J0651k7407R499l312l823M752
7228A31620l2503J9331K0434n934n647J0638R331j931J0870K0879L1152L9398
7216B47638j1335l1989J9020M1308j3093K2599J1973k1958J3433n802K6274r024
7204B89044J374n681j0880j5860L0375k6540L2728J7442L2658n317K9796k833
7192C66306J0072J2802K7613O117l4240j6253K3404P677l3514L2444J3082R823
7180D25333j1529K0694Q913p442J9344J2246j606P318M3052M3824L0393Q814J9696
$$ plain form
7267 41869 58086 61976 103600 75224 59672 98495 113349 115952 97863 64361 71454 75156 95522
7254 95522 98543 100103 130289 139403 120729 140106 166964 159733 134823 119196 135966 151649 140217
7241 140217 135126 139219 158780 183028 161340 149564 141260 151911 124504 134003 130691 126868 131620
7228 131620 99117 118448 138882 132948 127301 137939 147270 145339 156209 177088 208240 247638
7216 247638 236303 204314 223334 264642 251549 274148 286121 264163 277596 271794 298068 289044
7204 289044 290418 284737 273857 257997 288372 261832 294560 312002 344660 339343 369139 366306
7192 366306 376378 389180 416793 422910 388670 372417 395821 403498 369984 402428 415510 425333
7180 425333 413804 434498 443411 435969 455313 467559 465953 473271 516323 560147 590540 599354 619050
7167F19050P2025N943N1080O2150L8278J6985N0741M4820N5746L5499J1189N9875
7155A123381J4247J997M9048K3244M0470M8289M3901M5655L6383L5923L9333O9146
7143A571017N6645P9194P8219R9053J23388J35201J49620J61211J34627J58482
7133B746657J62879J83521K23999K36097K66123K42815K78419K52883L28747L74060
7123E296200M06050L71868M15622M56923N70208O61350Q43858J003618J299866
7114A1325563J468375J639585J871485K166681K591667L447516M516461N908872
7106C4936205P508054R461882J0834596R957866K196990p228920j0463743r993800
7098D7209130p882520o080264m520722l716610k998051k301244j836731j467367
$$ plain form
7167 619050 691075 697018 748098 810248 848526 865511 916252 961072 1016818 1052317 1063506 1123381
7155 1123381 1137628 1139625 1188673 1211917 1252387 1300676 1344577 1390232 1426615 1462538 1501871 1571017
7143 1571017 1627662 1706856 1785075 1884128 2007516 2142717 2292337 2453548 2588175 2746657
7133 2746657 2909536 3093057 3317056 3553153 3819276 4062091 4340510 4593393 4922140 5296200
7123 5296200 5702250 6074118 6489740 6946663 7516871 8178221 9022079 10025697 11325563
7114 11325563 12793938 14433523 16305008 18471689 21063356 24510872 29027333 34936205
7106 34936205 42444259 51906141 62740737 72698603 74895593 67666673 57202930 47209130
7098 47209130 39326610 33246346 28725624 25009014 22010963 19709719 17872988 16405621
7090A6405621j142195r82367r62759q81443q08115p77260o76798o53579o57617
7081H863488n73250m95426m60843m11365m21365l16004l10638k83556k51402k06496
7071E133143j90347k14676k12891k33690k09733j61075j48281j19984j26923j51362
7061C364181j54837j35301j32156j67314j46365j11958j36248j33645p5919r5931
7051B074507n2886p2370o7247j04954p4385l5053k8553m2182o1572l0345l0964
7040A473996l7039l9193j4038P927p081m3063j516O008n2937k4078l6737l2317
7028A199932m6644l1230l6679k2264k1136o6185p8954l6373r995L304K7498l8185
7016H43089j0938N708n0097m0764j1467J8252j1672r905j8618q253n1265k0947
$$ plain form
7090 16405621 15263426 14281059 13318300 12436857 11628742 10851482 10174684 9521105 8863488
7081 8863488 8290238 7794812 7333969 6922604 6501239 6185235 5874597 5591041 5339639 5133143
7071 5133143 4942796 4728120 4515229 4281539 4071806 3910731 3762450 3642466 3515543 3364181
7061 3364181 3209344 3074043 2941887 2774573 2628208 2516250 2380002 2246357 2170438 2074507
7051 2074507 2021621 1949251 1882004 1777050 1702665 1667612 1639059 1596877 1535305 1504960 1473996
7040 1473996 1436957 1397764 1383726 1391653 1384572 1341509 1339993 1346001 1293064 1268986 1232249 1199932
7028 1199932 1153288 1122058 1085379 1063115 1041979 975794 896840 860467 850472 853776 881274 843089
7016 843089 832151 837859 787762 746998 735531 753783 742111 732206 713588 705335 654070 633123
7004F33123j5187j6544r585m9398R477K7980l4769j3345L0653l4112k8104M677
6992E04866M940K8614J8054k7226k1336k1315L564n106J8671K2670Q310k1879
6980E12827J2713J0886n0143j4809l340j4648j1222j8682K4750l4468l0678J2166
6968C95352K028r591p767q564l6584l1883j1152j4928j5148J6795k3558k7208
6956B27792P022L7612L8664O344m179k0485m261J3683k8537j6990K2449l2553
6944B46561j4944k600L3674K6177p1353p394P64Q634R714j065j1117j7640J2655
6931B12066p029l9223l867k0775l0475J0424K0886k9161M270K1020k3980J3198
6919A27354J4524j1830k6067R041r575j0745J4073r093J1317R683K4968Q055l4759
$$ plain form
7004 633123 617936 601392 591807 542409 551886 579866 545097 531752 562405 528293 500189 504866
6992 504866 509806 538420 556474 529248 507912 486597 490161 485055 503726 526396 534706 512827
6980 512827 525540 536426 486283 471474 468134 453486 442264 423582 448332 413864 383186 395352
6968 395352 397380 387789 380022 371458 334874 302991 291839 276911 261763 278558 255000 227792
6956 227792 234814 272426 311090 317434 313255 292770 288509 302192 273655 256665 279114 246561
6944 246561 231617 229017 262691 288868 217515 210121 210885 219519 229233 228168 217051 199411 212066
6931 212066 205037 165814 161947 141172 110697 121121 142007 112846 117116 138136 114156 127354
6919 127354 141878 130048 103981 113022 103447 92702 106775 97682 108999 118682 143650 151705 116946
6906A16946k0193M068J7780k5398j811Q939j6168K304M403o750l160R429q184
6893H2205J8358q287l2475L9687r101j5464K1028m995j9560K2574K3409K007K7169
6880A46555r143l8895K3523J8481j549J7624J4216o5p448j4265L170m362j5133
6867A32709j0185r380n297N421N931l1745J7590M4347j4842m2420j641J2814K0017
6854A23319k0503J7323K3119n5884p306M6379N122k8877J299l972K81n585q453
6841H6262k9299q863M1921j2777l7303r48j3260j544J9312m3107R488J1766j538
6828B0110j0015p167J19n693J2643j0032O195j6382j576J7766k8370K54K0767
6815a381l103m520O653j2833K3229p989o340N181Q366k0523K3603P577R514l9248
$$ plain form
6906 116946 96753 100821 118601 93203 91392 100331 84163 86467 90870 84120 80960 90389 82205
6893 82205 100563 92276 59801 99488 90387 74923 95951 90956 71396 93970 117379 119386 146555
6880 146555 137412 98517 122040 140521 138972 156596 170812 170747 163299 149034 152204 147842 132709
6867 132709 122524 113144 107847 113268 119199 87454 105044 149391 134549 92129 90488 103302 123319
6854 123319 102816 120139 143258 87374 80068 126447 131569 102692 103991 100019 100300 94715 86262
6841 86262 56963 48100 90021 77244 39941 38993 25733 24189 43501 394 9882 21648 20110
6828 20110 10095 2928 3047 -2646 9997 -35 6160 -10222 -11798 5968 -22402 -22148 -1381
6815 -1381 -4484 -9004 -2351 -15184 8045 56 -6284 -1103 7263 -13260 10343 17920 27434 -11814
6801a1814J357J182n689K1536l698J6835J71m69N21K4956k7310j568J141r500
6787G651j5581K224K7178J6917k2033m700k02L03k972j02o136k3404l7792K1907
6773c6742K9565m450q483j2720o164L7220k9392l303L1906n136J2668o197J8840
6760A7612K0556l1409l0086J1469L4985k3440r108K9804m145j4701j8862K3572
6748F247O89k8596J6632j0128L9575N757l8737k1554q455L0806L055l288L5631
6735B7634l6686k5465J3705K3340j0265K6427K00j6401k70j7775q607R522k147
6722a6788J9563m522l955K4329M584J6212q24n995M341J0118j8196J8618k9274
6709A8211J9210K8530l4560K110L7268R769N8302J4871L712Q1604M0521P6414
$$ plain form
6801 -11814 -10457 -9275 -14964 6572 2874 19709 19880 19411 19932 44888 17578 16010 17151 7651
6787 7651 -7930 -5706 21472 38389 16356 11656 11454 11757 8785 8683 2547 -20857 -58649 -36742
6773 -36742 -7177 -11627 -20110 -32830 -38994 -1774 -31166 -34469 -2563 -7699 4969 -1228 17612
6760 17612 38168 6759 -23327 -11858 23127 -313 -9421 20383 16238 1537 -17325 6247
6748 6247 6936 -21660 -5028 -15156 24419 30176 -8561 -30115 -38570 -7764 -4709 -7997 27634
6735 27634 -9052 -34517 -20812 2528 -7737 18690 18890 2489 2219 -15556 -24163 -14641 -16788
6722 -16788 2775 -1747 -5702 18627 23211 39423 38599 32604 36945 47063 28867 47485 18211
6709 18211 37421 65951 31391 33501 70769 80538 138840 153711 157423 239027 279548 355962
6697C55962N3053n216n0662r4974l6735k1635l7303l3855m0098k8544k0650J094
6685D0437K2856k188O967J080k3409j6241K7045j4991k3724p424J7373K6627N053
6672E9461J7095l1968k5810K118p900j3594n729J2239J4567p947j3512Q98j1107
6659a1189O0790K947l8197j9385J0960L260J2788j3564r162O925l5943j987j3156
6646d4913m312L8071j7172j2941J0444P028J7324L011j275P433l609l2239R005
6633b4145r356l930M0518j1583k4607J8330J9791j5105j9132j4323J1832j299
6621c3009p203o369j1179K1515L3074P68k131J5287j7115K097K6178k605k3230
6608c922K3267k0909l2587M1816K660l1475J1807K4545J2484l7580l7715K5892
$$ plain form
6697 355962 409015 403799 353137 258163 221428 199793 162490 128635 88537 59993 39343 40437
6685 40437 63293 61105 68072 69152 45743 29502 56547 41556 17832 10408 27781 54408 59461
6672 59461 76556 44588 18778 20896 12996 -598 -6327 5912 20479 12532 -980 -82 -11189
6659 -11189 49601 52548 14351 -5034 5926 9186 21974 8410 -752 6173 -29770 -31757 -44913
6646 -44913 -49225 -11154 -28326 -41267 -30823 -23795 -6471 -3460 -4735 2698 -911 -33150 -24145
6633 -24145 -33501 -37431 3087 -8496 -33103 -14773 5018 -10087 -29219 -43542 -31710 -33009
6621 -33009 -40212 -46581 -57760 -36245 -3171 -2403 -4534 10753 -6362 -4265 21913 19308 -3922
6608 -3922 19345 -1564 -34151 7665 10325 -21150 -9343 15202 27686 -9894 -47609 -21717
6596b1717N34R414J409k4585l318k6962j0712K9415K3297J377J080j0810n356
6583c6934N783R185m66n88K2847m6032k2954N1067N026k8604K1508L3422j6440
6570c180J841j6512K6978j9539k670J4444k102K2319o502j2053q379K4074j5990
6557B729k5816j6356J824L0101m520J0807J4707l0870k6574R421J8323L084K973
6544a0167O359J006j4240p255J2637L095j8075K1140J5236m73l323O927P480j9348
6530I99o203J1499O913l3601k3791J9756L0680j8670j8669K5321j0452J0717J978
6517c523L835j1597k2813J5452J7296k4770n708M5887k2584m941J5443L2223L04
6504C4504j3215M0N922j687r138j9407j2875K7286Q845j2963K5024l5500j1137
$$ plain form
6596 -21717 -21183 -11769 -10360 -34945 -38263 -65225 -75937 -46522 -23225 -21848 -20768 -31578 -36934
6583 -36934 -31151 -21966 -22432 -23020 -173 -46205 -69159 -18092 -13066 -41670 -20162 13260 -3180
6570 -3180 -1339 -17851 9127 -10412 -13082 1362 -740 21579 15077 3024 -5355 18719 2729
6557 2729 -23087 -39443 -37619 -7518 -12038 -1231 13476 -17394 -43968 -34547 -16224 -13140 -10167
6544 -10167 -3808 -2802 -17042 -24297 -11660 -8565 -26640 -5500 9736 9263 5940 12867 20347 999
6530 999 -5204 6295 13208 -20393 -44184 -24428 6252 -12418 -31087 -5766 -16218 -5501 -3523
6517 -3523 312 -11285 -34098 -18646 -1350 -26120 -31828 14059 -8525 -13466 1977 34200 34504
6504 34504 21289 21329 27251 25564 16426 -2981 -15856 11430 20275 7312 32336 -3164 -14301
6491a4301J5678m429L2511J5602k2538P739J4077k4441J4692j3792q553J7616
6479B9861K3093J3009l5853p528K0975j3176k4150L1181O136m098k1261m060o774
6466G355j4321K547K5038j5065r72J6707l6437L455J2816k992j5724k095J4589
6453e099n880L4984N992o352J2484k07L108J5915Q84k1846n924K9470L909m0885
6439B0553J3393l006K323J8881j5626p797n293P74O161M768j508P007K2601m100
6425E9131q697j7847P480R248r710K513J920L024Q31k79O424k6192j0715J0329
6411B7460K7523j2007K8427j2851P011O855k1530l7943J6992J1369r880k6580
6399D846M2M831L1439j5149J7986k345k806m775J7917J6870k2121K3497J5716
$$ plain form
6491 -14301 1377 -3052 29459 45061 22523 30262 44339 19898 34590 20798 12245 29861
6479 29861 52954 65963 30110 22582 43557 30381 6231 37412 43548 39450 18189 14129 7355
6466 7355 -6966 -4419 20619 5554 4582 21289 -15148 -11693 1123 -1869 -17593 -19688 -5099
6453 -5099 -10979 24005 29997 23645 36129 35922 39030 54945 55829 33983 28059 57529 61438 20553
6439 20553 33946 30940 33263 52144 36518 28721 23428 24202 30363 35131 33623 40630 63231 59131
6425 59131 50434 32587 40067 49315 39605 42118 44038 47062 47893 47614 54038 27846 17131 27460
6411 27460 54983 42976 71403 58552 65563 72418 50888 12945 29937 41306 31426 4846
6399 4846 4888 9719 41158 26009 43995 41650 38844 34069 51986 68856 46735 70232 85948
6386H5948k9114J0347L3334r819j3888j9224j869N752j62p37Q411k0291N428K5876
6372G9992J0171p922J8024j1629p372r000L0463J3066j0060j3314J797L5102N644
6359A34962K8516M1744m7023r919k443j4228L683J2412j6176j2614J9278j8345
6347A19847j1654n335L015P988j1008L4177J3389j2816r641P932K7046r036J7864
6334A71768J6176j9357J3539L528k8133N778L9201J6454K8387K468l3272N663
6322B22200J9055k9653l8297P093K0375k0725m7462j5884L8337J3756K1232j4609
6310A75418L9678j2531p107J557k5057J7635J7776k0973l3281J5336J8004k3527
6298A62928O782J9253k6873J912L3932K8905j9294n135K787j2828p511r771K4627
$$ plain form
6386 85948 56834 67181 100515 90696 76808 57584 55715 61467 61305 60568 68979 48688 54116 79992
6372 79992 90163 82241 100265 88636 81264 72264 102727 115793 105733 92419 94216 129318 134962
6359 134962 163478 205222 158199 148280 145837 131609 135292 147704 131528 118914 138192 119847
6347 119847 108193 102858 105873 113861 102853 137030 150419 137603 127962 135894 162940 153904 171768
6334 171768 187944 168587 182126 185654 157521 163299 202500 218954 247341 249809 216537 222200
6322 222200 241255 211602 173305 180398 200773 180048 132586 116702 155039 168795 190027 175418
6310 175418 215096 202565 195458 197015 171958 189593 207369 186396 153115 168451 186455 162928
6298 162928 169710 188963 162090 164002 197934 226839 207545 202410 205197 192369 184858 175087 199714
6285A99714J1342K2670R10K8020k792k5313J2809K9284m291j5008J449j2830L3748
6272B79712M0162O085j2873n65J4293J3611L0898K5660J4658J687J11K1176J1355
6259D45970j2084j5399m7802M2282O1251J523k3918J073m797J4957K8324O609
6247D97989K5474J0775L4412M1663L0440j6963K3334k23p636m2633j7153J2461
6235E91940n048k627l0129n3920K5148N701j6425j8530J4551n841l814J9389k5474
6222D94921m788M724j4578j902l7351K3957J3017M18K168k9509n430l5401J7466
6209D27712j3248R74K9794m7948J0212m359j1042K4755j5201j8132K1411m827
6197D00101n26r457M2467j5541j6141j9526L822K0765J334n186k0464J0446J3201
$$ plain form
6285 199714 211056 233726 234636 262656 259864 234551 247360 276644 272353 257345 258794 245964 279712
6272 279712 319874 325959 313086 312521 326814 340425 371323 396983 411641 413328 413439 434615 445970
6259 445970 433886 418487 370685 412967 474218 475741 451823 452896 448099 463056 491380 497989
6247 497989 523463 534238 568650 610313 640753 623790 647124 646901 639265 596632 579479 591940
6235 591940 586892 584265 554136 500216 525364 531065 514640 496110 510661 504820 501006 520395 494921
6222 494921 490133 494857 480279 478377 441026 464983 478000 478418 480586 451077 445647 410246 427712
6209 427712 414464 415438 445232 397284 407496 403137 392095 416850 401649 383517 404928 400101
6197 400101 399575 390118 432585 417044 400903 381377 385199 405964 407298 402112 381648 392094 405295
6184D05295n076k8700J7705k869R789N6294q457k9175l6030J1801K7047J9211
6172D36835J78j3050K6522k7217K4049M579J0779K3273m653J1513o691j3797j7357
6159D54963L1311J9324l5490j2419O780l53J6170L9140k6175R620J6592M086O48
6146E24197j450P224K276j979L3333K9676j7786O290J3246J4457J534O599J906
6133F19523K3810J3247q998J286J804K4649K94K2016N625p048R734L0120K6932
6120G62994J2344j7363J2201R464J8523K3104l526M469L753K0222J1092L6434
6108H93711L8072M4284J6269j6344K7131K3655L6286k491r738N985K6287O0202
6096A143309N723q408K3429K4766L706J0878O7399N9018j854L0188M7393M0593
$$ plain form
6184 405295 400219 371519 389224 386355 396144 452438 443981 414806 378776 390577 417624 436835
6172 436835 437013 423963 450485 423268 447317 451896 462675 485948 481295 492808 486117 472320 454963
6159 454963 486274 505598 470108 457689 464469 464116 480286 519426 493251 502871 519463 523549 524197
6146 524197 522747 529971 532247 530268 563601 593277 575491 581781 595027 609484 611018 617617 619523
6133 619523 643333 656580 647582 648868 650672 675321 675615 697631 703256 696208 705942 736062 762994
6120 762994 775338 757975 770176 779640 798163 821267 817741 822210 825963 846185 857277 893711
6108 893711 931783 976067 992336 975992 1003123 1026778 1063064 1060573 1050835 1056820 1083107 1143309
6096 1143309 1149032 1140624 1164053 1188819 1192525 1203403 1270802 1329820 1327966 1358154 1405547 1446140
6084A446140N0752M5461Q9365L3493K7290L8888N7378O9934N8658M3762P4304
6073B035425Q7835O7210N9291J15647J50655R8561J18053J78809J98372K37597
6063C347455K68876K92300L77132M71484N49297O94647Q78391R83354J023890
6054H886826P98238P2581n75323q15300p86875o06728m80661l57624k45831j31663
6044E757640p6108n9175q9M2757J03548J30952J49596J80125K45626L66654M05488
6033G247014M88073N82805O57408P98074R59214J218474J558783J963439K399613
6024A7872897K903089L138399K672874P59043j634372k780535k755336k211125
6016A7964934j677278j270093r44663o92453m28293k37386j07525P6028K02335
$$ plain form
6084 1446140 1496892 1542353 1631718 1665211 1692501 1731389 1788767 1858701 1917359 1961121 2035425
6073 2035425 2123260 2190470 2249761 2365408 2516063 2614624 2732677 2911486 3109858 3347455
6063 3347455 3616331 3908631 4285763 4757247 5306544 6001191 6879582 7862936 8886826
6054 8886826 9685064 9757645 9182322 8367022 7580147 6973419 6492758 6135134 5889303 5757640
6044 5757640 5681532 5622357 5622268 5665025 5768573 5899525 6049121 6229246 6474872 6841526 7247014
6033 7247014 7735087 8317892 8975300 9773374 10732588 11951062 13509845 15473284 17872897
6024 17872897 20775986 23914385 26587259 27346302 25711930 22931395 20176059 17964934
6016 17964934 16287656 15017563 14072900 13380447 12952154 12714768 12607243 12683271 12885606
6007A2885606L02434M84587N54713O79841O94789N38177L18121J90701K31409
5998A6880378L22367N48902Q32295J239932J695609K233250K708661L023516K854434
5989C2339344J302028j213729k668678k850768k342631j736714j155232p36746
5981B0936874m40719j00306K95931N65798Q28721Q16166N97723K4423o36562j060412
5971B1827637j173835j048753q47275n82904l46007k17530p5383J9396K34384
5962A7789730L94110O08926Q74454J015661J079531O61454j2794n19829o40620
5953B1250623m71844j77612Q4226K92942M89968O40467O83107N78591L36818J7523
5943B3724809j40606j54421j957K31296M86724Q34246J144750J465635J770779
$$ plain form
6007 12885606 13188040 13672627 14227340 14907181 15601970 16140147 16458268 16648969 16880378
5998 16880378 17202745 17751647 18583942 19823874 21519483 23752733 26461394 29484910 32339344
5989 32339344 33641372 32427643 29758965 26908197 24565566 22828852 21673620 20936874
5981 20936874 20496155 20395849 20691780 21257578 22086299 22902465 23500188 23524611 22888049 21827637
5971 21827637 20653802 19605049 18757774 18174870 17828863 17611333 17535950 17555346 17789730
5962 17789730 18183840 18792766 19667220 20682881 21762412 22423866 22411072 21891243 21250623
5953 21250623 20778779 20601167 20685393 20978335 21468303 22108770 22791877 23370468 23707286 23724809
5943 23724809 23584203 23429782 23427825 23659121 24145845 24980091 26124841 27590476 29361255
5934B9361255K098829K327785K299038K081230J701590J269699J117801J019590
5926D3276817R95964R23802Q62176R06236J067501J188784J378888J554411J698886
5917E3853465J794537J718965J612164J471561J442275J578048J873947K244214
5909F7589176K552291K954026L252384L216090K427830Q13315j065403k407539
5901G9332170k906506k753502k402541k082029j802526j538388j398226j356663
5893F3091789j436748j526111j628663j596454j488361j413266j282555j161238
5885E1558393j009692q97721r34791j041580j095556j111036j311425j683766
5877D2472826k169950k538170k715279k585286k330658k044845j761828j475546
$$ plain form
5934 29361255 31460084 33787869 36086907 38168137 39869727 41139426 42257227 43276817
5926 43276817 44272781 45196583 46058759 46964995 48032496 49221280 50600168 52154579 53853465
5917 53853465 55648002 57366967 58979131 60450692 61892967 63471015 65344962 67589176
5909 67589176 70141467 73095493 76347877 79563967 81991797 82805112 81739709 79332170
5901 79332170 76425664 73672162 71269621 69187592 67385066 65846678 64448452 63091789
5893 63091789 61655041 60128930 58500267 56903813 55415452 54002186 52719631 51558393
5885 51558393 50548701 49650980 48716189 47674609 46579053 45468017 44156592 42472826
5877 42472826 40302876 37764706 35049427 32464141 30133483 28088638 26326810 24851264
5869B4851264j269984j051833q98945q13426p19221p57581p63075p98216p88412
5860A6990571p29519p37275o78107o47474o36331n96516o06218n23616n04397
5851A1331118m88927m28139l68988l40291l04273k94465k88060k81086l04893
5842H231996k77534k20792k51924k28788k33489j81888j96130j94450j66990j63898
5832F116113j52939j54989j55125j43010j28995j14700j32905j26137j24198r4806
5822D788309j00631j31774r2896o7374o1736j14083j20998j47475j30282j11937
5812C709123q0724m2699o8678q1772r4769r1134p3727o3664m4174r0706p8157
5801B898919k7509p0325m5308m6662n9979m4941K422k4602n0390j9701m2850n0467
$$ plain form
5869 24851264 23581280 22529447 21630502 20817076 20097855 19340274 18577199 17778983 16990571
5860 16990571 16261052 15523777 14845670 14198196 13561865 12965349 12359131 11835515 11331118
5851 11331118 10842191 10414052 10045064 9704773 9400500 9106035 8817975 8536889 8231996
5842 8231996 7954462 7733670 7481746 7252958 7019469 6837581 6641451 6447001 6280011 6116113
5832 6116113 5963174 5808185 5653060 5510050 5381055 5266355 5133450 5007313 4883115 4788309
5822 4788309 4687678 4555904 4463008 4395634 4333898 4219815 4098817 3951342 3821060 3709123
5812 3709123 3628399 3585700 3517022 3435250 3340481 3249347 3175620 3111956 3067782 2977076 2898919
5801 2898919 2871410 2801085 2755777 2709115 2649136 2604195 2606617 2582015 2531625 2511924 2469074 2418607
5789B418607L753m8343n2110k6792m5760j9565l2055k262l3897m9047l7753l9985
5777B034791q943m8861k2022j8603l4918k7673k4666k4018P393o011j1778n2057
5765A762634o75l0963k0282k0131M798k7374M32k00m2587k908k2173q920k2654
5752A568997l379K051l6437l6577J5095l0005j9041J0882p369p904j4282p5754
5740A366277K4825K302j0747L8678l3p008l1061n882L533J6624k2784j1031K7502
5727A391195L6565J8642l011q132K9960J7009j299p408P870N1696L9743O3047
5715A635877N3586L3255P8030J00139R6025J22350R7066J17721O7949J7921k904
5704B417015m0025k3385J3378k0656m9305K8657N9257M2241P1527K2071M3985
$$ plain form
5789 2418607 2422360 2374017 2321907 2295115 2249355 2229790 2197735 2195473 2161576 2112529 2074776 2034791
5777 2034791 2025848 1976987 1954965 1936362 1901444 1873771 1849105 1825087 1832480 1826469 1814691 1762634
5765 1762634 1761959 1730996 1710714 1690583 1695381 1668007 1668439 1668239 1625652 1622744 1600571 1591651 1568997
5752 1568997 1565618 1567669 1531232 1494655 1509750 1479745 1460704 1471586 1464217 1456313 1442031 1366277
5740 1366277 1391102 1393404 1382657 1421335 1421302 1414294 1383233 1377351 1380884 1397508 1374724 1363693 1391195
5727 1391195 1427760 1446402 1443391 1435259 1465219 1482228 1480929 1473521 1481391 1533087 1572830 1635877
5715 1635877 1689463 1722718 1800748 1900887 1996912 2119262 2216328 2334049 2401998 2419919 2417015
5704 2417015 2376990 2353605 2366983 2346327 2297022 2325679 2384936 2427177 2498704 2520775 2564760
5693B564760L8500N6309O9148J04536R3586O3992K7038O8968O8844J07452J44304
5682C407437K00014J87903J97843K25259K17615J20386j23722j81809k18770j40689
5672C891467j85938j58614j04509q4134p6566n4256n9028o1557p9199p5323n5059
5661B897284l9928k6685n2963n5323o2942k4752j1427Q595R296P4564N545O7303
5649B788567O2184L4731j0161j25399j52214j40690j36056j10526j13997r5821
5639B000618j03320n7257o0715o3665l4661l9854j791k1210j5145k9425q961m1420
5627A523194Q08j9328j4527l2237k6994j2096L8298M0457R170O7446p092n928
5615A561171L2571k4375o0361m5514k1921J5603j5153j6094j4221J9096L7118
$$ plain form
5693 2564760 2603260 2659569 2728717 2833253 2926839 2990831 3017869 3086837 3155681 3263133 3407437
5682 3407437 3607451 3795354 3993197 4218456 4436071 4556457 4432735 4250926 4032156 3891467
5672 3891467 3705529 3546915 3442406 3358272 3281706 3227450 3168422 3106865 3027666 2952343 2897284
5661 2897284 2857356 2830671 2777708 2722385 2659443 2634691 2623264 2631859 2641155 2715719 2721264 2788567
5649 2788567 2850751 2885482 2875321 2749922 2597708 2457018 2320962 2210436 2096439 2000618
5639 2000618 1897298 1840041 1779326 1715661 1681000 1641146 1639355 1618145 1603000 1573575 1564614 1523194
5627 1523194 1524002 1504674 1490147 1457910 1430916 1418820 1457118 1497575 1506745 1574191 1567099 1561171
5615 1561171 1593742 1569367 1509006 1463492 1441571 1457174 1442021 1425927 1411706 1430802 1467920
5604A467920j9069l6P438L2838P007N152N9638N8381N4801N0220N1805O6104O9037
5591A911236J06937J24561J10060J21380J14883P5976J67811K06471K25334K97009
5581C461658L79454M50576N26112N99242O09807M89315K04339j71564m09887n10759
5571E628293m87992m23928k68145j88290j27003q1393m5624L9996P5235P9418
5561D200567J10008J01319J46681J85164K37003L11195L55362M62965O12358P45095
5551G467717Q85520J071610J040568R06581L92070l09313p97508r92716j002111
5542H662418q18241o55702n76742m72321l57282k88157k10666j52624j27606j07715
5532D895362p7059o1990m4031R695M0424J10604J79982K47639K75563L78358M34174
$$ plain form
5604 1467920 1448851 1448815 1456253 1489091 1496098 1501250 1560888 1619269 1674070 1724290 1776095 1842199 1911236
5591 1911236 2018173 2142734 2252794 2374174 2489057 2565033 2732844 2939315 3164649 3461658
5581 3461658 3841112 4291688 4817800 5417042 6026849 6516164 6720503 6548939 6139052 5628293
5571 5628293 5140301 4716373 4448228 4259938 4132935 4051542 4005918 4045914 4121149 4200567
5561 4200567 4310575 4411894 4558575 4743739 4980742 5291937 5647299 6110264 6722622 7467717
5551 7467717 8353237 9424847 10465415 11371996 11764066 11454753 10657245 9664529 8662418
5542 8662418 7844177 7188475 6611733 6139412 5782130 5493973 5283307 5130683 5003077 4895362
5532 4895362 4818303 4756313 4712282 4721977 4762401 4873005 5052987 5300626 5576189 5954547 6388721
5521F388721L43243J50234j49531m01270n25486n67058m60287l76346l20332k74732
5511C807156k34926k07168j55993j04983r3277j12672p5742j11289o9120r5480
5501B546506q9517m7078n8988o2126k6582M3212J8297L9734J4474j6974k5812
5490B335146j9904J3218q466k5511K4771k6185K172J9472K4113K6765J5121Q0935
5478B461647O9160K6836L7887K4776j2652J0232L0373M3435P4111O1599P7557
5467B904961J24730J08821q466n9235r6075j01324j24946o6688q2744m4618l3836
5456B520580n2730n1363q6643n6025k4548m6254n8249n2692l8127l3912j5069
5445B004968k8777m8234j7933k7996l7938m1736k7353q405p4517j00400q5437
$$ plain form
5521 6388721 6731964 6882198 6732667 6331397 5805911 5238853 4778566 4402220 4081888 3807156
5511 3807156 3572230 3365062 3209069 3104086 3010809 2898137 2822395 2711106 2641986 2546506
5501 2546506 2456989 2409911 2350923 2288797 2262215 2305427 2323724 2363458 2377932 2360958 2335146
5490 2335146 2315242 2328460 2319994 2294483 2319254 2293069 2295241 2314713 2338826 2365591 2380712 2461647
5478 2461647 2530807 2557643 2595530 2620306 2607654 2617886 2648259 2691694 2765805 2827404 2904961
5467 2904961 3029691 3138512 3130046 3070811 2974736 2873412 2748466 2681778 2599034 2554416 2520580
5456 2520580 2467850 2416487 2329844 2273819 2249271 2203017 2144768 2092076 2053949 2020037 2004968
5445 2004968 1976191 1927957 1910024 1882028 1844090 1802354 1775001 1766596 1692079 1591679 1506242
5434A506242j20978j20387n8295k0859n1192m1034l8408l2802k969p485j2298
5423I99535n4574k7238n727j4654k3836q189n0996n3405p362j6234L285J2499
5411G53104m2889m0714J2627j7762k0999k6181L3403k4190k4473K921p57j4582
5399E89508L1288L217n5585j6243j8316O510K733r585J4723j2477k097j6952j4865
5386E01859M436J673k2945q228L7143o964j8723R112j0672J6008n526J7402j3331
5373E01244l0078o303j1428J9456k2375O437J7594k5233k2071J3771J5035o961
5361D49088J9415R466Q06J5144N809k2234J8326k5692J7743K4742k7119j6154
5349D69340O754L9411p725l1699Q289L3246m2930K7856m879M268J6560k6926J610
$$ plain form
5434 1506242 1385264 1264877 1206582 1185723 1134531 1093497 1055089 1022287 1019318 1011833 999535
5423 999535 944961 917723 911996 897342 873506 865317 814321 760916 753554 737320 740605 753104
5411 753104 710215 669501 682128 664366 643367 617186 650589 626399 601926 604847 604090 589508
5399 589508 620796 624013 568428 552185 533869 540379 543112 533527 548250 535773 533676 516724 501859
5386 501859 506295 507968 485023 476795 513938 506974 488251 497363 486691 502699 497173 514575 501244
5373 501244 471166 464863 453435 472891 450516 456953 474547 449314 427243 441014 456049 449088
5361 449088 468503 477969 478775 493919 499728 477494 495820 470128 487871 512613 485494 469340
5349 469340 476094 515505 507780 476081 484370 517616 474686 502542 497663 501931 518491 491565 493175
5336D93175J4663r397n797K6688M999J6633O93k01o048J3942J3864j6793J2064
5323E58485N133K7135J3562p397l842q550j3080L4105J8249K0052j1139m979j1168
5310F16566j410J6371j0347K0164J996Q383j2124J4051j474N171J399m8322j5891
5297E94533l2469J1617L3294J7687j4165L2304M0179k2222O629R841K2329L0126
5285G29683J2617P852R774O361K0299K383J2476J1135l5131P856L2131O634J8063
5272H42133L1341O6263m031K5208M7286O6279R2692R5041J38956R1226R9078O6356
5260A657828j2556l8347p8636p5560o6687p3476n3833l4173m2143j0352Q82M551
5248A177498K423J330L7668K7587K7998L5276K7415P5894M7923Q5103Q2074J10053
$$ plain form
5336 493175 507838 498441 492644 519332 524331 540964 541657 541456 535408 549350 563214 546421 558485
5323 558485 563618 590753 604315 596918 593076 584526 571446 605551 623800 643852 632713 627734 616566
5310 616566 615156 631527 621180 641344 643340 651723 639599 653650 652176 657347 658746 610424 594533
5297 594533 562064 573681 606975 624662 610497 642801 682980 660758 667387 677228 699557 729683
5285 729683 742300 750152 759926 766287 786586 788969 801445 812580 777449 785305 817436 824070 842133
5272 842133 873474 939737 935706 960914 1008200 1074479 1167171 1262212 1401168 1492394 1591472 1657828
5260 1657828 1645272 1606925 1528289 1452729 1386042 1312566 1258733 1224560 1182417 1172065 1172947 1177498
5248 1177498 1179921 1181251 1218919 1246506 1274504 1309780 1337195 1413089 1461012 1546115 1628189 1738242
5236A738242J99633J84280K23518K83408L29413L84773L69773K23264K9849j38632
5226C827521l08002l59973l10300k84767k29627j34864q7824q5215n0774p1206
5216A904969k0342k7581k3705L6057L2635M0127k240N5094N1677R3034J14886
5205B254611J42161J47492K08000K65604L51113L85118M34542M61383M29056K86337
5195E365417J9508j53333l52892l43962l57380l25862k83426k02813k09107j48244
5185C007906q2287q5938q1440q132Q851K8486N0605Q9472Q9683Q6489J32247J79683
5173C415625J87079J62044J60918J76404J59399J39941J84970K46212K80192L35861
5163E448645L13763L24730K47802Q3200p8179k85304l92295m03514l16030k95382
$$ plain form
5236 1738242 1937875 2122155 2345673 2629081 2958494 3343267 3713040 3936304 3966153 3827521
5226 3827521 3519519 3159546 2849246 2564479 2334852 2199988 2112164 2026949 1976175 1904969
5216 1904969 1884627 1857046 1833341 1869398 1902033 1942160 1939920 1995014 2046691 2139725 2254611
5205 2254611 2396772 2544264 2752264 3017868 3368981 3754099 4188641 4650024 5079080 5365417
5195 5365417 5384925 5231592 4878700 4534738 4177358 3851496 3568070 3365257 3156150 3007906
5185 3007906 2925619 2839681 2758241 2750109 2758960 2787446 2838051 2927523 3017206 3103695 3235942 3415625
5173 3415625 3602704 3764748 3925666 4102070 4261469 4401410 4586380 4832592 5112784 5448645
5163 5448645 5762408 6087138 6334940 6418140 6339961 6054657 5662362 5258848 4942818 4647436
5153D647436k51005j84529j11543o6126p6652j3460P8393J27736J11327J57968
5143D419545K68888L19489L52826L86853L49349K30712O3249r8529k01444k04589
5133E886349j13618K744N1022J52638K06296K38796J83932j6632k68177l45022
5123E978328l79943l86303l39071k85655k04735j78185j28380r1782l4227J8480
5113C968527O1838P6000J28862J87443K55306K88891L29098L15372K70174J0995
5103E892506j94068l55824l91154l49251k55634j77156j25231j32818o4141p8820
5093C768409q5991j65333j97100j71967j53750j63202j88658j52327j03985q0776
5083B305320q5029m8486n6547l1396J6505M9292N158M3711P6610M8523M9531O3863
$$ plain form
5153 4647436 4396431 4211902 4100359 4034233 3957581 3944121 4022514 4150250 4261577 4419545
5143 4419545 4688433 5007922 5360748 5747601 6096950 6327662 6390911 6292382 6090938 5886349
5133 5886349 5772731 5775475 5826497 5979135 6185431 6424227 6608159 6591527 6323350 5978328
5123 5978328 5598385 5212082 4873011 4587356 4382621 4204436 4076056 3984274 3950047 3968527
5113 3968527 4030365 4106365 4235227 4422670 4677976 4966867 5295965 5611337 5881511 5892506
5103 5892506 5698438 5342614 4951460 4602209 4346575 4169419 4044188 3911370 3847229 3768409
5093 3768409 3682418 3517085 3319985 3148018 2994268 2831066 2642408 2490081 2386096 2305320
5083 2305320 2220291 2171805 2115258 2083862 2100367 2149659 2154817 2198528 2275138 2323661 2373192 2437055
5071B437055l0209q0279j28262j29455j52412j18068j00735j42518j02781l9676
5061A412660o4959r8341n4499q9997k8759l1887l3632m2674j7393k1850k9843
5050H98826k0793j2280m5990l4719j9347j4657L209k0176j5907n2110k7789K7203
5038F65470p767k2194J723k7463J3619j7297J29j2451L07k0130j4433J2527P955
5025E79995l5540l2399M160q190m0037o607j3386L682J7676j1713o766j1711j1578
5012D27586L1149J7613p398j5233L0619j9671M55m28j3558J1201K6748K3423k3447
4999D89059K1456j0460j6010l883r293k0361O657l8289k0103r312M47M727j2212
4986C82423l130j5154J4680n979K089L118k7408j3269j2484K6008L5055J2131
$$ plain form
5071 2437055 2406846 2326567 2198305 2068850 1916438 1798370 1697635 1555117 1452336 1412660
5061 1412660 1347701 1249360 1194861 1104864 1076105 1044218 1010586 967912 950519 928669 898826
5050 898826 878033 865753 819763 785044 765697 751040 754249 734073 718166 666056 638267 665470
5038 665470 657703 635509 637232 609769 623388 606091 606220 593769 594076 573946 559513 572040 579995
5025 579995 544455 512056 516216 508026 467989 461382 447996 451678 469354 457641 450875 439164 427586
5012 427586 458735 476348 468950 453717 484336 464665 465120 464692 451134 462335 489083 512506 489059
4999 489059 510515 500055 484045 480162 470869 450508 457165 418876 398773 389461 389908 394635 382423
4986 382423 379293 364139 378819 372840 374929 378047 350639 337370 324886 350894 385949 398080
4974C98080J0762j7835L5165J0158q586K3943K8465L04O697k168p862J2266r295
4961D80094l4616q915k1283l2850j1257l6455R41K6368j1427J458o198n1291L39
4948B94908M8992j5138l695K438m806J2028J2656k9638j4199L2848l202J3573
4936C46765J7640L0768p635n512j1658J945j9988O953K5185k4332Q933J624k3850
4923C46838j6585J2595N679K1757K8355q304l1285P834k645m0378L1573J0878
4911C66312j2561k7861M4740L4933j6705K2894k0661O426K1159K7204Q906k6084
4899D28702J7951k1724K2456j4563m9091K4815K6543j8417j2812J2256j9511l968
4887C92637Q671K099K3503J6571o926k637k412P308L0325k0151j1821N095K5664
$$ plain form
4974 398080 408842 391007 426172 436330 427744 451687 480152 480456 487153 484985 477123 489389 480094
4961 480094 445478 436563 415280 382430 371173 334718 335659 362027 350600 352058 345860 294569 294908
4948 294908 343900 328762 325067 327505 322699 334727 347383 317745 303546 336394 333192 346765
4936 346765 364405 395173 387538 382026 370368 372313 352325 359278 384463 360131 369064 370688 346838
4923 346838 330253 342848 348527 370284 398639 390335 359050 366884 364239 323861 355434 366312
4911 366312 353751 325890 370630 405563 388858 411752 391091 397517 418676 445880 454786 428702
4899 428702 446653 424929 447385 432822 383731 408546 435089 416672 403860 416116 396605 392637
4887 392637 401308 403407 426910 443481 436555 433918 431506 438814 469139 448988 437167 442262 467926
4874D67926k522L0560n94O37K150k2350j4267r695k283o191J2864K4770J7021
4861D98026J6579L0499j1482k7114K3458L8848J0205K2405j7937R072J9677J4862
4849F27098J9701M3570K2078K7178J7258o77K3212K1163L8560M6671N3527O2845
4837A002184P8365Q2553P5189L5481N0448O7129r772j7147n3492o8750n5063k8375
4825A158750p3590n0909k8027m3463k4892K0319n529o240M1469J0652K6710M6545
4813A071795M8128K3325L4566L7998J9143P6655N4372M9155P4449R1238J12256
4802A693080J44012J65096J78566K03882J23417J56153Q3024j6910o2903p5076
4792B592341j10707k13388j63470j38621j35932j29653j10347j01003n2858n2242
$$ plain form
4874 467926 465404 495964 495370 496007 498157 475807 461540 451845 449562 443371 456235 481005 498026
4861 498026 514605 545104 533622 506508 529966 568814 579019 601424 583487 592559 612236 627098
4849 627098 646799 690369 712447 739625 756883 756206 779418 800581 839141 885812 939339 1002184
4837 1002184 1080549 1163102 1238291 1273772 1324220 1391349 1381577 1364430 1310938 1242188 1187125 1158750
4825 1158750 1085160 1034251 1006224 962761 937869 958188 952659 946419 987888 998540 1025250 1071795
4813 1071795 1119923 1143248 1177814 1215812 1234955 1311610 1365982 1415137 1489586 1580824 1693080
4802 1693080 1837092 2002188 2180754 2384636 2508053 2664206 2747230 2730320 2667417 2592341
4792 2592341 2481634 2268246 2104776 1966155 1830223 1700570 1590223 1489220 1436362 1384120
4782A384120k2761m8763m1874k665l2376m4378l3493K1037j1707o5174l9557l1517
4770A030892K6903l068K7139m755n5136j9947M590k2154J3331M861l6344M1739
4758A008051j2188M826J3125P963k4221L3374k3333j1999L1839J1552K3663M686
4746A067338k0671j0236K5598r384O846L890j0382J0023L303M9996M5106k6877
4734A134550k108N3675J8509M0523K5182p605L085M2082O072J0704L2695L1709
4722A389073L2622J886m9734J2201K0368L8638J3294j0626L0903J7692J6408j915
4710A510810O983N794K3908J5959N873k6806k583j1513L0308J1205J7984N245
4698A593167M1997J5726M9382M2150L8361N2737R273M5768J9206N5868J5785J1561
$$ plain form
4782 1384120 1361359 1312596 1270722 1268057 1235681 1191303 1157810 1178847 1167140 1101966 1062409 1030892
4770 1030892 1057795 1054727 1081866 1077111 1021975 1002028 1006618 984464 997795 1002656 966312 1008051
4758 1008051 995863 1000689 1013814 1021777 997556 1030930 1007597 995598 1027437 1038989 1062652 1067338
4746 1067338 1046667 1036431 1062029 1052645 1059491 1063381 1052999 1063022 1066325 1116321 1161427 1134550
4734 1134550 1132442 1186117 1204626 1245149 1270331 1262726 1265811 1307893 1313965 1324669 1357364 1389073
4722 1389073 1421695 1423581 1373847 1386048 1406416 1445054 1458348 1447722 1478625 1496317 1512725 1510810
4710 1510810 1517793 1523587 1547495 1563454 1569327 1542521 1539938 1528425 1558733 1569938 1587922 1593167
4698 1593167 1635164 1650890 1700272 1742422 1780783 1833520 1842793 1888561 1907767 1963635 1979420 1990981
4686A990981N1760M0485j8829m8519n184K8864J9216q438j8483N302l7706L2254
4674B031703J1708m4344j8113J2168M3068K6691L701k91N3401K4308N6036O2370
4662B262406N1598O9090N2199N3910N2945M9719O0771M1213O2685K5177O0086
4651B841799Q5111M0159M3539Q428n930k6509k5589k6980K0321r759N37J8245
4639B963372k9325J1310K0888J6647N6244J5722M3621N6679P2502O3955L4057
4628C325672J09086Q4280J02895O8278L0298O2515P6378Q2883M3752J14915J14223
4617D215175Q5061J14548J19857J41591J06376J30865J49543J52779R4531J55396
4607E465722J30951J02099R8111J14137J67786J11906J66388J59663J38687J68414
$$ plain form
4686 1990981 2042741 2083226 2064397 2015878 2010694 2039558 2058774 2050336 2031853 2037155 1999449 2031703
4674 2031703 2043411 1999067 1980954 1993122 2036190 2062881 2066582 2066291 2119692 2144000 2200036 2262406
4662 2262406 2314004 2383094 2435293 2489203 2542148 2591867 2652638 2693851 2756536 2781713 2841799
4651 2841799 2926910 2967069 3010608 3019036 3013106 2986597 2961008 2934028 2954349 2944590 2945127 2963372
4639 2963372 2934047 2945357 2966245 2982892 3039136 3054858 3098479 3155158 3227660 3291615 3325672
4628 3325672 3434758 3519038 3621933 3690211 3720509 3783024 3859402 3942285 3986037 4100952 4215175
4617 4215175 4300236 4414784 4534641 4676232 4782608 4913473 5063016 5215795 5310326 5465722
4607 5465722 5596673 5698772 5796883 5911020 6078806 6190712 6357100 6516763 6655450 6823864
4597F823864J60935J56165J77232J72788K13955J92512J60237J81720J77434J73619
4587H590461J59532K39617K83934K62586K79847L30872L68185M36912N27268N77163
4577A2056377N87032O46898P43378P86645Q50193Q75775R43371J004730J094825
4568A9589224J148925J229486J263514J385614J499273J681578J914616K162809
4560C1875039K459016K843393L257537L632271M140478M770367N605632O704935
4552F5288668Q159677R979595J2125940J4054421J4996207J4557059J2587777
4545A51749344R025504M116951j510836o500616j0097734j2091352j2585791j1599438
4537A10506032r685587p449017n436666l801323k500285j525648o86101J9652
$$ plain form
4597 6823864 6984799 7140964 7318196 7490984 7704939 7897451 8057688 8239408 8416842 8590461
4587 8590461 8749993 8989610 9273544 9536130 9815977 10146849 10515034 10951946 11479214 12056377
4577 12056377 12643409 13290307 14033685 14820330 15670523 16546298 17489669 18494399 19589224
4568 19589224 20738149 21967635 23231149 24616763 26116036 27797614 29712230 31875039
4560 31875039 34334055 37177448 40434985 44067256 48207734 52978101 58583733 65288668
4552 65288668 73448345 83427940 95553880 109608301 124604508 139161567 151749344
4545 151749344 160774848 164891799 163380963 156880347 146782613 134691261 122105470 110506032
4537 110506032 100820445 93371428 87934762 84133439 81633154 80107506 79421405 79441057
4529G9441057O30763J238013J912019K718272L616843M620643N726904O931257
4521A06835771Q328250R932708J1966460J4557351J7854861K1808873K6175728
4514B17460002L0070538L2245930L1920530K8620037K1983996J2391559J175996
4507C75868588r821100j9261820k6283180l0255780l1039086k9316361k6195726
4500B03695535k2428671j8636260j5310523j2634244j0593085r079132q000174
4493A07013446p177168o522738n950125n435997m988836m552844m116453l711937
4485F4557348l296317k901515k515236k149851j793392j566298j401028j327824
4477D7605887j418318j521459j712325j816344j874834j926602j888257j804233
$$ plain form
4529 79441057 80071820 81309833 83221852 85940124 89556967 94177610 99904514 106835771
4521 106835771 115164021 125096729 137063189 151620540 169475401 191284274 217460002
4514 217460002 247530540 279776470 311697000 340317037 362301033 374692592 375868588
4507 375868588 366047488 346785668 320502488 290246708 259207622 229891261 203695535
4500 203695535 181266864 162630604 147320081 134685837 124092752 115013620 107013446
4493 107013446 99836278 93313540 87363415 81927418 76938582 72385738 68269285 64557348
4485 64557348 61261031 58359516 55844280 53694429 51901037 50334739 48933711 47605887
4477 47605887 46187569 44666110 42953785 41137441 39262607 37336005 35447748 33643515
4469C3643515j675926j572684j484850j388052j304234j190878j125727j095324
4461B2805840r60558q80718q41976p70279p37837o63969o29022n70260n17618
4452A6233603n08952m48918m06344l68542l72905l20833l18673k59778k16189
4443A3012469k10309k30248k24154j55207k05498k34603j82984j88932k16678
4434A1163856j96286k06975k14922j66880j81935j83481r5604p5702l7710l6234
4424I768127K4946Q4391J56765J95110K30744L28507L91826L92935L19854K28051
4414A2121256N8872j50677l23322m20937n68126o19848n89388n97880n20127m72123
4404G917700l21084k84638k70668k14552j71753j26529j32024j35127j32891r8764
$$ plain form
4469 33643515 31967589 30394905 28910055 27522003 26217769 25026891 23901164 22805840
4461 22805840 21845282 20964564 20122588 19352309 18614472 17950503 17321481 16751221 16233603
4452 16233603 15724651 15275733 14869389 14500847 14127942 13807109 13488436 13228658 13012469
4443 13012469 12802160 12571912 12347758 12192551 11987053 11752450 11569466 11380534 11163856
4434 11163856 10967570 10760595 10545673 10378793 10196858 10013377 9917773 9842071 9804361 9768127
4424 9768127 9793073 9877464 10034229 10229339 10460083 10788590 11180416 11573351 11893205 12121256
4414 12121256 12180128 12029451 11706129 11285192 10717066 10097218 9507830 8909950 8389823 7917700
4404 7917700 7596616 7311978 7041310 6826758 6655005 6528476 6396452 6261325 6128434 6029670
4394F029670q2409r6012j16085r2231n9256j00667p9213q4561r8241r8234q1585
4383E041176q3357q3531r4460r7524q3079p4530r5295j14220p4428j00142j03069
4372D037541q1846p8681j05148p4876o9806n9235n1055m9055n1347l6997k5035
4361C354460k5938o6002l2411l1192O012m623j3175l2133n6977l0792l7023j9702
4349C010504o4253o0200m9907n6581l7499k0084o6581k3792o616k7953m7083m1392
4337B508563k7076o0484m1415l7239m4840k4780P757j1529L0299M055m6692l1746
4325B224873l0295K6739J5507k2681J1103j256j8829J9849j4955r221M632R742
4313B215208p887n9183j3570J1439J3191K0533K461o635J6055K2603K1232K1056
$$ plain form
4394 6029670 5947261 5851249 5735164 5642933 5583677 5483010 5403797 5319236 5220995 5122761 5041176
4383 5041176 4957819 4874288 4779828 4682304 4599225 4524695 4429400 4315180 4240752 4140610 4037541
4372 4037541 3955695 3877014 3771866 3696990 3627184 3567949 3516894 3467839 3416492 3379495 3354460
4361 3354460 3328522 3262520 3230109 3198917 3204929 3200306 3187131 3154998 3098021 3067229 3030206 3010504
4349 3010504 2946251 2886051 2836144 2779563 2742064 2721980 2655399 2631607 2624991 2597038 2549955 2508563
4337 2508563 2481487 2421003 2379588 2342349 2297509 2272729 2280486 2268957 2299256 2303311 2256619 2224873
4325 2224873 2194578 2221317 2236824 2214143 2225246 2223990 2205161 2225010 2210055 2200834 2205466 2215208
4313 2215208 2207321 2148138 2134568 2146007 2159198 2179731 2182192 2175557 2191612 2214215 2235447 2256503
4301B256503N0381L3103O4199K7907N3186N5606l630P4973N7878N9122M5024P3579
4289B847831Q0468M0997J00001N4048O3078Q1121Q4006R6039J50914J24431J31882
4278C854816J57631J42926K06829J81618J84712K24536K12629K50314L14782L27218
4268F058011L72418L80742M34047M61151N05964N25564N52784N87277N50507N23757
4258A0952222N01091M07367K70992J73427O4795q9316k18649l22676m05323m39489
4248A0894441m49358m73988m59220m71937m56577m59175m35990l56093l23348
4239G008755l22001l37104k93484k43497k24840k03101j78733j71575j64559j14199
4229D755662j39190j07775p7957j8866K0815L2126P4725N8944R4306M4273J1401
$$ plain form
4301 2256503 2306884 2339987 2404186 2432093 2485279 2540885 2537255 2612228 2670106 2729228 2774252 2847831
4289 2847831 2928299 2969296 3069297 3123345 3186423 3267544 3351550 3447589 3598503 3722934 3854816
4278 3854816 4012447 4155373 4362202 4543820 4728532 4953068 5165697 5416011 5730793 6058011
4268 6058011 6430429 6811171 7245218 7706369 8212333 8737897 9290681 9877958 10428465 10952222
4258 10952222 11453313 11860680 12131672 12305099 12369894 12280578 12061929 11739253 11333930 10894441
4248 10894441 10445083 9971095 9511875 9039938 8583361 8124186 7688196 7332103 7008755
4239 7008755 6686754 6349650 6056166 5812669 5587829 5384728 5205995 5034420 4869861 4755662
4229 4755662 4616472 4508697 4430740 4411874 4432689 4464815 4539540 4598484 4692790 4737063 4748464
4218D748464l4939j04640j45067k19215k59108k44009k20109k44288j69977j15264
4208B991848j62096j33524p7475r1867r4379p3424p7929m9060o1651q5443o3289
4197B021711p6611k1645l3981n7178l2011n9172k0342k3233k2327l8776l7799
4186A598636k2550k9590l3533m0841n3257j6646k0395l7274l1955j9085k9534
4175A263976n4192j9949j746j2779o598N624k3777r137l5868n4356R230J9138
4163A079566l1846j3156N455L33r710J9752j0680k5731n763q729M766n190K0202
4150A019269o40j5599K195K3348P420q48L282O503R361j2656k1422o480q138j9253
4136I86342l2814O726k545J7051p52J318q992Q965L0361J806R527L1486o376j0640
$$ plain form
4218 4748464 4713525 4608885 4463818 4244603 3985495 3741486 3521377 3277089 3107112 2991848
4208 2991848 2829752 2696228 2618753 2526886 2432507 2359083 2281154 2232094 2170443 2085000 2021711
4197 2021711 1945100 1923455 1889474 1832296 1800285 1741113 1720771 1697538 1675211 1636435 1598636
4186 1598636 1576086 1546496 1512963 1472122 1418865 1402219 1381824 1344550 1312595 1293510 1263976
4175 1263976 1209784 1189835 1188089 1175310 1168712 1174336 1150559 1141422 1105554 1051198 1060428 1079566
4163 1079566 1047720 1034564 1040019 1040352 1030642 1050394 1039714 1013983 1008220 999491 1004257 999067 1019269
4150 1019269 1018629 1003030 1005225 1028573 1035993 1035145 1038427 1044930 1054291 1041635 1020213 1013733 1005595 986342
4136 986342 953528 960254 957709 974760 974008 975326 966334 975299 1005660 1007466 1016993 1048479 1042103 1031463
4122A031463L0531K4694j0531J8370l216k9717M6203j5214k304r726l854J3146
4110A089845l7918k2542l230j0767j3519o428J333L21j2451J9361l2204m443n7957
4097I09401j3781K1646j4513k987l4843L0224o222J5236j8006j1786K274K9181
4085I05824N0729q884l1532R641O0244p270M063n7J77K3157J5933r161l1756L25
4071I81433P022j6463k0194l120k6567o358j7947L2870J4072k8424L318J6338
4059I35980j0760j3299n819L372J6691j43J3425M8510J5183J0806N059J355K8197
4046A048557L2410L9221j2547j5572j0629n467L3825J75r90j1954N5561j8836
4034A133754l35K2694J929L3554R442K5002O878O0033L5868O157P222M9042M9444
$$ plain form
4122 1031463 1061994 1086688 1076157 1094527 1091311 1061594 1107797 1092583 1090279 1080553 1076699 1089845
4110 1089845 1051927 1029385 1026155 1015388 1001869 995441 996774 997095 984644 1004005 971801 967358 909401
4097 909401 895620 917266 902753 899766 864923 895147 888925 904161 886155 874369 876643 905824
4085 905824 956553 947669 916137 925778 986022 978752 982815 982758 982935 1006092 1022025 1012864 981108 981433
4071 981433 988455 971992 951798 948678 922111 915753 897806 930676 944748 916324 919642 935980
4059 935980 925220 911921 906102 909474 926165 926022 939447 987957 1003140 1013946 1019005 1020360 1048557
4046 1048557 1080967 1120188 1107641 1092069 1081440 1075973 1109798 1109973 1108983 1097029 1152590 1133754
4034 1133754 1133419 1156113 1158042 1191596 1201038 1226040 1232918 1292951 1328819 1334976 1342198 1391240 1440684
4021A440684j9863L7446M593J2109K5217K7593j8638r701P0919j3269Q618K2988
4009A588696M8512M6695M3744P4428N7887N7592N4962O6427R4808Q8842J17038
3998B339631R5934J12356J22702J92693J52354J67965J08638K4572K2629l6766
3988C302708l4511p908N82M1626R0111R9631J34145J51857J42597J48930J13127
3977D182895Q5088N6015O0392P0986O9186Q5577Q7857J06690J57543J76155K79071
3966E417455L63355L72506M27190L69017J79878N452n2133j02122j42313j19813
3956F718472m4425m073M9558K5448J14395J51831J84692K01821J95386J88249
3946G781354J40386J07151R200j6922m0833J3722J4340N3249J46280J95361L16894
$$ plain form
4021 1440684 1420821 1458267 1462860 1474969 1500186 1527779 1509141 1499440 1570359 1557090 1565708 1588696
4009 1588696 1637208 1683903 1727647 1802075 1859962 1917554 1972516 2038943 2133751 2222593 2339631
3998 2339631 2435565 2547921 2670623 2863316 3015670 3183635 3292273 3316845 3339474 3302708
3988 3302708 3268197 3260289 3260871 3302497 3392608 3492239 3626384 3778241 3920838 4069768 4182895
3977 4182895 4267983 4323998 4384390 4455376 4524562 4610139 4697996 4804686 4962229 5138384 5417455
3966 5417455 5780810 6153316 6580506 6949523 7129401 7134853 7082720 6980598 6838285 6718472
3956 6718472 6674047 6669974 6719532 6744980 6859375 7011206 7195898 7397719 7593105 7781354
3946 7781354 7921740 8028891 8038091 8021169 7980336 7994058 8008398 8061647 8207927 8403288 8720182
3935H720182K89741L25808L04393J57923r0980l24585l56266l37756k76622k24262
3925H187576j76955r9712l1384k2378L0305R4051J32325J38535J19874J19405
3915H491642P7136J07191P9552O6239Q0916R6197R2755M5652Q8800L5137k0717
3904I240500r3087k08574k36407k22158j81641j48005q3385j9900K5628Q3500
3894H156471J36803J76734J08543J47380J53756K17959K49026L46439L73389M27547
3884A0494047M83191M61149M01697K77280J86840J17947J06953J34736K00051
3875A2863891J98382K02525J79473J71080J63603K10812K61948L30720L56246
3866A4938680M70349N60110O26021O28710O38763O07369N69975N90273O88894
$$ plain form
3935 8720182 9009923 9335731 9640124 9798047 9707067 9382482 9026216 8688460 8411838 8187576
3925 8187576 8010621 7910909 7879525 7857147 7887452 7981503 8113828 8252363 8372237 8491642
3915 8491642 8568778 8675969 8755521 8821760 8902676 8998873 9091628 9137280 9226080 9261217 9240500
3904 9240500 9147413 8938839 8702432 8480274 8298633 8150628 8067243 8047343 8072971 8156471
3894 8156471 8293274 8470008 8578551 8725931 8879687 9097646 9346672 9693111 10066500 10494047
3884 10494047 10977238 11438387 11840084 12117364 12304204 12422151 12529104 12663840 12863891
3875 12863891 13062273 13264798 13444271 13615351 13778954 13989766 14251714 14582434 14938680
3866 14938680 15409029 15969139 16595160 17223870 17862633 18470002 19039977 19630250 20319144
3857B0319144P68918R65413J166974J418495J679930J963451K192807K425322
3849C2900454K570698K536286K291288J870146J509459J239294J096513J017658
3841D7031796J138068J318158J575119J841751K025144J980490J686461J239916
3833E9836903R22809O85522O58963Q35197J098439J516577J977178K379663K883934
3824G2795185L325362L646093L398128K246511J99666j840412l057249l402231
3816G7311053l209001k760378k326578j956260j525261j154586q34992o03531
3808F2940466o45441q79524j249425j739088k140544k229472k094441j867892
3800E0094639j586797j396150j281804j185294j126636j264155j568957j921275
$$ plain form
3857 20319144 21088062 22053475 23220449 24638944 26318874 28282325 30475132 32900454
3849 32900454 35471152 38007438 40298726 42168872 43678331 44917625 46014138 47031796
3841 47031796 48169864 49488022 51063141 52904892 54930036 56910526 58596987 59836903
3833 59836903 60759712 61445234 62104197 62939394 64037833 65554410 67531588 69911251 72795185
3824 72795185 76120547 79766640 83164768 85411279 85610945 83770533 80713284 77311053
3816 77311053 74102052 71341674 69015096 67058836 65533575 64378989 63543997 62940466
3808 62940466 62295025 61415501 60166076 58426988 56286444 54056972 51962531 50094639
3800 50094639 48507842 47111692 45829888 44644594 43517958 42253803 40684846 38763571
3792C8763571k275547k370485k256928k084263j839410j648689j435548j181912
3784B3670789r68394q57579p21569o72083o59584o97888o89467o87663o48744
3775A7067818o68201n71149n13557m91922l99676l28628m01506m12697l98232
3766A2882250l48997l27187k52076k01463j55912j69023j74959j60534j80068
3757A0912031j58101j30720r2713j18355o9216n5467j8749m4341l8671O985R6731
3746A0289414J01157J79678J18305L137j11103l02788l69907l61776l27801k67714
3736H950602k20916j84519j80252j97388j02398j01584j26716m5806l8882K2018
3726G774159M7956P4963P0088k8565k8010q1504n9639M8313L2880K5850O4632
$$ plain form
3792 38763571 36488024 34117539 31860611 29776348 27936938 26288249 24852701 23670789
3784 23670789 22702395 21844816 21123247 20451164 19791580 19093692 18404225 17716562 17067818
3775 17067818 16399617 15828468 15314911 14822989 14423313 14094685 13693179 13280482 12882250
3766 12882250 12533253 12206066 11953990 11752527 11596615 11427592 11252633 11092099 10912031
3757 10912031 10753930 10623210 10530497 10412142 10342926 10287459 10268710 10224369 10185698 10192683 10289414
3746 10289414 10390571 10570249 10688554 10691691 10580588 10277800 9907893 9546117 9218316 8950602
3736 8950602 8729686 8545167 8364915 8167527 8065129 7963545 7836829 7791023 7752141 7774159
3726 7774159 7822115 7897078 7967166 7938601 7910591 7829087 7769448 7817761 7850641 7876491 7941123
3715G941123L2962J5530M2009m3008m4701q3754r0512p2379m8048r7018q9082
3704G463122j48073k37050k70410k52016k21321k12016j47199j10340j22955j32897
3694E608845j25369j64099r0081j15642r0420l5015o842K3434R9943P1910J27042
3683E303706J03252L6719K3270p199k7117m7809p2076j40702j56198j44823j60041
3672D710982j97121k36426k40374k09463j10460j14977j39418q6367r1072n1121
3662C234183p5476o6891k9758o072m9910j7393k2804j7140J9534K3301k3196n9684
3650B908694l0085k9302l9364j2298n0084m5589n0339o2329o5759p5510n3646
3639B394389k7788l0727q0293j9311n1491k7028L6372n391l3306j7427k047L095
$$ plain form
3715 7941123 7974085 7989615 8031624 7988616 7943915 7860161 7769649 7697270 7649222 7552204 7463122
3704 7463122 7315049 7077999 6807589 6555573 6334252 6122236 5975037 5864697 5741742 5608845
3694 5608845 5483476 5319377 5229296 5113654 5023234 4988219 4981377 5004811 5104754 5176664 5303706
3683 5303706 5406958 5443677 5466947 5459748 5432631 5384822 5312746 5172044 5015846 4871023 4710982
3672 4710982 4513861 4277435 4037061 3827598 3717138 3602161 3462743 3376376 3285304 3234183
3662 3234183 3158707 3091816 3062058 3055986 3006076 2988683 2965879 2948739 2968273 2991574 2968378 2908694
3650 2908694 2878609 2849307 2809943 2797645 2747561 2701972 2651633 2589304 2523545 2448035 2394389
3639 2394389 2366601 2335874 2255581 2236270 2184779 2157751 2194123 2188732 2155426 2137999 2135952 2139047
3627B139047l7369j4053j5618o7072j434J7448r111J091p589m619P978J495J8968
3614B029162o199j0371N282P39M0593K4817j4099j1934J6192L1968L8222N0741
3602B195113j9454k3081N881N8752L4682J8089L1711M9071N4436K6519R3604N2738
3590B578061N7389L5372N5007K2827O1108P6878O8547J00469N1602Q6612R2719
3579C286591J20508J49742J36617J54806J90298K53259K71787L05321L41491M29516
3569E639936M99737N79652O96900Q17716R21981R46880Q42404M62705j5493m45057
3559A0947361p27263p89356o96041n40659m49494l71856k35564j47938j09131
3550F880059n4493o593l428O2614Q7107J16973J73747K55602L32290L50083L95881
$$ plain form
3627 2139047 2101678 2087625 2072007 2004935 2003501 2020949 2011838 2012929 2005340 2000721 2008699 2010194 2029162
3614 2029162 2022963 2012592 2017874 2018613 2059206 2084023 2069924 2057990 2074182 2106150 2144372 2195113
3602 2195113 2175659 2152578 2158459 2217211 2251893 2269982 2301693 2350764 2405200 2431719 2525323 2578061
3590 2578061 2635450 2670822 2725829 2748656 2809764 2886642 2955189 3055658 3107260 3193872 3286591
3579 3286591 3407099 3556841 3693458 3848264 4038562 4291821 4563608 4868929 5210420 5639936
3569 5639936 6139673 6719325 7416225 8233941 9155922 10102802 10945206 11407911 11392418 10947361
3559 10947361 10220098 9430742 8734701 8194042 7744548 7372692 7137128 6989190 6880059
3550 6880059 6825566 6818973 6815545 6878159 6965266 7082239 7255986 7511588 7843878 8193961 8589842
3539H589842N33025N49874O99680Q40253J021021J240922J484945J786815J906341
3530A8652718J753258J113628N4044r80667j550963j639147j466130j225018r57303
3521A3754420p45262n55360l64375k40410j98551p3142j2261J2000O9523R5782
3511A1742364J20886J88762K54215L03116K92404L84050M24261M93841O03857
3502A4807756P41437R15367J120756J290526J442561J523755J376853J137270
3494B4356281R12690R32041J300798J833669K415273K880567K897800J457052
3486C8986171j106044k695224k942442k520411j897372j380914j006946p41727
3478B4695091n04529k52922p9633R8302J51877K29855K58558M07959N22661O22034
$$ plain form
3539 8589842 9122867 9672741 10372421 11212674 12233695 13474617 14959562 16746377 18652718
3530 18652718 20405976 21519604 21573648 20592981 19042018 17402871 15936741 14711723 13754420
3521 13754420 13009158 12453798 12089423 11849013 11650462 11577320 11565059 11577059 11646582 11742364
3511 11742364 11863250 12052012 12306227 12609343 12901747 13285797 13710058 14203899 14807756
3502 14807756 15549193 16464560 17585316 18875842 20318403 21842158 23219011 24356281
3494 24356281 25268971 26201012 27501810 29335479 31750752 34631319 37529119 38986171
3486 38986171 37880127 35184903 32242461 29722050 27824678 26443764 25436818 24695091
3478 24695091 24190562 23937640 23858007 23956309 24108186 24338041 24596599 25004558 25527219 26149253
3468B6149253Q17051J026012J230957J415429J665488J925711K387725L068905
3460C9686531L940465M908511O028891O847064O930595M575105o52351m605932
3452F7658879n698092m974003l713909k611496j684613j021039l70160J98007
3444D7783574P23189J138942J524849J768507J951693K026438K022980J976335
3436F0916507J814711J478226J014830M98761n0834n08761q16589q60268o40686
3427F2845897k73996L20814R10677J193755N42285j613653l793829m616870m421830
3418E1093250l868627l306550k849016k544644k281157k069442j863483j691602
3410C0618729j582596j515674j447634j314677j247273j191543j074391j067798
$$ plain form
3468 26149253 26966304 27992316 29223273 30638702 32304190 34229901 36617626 39686531
3460 39686531 43626996 48535507 54564398 61411462 68342057 72917162 72264811 67658879
3452 67658879 61960787 56986784 53272875 50661379 48976766 47955727 47585567 47783574
3444 47783574 48506763 49645705 51170554 52939061 54890754 56917192 58940172 60916507
3436 60916507 62731218 64209444 65224274 65723035 65672201 65163440 64346851 63486583 62845897
3427 62845897 62571901 62892715 63803392 64997147 65539432 63925779 60131950 55515080 51093250
3418 51093250 47224623 43918073 41069057 38524413 36243256 34173814 32310331 30618729
3410 30618729 29036133 27520459 26072825 24758148 23510875 22319332 21244941 20177143
3402B0177143r56525q46549p90286p45707o91659o12472n77671n70013n55489
3393A3830772n15520m78879m71225m41696m81391m29422l74607l61484l41962
3384I934586l05432l31428l16744k80757k97163k56727k65411k44147k28075k20575
3374G188127k50321k15105j60881j51566j58756j55570j25816j06088j32519j23007
3364E608498j18396j00820j36886j10348j04036j03350r7286p8611p3125o5313
3354D620327l3966n2740p0916m31m8361l0288k0207K3993N5392P2738J17279R4098
3342D726918J91058K15690K92037L58546L51932K78991Q1382j24858k93746l81269
3332E696681l99457k91865k33429k14875j40801j55207j17757l9569m1314p4316
$$ plain form
3402 20177143 19220618 18374069 17583783 16838076 16146417 15533945 14956274 14386261 13830772
3393 13830772 13315252 12836373 12365148 11923452 11442061 11012639 10638032 10276548 9934586
3384 9934586 9629154 9297726 8980982 8700225 8403062 8146335 7880924 7636777 7408702 7188127
3374 7188127 6937806 6722701 6561820 6410254 6251498 6095928 5970112 5864024 5731505 5608498
3364 5608498 5490102 5389282 5252396 5142048 5038012 4934662 4837376 4758765 4685640 4620327
3354 4620327 4586361 4533621 4462705 4462274 4413913 4383625 4363418 4387411 4442803 4515541 4632820 4726918
3342 4726918 4917976 5133666 5425703 5784249 6136181 6415172 6496554 6371696 6077950 5696681
3332 5696681 5297224 5005359 4771930 4557055 4416254 4261047 4143290 4103721 4062407 3988091
3322C988091l3970j5392L146J5470J6953N7053O9803J05580J30013J57883J96567
3311D691197K61275L48358M39333O21350O87514P67885P35612M24446j01199n11445
3301H364326p42245q02480o41156n66192m57076l83126l07379k31931j97491j37814
3291C897436j26689r4108q8327q5136l4263K50n9573m1470n3523p709J750L1691
3279C340329Q4432J40629J97557K51495K79360K86146L25574K21335M0247j85049
3269D982055l68728m15423l86200l18415k58613k24562j74830j35344j30555j17339
3259B452046p4635m9936q5145q2076k9400l5034o2740p6917n8112p6944m6743
3248A774364q8130n0538k5898q537K9J196o960m1969m2792k6905K554k8268n873
$$ plain form
3322 3988091 3954121 3938729 3941875 3957345 3974298 4031351 4101154 4206734 4336747 4494630 4691197
3311 4691197 4952472 5300830 5740163 6361513 7049027 7816912 8552524 8976970 8875771 8364326
3301 8364326 7622081 6819601 6178445 5612253 5155177 4772051 4464672 4232741 4035250 3897436
3291 3897436 3770747 3676639 3588312 3503176 3468913 3469163 3409590 3368120 3314597 3306888 3308638 3340329
3279 3340329 3424761 3565390 3762947 4014442 4293802 4579948 4905522 5126857 5167104 4982055
3269 4982055 4613327 4197904 3811704 3493289 3234676 3010114 2835284 2699940 2569385 2452046
3259 2452046 2377411 2327475 2242330 2160254 2130854 2095820 2033080 1956163 1898051 1821107 1774364
3248 1774364 1686234 1635696 1609798 1601261 1601290 1602486 1595526 1553557 1510765 1483860 1486414 1458146 1452273
3235A452273l707k2009m4985k3497K0362l5626k4707o163K6387J5885m1431m2744
3223A270038n407K4216m9435k5912K2499k5041M404q935n652L5984k2584k7125
3211A187050n538J5972L1353j848R625K463L3252K4305k0760P475L3361J7295
3199A334005J9120K0074M6135o821R937N9718n211K3554j8363j3362k298K2983
3187A489471L4961j304j770L9447j688J1727L0958M2792J4588M9352O7351O2487
3175A838372P4953N3083K7448L4583M1104L9800O7883N7812M9899L3913P6361
3164B395211P4105R9684L5727l502j7099M2882L7226M1593L9969N614L2566P0793
3152B854769R6142J13761J03950J22584J76445J23130J38737J28297J05151J21895
$$ plain form
3235 1452273 1448566 1426557 1381572 1358075 1378437 1342811 1318104 1311941 1338328 1354213 1312782 1270038
3223 1270038 1264631 1288847 1239412 1213500 1235999 1210958 1215362 1206427 1200775 1236759 1214175 1187050
3211 1187050 1181512 1197484 1228837 1226989 1236614 1239077 1272329 1296634 1275874 1283349 1316710 1334005
3199 1334005 1353125 1373199 1419334 1412513 1422450 1482168 1476957 1500511 1482148 1468786 1466488 1489471
3187 1489471 1524432 1523128 1521358 1560805 1559117 1570844 1601802 1644594 1659182 1708534 1775885 1838372
3175 1838372 1913325 1966408 1993856 2028439 2069543 2109343 2177226 2235038 2284937 2318850 2395211
3164 2395211 2469316 2569000 2604727 2601225 2584126 2627008 2664234 2705827 2745796 2751410 2783976 2854769
3152 2854769 2950911 3064672 3168622 3291206 3467651 3590781 3729518 3857815 3962966 4084861
3142D084861R4866R7243J54677J69735K32548K29022K15063K26816K11908K76288
3132E993027K94262L30551L60251L68648L94809M25403N02079N62059N88346O93714
3122A0513149P48281Q32014R05357R60281R72500R91603R47553Q14977O60713
3113A8346428M64538K80690J22218Q6014K9549P6908J53426J02569J16892J83442
3103A9962674J44153J79428J74316K13644K95664L85394M69882N43601O42620
3094B3011376P13660Q64954J065953J375853J755242K172977K585827K762612
3086C6308454K579601J472178m32629k005115k756712k833629k542591k232202
3078B7557355j881241j592389j312861j033889q93650p01952o69067n95661m92385
$$ plain form
3142 4084861 4179727 4276970 4431647 4601382 4833930 5062952 5278015 5504831 5716739 5993027
3132 5993027 6287289 6617840 6978091 7346739 7741548 8166951 8669030 9231089 9819435 10513149
3122 10513149 11261430 12093444 12998801 13959082 14931582 15923185 16870738 17685715 18346428
3113 18346428 18810966 19091656 19213874 19299888 19329437 19406345 19559771 19662340 19779232 19962674
3103 19962674 20106827 20286255 20460571 20674215 20969879 21355273 21825155 22368756 23011376
3094 23011376 23725036 24589990 25655943 27031796 28787038 30960015 33545842 36308454
3086 36308454 38888055 40360233 39927604 37922489 35165777 32332148 29789557 27557355
3078 27557355 25676114 24083725 22770864 21736975 20843325 20141373 19472306 18876645 18384260
3069A8384260m61271l72767k86502j85392j38135o8552j6195K2425J32659K27142
3059A7237672K79992K97047L00585J86375L5811k49400n60902p45592q79080r78435
3049A4924073r54367r00755q27981p62904o87879n89166n70171n00701n16150
3040H613999m80504l97358l74435l96140l83178l19052k82396l05775k81693k38881
3030E154587k48428k46321j51877j69948j55499j63262k11314j66015j15889p8096
3020C447938j26794j38830p7974j07140q2552q7209q7068r6625j31986r1375p6483
3009B343902r9757o1923o6327n8565q1837q4289n5665m5757l2339p6827j6199
2998A664417m0368m3181m2317n2701k0001n5622l9058j3833l7012j0844k4683
$$ plain form
3069 18384260 17922989 17550222 17263720 17078328 16940193 16871641 16855446 16877871 17010530 17237672
3059 17237672 17517664 17814711 18115296 18301671 18337482 18088082 17527180 16781588 15902508 14924073
3049 14924073 13969706 13068951 12240970 11478066 10790187 10201021 9630850 9130149 8613999
3040 8613999 8133495 7736137 7361702 6965562 6582384 6263332 5980936 5675161 5393468 5154587
3030 5154587 4906159 4659838 4507961 4338013 4182514 4019252 3807938 3641923 3526034 3447938
3020 3447938 3321144 3182314 3104340 2997200 2914648 2827439 2740371 2643746 2511760 2420385 2343902
3009 2343902 2244145 2182222 2115895 2057330 1975493 1891204 1835539 1789782 1757443 1680616 1664417
2998 1664417 1624049 1580868 1538551 1485850 1465849 1410227 1371169 1357336 1320324 1309480 1284797
2987A284797p596l5420l8307k2138k7749l0080j7111n2551l0075k6367k3954n347
2975I68102j2451j5151l0693k1497q552k2689m0151p185j8026l4482m083K4263
2963G77405l072k6228j458m2185k1894J1509j3959J1285k0764j5621j1503l432
2951F40083k6638m5543j1257L978n231l8987K0243m3085k046j330N532M121k8761
2938D71079k7653j5315J5655R003m2893k0205J1180J6180k1848m142p761Q817
2926C92097n549r404r240N958J8681k8326j4604k6200p104q997L972k8970j888
2913B80426O437l39l2259j5731l163J2941N184N184J3608j3720k2903k4747L241
2900B14159M9238l0321k5359J4011j931P730j3150j6154j0727L458J9512j6305
$$ plain form
2987 1284797 1277201 1241781 1203474 1181336 1153587 1123507 1106396 1053845 1023770 997403 973449 968102
2975 968102 955651 940500 909807 888310 879758 857069 816918 809733 791707 757225 753142 777405
2963 777405 774333 748105 746647 704462 682568 694077 680118 691403 670639 655018 643515 640083
2951 640083 613445 567902 556645 560623 555392 516405 536648 493563 491517 490187 495719 499840 471079
2938 471079 443426 428111 443766 452769 409876 389671 400851 417031 395183 391041 383280 392097
2926 392097 386548 377144 367904 373862 392543 364217 349613 323413 316309 307312 311284 282314 280426
2913 280426 286863 286524 254265 238534 235371 248312 253496 258680 272288 258568 235665 210918 214159
2900 214159 263397 233076 207717 221728 219797 227527 214377 198223 187496 190954 210466 194161
2888A94161j5204j0852K2316o380j7089k1318J832J9220P947j7845k0914M150
2876A40024j1875k7502K0562K1948J4645j6893K3094M502P127m3327k9758N216
2864A07763j0610R441J4498M2273p985j4156p741J1858L3814p135k8522m8713
2852I4785p706L3980L49O347j9146Q544K3224k6230R956J6390K0007m2465P046
2839A25081K4012p888J2711L29j686k4959J1793J9075j1985J8727Q003m901j2249
2826A56063j5334L6366p539R03J9649O812k8456J7056O516k1434r124L0634q052
2813A84060q661l0293J9469J1721K9739K4999k5276Q505l993n626K7090J5710
2801B47444J7039J6358l5250m8179J3476M507j7980k7033P821l7872J0902q773
$$ plain form
2888 194161 178957 168105 190421 184041 166952 145634 147466 166686 174633 156788 135874 140024
2876 140024 128149 100647 121209 143157 157802 140909 164003 168505 175632 132305 102547 107763
2864 107763 97153 106594 121092 163365 155380 141224 133483 145341 179155 172020 143498 94785
2852 94785 87079 121059 121408 127755 108609 117153 140377 114147 124103 140493 160500 118035 125081
2839 125081 149093 141205 153916 154245 152559 127600 139393 158468 146483 165210 173213 168312 156063
2826 156063 140729 177095 169556 170459 190108 196920 168464 185520 192036 170602 161478 192112 184060
2813 184060 175399 145106 164575 176296 206035 231034 205758 214263 210270 204644 231734 247444
2801 247444 264483 280841 245591 197412 210888 215395 197415 170382 178203 140331 151233 142460
2789A42460m751N38J43k3724k6064N036M931J8216r265j0505J3723J0605J018
2776A22361K2548L7633O281j7933j4929n147K4972l5851l3514K3567K5537k1605
2764A33920r647l5585j1165J9037j7064J3826m1k4503q338l4613J4828J6017J5887
2751G2559n363L845k7113R93l697q681j231j0015j657p772J3175p45Q112m651
2737B7759k0304L2293J8374j5493j9715j1443P05j6854J0171J5212M328j8967
2725F066j2896o149J293M332j2040K2365n139Q536m0353m409K3337k7996K7583
2712a5470K2167j0334o996O018o361j7704J7715N859j4505j840K1817j6743p587
2699b3964Q744J9352l0897k7609K6052J4140J4862p047j3475K6457l611l1422
$$ plain form
2789 142460 137709 138247 138390 114666 88602 93638 98569 116785 107520 97015 110738 121343 122361
2776 122361 144909 182542 188823 170890 155961 150814 175786 139935 106421 129988 155525 133920
2764 133920 124273 88688 77523 96560 79496 93322 93281 68778 60440 25827 40655 56672 72559
2751 72559 67196 71041 43928 44921 41224 32543 31312 21297 19640 11868 25043 24298 32410 27759
2737 27759 7455 39748 58122 42629 22914 11471 12176 -4678 5493 20705 25033 6066
2725 6066 -6830 -12979 -11686 -7354 -19394 2971 -2168 6368 -33985 -38394 -15057 -43053 -15470
2712 -15470 6697 -3637 -10633 -4615 -10976 -28680 -10965 -5106 -19611 -21451 366 -16377 -23964
2699 -23964 -15220 4132 -26765 -54374 -28322 -14182 680 -6367 -19842 6615 3004 -28418
2687b8418p492j3197K74K037j7433N032j0159K8076J6303p525j5656p544L1093
2674b4609K9249j5658k1214J5065j4643J2333l14j4608J336j8384R164j2808j2122
2661f7213K0208j8252J2212j8114j3774L0296K7827j0916j5464J6316Q860m630
2649c2644p091P913k999m2701J7069j2655K0371K1709R055j0619n711P488l636
2636c4451k742K487P008k0101k4792l6784J5538L8472K74J4775R938j3239l0409
2623g4026J5090J716l90J760N976Q887L992m504k4469M4156l2398k872N895p126
2609e8313R863j2132J5731l294O507J080k2059k2185M3803Q816m1296k7719M7464
2596e3734J2490J8423Q277j3194n335k266J4393j5603N871m838K5109k4215l5455
$$ plain form
2687 -28418 -35910 -49107 -48833 -46796 -64229 -59197 -69356 -41280 -24977 -32502 -48158 -55702 -24609
2674 -24609 4640 -11018 -32232 -17167 -31810 -19477 -19791 -34399 -33063 -51447 -42283 -55091 -67213
2661 -67213 -47005 -65257 -53045 -71159 -84933 -54637 -26810 -37726 -53190 -36874 -28014 -32644
2649 -32644 -39735 -31822 -34821 -77522 -60453 -73108 -52737 -31028 -21973 -32592 -38303 -30815 -34451
2636 -34451 -37193 -34706 -27698 -47799 -72591 -109375 -93837 -55365 -55091 -40316 -30378 -43617 -74026
2623 -74026 -58936 -57220 -57610 -55850 -49874 -40987 -36995 -41499 -65968 -21812 -54210 -57082 -51187 -58313
2609 -58313 -48450 -60582 -44851 -48145 -41638 -40558 -62617 -84802 -40999 -32183 -73479 -101198 -53734
2596 -53734 -41244 -22821 -14544 -27738 -33073 -35339 -20946 -36549 -30678 -35516 -10407 -34622 -70077
2583g0077J2590j0686J1019O505P465J616j7548p543k9344L0779o387J3795L0239
2570b7577l927m4857O028j7942N603J5918k898J5449r646k674K4102M2848n896
2557e469j6249j2151j737O651k4349N798K2093o470M383j7507j1640R285J5597
2544c1765O677q582k156j4314l1348M404J4243j2838J1808L1760o179j0793J783
2531d7300J6316N002J6330k3889k3661O514O159q900J3284J0784K457j1064k0679
2518e8647q34R983k0386j0704K7679l841o448R695K748r892L7637j1645r255N520
2504c8390j6380m091j0071k296J1449n094J9422K1239o075k3622j4234J8312j4762
2491f4593p649l9716J2057O1646L903K048k209j0213N266K4928j8827l210J453
$$ plain form
2583 -70077 -57487 -68173 -57154 -50649 -43184 -41568 -59116 -66659 -96003 -65224 -71611 -57816 -27577
2570 -27577 -31504 -76361 -70333 -88275 -82672 -66754 -69652 -54203 -63849 -66523 -42421 427 -5469
2557 -5469 -21718 -33869 -35606 -28955 -53304 -47506 -25413 -31883 -27500 -45007 -56647 -47362 -31765
2544 -31765 -25088 -33670 -35826 -50140 -81488 -77084 -62841 -75679 -63871 -32111 -38290 -49083 -47300
2531 -47300 -30984 -25982 -9652 -33541 -57202 -50688 -44529 -53429 -40145 -29361 -26904 -37968 -58647
2518 -58647 -59481 -49498 -69884 -80588 -52909 -56750 -63198 -53503 -50755 -60647 -23010 -34655 -43910 -38390
2504 -38390 -54770 -58861 -68932 -71228 -59779 -64873 -45451 -24212 -30287 -53909 -68143 -49831 -64593
2491 -64593 -72242 -111958 -99901 -38255 -34352 -32304 -34513 -44726 -39460 -14532 -33359 -36569 -35116
2478c5116O370j0326Q29K871k3878J1758j5930J3758P417J7396p331K964K6148
2465c070j8090l556M087J2053r457k3887L182J9373K889k2173k1829q760k4379
2452i3617L1106L1454O073r75J8698q512j5960J3135j9252N307j2925j0089J5588
2439c9969o416k5743L9820n126j4061J5547r050j2839N742L5256q200j7023K233
2426c9829j5127K4565J5118j4243n797K1639l108k6824J9639n104m5820K00n786
2413h0477P400N8031k3923K1218r682k4351j3787P344K1206J8147J7424k4417
2401b5867j0140K5897m10j6540J111L2799J1184k5002j8938j5403J4272J5797
2389a1240j1366O869k8931m046K3290J3711P779j7209j3262J1234K6308j9551
$$ plain form
2478 -35116 -28746 -39072 -38243 -35372 -59250 -47492 -63422 -49664 -42247 -24851 -32182 -29218 -3070
2465 -3070 -21160 -24716 -20629 -8576 -18033 -41920 -38738 -19365 -16476 -38649 -60478 -69238 -93617
2452 -93617 -62511 -31057 -24984 -25959 -7261 -15773 -31733 -18598 -37850 -32543 -45468 -55557 -39969
2439 -39969 -46385 -72128 -32308 -37434 -51495 -35948 -44998 -57837 -52095 -16839 -25039 -42062 -39829
2426 -39829 -54956 -30391 -15273 -29516 -35313 -13674 -16782 -43606 -23967 -29071 -74891 -74691 -80477
2413 -80477 -73077 -15046 -38969 -17751 -27433 -51784 -65571 -58227 -37021 -18874 -1450 -25867
2401 -25867 -36007 -10110 -10520 -27060 -25949 6850 18034 -6968 -25906 -41309 -27037 -11240
2389 -11240 -22606 -15737 -44668 -48714 -25424 -11713 -3934 -21143 -34405 -23171 3137 -16414
2377a6414J9223Q503j0874j0476J8814m335J3559o046l1315k0252K2876j9888
2365c6625J4700K0090K74L140k2467J378R613l132l4740J5675K1005J5713K7458
2352C2082j4692K4962j4873j0544J0413j7372j2701K4209K1903l2950K1558l954
2340B8041k158J1476P059j5082K0490k549j0694K5781M281K330L383J881J0438
2327H4677P253m253J2121J6231l1512N713N4782k096m702l719J8342N0054M3119
2314B46010O259M5708K537l425M6855J5046M1817K7814M6518O0764K5578M1719
2302F03200R5293J05759R6195P1195J24860J82824K55593L02167L81593M55831
2292B674510N20998L00678j50524m10778n00324m32907k93233k42133j79182j55346
$$ plain form
2377 -16414 2809 11312 438 -10038 8776 4441 18000 11954 -19361 -39613 -16737 -36625
2365 -36625 -21925 -1835 -1561 1579 -20888 -19510 -9897 -13029 -47769 -32094 -11089 4624 32082
2352 32082 17390 42352 27479 16935 27348 9976 -2725 21484 43387 10437 31995 28041
2340 28041 25883 37359 44418 29336 49826 47277 36583 62364 66645 68975 72358 74239 84677
2327 84677 91930 87677 99798 116029 84517 90230 145012 142916 138214 134495 152837 202891 246010
2314 246010 252269 297977 300514 297089 343944 358990 400807 428621 475139 535903 561481 603200
2302 603200 698493 804252 900447 971642 1096502 1279326 1534919 1837086 2218679 2674510
2292 2674510 3195508 3496186 3345662 2934884 2434560 2001653 1708420 1466287 1287105 1131759
2282A131759j52608j14274p2401k1237k7329j3748m0262o2151n4323k5626n6228
2271D91572l0837m6301l2663j0998k4089l4402l3120n543o387Q31n8659k7763
2259A81641J1588k8520J644K0433k2978l1212k4618L0418K0652k6603P927l18
2247A40054n682j5419l9712k3671j009L46j0659N357L764j5916O037J0490j1116
2234D2864K657k2793K4124J1972L64R627j7287k1667M750j0652K8993R294k3971
2221C8275O033j2056j1950O9L6676Q545k5112j9305O032j7764K32j4988J6390
2208A1077k071L470J33l0620M7881J080l426r432k1449P344j1478M956P629L303
2194H397k5075P674K6453J0020J667j1434J9139q301l8721l16J5628m002J1787
$$ plain form
2282 1131759 979151 864877 792476 771239 743910 730162 689900 627749 573426 547800 491572
2271 491572 460735 414434 381771 370773 346684 312282 279162 273619 267232 268063 209404 181641
2259 181641 193229 164709 166353 186786 163808 132596 107978 138396 159048 132445 140372 140054
2247 140054 134372 118953 79241 55570 54561 54907 44248 49605 53369 37453 43490 53980 42864
2234 42864 45521 22728 46852 58824 59188 68815 51528 29861 34611 23959 52952 62246 38275
2221 38275 44308 32252 20302 20371 57047 65592 40480 21175 27207 9443 9675 -5313 11077
2208 11077 9006 12476 12609 -18011 29870 30950 27524 18092 -3357 3987 -7491 -2535 5094 8397
2194 8397 -16678 -9004 17449 27469 29136 17702 36841 28540 -10181 -10497 5131 1129 12916
2181A2916L642l0127J7361k5283j517M5442r708k6257l872j2361n458L9981J5037
2168A9796r827l8523j6257M3419p028l5482Q004Q37m5037Q240K7655N4096J6132
2155B6025k3165k1413r940j4342k997N216K1222J5159k683J1092m390R881J5873
2142B5538j8255l2054K2500j6530K362o384J1085j451k5551o064L3436K0704k7690
2129a8354K123j0283Q602P019j085Q162L0598m1714l0543m158J8314L2716J2601
2116A3998k0790j146j8907r105N1442l0250m57j1348J7308J830j4010j8997J9637
2103b0795Q515N762J1554m601J8884j1311l7722k5465K8667J0503m0582l2846
2091h9437K9269J2463K524L0621n498K75j5602O677o910l283k7841M88M9764M976
$$ plain form
2181 12916 16558 -13569 3792 -21491 -23008 22434 12726 -13531 -17403 -29764 -35222 4759 19796
2168 19796 9969 -28554 -44811 -1392 -8420 -43902 -35898 -35061 -80098 -71858 -44203 9893 26025
2155 26025 2860 -18553 -28493 -42835 -45832 -40616 -19394 -4235 -6918 4174 -216 9665 25538
2142 25538 7283 -24771 -2271 -18801 -16439 -22823 -11738 -13189 -38740 -44804 -11368 9336 -18354
2129 -18354 -16231 -26514 -17912 -10893 -11978 -3816 26782 -14932 -45475 -49633 -31319 1397 13998
2116 13998 -6792 -7938 -26845 -35950 15492 -14758 -15215 -26563 -9255 -7425 -21435 -40432 -20795
2103 -20795 -12280 -6518 5036 435 19319 8008 -29714 -55179 -26512 -16009 -56591 -89437
2091 -89437 -60168 -47705 -45181 -14560 -20058 -19783 -35385 -28708 -35618 -38901 -66742 -66254 -16490 -11514
2077a1514p712o84R479j3590k9084K1026Q348J3714l9700L1076k711k9350K0015
2064c0687j6045L9426n3l2810Q597j2055J386L5333q881J6199l1039J4111Q522
2051g996N137J2816l824k8000j5382K2297r070o56K3352j3207j9751N654j0869
2038c9499N837Q60Q536J3581P958K2244p361k9733k336m999k401J7595K0908q389
2024B801k3232M9444j4280l5552K0863K1589j9219l628j4093M294J16j0012K6853
2011E944L902j1211l6505m056K5161m569O990l0158j7990J6315J5402K2400K1205
1998A2830j5790K2046j0681n053K789k918r836q932J8623q243q515J7644l757
1985B07k7995K1804j9828J0014m045p668J4681P306q302j0185N301j542K0780
$$ plain form
2077 -11514 -19226 -19910 -10431 -24021 -53105 -32079 -23731 -10017 -49717 -18641 -21352 -50702 -30687
2064 -30687 -46732 -7306 -7359 -40169 -31572 -43627 -42241 -6908 -15789 410 -30629 -16518 -7996
2051 -7996 -2859 9957 6133 -21867 -37249 -14952 -24022 -24678 -1326 -14533 -34284 -28630 -39499
2038 -39499 -33662 -32802 -24266 -10685 -2727 19517 12156 -17577 -19913 -24912 -27313 -9718 11190 2801
2024 2801 -20431 29013 14733 -20819 44 21633 2414 -1214 -15307 -11013 -10897 -20909 5944
2011 5944 9846 -1365 -37870 -41926 -16765 -21334 -14344 -44502 -62492 -46177 -30775 -8375 12830
1998 12830 -2960 19086 8405 3352 6141 3223 -6613 -15545 3078 -5165 -13680 3964 207
1985 207 -27788 -5984 -25812 -15798 -19843 -27511 -12830 -5524 -13826 -24011 -18710 -20252 528
1972E28L9442m614m2783k4370L883j0084N503J3479p111J2751o966J791J3485
1959e066k8401n117J886O68j611L1202J7723j7013l3371K8565Q414l7307J0800
1946b8628K9985l88k3039r71k663L4824J9016l2807j8316J9080J9585k0425k0089
1933b4836n313K127j6327K5529M702Q864r820Q902l207J293K3233n174j5508n45
1919f080K2464r462o221l7089K6990n16m5831n589M7554J7827J0248j3904k7599
1906b7208L9527l3590J5103J2994l3683J958j3207L456j113K4182j580J1336k1658
1893b3483J0276M532J9709K1220K454k7115j5126o760O53J2592L219k8142K597
1880b3374n195J1766J6464n677M524l4217K6519j4529N968j6242j081N5751K6968
$$ plain form
1972 528 39970 35356 -7427 -31797 -27914 -37998 -32495 -19016 -26127 -13376 -20342 -18551 -5066
1959 -5066 -33467 -38584 -36698 -36030 -37641 -6439 11284 -5729 -39100 -10535 -2121 -39428 -28628
1946 -28628 1357 969 -22070 -23041 -25704 9120 28136 -4671 -22987 -3907 15678 -4747 -24836
1933 -24836 -30149 -28022 -44349 -18820 -14118 -5254 -15074 -6172 -9379 -8086 15147 9973 -5535 -6080
1919 -6080 16384 6922 701 -36388 -9398 -9914 -55745 -61334 -13780 4047 14295 391 -27208
1906 -27208 12319 -21271 -6168 6826 -26857 -24899 -38106 -34650 -35763 -11581 -13161 -1825 -23483
1893 -23483 -13207 -8675 11034 32254 34708 7593 -7533 -14293 -13640 -1048 2171 -25971 -23374
1880 -23374 -28569 -16803 -339 -6016 -1492 -35709 -9190 -23719 -17751 -33993 -35074 20677 47645
1867D7645l9321l4960o171K2534O112j565n623J9747K846J0714J8397l2833k0360
1854a2838K4919k5807M784q484J7091O245n133j2505q90K2782j7935J0618j2479
1841i632P307K6568M8415n9153l3818J8694k5434J3034P690Q326l680j1582j141
1828a4406m217p634p314O329K5001J5882o177O049j5489p968O549p651l6621L7776
1814i891K380l7738J7855L4554l6115J0065L0307n280k6522L1945k5424l5887
1802d9751L9341k9943K0059J5285K4382j3575m2480J7917K2531j0234l0498N163
1790c1803R417m035J6716l7558m749J0003K0794R858K5992K709q838L266K629
1777A4401k8l8174q220m718K6020J394O275L6735k8692j1804k2769P427n928j9146
$$ plain form
1867 47645 8324 -26636 -32807 -10273 -4161 -5726 -11349 8398 11244 21958 40355 7522 -12838
1854 -12838 12081 -13726 -8942 -17426 -335 5910 777 -11728 -12618 10164 -7771 2847 -9632
1841 -9632 -2325 24243 72658 13505 -20313 -1619 -27053 -14019 -6329 1997 -1683 -13265 -14406
1828 -14406 -18623 -26257 -33571 -27242 -2241 13641 7464 13513 -1976 -9944 -3395 -11046 -47667 -9891
1814 -9891 -7511 -45249 -27394 7160 -28955 -18890 11417 6137 -20385 11560 -13864 -49751
1802 -49751 -10410 -40353 -20294 -5009 19373 5798 -36682 -18765 3766 -6468 -36966 -31803
1790 -31803 -22386 -26421 -9705 -47263 -52012 -42009 -21215 -11357 14635 17344 8506 11772 14401
1777 14401 14373 -23801 -32021 -36739 -10719 -9325 -3050 33685 4993 -6811 -29580 -22153 -28081 -47227
1763d7227L8900O900O151p680l0055j3859L9593J1598j6636j4337n234k881K1997
1750a2770K0730J0218k7057r422k39q08L0109k2356p304N314j524J3036M454J7005
1736A9386n540Q535r647j1243j5448n705k5175K1824Q242J585K1128J24j6563
1723h497l8955J6739j7492N7244J8781q341n0748n3805L0337J6508m340o85Q314
1710c4940K8776p514J8550l776K787K29j4417L2722l2288j368K2338l454Q215
1697A5860k1862j2786j6153j5257J0312L616J1826k1104P710K918L0297R643J9667
1684B4687j1027j1309j217P346Q537r424K0597r867J0463l2941p473j0130L8054
1671A6296p652N421o697k1288p017j4640K3705k3463J4308R185j2650n01k054
$$ plain form
1763 -47227 -8327 -1427 4724 -2956 -33011 -46870 -7277 4321 -12315 -26652 -31886 -34767 -12770
1750 -12770 7960 18178 -8879 -18301 -18540 -19348 10761 -11595 -18899 -13585 -15109 -2073 2381 19386
1736 19386 13846 22381 12734 1491 -13957 -19662 -44837 -23013 -14771 -13186 7942 8066 -8497
1723 -8497 -47452 -30713 -48205 9039 27820 19479 -31269 -85074 -54737 -38229 -42569 -43254 -34940
1710 -34940 -6164 -13678 4872 1096 3883 4112 -10305 22417 -9871 -11239 11099 7645 15860
1697 15860 -6002 -18788 -34941 -50198 -39886 -36270 -24444 -45548 -37838 -34920 -4623 5020 24687
1684 24687 13660 2351 1134 8480 17017 7593 28190 18323 28786 -4155 -11628 -21758 16296
1671 16296 8644 14065 7368 -13920 -20937 -35577 -11872 -35335 -21027 -11842 -24492 -24993 -27047
1658b7047M961m572K2714M052L935j2556k965L0501j5870M0924j4083Q980P119
1645D6093k5684J573R130j6567j6496P196k9565K9308m445j2837J4060J0658Q627
1632B1051k5145k9390J0774K2336j008j1123J7543Q523m1944k3154K4550L5160
1620H173K726m933k8680R588M647m054J9655M7792j7982l6657l773j2057M6865
1607C1310k5996k7079O390K6602k3892M503K0997K895l8585k0675K7402K6324
1595A0196K597k3580K292o295o030l487r804J5373M1050k5732l3715J5248L5758
1582A3871k4456M671j606j1502j3524J4277L8186j6630k5218J7361K273R878l7976
1569c0395J3559N263j9930k903L1114p853Q596j4025j4037J2309L6060J0687R166
$$ plain form
1658 -27047 -22086 -26658 -3944 108 4043 -8513 -11478 19023 3153 44077 29994 38974 46093
1645 46093 20409 21982 31112 14545 -1951 5245 -24320 4988 543 -12294 1766 12424 21051
1632 21051 -4094 -33484 -22710 -374 -1382 -12505 5038 13561 -28383 -51537 -26987 8173
1620 8173 10899 5966 -22714 -13126 -8479 -12533 7122 54914 36932 275 -3498 -15555 31310
1607 31310 5314 -21765 -15375 11227 -12665 -8162 12835 15730 -22855 -43530 -16128 10196
1595 10196 12793 -10787 -8495 -14790 -20820 -24307 -34111 -18738 22312 -3420 -37135 -21887 13871
1582 13871 -10585 -5914 -7520 -19022 -32546 -18269 19917 3287 -21931 -4570 -2297 7581 -30395
1569 -30395 -16836 -11573 -31503 -34406 -3292 -11145 -2549 -16574 -30611 -18302 17758 28445 37611
1556C7611j6821m5023J6140K2020Q768k7588J023j0970J7762O040J991J5115m381
1543B1687j1492J4998k5112J2332j444J5927L367l1036k5160J913j1292N287J9855
1530a0170J5842k2599k1634J4465L4J2981j042j0276L6501R858N445r289j4376
1517E740k4319J0693K1920m954o426j9797J819R856j551R458j316j5389J1661
1504b605K6089L031m9306O896J2582j7473Q48J932J3715R24K2599K2038l6964
1491D306l3246j0602k720L1428K8631k9683j5555O418J4685O455j7078k6873n903
1478d9737m928K1984K6771k5639k454K5007R106K161J7802n048k5803M881K0065
1465A4168N242j047k1747J3732j288K552k1800k1722L788J3842Q589R70N4297
$$ plain form
1556 37611 20790 -24233 -8093 13927 22695 -4893 -3870 -14840 2922 8962 10953 26068 21687
1543 21687 10195 25193 81 12413 10969 26896 30263 -773 -25933 -24020 -35312 -30025 -10170
1530 -10170 5672 -16927 -38561 -24096 -24062 -11081 -12123 -22399 14102 23960 29405 20116 5740
1517 5740 -18579 -7886 14034 9080 2654 -17143 -15324 -5468 -7019 2439 1123 -14266 -2605
1504 -2605 23484 26515 -22791 -15895 -3313 -20786 -19938 -18006 -4291 -3367 19232 41270 4306
1491 4306 -28940 -39542 -42262 -10834 17797 -11886 -27441 -21023 -6338 117 -16961 -43834 -49737
1478 -49737 -54665 -32681 -5910 -31549 -34003 -8996 110 2271 20073 15025 -10778 -5897 14168
1465 14168 19410 18363 -3384 10348 9060 11612 -10188 -31910 -28122 -14280 -5691 -4721 49576
1452D9576k2937J285r695J9917J5263j0546p591j8231J992P727o105n415R510
1439B4750j7963J4747J8986j6872k9449J1366j9234L1118J3571k4920L231O594
1427A5925K5321O136k6641j6622O42K5993L583j8748j0699K6098L1421k6247k2306
1414A3856k5434J3194R636N65J0973l3285k4558P377Q157J6802m020J7938K1721
1401C2922k6341J1149M0485l3002j420K862K2597J0977j6260k4654P45r286n387
1388E387M116Q521J2545J630k6072J771J3174p591n235O623L604k7428n142L677
1374a0420R956J9203q489m805j1981L1567l349k4280l955L881K9587l422j0851
1361A2642k1422n908P107J3376j1907K0003l324j715l625q890j3634R615K3003
$$ plain form
1452 49576 26639 27924 18229 38146 53409 42863 35272 17041 19033 26760 20655 15240 24750
1439 24750 6787 21534 40520 23648 -5801 5565 -13669 17449 31020 6100 9331 15925
1427 15925 41246 47382 20741 4119 4761 30754 34337 15589 4890 30988 62409 36162 13856
1414 13856 -11578 1616 11252 11817 22790 -10495 -35053 -27676 -19519 -2717 -6737 11201 32922
1401 32922 6581 17730 58215 25213 23793 26655 49252 60229 43969 19315 20060 10774 5387
1388 5387 9503 18024 30569 32199 6127 7898 21072 13481 8246 14869 18473 -8955 -14097 -10420
1374 -10420 -464 18739 10250 5445 -6536 25031 21682 -2598 -6553 -2672 26915 23493 12642
1361 12642 -8780 -14688 -7581 5795 -6112 13891 10567 8852 5227 -3663 -17297 -7682 15321
1348A5321j383O091k5579k004K8218j8264L4216K67l0726J8329K5220o791k3241
1335A9674R087P640q049p601J4308j2737K8200K7475n4888P720J0282l033J7711
1322E5789k0178q897J2768l9499J9919J3617Q800o773R956N896j8056l1823O579
1309H098M697m384k383l3933K297j0142N0438o928K652K9751m1000K053M3567
1296D4783o115j4249p888n266K0977J2398j5204R982l8187q612l087l6564l349
1283e0381K8348L3141j728j3526j3775J9795K4305P041J1530k6164q667j3105
1271c186L072K2997l4563N297J1813k7456o226M9495o970K2338k6478o107R830
$$ plain form
1348 15321 13938 20029 -5550 -7554 20664 2400 36616 36883 6157 24486 49706 42915 19674
1335 19674 28761 36401 28352 20751 35059 22322 50522 77997 23109 30829 41111 38078 55789
1322 55789 35611 26714 39482 -17 19902 33519 42319 35546 45502 51398 33342 1519 8098
1309 8098 12795 8411 6028 -27905 -25608 -35750 14688 7760 10412 40163 -837 1216 44783
1296 44783 38668 24419 16531 11265 32242 44640 29436 39418 1231 -7381 -10468 -47032 -50381
1283 -50381 -22033 11108 9380 -4146 -17921 1874 26179 33220 44750 18586 9919 -3186
1271 -3186 -114 22883 -11680 -6383 5430 -22026 -28252 21243 14273 36611 10133 4026 13856
$$ [...]
##END NTUPLES=NMR SPECTRUM
##END=
