##TITLE=1H_CA-9363-12
 200.13MHz,CDCl3,
 8 sc
 
 28.7.2025
##JCAMPDX= 6.0         $$ Bruker NMR JCAMP-DX V2.0
##DATA TYPE= NMR SPECTRUM
##DATA CLASS= NTUPLES
##ORIGIN= UXNMR, Bruker Analytische Messtechnik GmbH
##OWNER= pz
$$ XWIN-NMR		Version 3.5
$$ Mon Jul 28 15:02:32 2025 Russian Standard Time (UT+4h)  she@DPX200
##.OBSERVE FREQUENCY= 200.1313
##.OBSERVE NUCLEUS= ^1H
##.ACQUISITION MODE= SIMULTANEOUS
##.ACQUISITION SCHEME= undefined
##.AVERAGES= 8
##.DIGITISER RES= 18
##SPECTROMETER/DATA SYSTEM= spect
##.PULSE SEQUENCE= zg30
##.SOLVENT NAME= CDCl3
##.SHIFT REFERENCE= (INTERNAL, CDCl3, 0, 15.5838)
##AUDIT TRAIL= $$ (NUMBER, WHEN, WHO, WHERE, WHAT)
$$ ##TITLE= Audit trail, XWIN-NMR		Version 3.5
$$ ##JCAMPDX= 5.01
$$ ##ORIGIN= Bruker BioSpin GmbH
$$ ##OWNER= she
$$ F:/spectra/data/she/nmr/H-C/1/pdata/1/auditp.txt
$$ ##AUDIT TRAIL=  $$ (NUMBER, WHEN, WHO, WHERE, WHAT)
(   1,<2025-07-28 15:01:17.82 +0400>,<she>,<DPX200>,
      <created by zg, POWCHK disabled, PULCHK disabled
       configuration hash MD5:
       00 E9 B6 7A A2 85 ED C7 34 08 36 98 17 FE 4E 26
       data hash MD5: 16K
       4F F0 9C 8F 25 52 C2 CF FC 02 27 8C E9 04 B1 BC>)
(   2,<2025-07-28 15:01:20.48 +0400>,<she>,<DPX200>,
      <Start of raw data processing
       efp BC_mod = 2 LB = 0.25 FT_mod = 6 PKNL = 1 PHC0 = -1361.715 PHC1 = 17.79254 SI = 16K 
       data hash MD5: 16K
       51 8B 70 2C 6A D9 7D 9D EA ED BB 46 DD EF 1A 42>)
(   3,<2025-07-28 15:01:37.51 +0400>,<she>,<DPX200>,
      <pk PHC0 = 1.906446 PHC1 = -2.8 
       data hash MD5: 16K
       07 A8 A7 02 79 E4 47 2C AC 56 23 6A 61 BC 47 E2>)
(   4,<2025-07-28 15:01:41.29 +0400>,<she>,<DPX200>,
      <abs ABSG = 5 
       data hash MD5: 16K
       3E 0B C0 2F CE C9 1D 19 D3 78 A7 BE 2E AC 56 3C>)
$$ ##END=
$$ 
$$ hash MD5
$$ 1A 5F AA 4A 97 22 5D C9 59 43 45 A1 F1 C3 B4 69
##$RELAX= 
##$RELAX= 
##$RELAX= 
##$RELAX= 
##$RELAX= 
##$RELAX= 
$$ Bruker specific parameters
$$ --------------------------
##$DU= <F:/spectra>
##$EXPNO= 1
##$NAME= <H-C>
##$PROCNO= 1
##$TYPE= <nmr>
##$USER= <she>
##$AMP= (0..31)
100 100 100 100 100 100 100 100 100 100 100 100 100 100 100 100 100 100 
100 100 100 100 100 100 100 100 100 100 100 100 100 100 
##$AQSEQ= 0
##$AQ_mod= 1
##$AUNM= <au_zg>
##$AUTOPOS= <>
##$BF1= 200.13
##$BF2= 200.13
##$BF3= 200.13
##$BF4= 200.13
##$BF5= 200.13
##$BF6= 200.13
##$BF7= 200.13
##$BF8= 200.13
##$BYTORDA= 1
##$CFDGTYP= 0
##$CFRGTYP= 5
##$CHEMSTR= <none>
##$CNST= (0..31)
1 1 145 1 1 1 1 1 1 1 1 1 1 1 1 1 1 1 1 1 1 1 1 1 1 1 1 1 1 1 1 1 
##$CPDPRG= <>
##$CPDPRG1= <>
##$CPDPRG2= <>
##$CPDPRG3= <>
##$CPDPRG4= <mlev>
##$CPDPRG5= <mlev>
##$CPDPRG6= <mlev>
##$CPDPRG7= <mlev>
##$CPDPRG8= <mlev>
##$CPDPRGB= <>
##$CPDPRGT= <>
##$D= (0..31)
0 0.7 0 0 0 0 0 0 0 0 0 0.03 0 0 0 0 0 0 0 0 0 0 0 0 0 0 0 0 0 0 0 0 
##$DATE= 1753700477
##$DBL= (0..7)
120 120 120 120 120 120 120 120 
##$DBP= (0..7)
150 150 150 150 150 150 150 150 
##$DBP07= 0
##$DBPNAM0= <>
##$DBPNAM1= <>
##$DBPNAM2= <>
##$DBPNAM3= <>
##$DBPNAM4= <>
$$ [...]
##$SUBNAM3= <"">
##$SUBNAM4= <"">
##$SUBNAM5= <"">
##$SUBNAM6= <"">
##$SUBNAM7= <"">
##$SUBNAM8= <"">
##$SUBNAM9= <"">
##$SW= 18.0517328524113
##$SWIBOX= (0..15)
0 0 2 0 0 0 0 0 0 0 0 0 0 0 0 0 
##$SW_h= 3612.71676300578
##$TD= 16384
##$TD0= 1
##$TE= 0
##$TE2= 300
##$TE3= 300
##$TEG= 300
##$TL= (0..7)
0 120 120 120 120 120 120 120 
##$TP= (0..7)
150 150 150 150 150 150 150 150 
##$TP07= 0
##$TPNAME0= <>
##$TPNAME1= <>
##$TPNAME2= <>
##$TPNAME3= <>
##$TPNAME4= <>
##$TPNAME5= <>
##$TPNAME6= <>
##$TPNAME7= <>
##$TPOAL= (0..7)
0.5 0.5 0.5 0.5 0.5 0.5 0.5 0.5 
##$TPOFFS= (0..7)
0 0 0 0 0 0 0 0 
##$TUNHIN= 0
##$TUNHOUT= 0
##$TUNXOUT= 0
##$USERA1= <user>
##$USERA2= <user>
##$USERA3= <user>
##$USERA4= <user>
##$USERA5= <user>
##$V9= 5
##$VALIST= <valist>
##$VCLIST= <CCCCCCCCCCCCCCC>
##$VD= 0
##$VDLIST= <DDDDDDDDDDDDDDD>
##$VPLIST= <PPPPPPPPPPPPPPP>
##$VTLIST= <TTTTTTTTTTTTTTT>
##$WBST= 1024
##$WBSW= 4
##$XGAIN= (0..3)
0 0 0 0 
##$XL= 0
##$YL= 0
##$YMAX_a= 615618
##$YMIN_a= -615026
##$ZGOPTNS= <>
##$ZL1= 120
##$ZL2= 120
##$ZL3= 120
##$ZL4= 120
##$ABSF1= 15.5717
##$ABSF2= -2.480151
##$ABSG= 5
##$ABSL= 3
##$ALPHA= 0
##$AQORDER= 0
##$ASSFAC= 0
##$ASSFACI= 0
##$ASSFACX= 0
##$ASSWID= 0
##$AUNMP= <proc_1d>
##$AZFE= 0.1
##$AZFW= 0.1
##$BCFW= 0
##$BC_mod= 2
##$BYTORDP= 0
##$COROFFS= 0
##$CY= -3
##$DATMOD= 1
##$DC= 0
##$DFILT= <>
##$DTYPP= 0
##$F1P= 0
##$F2P= 0
##$FCOR= 1
##$FTSIZE= 16384
##$FT_mod= 6
##$GAMMA= 0
##$GB= 0
##$INTBC= 1
##$INTSCL= 3.241238e-09
##$ISEN= 128
##$LB= 0.25
##$LEV0= 0
##$LPBIN= 0
##$MAXI= 10000
##$MC2= 0
##$MEAN= 0
##$ME_mod= 0
##$MI= 1.114404
##$NCOEF= 0
##$NC_proc= -5
##$NLEV= 6
##$NOISF1= 3.799351
##$NOISF2= 2.8
##$NSP= 0
##$NTH_PI= 0
##$NZP= 0
##$OFFSET= 15.58383
##$PC= 1
##$PHC0= -1359.808
##$PHC1= 14.99254
##$PH_mod= 1
##$PKNL= yes
##$PPARMOD= 0
##$PSCAL= 0
##$PSIGN= 0
##$REVERSE= no
##$SF= 200.129987567333
##$SI= 16384
##$SIGF1= 3
##$SIGF2= 2
##$SINO= 0.751879
##$SIOLD= 32768
##$SREGLST= <19F.Aceton>
##$SSB= 0
##$STSI= 16384
##$STSR= 0
##$SW_p= 3612.71676300578
##$SYMM= 0
##$S_DEV= 0
##$TDeff= 16384
##$TDoff= 0
##$TI= <>
##$TILT= no
##$TM1= 0
##$TM2= 0
##$TOPLEV= 0
##$USERP1= <user>
##$USERP2= <user>
##$USERP3= <user>
##$USERP4= <user>
##$USERP5= <user>
##$WDW= 1
##$XDIM= 16384
##$YMAX_p= 410326898
##$YMIN_p= -126784
$$ End of Bruker specific parameters
$$ ---------------------------------
##NTUPLES= NMR SPECTRUM
##VAR_NAME=  FREQUENCY,     SPECTRUM/REAL,   SPECTRUM/IMAG
##SYMBOL=    X,             R,               I
##VAR_TYPE=  INDEPENDENT,   DEPENDENT,       DEPENDENT
##VAR_FORM=  AFFN,          ASDF,            ASDF
##VAR_DIM=   16384,         16384,           16384
##UNITS=     HZ,            ARBITRARY UNITS, ARBITRARY UNITS
##FACTOR=    0.220516191357247, 1,           1
##FIRST=     3118.79168008795, 0,            0
##LAST=      -493.92508291783, 0,            0
##MIN=       -493.92508291783, -126784,      0
##MAX=       3118.79168008795, 410326898,    0
$$ Real data points
##PAGE= N=1
##DATA TABLE= (X++(R..R)), XYDATA
$$ [...]
6223a590J4187J9797k1843n926P178p368k594j0550k039P266m339L161O078N474
6209F892j1496O262j1799J4456K474o062J2058l398l392j1597O732J1307M421
6196A6858o494J4072j3648n718l898l377j0727o578J4069P751K0956P63r948n675
6182H406J927k806q10j1765Q770l238L80P183n694L739j3732J2292J472N67J0142
6167A6833M043j4335j3479M979j898O219J1775J1341r59q491J3130j2143k766
6154A4249N857j4070J0906j2260q794J0162K983R881Q48q947M803J4866k0127
6141A0357r702j1682J9232J0081n279p793P464K2897l744j0585L976J2911j6160
6128B1973j6232O058J7852Q90k1218P829l645p628R669m760Q38j706l331J408
$$ plain form
6223 -1590 12597 32394 10551 4625 11803 4435 1841 -8709 -10748 -3482 -7821 -4660 1418 6892
6209 6892 -4604 1658 -10141 4315 6789 727 12785 9387 5995 -5602 1130 12437 16858
6196 16858 10364 24436 10788 5070 1172 -2205 -12932 -19510 -5441 2310 23266 24029 14081 8406
6182 8406 10333 7527 6717 -5048 3722 484 864 8047 2353 6092 -7640 4652 6124 6691 16833
6167 16833 20876 6541 -6938 -1959 -3857 2362 14137 25478 24519 16028 29158 17015 14249
6154 14249 20106 6036 16942 4682 -4112 6050 9033 18914 19762 10815 15618 30484 10357
6141 10357 655 -11027 8205 18286 13007 5214 12678 35575 31831 21246 25222 38133 21973
6128 21973 5741 11799 29651 30541 9323 17152 13507 5879 15548 10788 11626 9920 6589 7997
6114G997L566K680J2806M831l636j7650M5K4029p498j3875L880p610l595J5721
6100B1691P801n658N468Q96q795K664j5706L169k605l84K15o496j3090R478R505
6085H153j1823K4698J2894j1022j5081m282J1932Q308j5493n759J2680R668M149
6072B9022j3441j819J3478o817l502l860R194l092p622R513m701M682k214j4506
6058D315N239R631K325o323O058Q718l950J0339q872Q389o379l423O175j4914
6044A7328J1585n243k115P854l977Q229J1421Q704P078k2948l896j4969R917J0122
6030C9090k4271J1271N163J9583J775j7955R259P867n499j0459R704n607p821
6017C2100N26O252J4481m87Q107Q876r418j736J8957J7084j2568J0017j0786k335
$$ plain form
6114 7997 11563 14243 27049 31880 28244 10594 10639 34668 27170 13295 17175 9565 5970 21691
6100 21691 29492 23834 29302 30198 21403 24067 8361 11530 8925 8541 8756 2260 -10830 -1352 8153
6085 8153 -3670 21028 33922 22900 7819 3537 15469 23777 8284 2525 15205 24873 29022
6072 29022 15581 13762 27240 20423 16921 13061 22255 19163 11541 21054 16353 21035 18821 4315
6058 4315 9554 19185 21510 15187 21245 29963 26013 36352 27480 35869 29490 26067 32242 17328
6044 17328 28913 23670 21555 29409 25432 33661 45082 53786 60864 37916 34020 19051 28968 39090
6030 39090 14819 26090 31253 50836 52611 34656 43915 51782 46283 35824 45528 39921 32100
6017 32100 32626 38878 53359 52872 60979 69855 60437 58701 77658 94742 82174 92191 81405 79070
6003G9070j1967J4346L601l4864J7744J2518j2919j180n474q192L93M902J9131
5990G7109o980m263M385J0269o613M010M31J262q00K8357J2378M04O035o974j2701
5975A06309j2873O067o971j7082n586K891q088P044l239o05k30M140J0695r194
5961G3278j4934o215J8007j7710m238J8296O359k3800R794J7180R243R224j6033
5948G8451J31J5745n213q191N577q907j4207k026o807m926J4540n121P608n828
5934F0826N870o483N706m087j6508j1510P629R566j257J238r400j602k921k658
5920C4409M939k363k600j053J0881J7337j0661R62N648j6878l503N023J3844q575
5906D7410j941r05O069j2102K905N714m028J103P372m554k1913Q294j1010K1496
$$ plain form
6003 79070 67103 81449 85050 50186 67930 80448 67529 66349 60875 52683 53076 57978 77109
5990 77109 70129 65866 70251 80520 73907 77917 78348 79610 78810 107167 119545 119949 125984 119010 106309
5975 106309 93436 99503 92532 75450 69864 72755 64667 71711 68472 67867 67637 71777 82472 73278
5961 73278 58344 52129 70136 52426 48188 66484 72843 49043 58837 76017 85260 94484 78451
5948 78451 78582 94327 89114 80923 86500 77593 63386 61360 54553 49627 64167 59046 66654 60826
5934 60826 66696 60213 65919 61832 45324 33814 41443 51009 49752 50990 41590 39988 37067 34409
5920 34409 39348 36985 34385 33332 44213 61550 50889 51851 57499 40621 37118 42141 55985 47410
5906 47410 45469 44564 50633 38531 41436 47150 43122 44225 51597 47043 25130 33424 22414 43910
5892D3910N480q677q618K329j4683J5765J6325j2995n189K75L202J982r225M873
5878C4754J0610Q699m825k1480q618R58K3532o308r549J6346N683o677j3945J6581
5864D5761M934j1277M429J7562n124j5073j2302J0852O603n377J549j129L88J602
5850D3398J1238K824j3889j0496P132m924J523j5610Q57J5723r561R526L259p564
5836C3436j32J1623l31M037M254j1795j0669l465N716Q971O508K653j766l319
5822D5721K895r055N521r833p87j942n264M171k513O918j2437l547j715J3301
5808C1434J312k0856M675k558m8J3581m139j2206L110J280n442Q835K7309j8872
5794B7415p70p866J0749j417n367O856k525K982O721j2945j179n711R176P071
$$ plain form
5892 43910 49390 40713 32095 34424 19741 35506 51831 38836 33647 33922 37124 39106 29881 34754
5878 34754 45364 54063 49238 27758 19140 20098 43630 37322 27773 44119 49802 43125 29180 45761
5864 45761 50695 39418 43847 61409 56285 41212 28910 39762 46365 40988 42537 41408 41796 43398
5850 43398 54636 57460 43571 33075 40207 35283 36806 21196 22053 37776 28215 37741 41000 33436
5836 33436 33304 44927 44596 48633 52887 41092 30423 26958 32674 41645 48153 50806 49040 45721
5822 45721 48616 39561 45082 35249 34462 32520 27256 31427 28914 35832 23395 19848 18133 31434
5808 31434 32746 11890 16565 14007 13959 27540 23401 11195 14305 15585 10143 18978 46287 27415
5794 27415 26645 18779 29528 28111 22744 29600 27075 30057 36778 23833 22654 16943 26119 33190
5780C3190J4979r14j1819n490q788M799o058R786M782J917q877p541j6438M27
5766C955R745J4994P252J97q787l658l912O737K0478K492p971n20q878p50r402
5751B1972O62m866J2314J0913r828L606r52j6618J0933J801J870N736j034j1532
5737B4977p119M277L263J710K747J1531J2752J783j9383l025J1884o832M788j4543
5723B8810m772N780K4626k296k5597j80Q49O502P344r125O142J7251J257n476
5709E1115o285J6872j196j2522j0432K666l470p069J906P28L422o078j1209J4611
5695C3059L125J837j3975l806m706j2219J9257J4600j4636o06j097J5316m194
5682C1955J5311l519r556q478K0361J8132j6031j9325o459j120j78j1166P75N512
$$ plain form
5780 33190 48169 47255 35436 29946 21158 25957 19899 29685 34467 36384 27507 19966 3528 3955
5766 3955 13700 28694 35946 36143 27356 23698 19786 26523 47001 49493 41522 41002 32124 31374 21972
5751 21972 22634 17768 30082 40995 31167 34773 33821 17203 28136 29937 31807 37543 36509 24977
5737 24977 17858 22135 25398 27108 29855 41386 54138 55921 36538 33513 45397 38565 43353 28810
5723 28810 24038 29818 54444 52148 26551 26371 27220 33722 41066 31941 38083 55334 56591 51115
5709 51115 44830 61702 60506 47984 37552 40218 36748 29679 31585 32313 35735 29657 18448 33059
5695 33059 36184 38021 24046 20240 15534 3315 22572 37172 22536 21930 20833 36149 31955
5682 31955 47266 43747 34191 25713 46074 64206 48175 28850 22391 21271 21093 9927 10702 16214
5668A6214K943O077n732J1801P531o278K867o923k995J9420m856n333N531J2160
5654E2427j4197r40J0645j4090j7857J3898J2073R133j2662Q997K2393o912j4089
5641D8819n178l875K5421m594k165n247r03l050n957p385M489J5195K642p788
5627E0424Q546O440n977m558K878J3138q371J764j4090J4252J8006m343j1667
5614F6442N265J5500o265L392J0144l88J207J0852M385O796n347N249J4755K5488
5600A57475K1206M914N420K4111J1978M4221K2834K0285p849l1482m1190k9221
5588B02702J487j3767j3085j6099L325N033K0374j1544o688M911J2859R468P642
5575B06618p979R689K1273J2267J6817M4605K6770K7634M5467P3688P3572Q4648
$$ plain form
5668 16214 19157 25234 19502 31303 38834 32556 35423 28500 25505 44925 40069 34736 40267 52427
5654 52427 38230 37290 47935 33845 15988 29886 41959 51092 38430 47427 69820 62908 48819
5641 48819 43641 39766 65187 60593 58428 53181 52278 49228 43271 35886 40375 55570 58212 50424
5627 50424 58970 65410 59433 54875 57753 70891 62520 64284 50194 64446 82452 78109 66442
5614 66442 71707 87207 80942 84334 94478 94090 95297 106149 110534 117330 111983 117232 131987 157475
5600 157475 178681 183595 189015 213126 225104 269325 292159 312444 304595 273113 231923 202702
5588 202702 204189 190422 177337 161238 164563 169596 189970 178426 171738 176649 189508 198976 206618
5575 206618 198639 208328 229601 241868 258685 303290 330060 357694 403161 476849 550421 635069
5563F35069J12582O0644q834p2081j19039r5725o5116l3624m6282l1764j1665
5552C24165j2906k2586k4701j974R972N587M219L545j046j4825M164R101L2865
5539C15580P891Q103L1178M6821M8083O1773Q0356J01996Q7432M3918p107o3240
5527G62784j11366j25276n5880n7515l1825l7633k6940k6330j3682J901p035j4279
5515B56924j7528j1735O40k297p26N87J8592r293J1928M458P756P824N138J8522
5501B90790L2619L5573K0240J2308j5887l8975k9906k3794l3008j9560j8842k785
5489B08773j2714M604J5206o831r035J0924o639M36j9053j6709O815J167k501
5476A74443k2320j0805J652o854k140p239o420J1755j7612J352p031R476J3429
$$ plain form
5563 635069 747651 808295 799461 727380 608341 512616 447500 413876 367594 335830 324165
5552 324165 311259 288673 263972 261998 271970 277557 281776 285321 284275 269450 273614 282715 315580
5539 315580 323471 331574 362752 409573 457656 519429 599785 701781 789213 833131 826024 762784
5527 762784 651418 526142 470262 412747 380922 343289 316349 290019 276337 278238 271203 256924
5515 256924 239396 227661 228301 226004 225278 225865 244457 235164 247092 251550 259306 267130 272268 290790
5501 290790 323409 358982 379222 391530 375643 336668 306762 282968 249960 230400 211558 208773
5489 208773 196059 200663 215869 209038 200003 210927 204288 204724 185671 168962 175777 176944 174443
5476 174443 152123 141318 142970 136116 133976 126737 120317 132072 114460 115812 108781 118257 131686
5463A31686P856k313j6423o402J3756j383l063K6560j4359q452P588M409K6673
5450A66133q742p041j5358k3490O449r801j1189R258J246k818K195j896l641L37
5436A01642o030J122K5653m049j3204k185J909L203j4944P661J5074r144J2187
5423A18895l180J567n851o46j4168r516j8958N779J6871J1806N218j2406Q487
5410A03898R110j7225r962r503j9479J6464m200Q93Q567L850M621k162r316K0446
5396I6002q169q940J125O601r123k074R341j919J3298j2408K570K95M311j6864
5382G4046J045R955n579J841k081j435Q304p520P857J0828l845l200R080R497
5368A08793k204P758J0229m287m169J5132K021j1565M777J737J3933M20j3638
$$ plain form
5463 131686 139542 137229 120806 114404 128160 126777 123714 150274 135915 127463 135051 139460 166133
5450 166133 157391 150350 134992 111502 117951 108150 96961 106219 107465 104647 106842 104946 101305 101642
5436 101642 95612 96734 122387 118338 105134 102949 104858 108061 93117 100778 115852 106708 118895
5423 118895 115715 117282 111431 110785 96617 87101 68143 73922 90793 102599 107817 95411 103898
5410 103898 113008 95783 85821 76318 56839 73303 69103 69996 78563 82413 87034 84872 75556 96002
5396 96002 87833 78893 80018 86619 77496 75422 84763 82844 96142 83734 86304 86599 90910 74046
5382 74046 75091 85046 79467 81308 79227 77792 86096 78576 86433 97261 93416 90216 99296 108793
5368 108793 106589 114347 124576 120289 116120 131252 133273 121708 126485 128222 142155 142575 128937
5355A28937J2074L775O602j9594q483Q413l788r04j827L073M477J1658J2203J976
5341A58592N234O245j1168K0809K7609j8951m590R159J4329L104J8749K1441K393
5328B52955M592J2025J1442K678p700k0253k3184M368Q164J5376N337J9533L320
5315B88653M611N2599K1520L4441N9733P3491R4895J26763R4325O1916q702j01268
5303H02977j16798j11880p3969l7053m3476l8093l6669m5270k2197l911j6964
5292B56697j0274j0538k0917j3290o864j7575j4333j6053J0902Q083j8873n424
5280A41541m904o138q829j3941O449K0023J2875j1441k0283m400K785q563k554
5267A02620Q609n748q041m824j776p128N014M942m767j7379K620Q930J8654L751
$$ plain form
5355 128937 141011 144786 151388 131794 123311 131724 127936 127032 125205 128278 132755 144413 156616 158592
5341 158592 163826 170071 158903 179712 207321 188370 183780 192939 207268 210372 229121 250562 252955
5328 252955 257547 269572 281014 283692 275992 255739 232555 236923 245087 260463 265800 285333 288653
5315 288653 293264 345863 367383 401824 461557 535048 629943 756706 851031 912947 904245 802977
5303 802977 686179 574299 500330 463277 419801 381708 345039 299769 277572 273661 256697
5292 256697 246423 235885 214968 201678 194814 177239 162906 146853 157755 165838 146965 141541
5280 141541 136637 130499 121670 107729 114178 134201 147076 135635 115352 110952 113737 105174 102620
5267 102620 111229 105481 97440 92616 90840 83712 88726 93668 88901 71522 74142 83072 101726 105477
5253A05477j8873j6794N740J8800r003J3233J038l085J3043q650P679j7025l284
5240H8296l205j7809J0819m142k556j683j5352L698K8577J5955o850N318O680
5227A07746j2145j6752j890N387Q99n086p79j3635P540R702K388R0j6691L905
5213G0679J4586L298p232J806J3350j3400j1455Q940n492M756n619j5570r03J866
5199E9610J1495J630n637j0674o774J9674M886p084P630q505M983O687p100r881
5185F0940J1314L392p077L826j0715n389m857k357J7619J3653j0117Q854j725
5172G7361n195K940n487k729p015J2319R733l919r059m738R284N41j7614k364
5158E4058J747P877m231j2526J7036O210J848j1344K987n292J5005J9731J1044
$$ plain form
5253 105477 86604 69810 75550 94350 85347 98580 99618 96533 109576 100926 108605 91580 88296
5240 88296 85091 67282 78101 73959 71403 69720 54368 58066 86643 102598 95748 101066 107746
5227 107746 95601 78849 76959 82346 83245 78159 77380 63745 71285 80987 83375 83465 66774 70679
5213 70679 85265 88563 81331 83137 96487 83087 71632 80572 75080 79836 74217 58647 57744 59610
5199 59610 71105 72735 67098 56424 49650 69324 74210 67126 74756 66251 71234 77921 70821 60940
5185 60940 72254 75646 68569 72395 61680 56291 51434 49077 66696 80349 70232 79086 77361
5172 77361 72166 75106 69619 66890 59875 72194 81927 78008 68949 64211 73495 74036 56422 54058
5158 54058 55805 63682 59451 46925 63961 70171 72019 60675 63662 58370 73375 93106 104150
5145A04150k1032o911j2377L55J3566L065J0484o052j5618l150O426j4233j128
5132E7545K752K512J1099L262j3573j3793J7721j319o042j687l89K4571N698k438
5118H5919j8411O152J1682j5222P523j2340J6343j1086n215n445l418J1333R76
5105F8791O51k357M490j352J3248Q419m95k497p455O66N938P626P774M826j6111
5090I2162j5800P467K533J5840q685p490q93M662N23j0282P745P485k6716J93
5076F8744K850o118k634J2043J0115M153j4518o030J5312J3136q134n511O660
5063I0068j523n702J6135j5651j2547J3501P304p439J6549M773p032N774R609
5050A13819j0045q128K1309O039J4234j5777l0248L060K2170L434O458Q174q699
$$ plain form
5145 104150 83118 76207 63830 64185 77751 80816 91300 85248 69630 66480 72906 58673 57545
5132 57545 60297 62809 73908 77170 63597 49804 67525 66206 60164 58477 58088 82659 88357 85919
5118 85919 67508 73660 85342 70120 77643 65303 81646 70560 65345 59900 56482 67815 68791
5105 68791 69442 67085 71575 70223 83471 91890 91395 88898 81443 82109 88047 95673 103447 108273 92162
5090 92162 76362 83829 86362 102202 93517 86027 85134 89796 90319 80037 87782 95267 68551 68744
5076 68744 71594 65476 62842 74885 85000 89153 74635 68605 83917 97053 88919 83408 90068
5063 90068 88545 82843 98978 83327 70780 84281 91585 84146 100695 105468 98436 104210 113819
5050 113819 103774 95646 116955 122994 137228 121451 91203 94263 116433 119867 126325 134499 125800
5037A25800N292J1348K643k152R747J6113Q557J6485o983k3386J0242J487N712
5024A80905L293n943J815J0591m753N679M222j1454j285R010J6892J0004K934
5011B21910J2099m870j903K087K494J4480K4762M027L245J6581K220J8912J2846
4998C28890N739k0983l468M43k010J1981j0547j3319m566j4690P478k192J1689
4985B94445j6103m486j757l018o869M136l086p647j2246R986O372j6081m606N603
4971B44643J4833l53j3681p951r894m528O456j3001l24r820j7707r41M750q023
4957A84459n939O542j3272M704j760M795J5498p242K806n548k34L748O224k2941
4943A71840J6642K599M374l400p329O552q760J583K006R037p095R686o224Q583
$$ plain form
5037 125800 131092 142440 145083 142931 152678 168791 177348 193833 186850 163464 173706 175193 180905
5024 180905 184198 178255 180070 190661 185908 191587 195809 184355 183070 192080 208972 218976 221910
5011 221910 234009 229139 227236 229323 231817 246297 271059 275086 278331 294912 297132 316044 328890
4998 328890 334629 313646 310178 310621 308611 320592 310045 296726 292160 277470 284948 282756 294445
4985 294445 278342 273856 272099 269081 262212 266348 263262 255615 243369 253355 259727 243646 239040 244643
4971 244643 259476 259123 245442 237491 227597 223069 229525 216524 216200 206380 188673 187732 192482 184459
4957 184459 178520 185062 171790 176494 174734 179529 195027 187785 190591 185043 184809 188557 194781 171840
4943 171840 188482 191081 195455 192055 184726 191278 182518 184101 186107 195144 188049 197735 191511 200094
4929B00094m408j2432O405k559K652N817l228Q668J2630Q08j1732K650q727R84
4915A97622P516j5090l309P452n522N743J0239j5625j21K956J0528j1109n890
4902A85390L4767P96j081N201m262q340l885J0678Q617K2747o007N853l882J685
4888B48277m286n411J712K154L994J2052o854j279J0058l955J9804J725m083J5334
4874B89242J0059R076J8606m96j4305J5198K2397N84q641k3651j257J0014j587
4861C25239P784J9814q814j5506Q652J3360j3089j662R919l984J4469j774Q518
4848C62926O351J3319j1367j4518L749r318P558J3481q589Q730K6711q969o717
4835C83347L741j644r031J339n932J8968K7345j3614L748K343N506J0912J0766
$$ plain form
4929 200094 195686 183254 189659 187100 189752 195569 192341 201009 213639 214447 202715 205365 196638 197622
4915 197622 205138 190048 186739 194191 188669 194412 204651 189026 188905 191861 202389 191280 185390
4902 185390 220157 220953 219872 225073 220811 212471 208586 219264 227881 250628 244621 250474 246592 248277
4888 248277 243991 238580 240292 242446 246440 258492 251638 250359 260417 256462 276266 277991 273908 289242
4874 289242 299301 308377 326983 326487 312182 327380 349777 350361 341720 318069 316812 326826 325239
4861 325239 333023 352837 344023 328517 337169 350529 337440 335778 345697 341713 356182 354408 362926
4848 362926 369277 382596 371229 356711 360460 351142 358700 372181 363592 372322 399033 390064 383347
4835 383347 387088 385444 376413 377752 371820 390788 418133 404519 408267 410610 416116 427028 437794
4822D37794J2150J2008N701n98J926J807J0593N027P211N467R960J2446J728K571
4808E25791r97K2445M935Q3k928K5869J7627P738K2667k310L0138R494R618K295
4794F72465K1542L4390l576J9524J6337J8597L4618J0358K8025L6288L6018M4909
4782I69495M2967J1494K1627L0301K2662R803J4618L6336K7520K3760K4814L6163
4770A271560K9662N1506K4504J8883K8446L8911N0633M1622M3157M9129N1978
4759A699991O0255Q3932Q9379Q6423Q4326J10081J20260R9008J17204J19389J20362
4748B790610J12742J16889J67648J90731K09551J96246K14561K28403K32510K25688
4738D685579K56746L01816L18371L52883L88834L92191M20830M24612M93265N71410
$$ plain form
4822 437794 449944 461952 467653 467055 468981 470788 481381 486408 493619 499086 509046 521492 523220 525791
4808 525791 524794 547239 552174 552257 549329 575198 592825 600563 623230 620920 651058 660552 670170 672465
4794 672465 694007 728397 724821 744345 760682 779279 813897 824255 852280 888568 924586 969495
4782 969495 1012462 1023956 1045583 1075884 1098546 1108349 1122967 1159303 1186823 1210583 1235397 1271560
4770 1271560 1301222 1352728 1377232 1396115 1424561 1463472 1514105 1555727 1598884 1648013 1699991
4759 1699991 1760246 1844178 1933557 2019980 2104306 2214387 2334647 2433655 2550859 2670248 2790610
4748 2790610 2903352 3020241 3187889 3378620 3588171 3784417 3998978 4227381 4459891 4685579
4738 4685579 4942325 5244141 5562512 5915395 6304229 6696420 7117250 7541862 8035127 8606537
4728H606537P07208Q61439R69639J028339R79825P89163N34266L46973K53252
4719A5076641K26311K25112K02037J82272J78445K48236L37143L97029M33551
4710A7506777M68265N19728O11218O85369O87399P13140O65612N95632O02206
4701B3055346O37409P17657Q67539J006755J181353J295505J337487J231256Q78466
4692C2208773K93508l39785q59400j072570j037035r29748p99899p27037o27781
4683B6109026n36727n84665o38799p34288p94999p86646o88915n77278m98444
4674B0268265m20788l90126l60629l02366k18425j25567n6447n2703r3227j28730
4664A8119257j77869l03611m79583p34534j037481j199145j141594r95211q00507
$$ plain form
4728 8606537 9313745 10175184 11144823 12173162 13152987 13942150 14476416 14823389 15076641
4719 15076641 15302952 15528064 15730101 15912373 16090818 16339054 16676197 17073226 17506777
4710 17506777 17975042 18494770 19105988 19791357 20478756 21191896 21857508 22453140 23055346
4701 23055346 23692755 24410412 25277951 26284706 27466059 28761564 30099051 31330307 32208773
4692 32208773 32502281 32162496 31303096 30230526 29193491 28263743 27463844 26736807 26109026
4683 26109026 25572299 24987634 24348835 23614547 22819548 22032902 21343987 20766709 20268265
4674 20268265 19847477 19457351 19096722 18794356 18575931 18450364 18393917 18341214 18247987 18119257
4664 18119257 17941388 17637777 17158194 16423660 15386179 14187034 13045440 12050229 11249722
4655A1249722o25517n19932m63771m61556m05147m02765l88556l65211l31093
4646G286174l01944k92304k47518k56563k70734k60610k68292k70802k36737j96521
4636D684149k05315j99673j57559j64550j41537j59199j47841j10562j13356j02450
4626C182107q6174p2781q3902n7408o9592p8609l1464m8525l4732m3870o0566
4615B514484m8323n1043l3823l6256l1157l9705m7149n6731o5043l7907n2616
4604B014731m1731l6452n0681n0787m7261m6537l7981k3614m8287j2464k0479
4593A598457m3985j9748k9985k0748k9171k1639j9837k2424j8270k2517m5228
4582A304905k7100Q647N184k9230m6842k8817k4833m8291k3481k2935p468j8979
$$ plain form
4655 11249722 10624205 10104273 9640502 9178946 8773799 8371034 7982478 7617267 7286174
4646 7286174 6984230 6691926 6444408 6187845 5917111 5656501 5388209 5117407 4880670 4684149
4636 4684149 4478834 4279161 4121602 3957052 3815515 3656316 3508475 3397913 3284557 3182107
4626 3182107 3095933 3023152 2939250 2881842 2812250 2733641 2702177 2653652 2618920 2575050 2514484
4615 2514484 2466161 2415118 2381295 2345039 2313882 2274177 2227028 2170297 2105254 2067347 2014731
4604 2014731 1973000 1936548 1885867 1835080 1787819 1741282 1703301 1679687 1631400 1618936 1598457
4593 1598457 1554472 1534724 1504739 1483991 1454820 1433181 1413344 1390920 1372650 1350133 1304905
4582 1304905 1277805 1286452 1291636 1262406 1215564 1186747 1161914 1113623 1090142 1067207 1059739 1040760
4570A040760j4133k0226k9379q102j0995k3415j931q216p555m565P84m106k1851
4557H87070k4178l1487L534k4799j5993j8355j9874j2626j806k8048j9290j4400
4545F79748k0852k7475j3376j7647j2271P421J1582k1207j7558k7227o554n878
4533E28706p931j599n086N503k2610M030O466p808j1876J2412j8448l847n912
4520D72000O533J1110j3167l289q494O62k2211j087R587N495P062j9553m604l201
4506D36843j0458P581M126j2074O937n02n756K658N860r999o441R955N529j2535
4492D21724j9j0370J7520K3185l365r205L806r879p44J2528M048o496j3497J6203
4478D45439N371N809J927l55o857j1277k537k63K106r18k4816k59K365R449j2697
$$ plain form
4570 1040760 1026627 1006401 977022 968920 957925 934510 932579 924363 916808 912243 913027 908921 887070
4557 887070 862892 831405 834939 810140 794147 775792 755918 743292 741486 713438 694148 679748
4545 679748 658896 631421 618045 600398 588127 595548 607130 585923 568365 541138 534584 528706
4533 528706 520775 519176 514090 519593 496983 501013 507479 499671 487795 500207 481759 477912 472000
4520 472000 478533 489643 476476 473187 464693 465355 443144 442057 451644 457139 464201 444648 440044 436843
4506 436843 426385 433966 438092 426018 432955 432453 426697 429355 435215 425216 418775 428730 434259 421724
4492 421724 421705 411335 428855 452040 448675 439470 443276 433397 432653 445181 449229 442733 429236 445439
4478 445439 450810 456619 458546 458191 451334 440057 437520 437257 439363 438445 413629 413370 415735 425184 412487
4463D12487J1433J087k95p22M609K245j0829O142j6052m687O43j0853Q330J2627
4449D16165K695j0023p794j2451J274J0745o377p078l437j2575k0009J6087j3056
4436C54166R506k871l008k700j7588P673l862J3559J4472j4943k4052L676P514
4423C41542k019n033l439k208Q406Q808J4370L231j8068L22O533K0043m262J704
4409C69930r858q140K509J4498k294r243J0109L751k911k1695J0460Q82L134L949
4395C65081J1088j1413L2072J4536q754O455j7547O218K150J7384J3603p733K0741
4382D43881K2875l344K232n612m804k2689j1328r166R813P273r481P71j3647k9887
4368C76887J5846N372q049N922j1144K36J4566j7092P716R885k653K2325O793
$$ plain form
4463 412487 423920 425007 424712 423990 428599 430844 420015 426157 410105 405418 406061 395208 403538 416165
4449 416165 418860 408837 401043 388592 389866 400611 394234 387156 383719 371144 351135 367222 354166
4436 354166 363672 360801 357793 355093 337505 345178 341316 354875 369347 354404 330352 334028 341542
4423 341542 339523 334490 331051 328843 337249 346057 360427 363658 345590 345912 352445 372488 368226 369930
4409 369930 360072 351932 354441 368939 366645 357402 367511 371262 368351 346656 357116 357998 361132 365081
4395 365081 376169 364756 396828 411364 402610 409065 391518 397736 399886 417270 430873 423140 443881
4382 443881 466756 463412 465644 460032 455228 432539 421211 412045 421858 429131 419650 420421 406774 376887
4368 376887 392733 398105 390056 395978 384834 385070 399636 382544 390260 400145 397492 419817 426610
4355D26610j0777k077Q343j2439n879j091o121O997k722P707j4534k0963L403
4342C76457j648J2459k581K193l826r139K356Q599J0836mm68Q612j8483Q888K2980
4327D17231R063M786j1006j6402J3717J500j6381J1948J0578J68M872K02r294
4314D20982O466K9154L36p195M859J2480J4659M960J70J0618J8923J1298j3330
4301E14380J1834J8541N933L5933J2640j588K2401K6593M3077K7860J5329L146
4289G36079l4203j2113l2857k3948K565L055m849j77J1176r83m708K446Q378R69
4275F50830J4148O251Q931n332L992J8899K2433O083P053K1474L76J3066J7634
4262G85838J2230Q001M715R302J7884N084J8682L2383J5916k8K7385L4928K3522
$$ plain form
4355 426610 415833 413756 422099 409660 403781 402690 396569 403566 400844 408551 394017 373054 376457
4342 376457 374809 387268 384687 386880 383054 373915 376271 384870 395706 395702 395234 403846 385363 394251 417231
4327 417231 426294 431080 420074 403672 417389 418889 402508 414456 425034 425202 430074 430276 420982
4314 420982 427448 456602 456938 449743 454602 467082 481741 486701 486871 497489 516412 527710 514380
4301 514380 526214 544755 550688 586621 599261 597673 620074 646667 689744 717604 732933 736079
4289 736079 701876 689763 656906 632958 635523 638578 633729 633552 644728 643745 639037 641483 649861 650830
4275 650830 664978 671229 680160 674828 678820 697719 720152 726235 733288 754762 755138 768204 785838
4262 785838 798068 806069 810784 820086 837970 843054 861736 894119 910035 910007 937392 972320 995842
4249I95842L0657K7931J7438K2005L2934L9328L3550K8627L9111N3130M3548O2813
4237A426914N4985O3277Q6201P1326Q2778O7076P5329J12526J07483R1625Q6126
4226B325646J03731J30665J51892J48149J65766J97295J98687K36520K51015K72818
4216D182184K67218K41661K48347K32019K11742K24184K49879K78401L35415L73870
4206F844920M18939M89776M89664N05658N21771M86615M46672M20648L92482L44540
4196A1361685L96317M65423N20388O09735O50212O67727O45870N96415N39049
4187A6452821M93799M37748M22747M00203L86511M54233N58515O89389P99126
4178B1095092Q28152P51795N98478L57648J21415o3019j31967j44529j11312k8452
$$ plain form
4249 995842 1026499 1054430 1071868 1093873 1126807 1166135 1199685 1228312 1267423 1320553 1364101 1426914
4237 1426914 1481899 1545176 1631377 1702703 1785481 1852557 1927886 2040412 2147895 2239520 2325646
4226 2325646 2429377 2560042 2711934 2860083 3025849 3223144 3421831 3658351 3909366 4182184
4216 4182184 4449402 4691063 4939410 5171429 5383171 5607355 5857234 6135635 6471050 6844920
4206 6844920 7263859 7753635 8243299 8748957 9270728 9757343 10204015 10624663 11017145 11361685
4196 11361685 11758002 12223425 12743813 13353548 14003760 14671487 15317357 15913772 16452821
4187 16452821 16946620 17384368 17807115 18207318 18593829 19048062 19606577 20295966 21095092
4178 21095092 21923244 22675039 23273517 23631165 23752580 23689561 23557594 23413065 23301753 23273301
4168B3273301J16197K89204N02400O57087P48015O95170M46860N4319l91676p56886
4158B5633991r70016j012388r45414p70851n52867l37152o1329J42764K85727
4149B1412465L00189J63817j43885n38251r04481j164963j247547j240053j098154
4140A5539137q75773o69097n01557l12193j80124j20203j15886j97880l78698
4131A2187726n65045p26492p66040p42861p10202o13400m99029m12746l48481
4122F803430k57857k13693k16810j83635k18050k55811k69304k78448k88745k67383
4112D353694k33587k05089j80512j55339j67707j27920j28738j21042r2816j10600
4102B830344r0625q1020q3532o6726p2609q4776m6009n0529o5705n5828n4195
$$ plain form
4168 23273301 23389498 23678702 24181102 24838189 25586204 26281374 26728234 26782553 26390877 25633991
4158 25633991 24663975 23651587 22706173 21935322 21382455 21045303 20983974 21126738 21412465
4149 21412465 21712654 21876471 21732586 21194335 20289854 19124891 17877344 16637291 15539137
4140 15539137 14663364 13994267 13492710 13180517 13000393 12880190 12764304 12566424 12187726
4131 12187726 11622681 10896189 10130149 9387288 8677086 8063686 7564657 7151911 6803430
4122 6803430 6545573 6331880 6115070 5931435 5713385 5457574 5188270 4909822 4621077 4353694
4112 4353694 4120107 3915018 3734506 3579167 3411460 3283540 3154802 3033760 2940944 2830344
4102 2830344 2739719 2658699 2575167 2508441 2435832 2351056 2305047 2254518 2188813 2132985 2078790
4091B078790l9265l7115l3764k5978l9489m1723l8246l6538l4091m0340l3180
4080A679061n3302k8254m1965k4573k3844j5148k5114l5561j5570l0917j7604
4069A367209l3367j1827n153k4491q152j0566k9687k8734j0735n600r228k19j9987
4056A169463o409j1578j678j8693j4603k548j1498k6112j8661j0204j080k384
4044A044015j8827K230o542k9649j737j6068n990R704r96j0054j6159R4j3617
4031I36404j4973Q212r048l772n03j7701o961j0596j7438j5776O597K0635n540
4018H69540n088k1425k856k179j302K6931j1811j2981j4508J188K8451J0912J127
4005H65999j805J2284l200M253N781o877p385j2112R6m512N085J1629Q944K1109
$$ plain form
4091 2078790 2039525 2002410 1968646 1942668 1903179 1861456 1823210 1786672 1752581 1712241 1679061
4080 1679061 1625759 1597505 1555540 1530967 1507123 1491975 1466861 1431300 1415730 1384813 1367209
4069 1367209 1333842 1322015 1316862 1292371 1284219 1273653 1243966 1215232 1204497 1198897 1189669 1189450 1169463
4056 1169463 1163054 1151476 1149798 1131105 1116502 1113954 1102456 1076344 1057683 1047479 1046399 1044015
4044 1044015 1025188 1027418 1020876 991227 989490 973422 967432 977136 976140 966086 949927 950021 936404
4031 936404 921431 929643 920595 916823 916320 898619 891658 881062 863624 847848 854445 875080 869540
4018 869540 864452 843027 840171 837992 836690 863621 851810 838829 824321 825509 853960 864872 865999
4005 865999 864194 876478 873278 877531 883312 876435 869050 856938 857034 852522 857607 869236 878180 899289
3991H99289J396j3927M404K2619O979n308J4480l830m600L994j007N723L6K4055
3977I54303N274R201P889J5043Q124R528P380O127J8550K78j0307j621L7775J2009
3963A079553j4568J7065N70j0017L140K741K0353j5410M645N948K1243J0982r964
3950A116281J6388Q867K035l375l962J0328r606N172m434J4385J2986j359J9359
3937A183065M736J3059J3179R677r680L0473J8105J7344J9415J6605K7843R474
3925A353295L4221J7853L0385K9994J9956J2674L7566M3902M1205M8738M4706
3914A714495N0128M1407M4937L9709N3262K7275J8063M8197N4049L3514R104J1823
3902B145963L8363L6631M7398O7679L9745M8063P4336R1601R4791J15430J38156
$$ plain form
3991 899289 900685 886758 891162 913781 920760 915452 929932 926102 921502 925496 924489 930212 930248 954303
3977 954303 959577 968778 976667 991710 999834 1009362 1016742 1022869 1041419 1041697 1031390 1029769 1067544 1079553
3963 1079553 1064985 1082050 1082620 1072603 1075743 1078484 1098837 1083427 1088072 1094020 1115263 1126245 1116281
3950 1116281 1132669 1141536 1143571 1140196 1136234 1146562 1136956 1142128 1137694 1152079 1165065 1163706 1183065
3937 1183065 1187801 1200860 1214039 1223716 1214036 1244509 1262614 1279958 1299373 1315978 1343821 1353295
3925 1353295 1387516 1405369 1435754 1465748 1485704 1498378 1535944 1579846 1621051 1669789 1714495
3914 1714495 1764623 1806030 1850967 1890676 1943938 1971213 1989276 2037473 2091522 2125036 2134140 2145963
3902 2145963 2184326 2220957 2268355 2336034 2375779 2423842 2498178 2589779 2684570 2800000 2938156
3891B938156J41524J54757J66536J22578O5764N1419L6013J5467L0814K0991L9734
3880C783753O1460Q3009Q9149J28440J62232J60089J87846K27746K39451K66946
3870E390121L20902L72548M07965M18929M51686M65161M65729M70778N19122O46576
3860I929517P73605R17880J089330J145173J048476Q84752N81700K44940P7895
3851A6693268K3209P6317J61210K68023L90709N68233P79029R01038R48209R01102
3841B1710347P36233N52587L67225K20660J52299J34112J68932K79536M44065
3832B4765996O43459R03821J200350J479057J724039J839502J660523J192934
3824C5409681M00689o09372j533621j935890j874760j564738j211600r01907o30171
$$ plain form
3891 2938156 3079680 3234437 3400973 3523551 3589315 3640734 3676747 3692214 3723028 3744019 3783753
3880 3783753 3845213 3928222 4017371 4145811 4308043 4468132 4655978 4883724 5123175 5390121
3870 5390121 5711023 6083571 6491536 6910465 7362151 7827312 8293041 8763819 9282941 9929517
3860 9929517 10703122 11621002 12710332 13855505 14903981 15788733 16370433 16615373 16693268
3851 16693268 16716477 16792794 16954004 17222027 17612736 18180969 18959998 19861036 20809245 21710347
3841 21710347 22446580 22999167 23366392 23587052 23739351 23873463 24042395 24321931 24765996
3832 24765996 25409455 26313276 27513626 28992683 30716722 32556224 34216747 35409681
3824 35409681 35810370 35200998 33667377 31731487 29856727 28291989 27080389 26178482 25548311
3815B5548311m57743k90126j82982r6573k4861l5083j65286l33636n94311q34979
3805B2532731j002309j014822r12965p09965m77625k97516j71045j07737q0947
3796A7757800r8566k00463l50020n99515q53290j012715j015990q99961p62237
3787A1965043o03766n12530m40992l77569l72874l88796m01581l64470l28280
3778H174185k76400k65619k12150k04231j71920j42361j42209j10678q3115q2449
3768F483053p4782k9375m5280k9182n346j1713j2003o2607p4102p2070j00672
3757E965921p3975q4976o2088o9468m7832m1210j1848j0616N063o214l5117J1060
3745E538700M4287L5697K4550J1767K0873Q208P520J4383K4184K3292M3784N2295
$$ plain form
3815 25548311 25090568 24800442 24617460 24520887 24496026 24460943 24295657 23962021 23367710 22532731
3805 22532731 21530422 20515600 19602635 18892670 18415045 18117529 17946484 17838747 17757800
3796 17757800 17659234 17458771 17108751 16509236 15655946 14643231 13627241 12727280 11965043
3787 11965043 11361277 10848747 10407755 10030186 9657312 9268516 8866935 8502465 8174185
3778 8174185 7897785 7632166 7420016 7215785 7043865 6901504 6759295 6648617 6565502 6483053
3768 6483053 6408271 6378896 6333616 6304434 6299088 6287375 6275372 6212765 6138663 6066593 5965921
3757 5965921 5891946 5806970 5744882 5675414 5627582 5586372 5574524 5563908 5568971 5562757 5527640 5538700
3745 5538700 5582987 5618684 5643234 5655001 5675874 5684082 5691602 5705985 5730169 5753461 5797245 5849540
3733E849540M4248O9238P2812M3568N9833Q2330O1344R0036R0939J09859J06306
3722F680053J17577J46483J54966J50974J53090J69245J86051J98441K07435K22930
3712H387245K06056K43066K83892K85288L10851L26818L54513L95501M24544M46197
3702A1663971M83565N31948N62306O30456O93662P44752Q14331Q99618J009221
3693A8033830J109191J229893J377844J535078J705815J841242J936207J980813
3685C0749913J962834J841029J698319J491430J259901R98551P85398O75330O02626
3676D2065331O30030P24151R03670J114918J317847J475232J560267J555250J449348
3667E2796044J342344J141961R03207O86888N05948L60883K37495J76265J21574
$$ plain form
3733 5849540 5893788 5963026 6035838 6079406 6139239 6221569 6282913 6372949 6463888 6573747 6680053
3722 6680053 6797630 6944113 7099079 7250053 7403143 7572388 7758439 7956880 8164315 8387245
3712 8387245 8593301 8836367 9120259 9405547 9716398 10043216 10397729 10793230 11217774 11663971
3702 11663971 12147536 12679484 13241790 13872246 14565908 15310660 16124991 17024609 18033830
3693 18033830 19143021 20372914 21750758 23285836 24991651 26832893 28769100 30749913
3685 30749913 32712747 34553776 36252095 37743525 39003426 40001977 40787375 41462705 42065331
3676 42065331 42695361 43419512 44323182 45438100 46755947 48231179 49791446 51346696 52796044
3667 52796044 54138388 55280349 56183556 56870444 57376392 57737275 57974770 58151035 58272609
3658E8272609R1782N1317j3380j06210k27436l94479n83485p73409r85005j162209
3648E4170095j331418j462886j547823j629494j664878j677923j662554j649962
3640D1543157j596888j548154j508314j464448j399365j310703j295840j213990
3632C0205455j150256j083548j048524r77516r31757q91974q35305q01064p41223
3623B1744288p00702o82555o40122o10020n61177n30965n23323n03148m42390
3614A6549886m41631m38899l99801l83556l69148l63168l13319l23255k97436
3605A3219673k98217k50153k46137k43454k20310j74456j87204j76989j58960
3596A1263793j31922j47348j42667j37314j19508j16695j04984p9725p9110q6613
$$ plain form
3658 58272609 58364391 58415708 58402328 58296118 58068682 57674203 57090718 56317309 55332304 54170095
3648 54170095 52838677 51375791 49827968 48198474 46533596 44855673 43193119 41543157
3640 41543157 39946269 38398115 36889801 35425353 34025988 32715285 31419445 30205455
3632 30205455 29055199 27971651 26923127 25945611 25013854 24121880 23286575 22485511 21744288
3623 21744288 21043586 20361031 19720909 19110889 18549712 18018747 17495424 16992276 16549886
3614 16549886 16108255 15669356 15269555 14885999 14516851 14153683 13840364 13517109 13219673
3605 13219673 12921456 12671303 12425166 12181712 11961402 11786946 11599742 11422753 11263793
3596 11263793 11131871 10984523 10841856 10704542 10585034 10468339 10363355 10283630 10204520 10117907
3586A0117907p1057o4291n1537k9545l8270j2727j7841l893J8594L1406L4067
3575I912813L1216N8123P1871Q7056J12359J23358J62141J58440J65570K16337
3565A1099284J98815K32160K79030K99698L45175L86153M13219M78668N23138
3556A4255340N97456O76528P56131Q40889R60545J086077J215184J404027J597570
3547B3389747J854250K157956K500755K920216L350876L729709M036043M171884
3539D8111436M110909L844657L332832K699247J985225J225034N26045p4877n09917
3530F5250591p14580o74218m37073m4256L12626O02158O93872O03547K57397k33322
3520F5616742q07138j458098k082033k664037l125925l438751l546458l424844
$$ plain form
3586 10117907 10046850 9982559 9931022 9901477 9863207 9850480 9832639 9828746 9847340 9878746 9912813
3575 9912813 9944029 10002152 10074023 10161079 10273438 10396796 10558937 10717377 10882947 11099284
3565 11099284 11298099 11530259 11809289 12108987 12454162 12840315 13253534 13732202 14255340
3556 14255340 14852796 15529324 16285455 17126344 18086889 19172966 20388150 21792177 23389747
3547 23389747 25243997 27401953 29902708 32822924 36173800 39903509 43939552 48111436
3539 48111436 52222345 56067002 59399834 62099081 64084306 65309340 65835385 65760508 65250591
3530 65250591 64536011 63861793 63424720 63380464 63693090 64295248 64989120 65592667 65850064 65616742
3520 65616742 64809604 63351506 61269473 58605436 55479511 52040760 48494302 45069458
3512D5069458l226963k941774k588695k224426j854551j523637j261457j058300
3504B8389655q57127o86765n25863l73109k20963m0822R2829K64225M47073O42034
3494B7131167Q49974J052516J289551J525534J737795J911742J999035K029599
3486C9526913J986059J933835J826769J727541J623182J476930J309718J079198
3478E2490145P97943N06681K63695K0042j76604l44158n23372o62875q11159r52230
3468E0608108j089444j216246j325607j434252j525384j573453j626669j633013
3460C9184040j623796j604831j536675j430576j313023j196272j062273r15979
3452B8500615p58579o01722m69689l26280k13515r6506J2829R2352J94680L04858
$$ plain form
3512 45069458 41842495 38900721 36312026 34087600 32233049 30709412 29447955 28389655
3504 28389655 27532528 26845763 26319900 25946791 25725828 25685006 25777835 26042060 26489133 27131167
3494 27131167 27981141 29033657 30323208 31848742 33586537 35498279 37497314 39526913
3486 39526913 41512972 43446807 45273576 47001117 48624299 50101229 51410947 52490145
3478 52490145 53288088 53794769 54058464 54078506 53901902 53557744 53034372 52371497 51560338 50608108
3468 50608108 49518664 48302418 46976811 45542559 44017175 42443722 40817053 39184040
3460 39184040 37560244 35955413 34418738 32988162 31675139 30478867 29416594 28500615
3452 28500615 27742036 27140314 26670625 26344345 26130830 26034324 26047153 26139505 26334185 26639043
3442B6639043M39447N72318O97753Q42780J013591J198835J420830J678548J952019
3433C6455164K236294K551677K810706L037394L182330L244471L257510L153176
3425E9928722K995502K855563K708916K546210K397026K338362K380160K584131
3417H0734592K867081L229258L663451M122648M575801N050325N513630N947508
3409A15704294O185536O172576N790141N113231M207834L199784K192582J161720
3401A49727698J19076q85458j712236k231637k355335k060238j454070q24053
3393A38323747k51091J00858J55889m1658m59013j136113k070346l141135m255865
3384A27225273n231943o010786o464382o627661o510407o218688n804633n268705
$$ plain form
3442 26639043 27078490 27650808 28348561 29191341 30204932 31403767 32824597 34503145 36455164
3433 36455164 38691458 41243135 44053841 47091235 50273565 53518036 56775546 59928722
3425 59928722 62924224 65779787 68488703 71034913 73431939 75770301 78150461 80734592
3417 80734592 83601673 86830931 90494382 94617030 99192831 104243156 109756786 115704294
3409 115704294 121889830 128062406 133852547 138965778 143173612 146373396 148565978 149727698
3401 149727698 149846774 148961316 147249080 145017443 142662108 140601870 139147800 138323747
3393 138323747 138072656 138173514 138329403 138287745 137828732 136692619 134622273 131481138 127225273
3384 127225273 121993330 115982544 109518162 102890501 96380094 90161406 84356773 79088068
3376G9088068m670882m048064l401891k791262k209060j684659j214916p51385
3368E8315949l14866Q5076M99038R20195J389248J950354K607870L319791L913801
3359G2686456M416434M713866M757156M614844M356249M016458L681537L298494
3351A06541494K826718K251155J503059P50919L9181m90867q26248j042444j121331
3342A10431636j133420j078209j049081r57761r16389r07384r83234j225415j602080
3333A00578663k127816k689833l190405l624278m009625m340001m542999m635435
3325G1418271m602319m413456m164769l862387l531531l170752k888950k583424
3317D2200683k285849k025337j790864j649134j456860j292343j167615j043206
$$ plain form
3376 79088068 74417186 70369122 66967231 64175969 61966909 60282250 59067334 58315949
3368 58315949 58001083 58086159 58585197 59505392 60894640 62844994 65452864 68772655 72686456
3359 72686456 77102890 81816756 86573912 91188756 95545005 99561463 103243000 106541494
3351 106541494 109368212 111619367 113122426 113873345 113912526 113421659 112595411 111552967 110431636
3342 110431636 109298216 108220007 107170926 106213165 105296776 104389392 103406158 102180743 100578663
3333 100578663 98450847 95761014 92570609 88946331 84936706 80596705 76053706 71418271
3325 71418271 66815952 62402496 58237727 54375340 50843809 47673057 44784107 42200683
3317 42200683 39914834 37889497 36098633 34449499 32992639 31700296 30532681 29489475
3309B9489475r21515q07498o97523n90941n09030m16364l34587k97734k75019
3300B4639264k07023j12927k5331M4658O1958R4315J06926J62410J89544K48689
3290B5202483K36292K51330K61969K56940K61446K71611K89314L42768L30593
3281B7704746K37514J11654p0592l08777m89142n74326n70941m93465m40577l33355
3271B4772739k12161p7134P5969K52707M29781O05992P83217R43284J085150J196382
3261B9855926J271635J354933J458802J529751J603610J690440J762642J767280
3253D2295019J687762J582496J454070J385915J350220J359582J456921J585060
3245E4157045J734710J956692K151845K359869K461026K471053K441107K410339
$$ plain form
3309 29489475 28567960 27760462 27062939 26471998 25962968 25546604 25212017 24914283 24639264
3300 24639264 24432241 24319314 24293983 24338641 24400599 24494914 24601840 24764250 24953794 25202483
3290 25202483 25438775 25690105 25952074 26209014 26470460 26742071 27031385 27374153 27704746
3281 27704746 27942260 28053914 27983322 27674545 27185403 26611077 26040136 25546671 25106094 24772739
3271 24772739 24560578 24483444 24559413 24812120 25241901 25847893 26631110 27574394 28659544 29855926
3261 29855926 31127561 32482494 33941296 35471047 37074657 38765097 40527739 42295019
3253 42295019 43982781 45565277 47019347 48405262 49755482 51115064 52571985 54157045
3245 54157045 55891755 57848447 60000292 62360161 64821187 67292240 69733347 72143686
3237G2143686K442463K502150K525982K343824J896211J177407L38777m97302
3229H4873198j233388j885938k520257l085701l623221m087735m369414m464571
3221E9602973m412251m221910l987434l694159l402190l056716k719133k402206
3213C1706974k113302j837893j655593j487548j327926j207322j105433r98067
3205A9973890r50255q30232p61430p01828o27420n75853m88116m39872m23031
3196A4175853l72772l34462l22250k85600k80867k61626k70514k36960k51425
3187A1559377k33098k24561k01061j77209j83209j61883j41178j48810j10308
3178I978060q6075o8545o8866n9092n0792n4943q1648r2858r5541j36681j40524
$$ plain form
3237 72143686 74586149 77088299 79614281 81958105 83854316 85031723 85370500 84873198
3229 84873198 83639810 81753872 79233615 76147914 72524693 68436958 64067544 59602973
3221 59602973 55190722 50968812 46981378 43287219 39885029 36828313 34109180 31706974
3213 31706974 29593672 27755779 26100186 24612638 23284712 22077390 20971957 19973890
3205 19973890 19023635 18193403 17431973 16730145 16102725 15526872 15038756 14598884 14175853
3196 14175853 13803081 13468619 13146369 12860769 12579902 12318276 12047762 11810802 11559377
3187 11559377 11326279 11101718 10900657 10723448 10540239 10378356 10237178 10088368 9978060
3178 9978060 9891985 9823440 9754574 9695482 9644690 9589747 9508099 9415241 9319700 9183019 9042495
3167I042495j70271j97618j98906k02989k17833k36590k29095k22489k06864j93107
3157F966733j57371j48738j21911r8546q1599q4215r5880q5426q2875j06538j16900
3146E786734q5155q1681q1503o2906o2624m4413l4065k4676p260j9166k7056j7071
3134E239158o682j0770K115n110p574j7027j4137k0185j9398k2855J3902L9301
3122E170738M0195L8370M3638K8224J1283K7236J1964O480j7331l059J7900J7861
3110E393499l2021k0527j8454j1636k8419j5078J6281K4314L5922K3025M1550
3099E408456K7115M715j3211m873k9781k6382j3546m355J2067K5893M1616M9452
3087E477166K4013L3663M3096L8933L8716M3734Q0304J12116J04927J30818J59659
$$ plain form
3167 9042495 8872224 8674606 8475700 8272711 8054878 7818288 7589193 7366704 7159840 6966733
3157 6966733 6809362 6660624 6538713 6440167 6358568 6274353 6178473 6093047 6010172 5903634 5786734
3146 5786734 5701579 5619898 5538395 5475489 5412865 5368452 5334387 5309711 5302451 5283285 5256229 5239158
3134 5239158 5232476 5221706 5223821 5218711 5211137 5194110 5179973 5159788 5140390 5117535 5131437 5170738
3122 5170738 5210933 5249303 5292941 5321165 5332448 5359684 5371648 5378128 5360797 5357738 5375638 5393499
3110 5393499 5361478 5340951 5322497 5310861 5282442 5267364 5283645 5307959 5343881 5366906 5408456
3099 5408456 5435571 5440286 5427075 5422202 5392421 5366039 5352493 5348138 5360205 5386098 5427714 5477166
3087 5477166 5501179 5534842 5577938 5616871 5655587 5699321 5779625 5891741 5996668 6127486 6287145
3076F287145J78126J88781K10620K34064J98913J96468J75811J27069J31425J23014
3066H051436J32777J86733K21166K36837K23227K03469K25092J80114J33332J47921
3056I942104J63316J90610K26134L06000L38516L87511M07260M30148M86379N10751
3046A3388729N81003O42902P11085P66025Q10953Q46266Q73828R44352J027802
3037B0592945J149534J269886J364662J445841J527520J612457J717269J910472
3029C2590586K124221K370861K616710K904783L260508L694886M183503M717277
3021E8463335N293306N866950O566904P472144Q585410J0054145J2009421J4536604
3013A28848219J7494116K0467707K2643237K2748027J9880349J4423620Q280538
$$ plain form
3076 6287145 6465271 6654052 6864672 7098736 7297649 7494117 7669928 7796997 7928422 8051436
3066 8051436 8184213 8370946 8592112 8828949 9052176 9255645 9480737 9660851 9794183 9942104
3056 9942104 10105420 10296030 10522164 10828164 11166680 11554191 11961451 12391599 12877978 13388729
3046 13388729 13969732 14612634 15323719 16089744 16900697 17746963 18620791 19565143 20592945
3037 20592945 21742479 23012365 24377027 25822868 27350388 28962845 30680114 32590586
3029 32590586 34714807 37085668 39702378 42607161 45867669 49562555 53746058 58463335
3021 58463335 63756641 69623591 76190495 83662639 92248049 102302194 114311615 128848219
3013 128848219 146342335 166810042 189453279 212201306 232081655 246505275 254785813
3006B54785813N263486Q390413J6676750K6766983L4467095L4708986K4519666
2999D05579192M747706k0404145m0503521m7145466m3005434l4951163k6954804
2992A97362365k0719449j6422569j3511987j1560216j0339501r502320q711308
2985A06595015p821327o894323o117072n542253n154666m850723m560644m259010
2977F1394997l888289l507762l134654k781837k511497k283593k089289j904671
2969C9293405j733054j611511j488089j373748j251315j084280r86815r06365
2961B8858228q49228q60876q59426q37892q27714q32823q22438p70189p35581
2952B1462061p04649o66662o38291n98387n80635n38143n20038n36973n46384
$$ plain form
3006 254785813 260049299 268439712 285116462 311883445 346350540 381059526 405579192
2999 405579192 410326898 389922753 349419232 302273766 259268332 224317169 197362365
2992 197362365 176642916 160220347 146708360 135148144 124808643 115306323 106595015
2985 106595015 98773688 91879365 85762293 80220040 75065374 70214651 65654007 61394997
2977 61394997 57506708 53998946 50864292 48082455 45570958 43287365 41198076 39293405
2969 39293405 37560351 35948840 34460751 33087003 31835688 30751408 29764593 28858228
2961 28858228 28009000 27148124 26288698 25450806 24623092 23790269 22967831 22197642 21462061
2952 21462061 20757412 20090750 19452459 18854072 18273437 17735294 17215256 16678283 16131899
2943A6131899n55407n41770n48416n20812m88521m31855l46917k92400k57586
2934A2148215k63484k79754k47696k85758k80261k60990k31718k15337j89190
2925I894027j90957j57914j37256j57560j74974j50277j35750j69002j61891j77559
2915H280887k10828j82099j69126j48739j39426j33443q9312o2049r1826j23331
2905F930708r4459j05268j31263j42451j14784j00058p9644q1173p7580m2029
2895E961999n5613r2629j02519q8077r3243j08814r1767p5415o4252q0777p2048
2884E036845p2917m6623o1815p0922n7467q3136o4923m0846l3905k9069l4180
2873D441042n5901p6012j01008r4875p6088p3247n6308o0011n6010n5328n4745
$$ plain form
2943 16131899 15576492 15034722 14486306 13965494 13476973 13045118 12698201 12405801 12148215
2934 12148215 11884731 11604977 11357281 11071523 10791262 10530272 10298554 10083217 9894027
2925 9894027 9703070 9545156 9407900 9250340 9075366 8925089 8789339 8620337 8458446 8280887
2915 8280887 8070059 7887960 7718834 7570095 7430669 7297226 7207914 7145865 7054039 6930708
2905 6930708 6836249 6730981 6599718 6457267 6342483 6242425 6162781 6081608 6004028 5961999
2895 5961999 5906386 5813757 5711238 5623161 5529918 5421104 5329337 5253922 5189670 5108893 5036845
2884 5036845 4963928 4917305 4855490 4784568 4727101 4643965 4579042 4538196 4504291 4475222 4441042
2873 4441042 4385141 4309129 4208121 4113246 4037158 3963911 3907603 3847592 3791582 3736254 3681509
2862C681509n5669n4312l6712o0219o5101n0939n2663o7051n8226p0338o1743
2851C048536q2634p3258p2811q3614n0140j9707l1548j8515q088l6142r844k3265
2839B538970l0282n6017o0844k8122k6885k0075L801Q761K1079K5239J9858n882
2827B389601k4202n691j580k8263l1955k3868j3530j6448m0224k0820j5903k5743
2815B141374j6498m870J5229k5226l1438l7735k0707n4162m9452l3190k5329l2001
2803A825995l9565l4315m0406k8118l9347j99k4462m0068k0594o953k0027m0312
2791A491629j3786j5748n666M768J4509J9193M23n307k1766k6668j2725j5352
2779A413504j4702j9163J8147J520j7497n683K784L394j9177r701k0042n202j8759
$$ plain form
2862 3681509 3625840 3571528 3534816 3474597 3409496 3358557 3305894 3238843 3180617 3110279 3048536
2851 3048536 2965902 2892644 2819833 2736219 2686079 2666372 2634824 2616309 2608221 2572079 2562235 2538970
2839 2538970 2508688 2452671 2391827 2363705 2336820 2316745 2320546 2329307 2350386 2375625 2395483 2389601
2827 2389601 2365399 2359708 2358128 2329865 2297910 2274042 2260512 2244064 2203840 2183020 2167117 2141374
2815 2141374 2124876 2120006 2135235 2110009 2078571 2040836 2020129 1965967 1916515 1883325 1857996 1825995
2803 1825995 1786430 1752115 1711709 1683591 1644244 1644045 1619583 1579515 1558921 1551968 1531941 1491629
2791 1491629 1477843 1462095 1456429 1461197 1475706 1494899 1495322 1490015 1468249 1441581 1428856 1413504
2779 1413504 1398802 1379639 1397786 1399306 1381809 1376126 1378910 1382304 1363127 1353426 1333384 1328182 1309423
2766A309423j8945J0394j1249j3642n144k605k7586j9780l790j6186M670j0271
2754A195289j2963k490M630P820J837J1959K3060o146q485J8546P632J0940J381
2741A253010j0568J3108M1298J5942J5890K5851O456M4087M0511M9707P1096Q1866
2729A648254Q6602R6244J15741J20496O1511M5410N1731M8789P4848J28454J61446
2718B639526J89486J50022M7201q0277j92663k64968k54377k14957j73702j31271
2708A714020r9907q5589n6265o0392o4516o4712o0857n0898m9409k0055l2658
2697A068762m1157l7392l9606l2217k0858l0686k6229k089j7108j3448q046j8964
2685G80962j8089l6806j2087k2816j6818q751j1294N43K530j1086k5976m247o30
$$ plain form
2766 1309423 1290478 1300872 1289623 1275981 1270837 1268232 1240646 1220866 1217076 1200890 1205560 1195289
2754 1195289 1182326 1179836 1184466 1192286 1194123 1206082 1229142 1222996 1214511 1233057 1240689 1251629 1253010
2741 1253010 1242442 1255550 1296848 1312790 1328680 1354531 1360987 1405074 1445585 1495292 1566388 1648254
2729 1648254 1734856 1831100 1946841 2067337 2128848 2174258 2225989 2274778 2349626 2478080 2639526
2718 2639526 2829012 2979034 3026235 2945958 2753295 2488327 2233950 2018993 1845291 1714020
2708 1714020 1614113 1528524 1472259 1411867 1347351 1282639 1221782 1170884 1121475 1101420 1068762
2697 1068762 1027605 990213 950607 918390 897532 866846 840617 838528 821420 807972 799926 780962
2685 780962 762873 726067 713980 691164 674346 665595 654301 654844 657374 646288 620312 616065 615435
2672F15435p169J5615J7376m618J439j89N018k2451j1435J5929m312j7426j2739
2659E90473J730R272J2249n810M561O739O98J7399j3223j9240r773k8272L188
2646E69991K063k2707j9179J6904n292n119Q610J827m652k842l026P829l841j7578
2632E22988j1301J5351j1219l380k570P631P564q199j1791j4861j4334K525J5867
2619D94271m744j4860l1682J2634K4205P827j0165j2591j3387j4352j7869j74
2607D19113k599r143m614j375j089j8437j907m229J8021j433K850j4919j0617
2594C69622j2375j1544O601j1156j8354k562j1165J76N241M958j6328j0582J2395
2581C04927L312O641l249L1141J634J1260q991o084p974L736m004N127r718q377
$$ plain form
2672 615435 608266 623881 641257 636639 638078 637889 642907 620456 609021 624950 620638 603212 590473
2659 590473 592203 601475 613724 607914 612475 619214 619912 637311 624088 604848 595075 566803 569991
2646 569991 572054 549347 530168 547072 541780 536661 545271 547098 542446 539604 536578 544407 540566 522988
2632 522988 511687 527038 515819 512439 509869 517500 525064 516865 505074 490213 475879 478404 494271
2619 494271 489527 474667 442985 455619 479824 487651 477486 464895 451508 437156 419287 419113
2607 419113 416514 407371 402757 401382 400293 381856 379949 375720 393741 392308 395158 380239 369622
2594 369622 357247 345703 352304 341148 322794 320232 309067 309243 314484 319442 303114 292532 304927
2581 304927 308239 314880 311631 342772 344406 355666 346675 340591 332617 336353 332349 337476 327758 319381
2567C19381n701o925j3113k3654n438K797P212N121l266j0516n98j482q68J781
2553B64731k0612Q87r613N61P180J9842K3304o50O967l796Q60l380L736Q405j7583
2538B80839r903l485L972r522j2359L834j9644r513K155J3834n629o623n195k480
2524B20281M600J0643j2251k449p9K0927K1730l878k4256P539Q741j1100K8716
2511B69164Q80J658q51k0508l062j3561l184O870r40O721M946r199O172p797r45
2496B36364j265j851p351L077K0723j7287k160P726o958r264J4706O23j5964L267
2482B24386r794J7742j4834j9505J6826m755J7176j523l3200J0575j305j3858
2470A87931p829M188N240p742m284m692J9052k526J400P51m626k3209L454J552
$$ plain form
2567 319381 313680 306755 293642 269988 264550 267347 274559 279680 276414 265898 265300 263818 262950 264731
2553 264731 244119 245006 235393 235954 243134 262976 286280 285630 292597 288801 289661 286281 290017 298422 280839
2538 280839 270936 267451 271423 261901 249542 253376 233732 224219 226374 240208 234579 227956 222761 220281
2524 220281 224881 235524 223273 220824 220745 241672 263402 259524 235268 242807 251548 240448 269164
2511 269164 270044 271702 270851 250343 247281 233720 230536 237406 236466 243187 248133 238934 245106 237309 236364
2496 236364 235099 233248 225897 228974 249697 232410 230250 237976 231018 221754 236460 237083 221119 224386
2482 224386 214592 232334 217500 197995 214821 210066 227242 225719 192519 203094 201789 187931
2470 187931 180102 184290 189530 181788 177504 172812 191864 189338 190738 191489 186863 163654 167108 168660
2456A68660m846Q353n702j4193K598o754K1532P2j1111j6766L843P806r608J5249
2442A59133N417j2542q103j1937J534o719j3094J3971j1122R734N114m601l289
2429A23496K4681Q788r14j0690k109M823k495J6302m035k615N498K2896r725k2361
2415A51540K8248k902j9645P043j3695o75R837J4108J3132k9741j3548J6446j1297
2402A48851R949J7741O300o662M357M538j7486P821N951J3030l489j0636k765
2389A77500J1470N292q699j1079j414J8436J5173k116m92k1273O830j2316L961
2376A81273R577P57j3746p398J0938p654j531J871M279O388k932N320l5421j14
2362A51607J8014j3731j1550k354J0212l062J7751R847j7365j8093j2791J6123
$$ plain form
2456 168660 163814 172167 166465 152272 154870 148116 169648 169720 158609 141843 145686 153492 143884 159133
2442 159133 164550 152008 143905 131968 133502 126783 113689 127660 116538 126272 131386 126785 123496
2429 123496 148177 156965 156051 145361 143252 148075 145580 161882 157847 155232 160730 183626 173901 151540
2415 151540 179788 176886 157241 164284 150589 149914 159751 173859 186991 157250 143702 160148 148851
2402 148851 158800 176541 182841 176179 180536 185074 167588 175409 181360 194390 190901 180265 177500
2389 177500 188970 194262 185563 174484 173070 191506 206679 204563 204071 182798 189628 177312 181273
2376 181273 190850 191607 177861 170463 181401 173747 172216 174087 178366 184754 181822 187142 151721 151607
2362 151607 169621 155890 144340 141986 152198 149136 166887 176734 159369 141276 128485 144608
2350A44608J4898p301m68p26p009o407K0555j760k202M749Q166j231n5k5201P118
2335A47734Q936j1653m227k647o314J5871r106k4096l825N329K3345M276p976
2322A35647k822Q847J672o793J0811j2666O131k3089J2254J0825j5353J1996r130
2309A28330q081n75J3357r16R970j8452K633l536J0780R768j600j5537o690K6078
2295A45529K926N621q439l843J360q89o146j2263Q095J3372j806J449j2408p836
2281A24722m472M368J7897P71J7280M064j3741k344q975K3272R989Q826l664j1538
2267A66455J0790J0966N384l347K0576K0698K405J2700L2949L0336J7049J8861
2255C45822K2291J7733J8545J6114M1537M6649M9741O3470P9739J17984J47779
$$ plain form
2350 144608 159506 152205 151737 151011 144002 137595 158150 156390 154188 158937 167103 165872 165817 140616 147734
2335 147734 156670 145017 140790 138143 131829 147700 138594 114498 110673 116002 139347 143623 135647
2322 135647 132825 141672 143344 136551 147362 134696 140827 117738 129992 140817 125464 137460 128330
2309 128330 120249 119674 133031 132115 142085 123633 126266 122730 133510 143278 141678 126141 119451 145529
2295 145529 148455 154076 145637 141794 143154 142265 136119 123856 131951 145323 143517 144966 132558 124722
2281 124722 120250 124618 142515 143286 160566 164630 150889 148545 139570 162842 172831 181657 177993 166455
2267 166455 177245 188211 193595 190248 210824 231522 233927 246627 279576 309912 326961 345822
2255 345822 368113 385846 404391 420505 462042 508691 558432 621902 701641 819625 967404
2244I67404J85073K66663K81706K20016J17144p9136l14175l05465k18658j76797
2234I43775j04155r2860o5005o0722m9543k4855k9887j6635l0163k9419k9350
2223D11181k7515k5593l7373k5584k2180k12j1894p887q455r002j7328o181P024
2210B19001o210m408j819j0497l0784J2169O563p272k2137L325J4679j6194j5056
2197A41360o246P550K336J4340k0532j3298R96P064k598j0251Q478j4867J124
2184A15456l020J860K79k695K4272J789j2840q057o771P582m769K273J855o437
2170A10777J1212p893j41r384j399K0656q234j7852P461K3345Q613L687j931k8359
2156A10558j7901J7076P749o897o001L088M428n702n566O235k949k150q979k1119
$$ plain form
2244 967404 1152477 1419140 1700846 1920862 2038006 1958870 1644695 1339230 1120572 943775
2234 943775 839620 746760 681755 621033 571490 546635 516748 500113 469950 440531 411181
2223 411181 383666 358073 320700 295116 272936 272724 260830 252943 244488 235486 218158 211977 219001
2210 219001 212791 208383 206564 196067 165283 177452 184015 176743 154606 157931 172610 156416 141360
2197 141360 135114 142664 145000 159340 138808 125510 126506 133570 130972 120721 129199 114332 115456
2184 115456 112436 114296 114575 111880 136152 137941 125101 117044 110273 117855 113086 115359 117214 110777
2170 110777 121989 114096 113955 104571 103172 123828 115594 97742 105203 128548 137161 140848 138917 110558
2156 110558 92657 109733 117482 110585 104584 107672 112100 106398 100832 107067 104118 101968 92989 71870
2142G1870J6400M152p028K071L553j116n316R118j7712N724J18P769j54q278K847
2127H4018o333M357K351J281O512k5623P33j941j43L224j1614P813P989P568k700
2112G7492M505r457l981m431J975J1502l639m983J2526r880k954N412J2150m021
2098H2216r130J0770j755k989J0743j9849M737M201j495j2446N795N551r931L351
2084F9769J2197m959Q665O116q129J8402k4350l1635J8378P581j3673j3239l907
2071D1216J7919J3594j976o934j412J1502l359R974N295j8110N449q180j3055
2058E1923l596j208J6835N432K534N02k49o305O784P880M526p152j1523Q4j1136
2043E5331K0436j2434q585J0686J4241n031J073O250q945n125K862M28N514j0071
$$ plain form
2142 71870 88270 92422 85394 87465 91018 89902 84586 93704 75992 81716 81834 89603 89449 81171 84018
2127 84018 77685 82042 84393 85674 92186 66563 67296 65355 65212 68436 56822 64635 72624 80192 77492
2112 77492 81997 72540 68559 64128 66103 77605 73966 68983 81509 71629 68675 74087 86237 82216
2098 82216 73086 83856 82101 79112 89855 70006 74743 78944 77449 65003 70798 76349 66418 69769
2084 69769 81966 77007 85672 91788 83659 102061 77711 46076 64454 72035 58362 45123 41216
2071 41216 59135 72729 70753 63819 62407 73909 70550 80524 85819 67709 73158 64978 51923
2058 51923 48327 47119 63954 69386 71920 72422 72173 65868 72652 80532 85058 77906 66383 66467 55331
2043 55331 75767 63333 54748 65434 79675 74644 75717 81967 73022 67897 70759 71187 76701 66630
2029F6630q917K597K6424m144p194N2k487j5229M085j1746O695M888r859J6592
2015F8387n028j8967J4698J2839j3105j6334J0772L822N409j066j0325M226l400
2002E1928J244l468J0050K967m618n368L076O666M062O926J740j6560j098M538
1988F2085o879P312Q035j0944O486m141k035P561k2495o833P038j605J6696m910
1974E5371Q072L937j240o577n699q754l060j3557R613O966q607l59J0609L14L009
1959E0038O414J346N562K0582r930j3895j1478J3965q941L508p522j1864J1888
1946D9673J0052J2222l639k3518j3356J4507j4820j7009J9958L737j361M598n280
1933C5764J6635n043r661j366J8400m870j024K814j559k223J4329l049L551l899
$$ plain form
2029 66630 57713 60310 86734 82590 75396 75448 72961 57732 61817 50071 56766 61654 51795 68387
2015 68387 63359 44392 59090 71929 58824 42490 53262 57084 62493 61427 51102 55328 51928
2002 51928 53172 49704 59754 62721 58103 52735 55811 62477 66539 73465 75205 58645 57547 62085
1988 62085 55206 62518 70553 59609 66095 61954 59919 67480 44985 38152 45190 43585 60281 55371
1974 55371 63443 67380 66140 59563 53864 45110 42050 28493 38106 45072 36465 36106 46715 47029 50038
1959 50038 56452 57798 63360 83942 74012 60117 48639 62604 53663 57171 49649 37785 49673
1946 49673 59725 71947 68308 44790 31434 45941 31121 14112 34070 37807 36446 41044 35764
1933 35764 52399 47356 37695 36329 54729 49859 48835 51649 50090 47867 62196 59147 62698 58799
1919E8799j7282J2744r163O000J505j8744J5373l304n625N373O050q039k438J3340
1905E4589N766o343j3061j6787J5463n223J015Q613J1034j0444j1734j797P574
1892C8665j0915P63J4122O81r879p597O004p501l416P827k6312M33M0081Q644
1878E1600m92j4046j4118P002K782J99j0894R632K1477k8368o776R51J5956j7401
1864A7504m006J0055K4813N004r068j5390j444J2965j1435l789Q367J4996P705
1851E6277M464p161J144J0848k0500k8377k805n333N139J6905J591o848M992O142
1837C6478K028p500q110k5494J4035J8065k0613N75K8998J0613k1799n080J1360
1824C3556O231p4l443O782N088k188n999j5035N17j7780J2582J4029p582J817
$$ plain form
1919 58799 41517 54261 45098 51098 52603 33859 49232 45928 40303 45676 51726 43687 41249 54589
1905 54589 60355 54012 40951 24164 39627 34404 35419 44032 55066 44622 32888 31091 38665
1892 38665 27750 28513 42635 43316 33437 25840 31844 24343 20927 28754 2442 2875 42956 51600
1878 51600 51108 37062 22944 29946 32728 32927 22033 31665 53142 24774 17998 18949 34905 17504
1864 17504 13498 23553 48366 53370 44302 28912 27468 40433 28998 25209 33576 48572 56277
1851 56277 60741 53580 54724 65572 45072 16695 13890 8557 13696 30601 32192 25344 30336 36478
1837 36478 38506 31006 22896 -2598 11437 29502 8889 9464 38462 49075 27276 22196 33556
1824 33556 39787 39713 36270 43052 48140 45952 39953 24918 25435 7655 20237 34266 26684 28501
1810B8501o40K19N960J5470j7990k771P648M426K719n993j3910j2982J6185J8068
1796D4910K824q150j806n749j9066o687K3337L035j7325l64o245R44J0120J4175
1782C3953J054l757L043q973K54M987K437j2564r474N779K559N22J4114O988j3797
1767B7125k0275n851L0790m948j1973J2696o916J4980m488j2171J0512M57j0337
1754A9601l693n196J5751Q648n402j6316o534K920k788L76R841J3061J1931j356
1740D0844j2726n489N91M957J4029m495p315M81n972o253m666j241k537m871N171
1725A0508J2764q943J8381o688r328M312o781O548P880j7462K751R155o116K882
1711A9863J5551n980p641o589L133m933J4945m885n874K206l054J9868M110j601
$$ plain form
1810 28501 27861 28080 34040 49510 31520 28749 36397 40823 43542 37549 23639 10657 26842 44910
1796 44910 47734 39584 37778 32029 12963 6276 29613 32648 15323 14959 8714 9658 19778 33953
1782 33953 35007 31250 34293 25320 25574 30561 32998 20434 10960 16739 19298 19820 33934 40922 27125
1767 27125 6850 999 31789 26841 14868 27564 20648 35628 31140 18969 29481 29938 19601
1754 19601 15908 10712 26463 35111 29709 13393 6859 9779 6991 7367 17208 30269 42200 40844
1740 40844 28118 22629 23220 28177 42206 37711 30396 30877 24905 18652 13986 12745 10208 5337 10508
1725 10508 23272 14329 32710 26022 16694 21006 14225 20773 28653 11191 13942 23097 16981 19863
1711 19863 35414 29434 21793 15204 18337 13404 28349 23464 17590 19796 16742 36610 40720 39119
1697C9119j8764J665j199N666j1023J846N887p465n617q50J5863K781j4410L969
1683A7468o105J1716K515J871o233J167N189Q065R471m64j3467j3624P584J931
1669B7084r235j1460M692p27J70J050r993j4194L5347M629L482n104L661Q778
1655C8180k5125m628P08K7336J1361k4792p265J509J8730k749j3800m214P501
1642B2752J354L916m281J8571j4195r334p499j0019l886J137M650J2019K246j9960
1628b529M50K50J1114L45q864j125J687Q297N799N709O274k4779O360r62j442
1613F584J0714j6273r047O137J5897K039N977p013p410P895J4400L19j644k005
1599B6570j4837k581N868J905j3800J0680N69j1172p374J1946M140P36j1135K328
$$ plain form
1697 39119 20355 22020 20821 26487 15464 17310 23197 15732 10115 9265 25128 27909 13499 17468
1683 17468 11363 23079 25594 27465 21232 22399 27588 35653 45124 44660 31193 17569 25153 27084
1669 27084 17849 6389 11081 10354 10524 11574 1581 -12613 22734 27363 30845 25741 29402 38180
1655 38180 13055 8427 9135 36471 47832 23040 15775 17284 36014 33265 19465 15251 22752
1642 22752 24106 28022 23741 42312 28117 18783 11284 1265 -2621 -1484 3166 15185 17431 -2529
1628 -2529 -2079 -1829 9285 9630 766 -359 1328 9625 15424 21133 27407 2628 8988 8026 6584
1613 6584 17298 1025 -8022 -1885 14012 16051 22028 15015 7605 15500 29900 30219 28575 26570
1599 26570 11733 9152 15020 16925 3125 13805 14374 3202 -4172 7774 11914 12650 1515 3843
1585C843r977j987Q091R12n579j937N216P189J5331l571j3204J710J952j0875
1571b886q011J9345J4522J427p848k527R174j1650j4107k288k329J7848j4160
1558c490Q432K767k429l647n188J3070K873K793P800J964k133q843J6471K709
1544C3149j4036m452q560L804J6207j0o361Q197j7576o7o798Q413O03J6145J2397
1529D1055m495q587m494O776N960j1936j4294J3377j7176j169J3577l425L547
1516A8716j7285n333K868j1513R080N81O710N061o329J666O917R437l357q008
1502I211r545O820j455K514J1615j5037k117q228q579L590J0686R294o277J9660
1488B2152q155l714k787J5501n168j1751M318Q61n88r391P241J6812N38j2605
$$ plain form
1585 3843 -6134 -8121 -30 882 -4697 -6634 -1418 5771 21102 17531 4327 6037 7989 -2886
1571 -2886 -10897 8448 22970 24397 16549 14022 23196 11546 -2561 -4849 -7178 10670 -3490
1558 -3490 4942 7709 5280 1633 -3555 9515 12388 15181 22981 24945 22812 13969 30440 33149
1544 33149 19113 14661 6101 9905 26112 26102 19741 27938 10362 10295 3497 11910 12513 28658 41055
1529 41055 36560 27973 23479 30255 36215 24279 9985 23362 6186 5017 18594 15169 18716
1516 18716 1431 -3902 -1034 -12547 -3467 -2886 3824 8885 2556 4222 11139 20576 17219 9211
1502 9211 -334 6486 5031 7545 19160 4123 2006 -6222 -14801 -11211 -525 8769 2492 22152
1488 22152 13997 10283 7496 22997 17829 6078 10396 11257 10669 1278 8519 25331 25869 13264
1474A3264k0341J7089J107j2269O0K4091p812K80n312k214J775L077Q649j1176
1460A0268P954J1039j4542m238l255J0137j1814J449o224o431Q996l13k880M071
1446D217O696o489P892p931j5336l985K5397l583j2026m30J8560j412j246q803
1432A521J1130p478k1789J745K7056l347J824m304R995j3671j4114J3472K872
1419D912r005L548j892M539J2112j2241j0396J0228P512o709j3179J5934q85m841
1405c63J3273j999K204k081k223m030j325P962j0538J4684j3847O727Q543m988
1391A1999J3235p876j2828p460J1735N403r849K985J4798j171j4347j0630L417
1378e89L25R327m117N742j3224L101L19J7677R336j2081r087Q283p221j26O986
$$ plain form
1474 13264 -7077 10012 11119 -1150 -1090 23001 15189 15469 10157 7943 9718 12795 21444 10268
1460 10268 18222 29261 14719 10481 7226 17363 5549 6998 774 -5657 3339 3026 146 4217
1446 4217 10913 4424 12316 4385 -10951 -14936 10461 6878 -5148 -5578 12982 11570 10324 1521
1432 1521 12651 5173 -16616 -14871 12185 8838 10662 6358 16353 2682 -11432 2040 4912
1419 4912 -4093 -545 -2437 2102 14214 1973 -8423 1805 9317 2608 -10571 5363 4478 -363
1405 -363 12910 10911 13115 11034 8811 4781 3456 11418 880 15564 1717 8444 16987 11999
1391 11999 25234 17358 4530 -2930 8805 14208 4359 7344 22142 20971 6624 -4006 -589
1378 -589 -264 9063 4946 10688 -2536 565 884 18561 27897 15816 6729 15012 7791 7665 14651
1363A4651N471L416O817L170j9272p547N300m90k0502l197J3415N330m457j3800
1349a1695j85J8496J475K744J657p031j5100N141J6450j4487j57l745j62N398
1335a201J0152J2851M258r929j3447k864j5367Q852J3300l903R41j0895Q808J1929
1321A3485k954P854j0843M852q768L153q644P55L37n271J3279n853P407j0321
1307a532k328J2552j1690L121K186J3713p076r380M451N519N25p438o650O325
1293B298J4666K21l351j1394j690l92n991j5727K1062N159j0064j2380J6511P261
1279F189J301N152J2159j646j6690k0047O823R433n150P186o125j137n024O542
1265a034J3650J861n580k667M822p76m21k616j4470l551M017k527J9570M326J2276
$$ plain form
1363 14651 20122 23538 30355 33525 14253 6706 12006 11516 -8986 -12183 1232 6562 2105 -11695
1349 -11695 -11880 6616 8091 10835 12492 5461 -9639 -4498 11952 -2535 -2692 -6437 -6599 -1201
1335 -1201 8951 21802 26060 16131 2684 -180 -15547 -6695 6605 2702 3643 -7252 1556 13485
1321 13485 10531 18385 7542 12394 3626 6779 -1865 -1110 -773 -6044 7235 1382 8789 -1532
1307 -1532 -3860 8692 -2998 123 2309 16022 8946 -434 4017 9536 10061 2623 -4027 2298
1293 2298 16964 17185 13834 2440 750 358 -5633 -21360 -298 4861 -5203 -17583 -1072 6189
1279 6189 7490 12642 24801 23155 6465 -13582 -6759 2674 -2476 4710 -1415 -2552 -7576 -1034
1265 -1034 12616 14477 8897 6230 11052 10276 9855 7239 -7231 -10782 -6765 -9292 10278 14604 26880
1250B6880q139k0370J543j3583N24J1021Q563J331r600o685R715O23m224Q42k496
1235d055J4072R30r109M170l396J3396r881j5395K453J212M241Q081l53l452j4214
1220a1300P828J6584M834P415o293j1648O76j1840p742J7700Q620k273o654j1583
1206e676N778R290R233j7005p654o006n958O476J3743M393j9301l240J2140j0099
1192a3886Q825O234K531M883l571Q751K700R30M51q270o611L0L611nj0053Q622
1176E172o144J2585J532j490k204p172P351j0544n14j0769N122J1560J3578k5537
1162g474l898K5261N071j9711l664K4946p73K52q200q74j1007q266l425L555K425
1147e782K0194j2153n659Q115O87j2493j32M612K453J1646J596Q570L705n166
$$ plain form
1250 26880 18741 -1629 -86 -13669 -13145 -2124 6439 7770 -1830 -8515 1200 1823 -2401 -1559 -4055
1235 -4055 10017 10947 1838 6008 2612 16008 6127 -9268 -6815 -5603 -1362 6719 6366 2914 -11300
1220 -11300 -3472 13112 17946 25361 19068 7420 8096 -3744 -11486 6214 14834 12561 5907 -5676
1206 -5676 102 9392 18625 1620 -6034 -12040 -17998 -11522 2221 6614 -12687 -15927 -3787 -13886
1192 -13886 -5061 1173 3704 8587 5016 13767 16467 17397 17848 9578 2967 2997 6608 6603 -3450 5172
1176 5172 -972 11613 13145 11655 9451 2279 9630 -914 -1428 -12197 -7075 4485 18063 -7474
1162 -7474 -11372 13889 18960 -751 -4415 20531 19758 20010 11810 10936 -71 -8337 -11762 -8207 -5782
1147 -5782 14412 2259 -3400 4715 5402 -7091 -7223 -2611 -158 11488 13084 21654 25359 20193
1133B0193j4157l814l521N212R046k121k0799k709J3537J3832N13K647o546j1169
1119A44K735o176R018j993m335J1862P517l900k2670L280J1677p572n377j930
1105g720j1271N987P909k261j1024N953L090J908P067J0981j149j3774j3071J1188
1091f187J2446p854j044R555O629j3324j0725N106J0375j4402N310q829J4075
1078A131J6450m288j6655M850n022N656Q853K389O186m016l246j3160O267R379
1064A4774M374m009j621j4802J000n665m623J6926l669m887k557n032L342l96
1050f845J810K1009j3406j0720J1585J0762j8665k181R364J4181K178o698q609
1037C765k981k415l441J1021k98R43j7630J1841J6914q203O725j5706q975M997
$$ plain form
1133 20193 6036 2222 -1299 3913 12959 10838 -9961 -12670 867 14699 15212 17859 11313 144
1119 144 2879 -3297 5721 3728 -607 11255 18772 14872 -7798 -4518 7159 -413 -5790 -7720
1105 -7720 -18991 -13004 -5095 -7356 -18380 -12427 -9337 -7429 -362 10619 9470 -4304 -17375 -6187
1091 -6187 6259 -1595 -2639 6916 13545 221 -10504 -5398 4977 -9425 -4115 -12944 1131
1078 1131 17581 13293 -3362 1488 -3534 2122 10975 13364 19550 15534 12288 -872 5395 14774
1064 14774 19148 15139 13518 -1284 -284 -5949 -10572 6354 2685 -2202 -4759 -9791 -6449 -6845
1050 -6845 -5035 15974 2568 -8152 3433 14195 -4470 -6651 2713 16894 19072 12374 3765
1037 3765 784 -1631 -5072 5949 5651 6594 -11036 805 17719 9516 16241 535 -8440 -3443
1023c443o629j337j519n36o170N468J1050n546p643K4198n09k471r519J3243J179
1008I816j5497m102J6886J2511l680n635l12j3343m831J8830P664K469q167n086
994G523j0441j606R763J3056j4649o27l238j36O649N705l036O195K47q773n218
979A414k680K50P426N640j1531R632j3530m0M672j6161j4997M197J77k2M726Q646
963a2181k10J5174j8109J2228L548l562j379O324J431j2167P229j1113N116K877
949d794p29J4056J4572n421j2508M778K020j4918j9796J5940J6137R721p598j4706
935c246L42q597m127O832J0804j9413J84J5931P662J0787O288j5047p389j4358
921a3347P34l253K355J2160J3257J240j0850J7578M942j2755q485K916K1031j8246
$$ plain form
1023 -3443 -10072 -11409 -12928 -13464 -19634 -14166 -3116 -8662 -16305 7893 7384 4913 -4606 8637 9816
1008 9816 -5681 -9783 7103 19614 15934 10299 9987 -3356 -8187 10643 18307 20776 12609 7523
994 7523 -2918 -4524 5239 18295 3646 3019 -219 -355 6294 11999 8963 15158 15405 6632 1414
979 1414 -1266 -1016 6410 12050 519 10151 -3379 -3419 1253 -14908 -29905 -25708 -25531 -25553 -20827 -12181
963 -12181 -12391 2783 -15326 -3098 450 -3112 -4491 1833 3264 -8903 -1674 -12787 -7671 -4794
949 -4794 -5523 8533 23105 17684 5176 9954 11974 -2944 -22740 -6800 9337 19058 11460 -3246
935 -3246 -2904 -11501 -15628 -8796 2008 -17405 -17221 -1290 6372 17159 23447 8400 1011 -13347
921 -13347 -12613 -15866 -13511 -1351 11906 13146 2296 19874 24816 12061 3576 6492 27523 9277
907I277J118q028n827K731P737J515n920l655N371k119J54L464j1814k746j1894
892b0636K19p26J0589J6502j4821J4213j025N569Q08r264j1150k292K498J6952
878G436p35j1175l165J5124k4339K551J3141R98O856j9082m562L552O438o366
864a3328J2825J472N961k27Q398j7942j429J1228N91j0764J0511L399m196p558
850a059M74J3802j295K951L811n740j458J1832r03j1564Q358o974j1256K405J8070
835B1454j5780J844r169k896k819r739N31K0297j0363n990M69J7439O153r405
821B026K0089m393J39j5487j5381j9641J1459K0621N300j0510L00J7279j1898
808i7M98Q29j6949j901j480l978Q065J1959l616m372M516j0584J281p94p241J8649
$$ plain form
907 9277 10395 2367 -3460 -729 7008 8523 2603 -1052 4319 2200 2354 5818 -5996 -8742 -20636
892 -20636 -20417 -21143 -10554 5948 -8873 5340 4315 9884 10692 1428 -9722 -12014 -9516 7436
878 7436 6701 -4474 -7639 7485 -16854 -14303 -1162 -164 6692 -12390 -16952 -13400 -6962 -13328
864 -13328 -503 969 6930 6703 15101 -2841 -4270 6958 7549 -3215 7296 10695 6499 -1059
850 -1059 -585 13217 11922 14873 18684 12944 11486 23318 22415 10851 19209 12235 979 3384 21454
835 21454 5674 7518 -1651 -4547 -7366 -17105 -16574 3723 -6640 -12630 -12161 5278 11431 2026
821 2026 22115 17722 17861 2374 -13007 -32648 -21189 -568 4732 -5778 -5478 11801 -97
808 -97 401 1230 -15719 -17620 -19100 -23078 -15013 -3054 -6670 -11042 -6526 -17110 -15829 -16623 -23864 -5215
792e215J778n329N423N70O141P635R592j9807m541N593n725J5582n724k3208m902
777b2137M233l425M553L787J3580J45M559m604l674q684J163R372J525j22k7893
762b7622k749K7962r411j1471O548O351j426n486J1150p248l699J0493k346l744
748a2698J241j228O150N720L207Q448p44r823q482P585K705J837j876Q986k4752
733a3724O975J7J0512q268p0j839q142K5413j3359j6900J4579j1611J8820J4413
719A6816j8395K888l554o369R883l886l537N943j2984p244l915R351J2949J1018
705H964j9850M02O624r89M819J3898p580j3118Q963q03n089K6691r481l988j8094
690h631n759P949M91N547l613k968o415M882J687L289P331r169j895l195r274
$$ plain form
792 -5215 -3437 -8766 -3343 -2773 3368 11003 20595 788 -3753 1840 -3885 11697 5973 -17235 -22137
777 -22137 -17904 -21329 -16776 -12989 591 736 5295 691 -2983 -11667 -10504 -1132 393 271 -27622
762 -27622 -30371 -2409 -11820 -23291 -16743 -10392 -11818 -17304 -6154 -13402 -17101 -6608 -8954 -12698
748 -12698 -11457 -12685 -6535 -815 2392 10840 10096 273 -8209 -624 2081 3918 2042 11028 -13724
733 -13724 -6749 -6732 3780 -4488 -4558 -6397 -14539 10874 -2485 -19385 -4806 -16417 2403 16816
719 16816 -1579 1309 -2245 -8614 1269 -2617 -6154 -211 -13195 -20439 -24354 -15003 -2054 8964
705 8964 -10886 -10484 -3860 -4849 -30 13868 6288 -6830 2133 1330 -3759 22932 13451 9463 -8631
690 -8631 -14390 -6441 -5950 -403 -4016 -6984 -13399 -8517 -6830 -3541 3790 -5379 -7274 -10469 -19743
675a9743n596J8809K331M634l106l552k13j971J7887J7492r658j3702K047O08
661F267o390o621J705J1240l003j1091j888j913M262o555P742j41L586j924J4717
646I993O551j8179L396o817n961j489R366J1324n605J849p53j3507L453J4177
632G798o006j0177O711j410k0206Q143J139p66M162n910l309l081J0863J5041
618B992J291j1092K077l392K617o624l700K743L881J0428o786j1895k363J6653
604c170J0333J0767K674k0037j4979J1462l895N563Q71N45O812l931p416j5878
590b0279Q843l395L535m829P106Q231K220P390j7927J3037P009j5417j4940L134
576a6282J7966J6890p614l005n866j353m730J780R135j1121K250n657j3556N742
$$ plain form
675 -19743 -25339 -6530 -4199 435 -2671 -6223 -6436 -8407 9480 26972 17314 3612 5659 6267
661 6267 -123 -6744 -5039 6201 3198 -7893 -9781 -11694 -7432 -13987 -6245 -6386 -2800 -4724 9993
646 9993 16544 -1635 1761 -5056 -11017 -12506 -3140 8184 2579 4428 3675 -9832 -6379 7798
632 7798 1792 -8385 -1674 -3084 -23290 -15147 -14008 -14774 -10612 -16522 -19831 -22912 -12049 2992
618 2992 4283 -6809 -4732 -8124 -5507 -12131 -15831 -13088 -9207 1221 -5565 -17460 -19823 -3170
604 -3170 7163 17930 20604 567 -14412 -2950 -6845 -1282 -411 134 6946 3015 -4401 -20279
590 -20279 -11436 -14831 -11296 -16125 -9019 -788 1432 8822 -9105 3932 10941 -4476 -19416 -16282
576 -16282 1684 18574 10960 7955 2089 736 -3994 -2214 6921 -4200 -1950 -7607 -21163 -15421
562a5421m347j525J9703J0360n821j5744j781k373l63J4062m155O426r31K2j2143
547a4031j1743l322K9431p134q323K0076n207K269J3711j6400j8416J948K384
534a4757j1782k534K1927P567j074J463n835K118J9298l705j5177r662Q514J0279
520F640r124n250R47j0852R858k51J4555k0219j6403J3126Q45m420J7172P205
506C829o925M009j0758N555j117j489J0880l931P993k0278m751K188o905j345
492b3045Q509R544l449n254J1602R586l622j0873k1626O162O967j1428J3293O90
478a2944M354L201N266K109j3632j2668J2484m755M77P937N530M131j968N592
464E114j1160j888L088J605P036p869j9502J4367k530M123l119q997L944J614
$$ plain form
562 -15421 -19768 -21293 -1590 8770 2949 -12795 -14576 -16949 -17312 -3250 -7405 -979 -1910 -1888 -14031
547 -14031 -25774 -29096 335 -6799 -15122 4954 -253 2016 15727 -673 -19089 -17141 -14757
534 -14757 -26539 -29073 -7146 421 -653 810 -5025 -2907 16391 12686 -2491 -12153 -3639 6640
520 6640 -2484 -7734 -6787 -17639 -7781 -8032 6523 -13696 -30099 -16973 -16128 -20548 -3376 3829
506 3829 -3096 913 -9845 -4290 -5407 -6896 3984 53 8046 -12232 -16983 -14795 -21700 -23045
492 -23045 -14536 -4992 -8441 -13695 -2093 7493 3871 -7002 -28628 -22466 -15499 -26927 -13634 -12944
478 -12944 -8590 -5389 -123 1986 -11646 -24314 -11830 -16585 -16108 -8171 -2641 1490 -478 5114
464 5114 -6046 -7934 -4846 -3241 3795 -4074 -23576 -9209 -11739 -7616 -10735 -19732 -15788 -14174
450a4174m452o538o552J3599J7527l733l788j7740Q8J0643j2296j4050Q720J0537
436b2209l334J3423M318j2616O986M503p231p21J2457J249q053M063j513O059
422b619j064O239m839J7653l446j6157j2145j742J0564k430P632J3764o382R97
408F025j3438l14M880r498o616J5180Q987q898J741N042j0543j4942J6813j3377
394a8958J1668Q718n333K225N980J3480m135l632j3556m210N694J44r592l071
380a4578Q834J5407p030k3368M279P67k0210J3829K6667J6786m901n280q950m618
366b366l233L821J3977j0322q287q478j264q297M914q41J0605M328J9205K184
352A5946j4127k0968J2912J0362o726k0870P326K5479o206L767j5376l276J0376
$$ plain form
450 -14174 -18626 -25164 -31716 -18117 -590 -4323 -8111 -25851 -25763 -15120 -27416 -41466 -32746 -22209
436 -22209 -25543 -12120 -7802 -20418 -13432 -8929 -16160 -16881 -4424 -3175 -11228 -7165 -8678 -2619
422 -2619 -3683 2556 -2283 15370 11924 -4233 -16378 -18120 -7556 -9986 -2354 11410 5028 6025
408 6025 -7413 -7727 -2847 -12345 -18961 -3781 5206 -3692 -1951 3091 -7452 -22394 -5581 -18958
394 -18958 -7290 1428 -3905 -1680 4300 17780 13645 10013 -3543 -7753 -2059 -1915 -11507 -14578
380 -14578 -5744 9663 2633 -20735 -16456 -15689 -35899 -22070 4597 21383 16482 11202 2252 -2366
366 -2366 -5599 -1778 12199 1877 -6410 -14888 -16152 -24449 -19535 -20376 -9771 -5443 13762 15946
352 15946 1819 -19149 -6237 4125 -2601 -23471 -16145 9334 3128 6895 -8481 -11757 -1381
339a381m825J96j2188N977N302j2783J7054r945j486p559J6342J1170J450p917
325e93q70J830j6280K8383j2678o458P372p865N508j0428m038J7897J604j432
311A952m276o767j758J1570j788j180N462L10l715j598n479n507P403M086O102
296D817j0257q698n967J4257Q042P714o300J6325K219O839r793k4712p445M043
282h916J0144J5697j0704j5838J0754m744k306q975P098o264p478L736J0992J814
268d990Q199k377o643J304J750k170n505L675L30J961p460Q637L663q949r237
253a7812J2335j179q772K232l938R359O820j7520K917J0502Q050m259q772j151
239a1188N111j3900j5554J4193j1452O653j113J3477q107Q904R17J7560j1749
$$ plain form
339 -1381 -6206 -6010 -18198 -12221 -6919 -19702 -2648 -12593 -14079 -21638 -5296 5874 7324 -593
325 -593 -1463 367 -15913 12470 -208 -6666 706 -7159 -1651 -12079 -16117 1780 3384 1952
311 1952 -2324 -9091 -10849 721 -1067 -2247 3215 3525 -190 -1788 -7267 -12774 -5371 -1285 4817
296 4817 -5440 -14138 -20105 -5848 2194 9908 3608 19933 22152 28991 19198 -5514 -12959 -8916
282 -8916 1228 16925 6221 -9617 1137 -3607 -5913 -14888 -7790 -14054 -21532 -17796 -6804 -4990
268 -4990 3209 832 -5811 -4507 -2757 -4927 -10432 -6757 -6427 -4466 -11926 -3289 374 -8575 -17812
253 -17812 -5477 -6656 -15428 -13196 -17134 -7775 -955 -18475 -15558 -5056 2994 -1265 -10037 -11188
239 -11188 -6077 -19977 -35531 -21338 -32790 -26137 -27250 -13773 -21880 -12976 -12059 5501 -6248
226f248j1958k51M144n133n608J8154o98J4499M752j7405M313o163J221R791n070
211a660P568k020r623n11n082M621O022j2849L375M300p323r616m472J1287J5117
196h66m662J4002m912q869N296O021j2939j9240M925J9869r278q403J6029M968
182A941O004m175k7919J5591K275L821n213k956P308J3144j0808R681Q030j0984
168E740J2584m94j2000l184k644j5422K158J6029P930J4026q699r551q851l811
154f189J0730J2415p801k1095J5451J3823R13p742j3796p70k344j196R033k0253
140a8821k511N390J181n088J411m335J3088M903o193L015n588O119q841O692K711
125f867j5068j6241R913M385M110K1165Q64Q696q809k6111m288R634J613J1469
$$ plain form
226 -6248 -18206 -18457 -14313 -19446 -25054 -6900 -7598 6901 11653 -5752 -1439 -7602 -6381 3410 -1660
211 -1660 5908 3888 -5735 -6246 -11328 -6707 -685 -13534 -10159 -5859 -13182 -22798 -27270 -15983 -866
196 -866 -5528 8474 3562 -5307 -11 6010 -6929 -26169 -21244 -1375 -10653 -19056 -3027 1941
182 1941 7945 3770 -24149 -8558 -6283 -2462 -7675 -10631 -3323 9821 -987 8694 16724 5740
168 5740 18324 17830 5830 2646 2 -15420 -13262 2767 10697 24723 16024 6473 -2378 -6189
154 -6189 4541 16956 9155 -11940 3511 17334 18247 10505 -3291 -4061 -6405 -7601 1432 -18821
140 -18821 -21332 -15942 -14761 -19849 -18438 -22773 -9685 -4782 -10975 -7960 -13548 -7429 -16270 -9578 -6867
125 -6867 -21935 -38176 -28263 -23878 -19768 1397 2261 10957 2148 -23963 -28251 -18617 -17004 -5535
111e535r9K491q888M008J598l17J1446K841O364j9641j5859J6088R274j3961L079
96g111m578o948q85J391J654K452p92O477Q7j850J154p204N268N29k406k66L848
79i180O344Q101j8679P362N239r140j0379M538J973k81R79O996P722l458j017
64b880k735j0447k322L512J0360Q785j9032l016O924K919O5j120J3707R595N6
49A4371k0056j218k912j723J2188L64q666P450K852j3418J4319j8628N168L067
35f842j395l725j537n070J337J0892l589j0091M365J0363K454J329p876L618k202
20g969q278R270j555j0268R89J4038J3375l67p889K543n685q439n368n009M758
5a5854K007l249J2731N984j9966
$$ plain form
111 -5535 -5634 -3143 -12031 -8023 -6425 -6742 4704 7545 13909 -5732 -21591 -5503 3771 -10190 -7111
96 -7111 -11689 -18637 -19522 -18131 -16477 -14025 -14817 -8340 -8253 -10103 -8949 -16153 -10885 -10356 -12762 -13028 -9180
79 -9180 -2836 5265 -13414 -6052 -813 -9953 -20332 -15794 -13821 -14102 -13123 -6127 1595 -1863 -2880
64 -2880 -5615 -16062 -18384 -14872 -4512 4273 -14759 -17775 -10851 -7932 -7867 -8987 4720 14315 14371
49 14371 -5685 -6903 -9815 -11538 650 1014 -7652 -202 2650 -10768 3551 -15077 -9909 -6842
35 -6842 -8237 -11962 -13499 -18569 -17232 -6340 -9929 -20020 -15655 -5292 -2838 -1509 -9385 -5767 -7969
20 -7969 -16247 -6977 -8532 -18800 -17811 -3773 9602 9235 1346 3889 -1796 -10235 -15603 -20612 -15854
5 -15854 -13847 -17096 -4365 1619 -18347
0a8347
$$ plain form
0 -18347
$$ Imaginary data points
##PAGE= N=2
##DATA TABLE= (X++(I..I)), XYDATA
16383a364748Q411K1714J6610K8528J8954k736J2361K3729R052J4965K0003J5224
16371a177933J5918J4683J6682K1171J8057K0471J3338K2251J6466P985J2582
16360i98329J7095J5208K10O243N015K7870K9376K4738J1561J0603K0898J0801
16348h18711R818J2134K1173N489J1976J6995J0161J8921K8666J7924J9225O703
16336f39526J2971J9348J4374M827K2707J5494K2371J1783J1965J2466J1663J1366
16324d68191N097K0595J7105J2486J8088P605Q273K2870J2655Q756K2195J5730
16312b96736K2371R973J4537J9050J4324K8264L036p246J476J2389J0521R184
16300a58857J9997J5484J1065J3258J7210R456J0713K0486J7218J6752P581J8879
$$ plain form
16383 -1364748 -1356337 -1334623 -1318013 -1289485 -1270531 -1273267 -1260906 -1237177 -1228125 -1213160 -1193157 -1177933
16371 -1177933 -1162015 -1147332 -1130650 -1109479 -1091422 -1070951 -1057613 -1035362 -1018896 -1010911 -998329
16360 -998329 -981234 -966026 -965816 -959573 -954558 -926688 -897312 -872574 -861013 -850410 -829512 -818711
16348 -818711 -808893 -796759 -775586 -770097 -758121 -741126 -730965 -712044 -683378 -665454 -646229 -639526
16336 -639526 -626555 -607207 -592833 -588006 -565299 -549805 -527434 -515651 -503686 -491220 -479557 -468191
16324 -468191 -463094 -442499 -425394 -412908 -394820 -387215 -378942 -356072 -343417 -334661 -312466 -296736
16312 -296736 -274365 -264392 -249855 -230805 -216481 -188217 -185181 -192427 -190951 -178562 -168041 -158857
16300 -158857 -138860 -123376 -112311 -99053 -81843 -72387 -61674 -41188 -23970 -7218 363 19242
16288A9242m683O162K2021R771Q332K1430K0262J3373k824M656J6447K4214P060
16275A65463J884P310O248Q403K0905J0024J2296K288m404K1024R928N130K5144
16262B91643J8107Q384j901P261J2800R053M379J3019J9496L389K0858J619K651
16249D10758J8950J6537J6174j0132k818J9104J4090p08J6453J915K423J8374
16237E21120J1740M627l08l70J1757J1147J6893L857N957j953K0382R213j896
16224F12166J3871J3346R976O77J5769l656r07k057o052M836M823L8250M639Q107
16210G13788P493j0850J7204J9186J1905J846J6698k212J6024m447j4332j080
16198G71223N290J4310J5382n772J6892L001J8432j9389M409M787P041l088P662
$$ plain form
16288 19242 14559 20721 42742 52513 60845 82275 102537 115910 113086 117742 134189 158403 165463
16275 165463 167347 174657 180905 189308 210213 220237 232533 234821 230417 251441 261369 266499 291643
16262 291643 309750 318134 316233 323494 336294 345347 349726 362745 382241 385630 406488 408107 410758
16249 410758 429708 446245 462419 452287 449469 468573 482663 481955 498408 500323 502746 521120
16237 521120 532860 537487 537179 536809 548566 559713 576606 580463 586420 584467 604849 614062 612166
16224 612166 626037 639383 649359 650036 665805 662149 661242 659185 653133 657969 662792 701042 705681 713788
16210 713788 721281 710431 727635 746821 758726 760572 777270 775058 791082 786635 772303 771223
16198 771223 776513 790823 806205 800433 817325 820326 838758 819369 823778 828565 835606 832518 840180
16185H40180J8521K6244j1272r35o242L206N834j463K6857j2607R774k715N100
16172I00482J2567M349j4551Q163K259J6169p346J5225M135J250K256J2246J4397
16159I71601j4201J811K08L01J0756j90j944N455k554J535R61J4612J3976K250
16145A004577q31J3606m328M370J1869k0213J5536P371L059k757m573m329O710
16132A030067L25j8123N549K316j455K7843r313j0267K0325m339j018n92j307
16119A040011n128N383O949n489l691N737N807J0216J0786J8128n220k434j7131
16106A063924R202M682j2779n265K926l187J8354N987r36N12q807K0839P612l769
16092A099295M649r083r935J6019L696L706K887N232M073k575K031L384j5125
$$ plain form
16185 840180 858701 884945 873673 872738 866496 869702 875536 874073 900930 888323 898097 895382 900482
16172 900482 913049 917398 902847 911010 913269 929438 922092 937317 941452 942702 944958 957204 971601
16159 971601 957400 959211 959419 959720 970476 970286 968342 973797 971243 972778 973739 988351 1002327 1004577
16145 1004577 1003746 1017352 1013024 1017394 1029263 1009050 1024586 1031957 1035016 1032259 1027686 1023357 1030067
16132 1030067 1030392 1012269 1017818 1020134 1018679 1046522 1037209 1026942 1047267 1042928 1041910 1041318 1040011
16119 1040011 1034883 1040266 1047215 1041726 1038035 1043772 1049579 1059795 1070581 1088709 1083489 1081055 1063924
16106 1063924 1073126 1077808 1065029 1059764 1062690 1059503 1077857 1083844 1082908 1083420 1074613 1095452 1103064 1099295
16092 1099295 1103944 1094861 1084926 1100945 1104641 1108347 1111234 1116466 1120539 1117964 1119995 1123379 1108254
16079A108254j4718L291J65M883J2922M714k642q816P947N160k6635O2J0268m342
16065A100513J2264K942N747q897n382N163J7224K561j778l288o663j0888o549
16052A102969p640m210k595J458J0810K9796n090k3500J8681R858j8325q718L408
16039A106902P20n276J7345Q833J953j9906o83R138j846j2457J2106J0307j4385
16026A112751j0189L226R413m892M158J4341P885k0466k2837J8569J1026l1432
16014A091553J3004J0426O233K19O601j4837J7120J7910l819k1070j868O870k599
16001A125743n394r773J0104N977j7533K633R246P399J3550p173j7346L042J3311
15988A133786P63J76l180M615O237J78o551k059j2159J2279P195k628J0326k102
$$ plain form
16079 1108254 1093536 1096827 1096992 1101875 1114797 1119511 1116869 1108053 1116000 1121160 1094525 1094587 1104855 1100513
16065 1100513 1112777 1115719 1121466 1112569 1107187 1112350 1129574 1132135 1130357 1127069 1120406 1109518 1102969
16052 1102969 1095329 1091119 1088524 1089982 1100792 1130588 1125498 1101998 1120679 1130537 1112212 1103494 1106902
16039 1106902 1107622 1102346 1119691 1128524 1130477 1110571 1109888 1119026 1117180 1104723 1116829 1127136 1112751
16026 1112751 1102562 1105788 1115201 1110309 1114467 1128808 1136693 1116227 1093390 1111959 1122985 1091553
16014 1091553 1104557 1114983 1121216 1121435 1128036 1113199 1130319 1148229 1144410 1123340 1121472 1128342 1125743
16001 1125743 1120349 1110576 1120680 1126657 1109124 1111757 1121003 1128402 1141952 1134779 1117433 1120475 1133786
15988 1133786 1134549 1134725 1131545 1136160 1142397 1142575 1136024 1133965 1121806 1134085 1141280 1138652 1148978 1146876
15974A146876j9758j3126O143K6649j512m607N791k919O640J7184j2843q422R508
15961A155604p242j3992K516Q796j2718p396p1R623j3835J3272K0638j3561j4717
15948A126917k124P077k894J0316K479j6610n486N642r35N255K695Q063j119P813
15934A147089m577Q302R655k5355m73m084R648m403k087J465L533L318p946J1121
15920A145206L10o508J004R049j5168r580K633N484J009N199J5770j5321J2182
15907A151269j979p084m395k147j2117J5075J5967P706l2858J2969j505M935m955
15894A140881Q76P255p013j5040j8053J9145K0774j0318n355K033n809L337q652
15881A124061P422O339Q117o282m204j0558J9651m955r811n218K4340n022j2901
$$ plain form
15974 1146876 1127118 1113992 1120135 1146784 1145272 1140665 1146456 1143537 1150177 1167361 1154518 1146096 1155604
15961 1155604 1148362 1134370 1136886 1145682 1132964 1125568 1125497 1135120 1121285 1134557 1155195 1141634 1126917
15948 1126917 1124793 1131870 1128976 1139292 1141771 1125161 1119675 1125317 1124382 1129637 1132332 1140395 1139276 1147089
15934 1147089 1142512 1150814 1160469 1135114 1134641 1130557 1140205 1135802 1133715 1135180 1138713 1142031 1134085 1145206
15920 1145206 1145516 1139008 1140012 1149061 1133893 1124313 1126946 1132430 1133439 1138638 1154408 1139087 1151269
15907 1151269 1149290 1142206 1137811 1135664 1123547 1138622 1154589 1162295 1129437 1142406 1140901 1145836 1140881
15894 1140881 1141757 1149012 1141999 1126959 1108906 1128051 1148825 1138507 1133152 1135185 1129376 1132713 1124061
15881 1124061 1131483 1137822 1145939 1139657 1135453 1124895 1144546 1139591 1129780 1124562 1148902 1143880 1130979
15868A130979N281k931N130K313p383J3315J611l696p145J3811o590q184K1105
15855A157616o459k411k837k364O623r610j997o559L100l9k444p167Q24R334j390
15840A134220Q4j548O454l556P661O86m504M349L162Q617l723M866m113j314r052
15825A142289K824j1005j2361J4700K5541m893q852k417m478k113J2424j6314
15813A135345O909P475K1505r05l5786k210J2843j1357r57q38k346J4393m41J3545
15799A157175j1854l227r161N692J9199O82L40j3605m842J5528P277o307r499
15786A147398l811Q693j9345j3624L4699j290r432m6R671j1021j352J5031j1530
15773A144041j2630J7598o593M821p843O802M763J4091p076M949j8998q216J9873
$$ plain form
15868 1130979 1136260 1133329 1138459 1140772 1133389 1146704 1148315 1144619 1137474 1151285 1144695 1136511 1157616
15855 1157616 1151157 1148746 1145909 1143545 1150168 1140558 1138561 1132002 1135102 1135063 1132619 1125452 1126276 1135610 1134220
15840 1134220 1134304 1132756 1139210 1135654 1143315 1144001 1139497 1143846 1147008 1155625 1151902 1156768 1152655 1151341 1142289
15825 1142289 1145113 1134108 1121747 1136447 1161988 1157095 1148243 1145826 1141348 1139235 1151659 1135345
15813 1135345 1142254 1149729 1171234 1170329 1134543 1132333 1145176 1133819 1132862 1132024 1129678 1144071 1143630 1157175
15799 1157175 1145321 1142094 1132933 1138625 1157824 1158506 1158846 1145241 1140399 1155927 1163204 1156897 1147398
15786 1147398 1143587 1152280 1132935 1119311 1154010 1152720 1143288 1143242 1152913 1141892 1140540 1155571 1144041
15773 1144041 1131411 1149009 1142416 1147237 1139394 1146196 1150959 1165050 1157974 1162923 1143925 1135709 1155582
15760A155582K111j6905Q57N646k95o926M81K806J466J9358j0358q256l283o126
15746A136158J4494J5883j6660M885P075j5086J895k061l198M6J6107J1465j3287
15733A157716j7398J2255J6507k4121M500J7778N731Q662m602j7712P757J262
15721A168335k5676Q111p15m547N139J259J0851M838p791k131l717P121n15R674
15707A170236o638j2984J4450n734j250q237l417P5n195P940J8046K075n230k79
15693A163858J0196m155l947M118q795l788Q127R0j19j8229O872K95q98p683k133
15678A143809N572K4822o576p403o064J1955P022j4636N653P129l225j0254J9069
15665A176873k489p972k0753j6242J4971K546M652J7652m967P60j5109J1549j4863
$$ plain form
15760 1155582 1157693 1140788 1141645 1147291 1146996 1140070 1140551 1143357 1144823 1164181 1153823 1145567 1142284 1136158
15746 1136158 1150652 1166535 1149875 1154760 1161835 1146749 1148644 1146583 1143385 1143431 1159538 1171003 1157716
15733 1157716 1140318 1152573 1169080 1144959 1149459 1167237 1172968 1181630 1177028 1159316 1167073 1168335
15721 1168335 1142659 1150770 1150055 1145508 1150647 1151906 1162757 1167595 1159804 1157673 1153956 1161077 1160562 1170236
15707 1170236 1163598 1150614 1165064 1159330 1158080 1149843 1146426 1146501 1141306 1149246 1167292 1169367 1164137 1163858
15693 1163858 1174054 1169899 1165952 1170070 1161275 1157487 1165614 1165704 1165585 1147356 1154228 1154523 1153625 1145942 1143809
15678 1143809 1149381 1174203 1167627 1160224 1154160 1166115 1173137 1158501 1164154 1171283 1168058 1157804 1176873
15665 1176873 1174384 1166412 1145659 1129417 1144388 1146934 1151586 1169238 1164271 1165031 1149922 1161471 1146608
$$ [...]
##END NTUPLES=NMR SPECTRUM
##END=
