##TITLE=1H_CA-9363-14
 200.13MHz,CDCl34,
 8 sc
 
 28.7.2025
##JCAMPDX= 6.0         $$ Bruker NMR JCAMP-DX V2.0
##DATA TYPE= NMR SPECTRUM
##DATA CLASS= NTUPLES
##ORIGIN= UXNMR, Bruker Analytische Messtechnik GmbH
##OWNER= pz
$$ XWIN-NMR		Version 3.5
$$ Mon Jul 28 14:56:54 2025 Russian Standard Time (UT+4h)  she@DPX200
##.OBSERVE FREQUENCY= 200.1313
##.OBSERVE NUCLEUS= ^1H
##.ACQUISITION MODE= SIMULTANEOUS
##.ACQUISITION SCHEME= undefined
##.AVERAGES= 8
##.DIGITISER RES= 18
##SPECTROMETER/DATA SYSTEM= spect
##.PULSE SEQUENCE= zg30
##.SOLVENT NAME= CDCl3
##.SHIFT REFERENCE= (INTERNAL, CDCl3, 0, 15.5717)
##AUDIT TRAIL= $$ (NUMBER, WHEN, WHO, WHERE, WHAT)
$$ ##TITLE= Audit trail, XWIN-NMR		Version 3.5
$$ ##JCAMPDX= 5.01
$$ ##ORIGIN= Bruker BioSpin GmbH
$$ ##OWNER= she
$$ F:/spectra/data/she/nmr/H-C/1/pdata/1/auditp.txt
$$ ##AUDIT TRAIL=  $$ (NUMBER, WHEN, WHO, WHERE, WHAT)
(   1,<2025-07-28 14:55:34.89 +0400>,<she>,<DPX200>,
      <created by zg, POWCHK disabled, PULCHK disabled
       configuration hash MD5:
       00 E9 B6 7A A2 85 ED C7 34 08 36 98 17 FE 4E 26
       data hash MD5: 16K
       74 D1 60 FB 4B F5 FD 8F 17 84 AF 88 EF DC 9C F2>)
(   2,<2025-07-28 14:55:39.45 +0400>,<she>,<DPX200>,
      <Start of raw data processing
       efp BC_mod = 2 LB = 0.25 FT_mod = 6 PKNL = 1 PHC0 = -1198.933 PHC1 = 14.19254 SI = 16K 
       data hash MD5: 16K
       43 F6 2A 16 BA 8D 4E 3D 88 39 FD 8F 94 B5 FB 12>)
(   3,<2025-07-28 14:56:01.17 +0400>,<she>,<DPX200>,
      <pk PHC0 = -162.7819 PHC1 = 3.600001 
       data hash MD5: 16K
       71 4D 34 1F 9D 59 F3 23 D1 25 E1 6C 95 52 99 85>)
(   4,<2025-07-28 14:56:05.67 +0400>,<she>,<DPX200>,
      <abs ABSG = 5 
       data hash MD5: 16K
       51 41 69 D9 40 E5 65 5E B6 5C 02 82 94 FE 4A 17>)
$$ ##END=
$$ 
$$ hash MD5
$$ F2 43 40 D3 92 6A B4 66 3C BB 02 E2 93 72 70 DD
##$RELAX= 
##$RELAX= 
##$RELAX= 
##$RELAX= 
##$RELAX= 
##$RELAX= 
$$ Bruker specific parameters
$$ --------------------------
##$DU= <F:/spectra>
##$EXPNO= 1
##$NAME= <H-C>
##$PROCNO= 1
##$TYPE= <nmr>
##$USER= <she>
##$AMP= (0..31)
100 100 100 100 100 100 100 100 100 100 100 100 100 100 100 100 100 100 
100 100 100 100 100 100 100 100 100 100 100 100 100 100 
##$AQSEQ= 0
##$AQ_mod= 1
##$AUNM= <au_zg>
##$AUTOPOS= <>
##$BF1= 200.13
##$BF2= 200.13
##$BF3= 200.13
##$BF4= 200.13
##$BF5= 200.13
##$BF6= 200.13
##$BF7= 200.13
##$BF8= 200.13
##$BYTORDA= 1
##$CFDGTYP= 0
##$CFRGTYP= 5
##$CHEMSTR= <none>
##$CNST= (0..31)
1 1 145 1 1 1 1 1 1 1 1 1 1 1 1 1 1 1 1 1 1 1 1 1 1 1 1 1 1 1 1 1 
##$CPDPRG= <>
##$CPDPRG1= <>
##$CPDPRG2= <>
##$CPDPRG3= <>
##$CPDPRG4= <mlev>
##$CPDPRG5= <mlev>
##$CPDPRG6= <mlev>
##$CPDPRG7= <mlev>
##$CPDPRG8= <mlev>
##$CPDPRGB= <>
##$CPDPRGT= <>
##$D= (0..31)
0 0.7 0 0 0 0 0 0 0 0 0 0.03 0 0 0 0 0 0 0 0 0 0 0 0 0 0 0 0 0 0 0 0 
##$DATE= 1753700134
##$DBL= (0..7)
120 120 120 120 120 120 120 120 
##$DBP= (0..7)
150 150 150 150 150 150 150 150 
##$DBP07= 0
##$DBPNAM0= <>
##$DBPNAM1= <>
##$DBPNAM2= <>
##$DBPNAM3= <>
##$DBPNAM4= <>
$$ [...]
##$SUBNAM3= <"">
##$SUBNAM4= <"">
##$SUBNAM5= <"">
##$SUBNAM6= <"">
##$SUBNAM7= <"">
##$SUBNAM8= <"">
##$SUBNAM9= <"">
##$SW= 18.0517328524113
##$SWIBOX= (0..15)
0 0 2 0 0 0 0 0 0 0 0 0 0 0 0 0 
##$SW_h= 3612.71676300578
##$TD= 16384
##$TD0= 1
##$TE= 0
##$TE2= 300
##$TE3= 300
##$TEG= 300
##$TL= (0..7)
0 120 120 120 120 120 120 120 
##$TP= (0..7)
150 150 150 150 150 150 150 150 
##$TP07= 0
##$TPNAME0= <>
##$TPNAME1= <>
##$TPNAME2= <>
##$TPNAME3= <>
##$TPNAME4= <>
##$TPNAME5= <>
##$TPNAME6= <>
##$TPNAME7= <>
##$TPOAL= (0..7)
0.5 0.5 0.5 0.5 0.5 0.5 0.5 0.5 
##$TPOFFS= (0..7)
0 0 0 0 0 0 0 0 
##$TUNHIN= 0
##$TUNHOUT= 0
##$TUNXOUT= 0
##$USERA1= <user>
##$USERA2= <user>
##$USERA3= <user>
##$USERA4= <user>
##$USERA5= <user>
##$V9= 5
##$VALIST= <valist>
##$VCLIST= <CCCCCCCCCCCCCCC>
##$VD= 0
##$VDLIST= <DDDDDDDDDDDDDDD>
##$VPLIST= <PPPPPPPPPPPPPPP>
##$VTLIST= <TTTTTTTTTTTTTTT>
##$WBST= 1024
##$WBSW= 4
##$XGAIN= (0..3)
0 0 0 0 
##$XL= 0
##$YL= 0
##$YMAX_a= 608458
##$YMIN_a= -600428
##$ZGOPTNS= <>
##$ZL1= 120
##$ZL2= 120
##$ZL3= 120
##$ZL4= 120
##$ABSF1= 15.48356
##$ABSF2= -2.56829
##$ABSG= 5
##$ABSL= 3
##$ALPHA= 0
##$AQORDER= 0
##$ASSFAC= 0
##$ASSFACI= 0
##$ASSFACX= 0
##$ASSWID= 0
##$AUNMP= <proc_1d>
##$AZFE= 0.1
##$AZFW= 0.1
##$BCFW= 0
##$BC_mod= 2
##$BYTORDP= 0
##$COROFFS= 0
##$CY= -3
##$DATMOD= 1
##$DC= 0
##$DFILT= <>
##$DTYPP= 0
##$F1P= 0
##$F2P= 0
##$FCOR= 1
##$FTSIZE= 16384
##$FT_mod= 6
##$GAMMA= 0
##$GB= 0
##$INTBC= 1
##$INTSCL= 3.241238e-09
##$ISEN= 128
##$LB= 0.25
##$LEV0= 0
##$LPBIN= 0
##$MAXI= 10000
##$MC2= 0
##$MEAN= 0
##$ME_mod= 0
##$MI= 1.114404
##$NCOEF= 0
##$NC_proc= -5
##$NLEV= 6
##$NOISF1= 3.799351
##$NOISF2= 2.8
##$NSP= 0
##$NTH_PI= 0
##$NZP= 0
##$OFFSET= 15.5717
##$PC= 1
##$PHC0= -1361.715
##$PHC1= 17.79254
##$PH_mod= 1
##$PKNL= yes
##$PPARMOD= 0
##$PSCAL= 0
##$PSIGN= 0
##$REVERSE= no
##$SF= 200.129989993792
##$SI= 16384
##$SIGF1= 3
##$SIGF2= 2
##$SINO= 0.751879
##$SIOLD= 32768
##$SREGLST= <19F.Aceton>
##$SSB= 0
##$STSI= 16384
##$STSR= 0
##$SW_p= 3612.71676300578
##$SYMM= 0
##$S_DEV= 0
##$TDeff= 16384
##$TDoff= 0
##$TI= <>
##$TILT= no
##$TM1= 0
##$TM2= 0
##$TOPLEV= 0
##$USERP1= <user>
##$USERP2= <user>
##$USERP3= <user>
##$USERP4= <user>
##$USERP5= <user>
##$WDW= 1
##$XDIM= 16384
##$YMAX_p= 336524477
##$YMIN_p= -51095
$$ End of Bruker specific parameters
$$ ---------------------------------
##NTUPLES= NMR SPECTRUM
##VAR_NAME=  FREQUENCY,     SPECTRUM/REAL,   SPECTRUM/IMAG
##SYMBOL=    X,             R,               I
##VAR_TYPE=  INDEPENDENT,   DEPENDENT,       DEPENDENT
##VAR_FORM=  AFFN,          ASDF,            ASDF
##VAR_DIM=   16384,         16384,           16384
##UNITS=     HZ,            ARBITRARY UNITS, ARBITRARY UNITS
##FACTOR=    0.220516191357247, 1,           1
##FIRST=     3116.3641844249, 0,             0
##LAST=      -496.352578580879, 0,           0
##MIN=       -496.352578580879, -51095,      0
##MAX=       3116.3641844249, 336524477,     0
$$ Real data points
##PAGE= N=1
##DATA TABLE= (X++(R..R)), XYDATA
$$ [...]
6050I58035J3610J654n107K7026L4791K6318L6933O0467O3664P8748Q5594Q8030
6038A469763J12458J21920J10854J04303P9826O8746P4368R3114P3654L3190J1616
6027B353812K0169K2228O4169J02065J13096J59914J62209J96479J42933O3735
6017C400809j9395q5554j15920p9682m7600j3156L2346N2105N7738O1602R6731
6006C340024J7743n8878j13125j13186q9948p8549l4417j7875L8862R2403J32896
5995C115950J51328K20611K65462K79271L33759L20692K16642k6298k70981l80780
5985D225656l86727l47742k63626k02550j48258j03247m8594n9353p8985j07555
5975B479019j28299r6502j03714q2068n7792k6202k3175R252J6252K9818M5314
$$ plain form
6050 958035 971645 973299 968192 995218 1030009 1056327 1093260 1153727 1217391 1296139 1381733 1469763
6038 1469763 1582221 1704141 1814995 1919298 1999124 2067870 2142238 2235352 2309006 2342196 2353812
6027 2353812 2373981 2396209 2460378 2562443 2675539 2835453 2997662 3194141 3337074 3400809
6017 3400809 3381414 3295860 3179940 3100258 3052658 3039502 3071848 3123953 3181691 3243293 3340024
6006 3340024 3357767 3298889 3185764 3072578 2982630 2904081 2869664 2851789 2890651 2983054 3115950
5995 3115950 3267278 3487889 3753351 4032622 4366381 4687073 4903715 4877417 4606436 4225656
5985 4225656 3838929 3491187 3227561 3025011 2876753 2773506 2724912 2665559 2586574 2479019
5975 2479019 2350720 2254218 2150504 2068436 2010644 1984442 1961267 1970519 1986771 2016589 2061903
5964B061903Q1100J18398J39605J59598J19453P2703k6890j43846k08871k33418
5954B139735k28382j70760j34096j22516q5873q6554o1627m3936o0622k2482j5893
5943A106994m5581m4140n1737l2743l8333m1127k1077k2445l5372k1790k1939
5932G30710k6466j8697j4867o900l636j4569j4728O303L807j2471j3470N261L714
5919F23991J5560q326j293J3754J2758K537j2740j248R043o934J365j3183K555
5906F37839j700O213K1733r73M464J2042Q871J9631K5393P328J2796P303R753
5893G70693k805k6557k3315j0761O699Q736r771k1474J9752k060j4394O977J2372
5880G14092J5561l165j4470J2587k983K2437N631J6341K5012J5982m565J3828
$$ plain form
5964 2061903 2143003 2261401 2401006 2560604 2680057 2752760 2725870 2582024 2373153 2139735
5954 2139735 1911353 1740593 1606497 1483981 1398108 1311554 1249927 1205991 1145369 1122887 1106994
5943 1106994 1061413 1017273 965536 932793 894460 853333 832256 809811 774439 752649 730710
5932 730710 704244 685547 670680 663780 660144 645575 630847 637150 640957 628486 615016 620277 623991
5919 623991 639551 631225 629932 643686 656444 658981 646241 644993 654036 647102 648467 635284 637839
5906 637839 636139 642352 664085 663112 667576 679618 688489 708120 733513 740841 753637 760940 770693
5893 770693 767888 741331 718016 707255 713954 722690 712919 691445 711197 709137 694743 701720 714092
5880 714092 729653 726488 712018 724605 721622 744059 749690 766031 791043 807025 802460 816288
5868H16288P422k334k552l1888k2509l6913l3247l4953j8302j6729k5445l3446
5856E65392j0312k2744o240j2757p124r217N600j7851p465L973m50J5596j0102
5843D86299j1898l523j1145N931j6224j0807P273j3682j6911j8451j4328k3336
5831C59198k058J178l5368k2656j5934j6138j1554P780j9739j0966L232Q106l16
5818B44765j295l764j5706k0662j682n439J652n834M380j4226j0755K991j2909
5805A61516K538M48J6201j370j7151J590K645r425R628P616q754j2741J8009j3763
5791A56987M314K2018j14n798R444k688n090o7j683J195P964m096J4291j4652
5777A82025j0443r171m760K320k46o166o65q764j3785L228j763j4810j1081J2634
$$ plain form
5868 816288 823710 821376 818824 786936 764427 727514 694267 659314 641012 624283 598838 565392
5856 565392 555080 532336 526096 513339 506215 496998 502598 484747 477282 481255 480805 496401 486299
5843 486299 474401 470878 459733 465664 449440 438633 445906 432224 415313 396862 382534 359198
5831 359198 357140 358318 322950 300294 284360 268222 256668 264448 244709 233743 236975 245081 244765
5818 244765 243470 239706 224000 203338 201656 196217 197869 192035 196415 182189 171434 174425 161516
5805 161516 164054 164502 180703 179333 162182 163772 166417 156992 166620 174236 165482 152741 170750 156987
5791 156987 161301 183319 183205 177407 186851 184163 179073 179006 177323 178518 186482 182386 196677 182025
5777 182025 171582 162411 157651 159971 159725 153559 152894 144130 130345 133573 131810 117000 105919 118553
5763A18553m513J3564N05j4001j1402J188j5057Q257J3477L028J0346o809j2246
5750A04890M203Q005J3836k81l71k892j7949O454k4406N109J4555J2999J5420
5737A39572j3525k5293J963J8164J2024J4652n062o754l681j806J0247j3857M194
5724A30838P298n478L828j4804L005L085j4136j8618L052K351J1364p835q454
5711I5496Q654r104q481j6220J720o712L267L599k01J8490L879k013k423L696
5697I3647l292j8279r025R083Q756R344J4382j3423j782q287j647K080j4633K1837
5683H8761J5705k020J0898q169j7545n317j2434J1171J3038P408l556J786o169
5670I3557J1222j1914k858Q01J070n611P039Q291q956k2568j0565L0294J3642
$$ plain form
5763 118553 114040 127604 128109 114108 102706 103894 88837 97094 110571 113599 123945 117136 104890
5750 104890 109093 117098 130934 130653 130282 127390 109441 115895 91489 96598 111153 124152 139572
5737 139572 126047 100754 102717 120881 132905 147557 142495 135741 132060 130254 140501 126644 130838
5724 130838 138136 132658 136486 121682 124687 127772 113636 95018 98070 100421 111785 103950 95496
5711 95496 104150 95046 86565 70345 72065 65353 68620 72219 72018 90508 94387 92374 89951 93647
5697 93647 90355 72076 63051 72134 80890 90234 104616 91193 89411 81124 79477 81557 66924 88761
5683 88761 104466 102446 113344 105175 87630 82313 69879 81050 94088 101496 97940 99726 93557
5670 93557 104779 92865 90007 90808 91878 86267 93306 101597 92641 70073 59508 89802 103444
5657A03444n025L877j5128J7496K1384n109j0005j312J9388k1980q075N773l504
5644A01224j030J6387M436j1026q872k100M63q727Q532l348j5785K1711J3894
5631A15759o659j812Q989J849J121J048N278J2347l595l979J8277j2556k420J4187
5617A47834Q719N431l039M780J8673K2259K5710M38j3371k4765j5960j2557N507
5604A69659M81n294j8411q187K1095Q371k6021k93K2578M650K172p44J9270R019
5590A98345r053J5326K0783j321J9053M223K6044K4959M4424O0632M3917K4476
5578D71808K45l4723k8830k7732k3866l231K246J773r528j3971k7385j1280N100
5565C00626n843P067R185j5951N865J7669R742P775P650J7312P107K6885L6156
$$ plain form
5657 103444 98419 102296 87168 104664 126048 120939 110934 109622 129010 107030 98955 104728 101224
5644 101224 100194 116581 121017 109991 101119 99019 99482 90755 99287 95939 80154 101865 115759
5631 115759 109100 107288 116277 118126 119247 120295 125573 137920 134325 130346 148623 136067 133647 147834
5617 147834 156553 161984 158945 163725 182398 204657 230367 230805 217434 192669 176709 164152 169659
5604 169659 170140 164846 146435 138248 159343 167714 141693 141400 163978 168628 170800 170056 189326 198345
5590 198345 189292 204618 225401 224080 243133 247356 273400 298359 342783 403415 447332 471808
5578 471808 472053 437330 408500 380768 356902 353671 355917 357690 348162 334191 306806 295526 300626
5565 300626 294783 301850 311035 295084 300949 318618 328360 336135 343785 361097 368204 395089 431245
5552D31245L2357M2399M7750M2901K9866K6650R130k0156l2082l8092k9000r932
5540E33036L779R890P280R529k0262Q751M955J776L6000K6238K2911K5878J5059
5527F84820L5899L3837N0246M2236M7952N1592N3199O9570O5819N5883K5833J5491
5515A232377K466k8766j0403j3560j6571k5915m2463l3996k2126q628j4595j2765
5503A005055L8753L6881K6999M7496L8819N0640N3849L6640O8883R1349O5840
5492A561204R0354Q1217O5297k28q3048j03078j19068j12328r4439r5216n7025
5481A133642p0126m9878k4387j8363l1708L6887K1209j5888J6956L3493N1124
5470A082961P7920M5760P8559Q0622Q6268J16519J04277R5506K7146n2172j28516
$$ plain form
5552 431245 463602 506001 553751 596652 626518 653168 662298 642142 610060 571968 542968 533036
5540 533036 536815 546705 553985 563514 543252 552003 556958 558734 594734 620972 643883 669761 684820
5527 684820 720719 754556 804802 847038 894990 946582 999781 1069351 1135170 1191053 1216886 1232377
5515 1232377 1234843 1206077 1195674 1182114 1165543 1139628 1097165 1063169 1041043 1032415 1017820 1005055
5503 1005055 1043808 1080689 1107688 1155184 1194003 1244643 1298492 1335132 1404015 1495364 1561204
5492 1561204 1651558 1732775 1798072 1797844 1714796 1611718 1492650 1380322 1285883 1190667 1133642
5481 1133642 1063516 1013638 989251 970888 939180 976067 997276 981388 998344 1031837 1082961
5470 1082961 1160881 1206641 1285200 1365822 1452090 1568609 1672886 1768392 1795538 1743366 1614850
5459A614850j69891j52982j05755q7477q5832n9297k1836m7731m2568k7403k6801
5448G87277J3427R663p467K5868J9983M581M0017N2006N5735O7336O0111Q6984
5436A215521P7506N5909J18r0098j12762j16284j19979q9146n1118l1462m2242
5425F95963l3932k9P723k7887k2361j3663K2375K716Q141J1068J3883J6807K3648
5412G04452K4675K2823M3229K8476L7647L5251J328j0196j9916q773l0904k1505
5400H06587M368r051o793j817K0685P747K5831M3061N2228N1253M4686N3317O5391
5387A157493R5510Q9144K5240o608r353j9213k6311L677M01K1085N7009L8243
5375A426317L5049L4262K3696L3265N6957Q3103R0707J11868J13180R9246P0379
$$ plain form
5459 1614850 1444959 1291977 1186222 1098745 1012913 953616 931780 884049 841481 814078 787277
5448 787277 800704 810367 802900 828768 848751 853332 893349 945355 1001090 1068426 1128537 1215521
5436 1215521 1293027 1348936 1349054 1258956 1146194 1029910 909931 820785 769667 738205 695963
5425 695963 662031 662002 669725 641838 619477 605814 628189 630905 639046 650114 663997 680804 704452
5412 704452 729127 751950 795179 823655 861302 896553 897881 887685 867769 858996 828092 806587
5400 806587 810955 801904 795111 793294 813979 821726 847557 890618 942846 994099 1038785 1092102 1157493
5387 1157493 1253003 1342147 1367387 1360779 1351426 1332213 1305902 1309579 1309980 1331065 1388074 1426317
5375 1426317 1461366 1495628 1519324 1552589 1609546 1692649 1783356 1895224 2008404 2107650 2178029
5364B178029L3051K5416L9153O4685J01214J00180P6833M5768n5662j02907j31252
5353B374508r9721n4022k9427j6709j2318K3837J0759J9750M5615O8461R8913
5342B429646R3249J28269J47594J54665J25901L6738q3533j73079j87973j64141
5332B507336j26684j18171j17923r6618j28049j28198j10379j02497r1412m8976
5322A438429m8199l8880k6145l1496K0116j3750M049L1461L5834M2781N2004M8574
5310A514778P2185L1343k1831o7126j16398j35618j09338q8752q0800n6286n5586
5299H86571p0334o9020n0367k1551l1894j6951l2043l4127l292l7047j817j6838
5287E01290l7570j9274j6936m956J3665j1104k6142O980m585M315J660M565K589
$$ plain form
5364 2178029 2211080 2236496 2275649 2340334 2441548 2541728 2618561 2664329 2608667 2505760 2374508
5353 2374508 2274787 2220765 2191338 2174629 2162311 2186148 2196907 2216657 2262272 2330733 2429646
5342 2429646 2522895 2651164 2798758 2953423 3079324 3116062 3032529 2859450 2671477 2507336
5332 2507336 2380652 2262481 2144558 2047940 1919891 1791693 1681314 1578817 1487405 1438429
5322 1438429 1390230 1351350 1325205 1293709 1313825 1300075 1304124 1335585 1371419 1414200 1466204 1514778
5310 1514778 1586963 1618306 1596475 1529349 1412951 1277333 1167995 1079243 998443 942157 886571
5299 886571 816237 747217 696850 675299 643405 626454 594411 560284 556992 519945 518128 501290
5287 501290 463720 444446 427510 422554 436219 425115 398973 405953 401368 405683 407343 411908 414497
5274D14497j3146N732l558J403M020r961q013K7250j9548k8023p940J22j4674
5261C48161j3031J962q446o538L797j0461j7168j3106M475J521r468m323M12N876
5247B83663j0044K4090k652l273R332l612k0750j581j2719k0148P480Q07r540
5234B41053k2728M55J5097P535M416q029J981n107R861j458k0343n961k6650R217
5220A99339J6413j547N457j756n472N05J2594Q639J300j2824J972K106J074j7556
5206B10244j6932m497O15K254n206o790j392n880n670l123J0926P256J0329Q182
5192B00316j9155m822P36j0606k733j1225M051K543l304J7254N402R60k0239J2045
5178A71223P641j1908J095p45j0731J444l401Q788R51q333j004j021j2137q338
$$ plain form
5274 414497 401351 407083 403525 404928 408948 398987 390974 418224 398676 370653 362713 362835 348161
5261 348161 335130 337092 328646 322108 325905 315444 298276 285170 289645 291166 281698 277375 277787 283663
5247 283663 273619 297709 295057 291784 301116 297504 276754 275173 262454 242306 249786 250593 241053
5234 241053 218325 218780 233877 241412 245828 237799 239780 234673 244534 243076 222733 216772 190122 199339
5220 199339 215752 214205 219662 217906 212434 212939 225533 234172 235472 222648 224620 226726 227800 210244
5206 210244 193312 188815 189430 191684 186478 179688 178296 172416 166746 163623 174549 181805 192134 200316
5192 200316 181161 176339 177075 166469 163736 152511 156562 159105 155801 173055 178457 179417 159178 171223
5178 171223 178864 166956 168051 167306 156575 158019 154618 163406 164357 156024 155020 153999 141862 133524
5164A33524J1759j438Q739O34M386K175K798P681k596r215q238j4171j598K2372
5150A56812J7816o496o777J4218m808j3822j9260J0391j3313R118N273l549K056
5137A47659Q45O391Q11Q987O391q544N49P146j7669K882p380r554L342Q587k387
5122A48056P792J7705R276j0885j9061J294n869J8322M97J646j2045l466K1244
5109A74506p207P453j1709j5069J0727L5J4933N2l300R564n208J5398M855m952
5095A90078K748M892j1774M281j1445n939J4984q32j195J6J4381o785M204J3189
5081B10803J1920O939j2499K3076J5534M370O644k4k388K3836J3145J3888n912
5068C09332L050J9584J4449m985j3530L8104J6939J3961J9609K1574J7466K0888
$$ plain form
5164 133524 145283 143845 152584 153218 157604 159779 162577 170258 167662 158447 150209 136038 134440 156812
5150 156812 174628 168132 161355 175573 170765 156943 137683 148074 134761 143879 149152 145603 147659
5137 147659 148504 154895 155706 164693 171084 162540 163089 170235 152566 155448 148068 138514 141856 150443 148056
5122 148056 155848 173553 182829 171944 152883 154177 148308 166630 167127 168773 156728 153262 174506
5109 174506 167299 174752 163043 147974 158701 158736 173669 173721 170421 179985 174777 190175 195030 190078
5095 190078 192826 197718 185944 190225 178780 172841 187825 186993 185798 185814 200195 193410 197614 210803
5081 210803 222723 229662 217163 240239 255773 260143 266787 266763 264375 288211 301356 315244 309332
5068 309332 312382 331966 346415 341430 327900 366004 382943 396904 416513 438087 455553 476441
5056D76441L5089M4370L8757N2734N6885O5358P9564Q2827J20646J37284J72784
5045A362739K00756J38693p5775k01838j84061j60152j15464p3678m9416n1902
5035G89902j7163j2232k0108r163N559K299j9482P766Q071J6542K8404K0495J2312
5022H13202L4812J8717L9757O5105M4877O0855P1616N5055O2621P6176Q3749J11309
5010A537851J40558J58679K02420K29762K64994L34383M25103N09292O43998M88654
5000D935694Q812k15169j98763k5087J57156J03861l5838p887R9708K64001L61583
4989E448071M8299m38934o40068n79308m23446l20573k29104j34626r6796q1432
4979B552083j31042k07334k07197j53905j43107j19187q3711p8468n3405n5960
$$ plain form
5056 476441 511530 555900 594657 647391 704276 769634 849198 932025 1052671 1189955 1362739
5045 1362739 1563495 1702188 1626413 1424575 1240514 1080362 964898 891220 841804 789902
5035 789902 772739 760507 740399 731236 736795 739094 719612 727378 735449 751991 780395 800890 813202
5022 813202 848014 866731 906488 971593 1016470 1077325 1148941 1203996 1266617 1342793 1426542 1537851
5010 1537851 1678409 1837088 2039508 2269270 2534264 2868647 3293750 3803042 4447040 4935694
5000 4935694 4944506 4729337 4530574 4505487 4662643 4766504 4730666 4722779 4822487 5086488 5448071
4989 5448071 5496370 5057436 4417368 3838060 3414614 3094041 2864937 2730311 2633515 2552083
4979 2552083 2421041 2213707 2006510 1852605 1709498 1590311 1506600 1428132 1374727 1318767
4969A318767o7726q7834m7075m0137l2396m9993l0536l4838n6608k4725k2055
4958H24844o327k7402j7678k6032j1973r39j5018p968l4397j7766r32k1249j9706
4945F17457r235K408l058j5192j2887k1408j8903j0201j205o478j5452Q244M037
4932E18127L280j6153j6596j3444p3J696j0741L3329R096P289n057r344j5342
4919D86067J0309J321j2843l615K460O108J5728J1665n57p98P966L5916J2300
4906E72027m774q677K0316J9569L2027O482r617L2562K2176J8480K1031K5641
4894G47243L2078K4982K8853J8667L9165K3307O7803K3376M2399N4981K4141L5168
4882A162163M3568O566j4722r548j9350m3230m4082l1916o0357o6025l4800l0749
$$ plain form
4969 1318767 1251041 1163207 1116132 1075995 1043599 993606 963070 928232 871624 846899 824844
4958 824844 818517 791115 773437 747405 735432 734493 719475 711507 677110 659344 658412 637163 617457
4945 617457 608222 610630 607572 592380 579493 558085 539182 528981 527776 521298 505846 514090 518127
4932 518127 521407 505254 488658 475214 475141 476837 466096 499425 508521 515810 510753 501409 486067
4919 486067 496376 497697 484854 481239 483699 489807 505535 517200 516643 515845 523811 559727 572027
4906 572027 567253 558576 578892 598461 630488 636970 627353 659915 682091 700571 721602 747243
4894 747243 779321 804303 833156 851823 890988 914295 982098 1005474 1047873 1102854 1126995 1162163
4882 1162163 1205731 1212297 1197575 1188027 1168677 1125447 1081365 1049449 989092 923067 888267 857518
4870H57518l2444l1766l8552k0740j2249k0957j7850j9700j8784j0655r205m506
4858F20110k3701j4911j5834o088K989J0130r213p198j791N727j3774K2151K2603
4845E91200K3330M822n9k8713r166R175j0807J0866p419j2588M832N569R508P14
4831E91264q858r30J9763J8400m654J4138M513L224J8805J7771L584j12M3237
4818G20145L5327L3938J459l517m855k7549j8267n136L099R657Q261j5293J312
4805G38581J1091n38K937J6433J8313R605O112J9508K2692K6381L5034M1159M4370
4792I91678J7137r315p820l8498j6894R999L664q400P559k938P031J314Q224K0074
4778I82815J3178K7030R159K7926L3109M2558K0480K8310N7867K8632K2908J2454
$$ plain form
4870 857518 825074 793308 754756 734016 721767 700810 682960 663260 644476 633821 624616 620110
4858 620110 596409 581498 565664 559576 562565 572695 563482 556284 554493 560220 546446 568597 591200
4845 591200 614530 619352 619293 590580 581414 590589 579782 590648 583229 570641 575473 581042 590550 591264
4831 591264 582406 581476 601239 619639 614985 629123 633636 636860 655665 673436 677020 676908 720145
4818 720145 755472 789410 790869 787352 782497 754948 736681 731545 734644 744301 752562 737269 738581
4805 738581 749672 749134 752071 768504 786817 796422 802534 822042 844734 871115 906149 947308 991678
4792 991678 1008815 999500 991680 953182 936288 946287 949951 941551 949110 946172 953203 954517 962741 982815
4778 982815 995993 1023023 1032182 1060108 1093217 1135775 1156255 1184565 1242432 1271064 1293972 1306426
4766A306426N284P494J1032J5448K4000L3240L8016L4215L0711K8140L0934L3739
4754A598679L9521K6014L3739M0844M0700L8342N8684O0647P4556P6781P4636
4743B163143R6715J14252J35725J31871J23674J20767J16889J26541J53186J71150
4733C453913J79939K02986K19167K32137K20011K34358K50672K63834K80444L10631
4723E848092L46068L83177M03324M47164M49498M93154N41427O06736P47378Q95619
4713A1161637J084059J194389J164692R54256N94899L46187K83754L03399L17221
4704A7404493K37760J74758J89117K67369L68240M62387N00160M96968N79696
4695B0680948O67793P69526Q26348Q21100P62134O89354O66139O91796Q18612
$$ plain form
4766 1306426 1311710 1319204 1330236 1345684 1369684 1402924 1440940 1475155 1505866 1534006 1564940 1598679
4754 1598679 1638200 1664214 1697953 1738797 1779497 1817839 1876523 1937170 2011726 2088507 2163143
4743 2163143 2259858 2374110 2509835 2641706 2765380 2886147 3003036 3129577 3282763 3453913
4733 3453913 3633852 3836838 4056005 4288142 4508153 4742511 4993183 5257017 5537461 5848092
4723 5848092 6194160 6577337 6980661 7427825 7877323 8370477 8911904 9518640 10266018 11161637
4713 11161637 12245696 13440085 14604777 15559033 16153932 16500119 16783873 17087272 17404493
4704 17404493 17642253 17817011 18006128 18273497 18641737 19104124 19604284 20101252 20680948
4695 20680948 21348741 22118267 22944615 23765715 24527849 25217203 25883342 26575138 27393750
4686B7393750R37133J083924J230762J358696J454278J431630J142386L99484
4678C6432043m65533j002197j199255j168334j040969r44347q32076o52597n84020
4669B8542715n50964o74113q27284r19317q73480p96761o64977n25010m11576
4660B2299233l97803l91618l20367k08610p4313j5284m2471j44392j97770j96395
4650B0310210j95360m01488q06108j191993j319282j228244j015024p77376n98658
4641A2776677m67141l71564l24625l21586k65089k75572k50283k33033k90059
4632I977725l37421l54464l54409l33403l08073k68780k27077k04837j82603j90506
4622G216152k04338k24605k29684k06980j76725j48536j24006q9576p5505l6401
$$ plain form
4686 27393750 28330883 29414807 30645569 32004265 33458543 34890173 36032559 36432043
4678 36432043 35966510 34964313 33765058 32596724 31555755 30611408 29779332 29126735 28542715
4669 28542715 27991751 27317638 26490354 25571037 24697557 23900796 23235819 22710809 22299233
4660 22299233 21901430 21509812 21189445 20980835 20906522 20891238 20848767 20704375 20506605 20310210
4650 20310210 20114850 19713362 18907254 17715261 16395979 15167735 14152711 13375335 12776677
4641 12776677 12309536 11937972 11613347 11291761 11026672 10751100 10500817 10267784 9977725
4632 9977725 9640304 9285840 8931431 8598028 8289955 8021175 7794098 7589261 7406658 7216152
4622 7216152 7011814 6787209 6557525 6350545 6173820 6025284 5901278 5811702 5736197 5699796
4612E699796J4246K7930M1218P4109R2553J16331J42839J78462K01433J68274
4602F757191J11139O2416m725q7201r8087j24478j13106q1795r1110j05149p3904
4591F151191j07311j62063j99186k16705k22018j98786j84762j59549j41753j23089
4581D435969j14880q8706p6909o4151j1292p047r448L3371L5031P3830Q3484Q6792
4569D376044O9370j2831o1936j09552j35387j50681j39492j19716j18134j24309
4559C473376j16214j47672j80624j67007j68140j70638j39181j26015j17524p6380
4549B063981p8504q5019r6394n3442n7964n0401m7306n5269n0202n1227l5009
4538A403244n3548k6188l4077m2500k6831l1771j3143j2236j2009l2270k6990
$$ plain form
4612 5699796 5714042 5741972 5783190 5857299 5949852 6066183 6209022 6387484 6588917 6757191
4602 6757191 6868330 6930746 6926021 6838820 6740733 6616255 6503149 6421354 6330244 6225095 6151191
4591 6151191 6043880 5881817 5682631 5465926 5243908 5045122 4860360 4700811 4559058 4435969
4581 4435969 4321089 4232383 4155474 4091323 4080031 4072984 4063536 4096907 4131938 4205768 4289252 4376044
4569 4376044 4445414 4432583 4370647 4261095 4125708 3975027 3835535 3715819 3597685 3473376
4559 3473376 3357162 3209490 3028866 2861859 2693719 2523081 2383900 2257885 2140361 2063981
4549 2063981 1985477 1900458 1804064 1750622 1692658 1642257 1594951 1539682 1489480 1438253 1403244
4538 1403244 1349696 1323508 1289431 1246931 1220100 1188329 1175186 1162950 1150941 1118671 1091681
4527A091681l1715m1410M54j6689k1777M85j3625j8477j6445j4102j318n750k9421
4514H81891j6740J760J2314k1694p034k2146k572j995j4730J817o100o075r353
4501G89343p049r639l522O006j8492q107N695j7140N151p770Q050p146J306R067
4487G45753j9582o902n192O217J2261j4732l580K470j3428R942j6617k0227J8569
4474F94952n779p615p390J5616j570j528K331k5059j3107L417n519j9434q0N54
4460F29789j2313P555k0274Q545p836j7166o283J7935j3882N668k238k4665j4676
4447E50159O989k750L614l959k7412m857J1934r098p031j3781m793o686N474M87
4433D98290o378J159q246j0518p379j8984J9828P164L580j578M378M776m002R042
$$ plain form
4527 1091681 1059966 1018556 1019010 1002321 980544 981029 967404 948927 932482 918380 917062 911312 881891
4514 881891 865151 866911 879225 857531 850497 828351 825779 823784 809054 810871 804771 798696 789343
4501 789343 782294 772655 769133 775139 756647 748540 754235 737095 742246 734476 742526 735380 736686 745753
4487 745753 726171 719269 714077 720294 732555 717823 714243 716713 703285 713227 696610 676383 694952
4474 694952 689173 681558 674168 689784 688214 686686 689017 663958 650851 654268 648749 629315 629235 629789
4460 629789 617476 625031 604757 613302 605466 588300 582017 599952 586070 591738 589500 564835 550159
4447 550159 557148 554398 558012 554053 526641 521784 533718 524620 517589 503808 499015 492329 497803 498290
4433 498290 491912 493071 484825 474307 466928 447944 467772 474936 478516 476938 481316 486092 482090 491132
4419D91132P686N784M594j7813k6214J0932l380M053j840R826k34K0463J787j0072
4405D96704L139J0831L406P882j7534K2136J733l383J215J097O894M522M47N734
4391E44823J7529K3298k987Q210r224m176j895J515J3048R375J4680J616K934
4378F18746k766O882J2707J972M859K5463J8391R552J445J1134J2493j225j5693
4365G03960r25K001j0852J6630Q295r835r799J8486J3632j4858k4342K1290J3328
4352G27011P084M578P624P37n514M599J3640J3549Q76l6p523M621K6364Q960J3071
4337H19641K592p872j4974o496m961r00Q788j2886P041K3716J3156K647K2665
4324H52157J4373l414J5445M877q531J0372K3054J1218j3715j631K5447J5715
$$ plain form
4419 491132 498818 504602 509196 491383 465169 476101 472721 476774 474934 484760 484526 504989 506776 496704
4405 496704 499843 510674 514080 521962 504428 526564 528297 524914 526129 527226 534120 538642 539089 544823
4391 544823 562352 585650 582663 590873 581649 577473 575578 577093 590141 599516 614196 615812 618746
4378 618746 615980 622862 635569 637541 642400 667863 686254 695806 697251 708385 720878 719653 703960
4365 703960 703035 705036 694184 710814 719109 709274 699475 717961 731593 716735 692393 713683 727011
4352 727011 734095 738673 746297 747034 741520 746119 759759 773308 774184 774148 766625 771246 797610 806570 819641
4337 819641 822233 814361 799387 792891 787930 787030 795818 782932 789973 813689 826845 829492 852157
4324 852157 866530 863116 878561 883438 874907 885279 908333 919551 905836 904205 929652 945367
4312I45367J1489J0288J0088O005J289K6240J9956J2362L3777L2474M2740N743
4300A157818k2939j651k1218j8670J0832Q688q203J5024N174j755k9340K100J1545
4287A107405R211J211L827J2019n049K7842M546m328K554M531J5953j2243J0697
4274A178176R234O125P012j5352K0390K6968l608K8297K6885J3797O877P601j123
4261A311279K2948L0107K8222J6624K4954J2830K0432J5945K3121L8619M1678
4250A586759L2685M7682P1385L2928J9583O0065N3779M3736O5803O2417O7544
4239B144366O5702P7492R0024J22245J15226J40253J27039J26879J10937J19470
4229C239633J35399J52538J89192K06408K08759K53842L13468L20048L40094L36082
$$ plain form
4312 945367 956856 967144 977232 983237 984526 1010766 1030722 1043084 1076861 1109335 1152075 1157818
4300 1157818 1134879 1133228 1112010 1093340 1104172 1112860 1104657 1119681 1124855 1123100 1093760 1095860 1107405
4287 1107405 1116616 1117827 1121654 1133673 1128624 1156466 1161012 1156684 1159238 1163769 1179722 1167479 1178176
4274 1178176 1187410 1193535 1200547 1185195 1205585 1232553 1228945 1257242 1284127 1297924 1304801 1312402 1311279
4261 1311279 1334227 1364334 1392556 1409180 1434134 1446964 1467396 1483341 1506462 1545081 1586759
4250 1586759 1619444 1667126 1738511 1771439 1791022 1851087 1904866 1948602 2014405 2076822 2144366
4239 2144366 2210068 2287560 2377584 2499829 2615055 2755308 2882347 3009226 3120163 3239633
4229 3239633 3375032 3527570 3716762 3923170 4131929 4385771 4699239 5019287 5359381 5695463
4219E695463L33601L08752K74031K43242K44327K30637K86980L38440L97426M94113
4209H847012N71381O17604O95009P03132O55210N82804M98213M08964K95705K59945
4199A4134979K33633K44379L23921M22931N46135O56909P70213Q03822P87125
4190A8924047P33306N96849M88942L37866J46762p126j04604j77270j32926m9066
4180B0756780O4389K05457L03805L71282L76473L60390L22599K24349M1671k09091
4170B2818104m34493o45669p76285p74189p10426n45815m12174k99838j65181
4161A8054034r4533n1458k2860q7377k26945m39525o59823q29544r03294q93010
4151A3845665q23720o98596n77053m38839l61365k74050k25993j75546k03461
$$ plain form
4219 5695463 6029064 6337816 6611847 6855089 7099416 7330053 7617033 7955473 8352899 8847012
4209 8847012 9418393 10035997 10731006 11434138 12089348 12672152 13170365 13579329 13875034 14134979
4199 14134979 14368612 14612991 14936912 15359843 15905978 16562887 17333100 18136922 18924047
4190 18924047 19657353 20254202 20743144 21081010 21227772 21220646 21116042 20938772 20805846 20756780
4180 20756780 20821169 21026626 21330431 21701713 22078186 22438576 22761175 22985524 23027195 22818104
4170 22818104 22383611 21737942 20961657 20187468 19477042 18931227 18519053 18219215 18054034
4161 18054034 17959501 17908043 17885183 17797806 17570861 17131336 16471513 15641969 14738675 13845665
4151 13845665 13021945 12323349 11746296 11307457 10946092 10672042 10446049 10270503 10067042
4142A0067042k82084m16460m94104n41730n52422n07021m41189l75175l26370
4133F130487k82880k18712j92221j75133j50761j64840j74491j86992j90921j79686
4123D213850j73991j76991j51916j17607j02713q7502j00941j04217r8774q7429
4113C011769q2359o9948q0043q2030o6386n0655p1939n4830l9319l8685n1635
4102B323940l1467l0857m0242m5555n8592l8166k4584l8559j2628p571n0733k2795
4090A922191k9590k0790k0867k4124k2471m117k1075n571o556k7086m5036k3071
4078A671837j0549j7250j4556m224j4668j5992l6370j8078m253l117j805R318
4066A540293J867j5649j2749q252l368N691j2321k4891k829k358k296O734J0990
$$ plain form
4142 10067042 9784958 9368498 8874394 8332664 7780242 7273221 6832032 6456857 6130487
4133 6130487 5847607 5628895 5436674 5261541 5110780 4945940 4771449 4584457 4393536 4213850
4123 4213850 4039859 3862868 3710952 3593345 3490632 3403130 3302189 3197972 3099198 3011769
4113 3011769 2929410 2859462 2779419 2697389 2631003 2580348 2508409 2453579 2414260 2375575 2323940
4102 2323940 2292473 2261616 2221374 2175819 2117227 2079061 2054477 2015918 2003290 1995719 1944986 1922191
4090 1922191 1892601 1871811 1850944 1826820 1804349 1800232 1779157 1773586 1767030 1739944 1694908 1671837
4078 1671837 1661288 1644038 1629482 1625258 1610590 1594598 1558228 1540150 1535897 1532780 1530975 1540293
4066 1540293 1542160 1526511 1513762 1505510 1502142 1507833 1495512 1470621 1467792 1465434 1463138 1469872 1480862
4053A480862L502j4397o424J6712O034R317O843o448j8673j3398J1189J1657Q344
4040A495120J59N772O956Q342J6047J4259N287L5180K2446L6884L1332L1288O857
4027A715929J8380K4441J6256L6509M1429M5413N4402O8820N8611N2786M7464
4016B180440M1303J7321J6922Q129L4332M5971K4186M1086O4170N1765M2357O6436
4004B634418J02703O7453n231q740k4007k5153k3014j1202J4717L1621L7333N1974
3992B842872P6374N4405N6493J9653m2104o9146n2499m2711l2334l4559j0393
3981B766051n245J2972K5888K2907K3054K1779L3693N549L0O723L4900K8089N517
3968B981907K1914J5674L9024L0871J5674J7980J0358p581L495K1477J6339M1287
$$ plain form
4053 1480862 1484364 1469967 1463543 1480255 1486289 1495606 1502449 1496001 1477328 1463930 1475119 1486776 1495120
4040 1495120 1495279 1501051 1508007 1516349 1532396 1546655 1551942 1587122 1609568 1646452 1677784 1709072 1715929
4027 1715929 1734309 1758750 1775006 1811515 1852944 1898357 1952759 2021579 2080190 2132976 2180440
4016 2180440 2221743 2239064 2255986 2264115 2298447 2344418 2368604 2409690 2473860 2525625 2567982 2634418
4004 2634418 2737121 2804574 2799343 2790603 2766596 2741443 2718429 2707227 2721944 2753565 2790898 2842872
3992 2842872 2919246 2973651 3030144 3049797 3007693 2938547 2886048 2843337 2811003 2776444 2766051
3981 2766051 2760806 2773778 2799666 2822573 2845627 2867406 2901099 2906648 2906678 2913401 2948301 2976390 2981907
3968 2981907 3003821 3019495 3058519 3089390 3105064 3123044 3133402 3125821 3129316 3150793 3167132 3208419
3956C208419M4364J1091N8612O8069M5289L5557L5659M2602K7790K8573K4284
3945C630309K9836M3652L9710M9423L6532N0829L0928k403j3370j1945n681P085
3933C884905J3032q838n227J5743Q568K686P662j5014n452n708k997k0886k648
3920C865826j5303m0510n810O176J9226K0783K4950M0117L7832K6306K7339L8266
3908D045198L5694J7140J7882K1344J1950K7882P133k5572j103N446N314K0655
3896D188963K3248N6304N8774O3691J12335J32314J34679J55041J71307J78892
3886E275548J70655J30076P5587O5734L4285K7617K7875M6891P4423J03581J20995
3875F153267J70990J99175K09981K26586K61342K82307K94701L32795L54120M23732
$$ plain form
3956 3208419 3252783 3263874 3322486 3390555 3435844 3471401 3507060 3549662 3577452 3606025 3630309
3945 3630309 3660145 3703797 3743507 3792930 3829462 3880291 3911219 3908816 3895446 3883501 3877820 3884905
3933 3884905 3897937 3889099 3883872 3899615 3908183 3910869 3918531 3903517 3898065 3892357 3889360 3868474 3865826
3920 3865826 3850523 3810013 3804203 3810379 3829605 3850388 3875338 3915455 3953287 3979593 4006932 4045198
3908 4045198 4080892 4098032 4115914 4137258 4149208 4177090 4184223 4158651 4157548 4162994 4168308 4188963
3896 4188963 4212211 4268515 4327289 4390980 4503315 4635629 4770308 4925349 5096656 5275548
3886 5275548 5446203 5576279 5651866 5717600 5751885 5779502 5807377 5854268 5928691 6032272 6153267
3875 6153267 6324257 6523432 6733413 6959999 7221341 7503648 7798349 8131144 8485264 8908996
3865H908996M92311N39582N52852N25806N54634O12921O71624P98384R26054J106583
3855A5689747J278122J373808J334514J068328O38991K91989J12749J57821K31574
3846B2177643K84150L60720M98732P27843R51109J067894J093406J001092Q06532
3837B8969121N38246L07809J65699J04400Q5325J56142K82439M70184O93793R55811
3827C2728969J249603J522701J766476J859119J805522J341275K38452j044774
3819D1467343j935995k217740j983592j556767j130294p93092n54576l84712k39852
3810C0670723j05385l5601j4444o5930k03434l92128p34677j042431j178985j154191
3800B5743517r79815p22878m82030l01395k10171j59112j29259r1751j75155m11428
$$ plain form
3865 8908996 9401307 9940889 10493741 11019547 11574181 12187102 12858726 13657110 14583164 15689747
3855 15689747 16967869 18341677 19676191 20744519 21383510 21675499 21788248 21946069 22177643
3846 22177643 22461793 22822513 23321245 24049088 25000197 26068091 27161497 28162589 28969121
3837 28969121 29507367 29815176 29980875 30085275 30170600 30326742 30609181 31079365 31773158 32728969
3827 32728969 33978572 35501273 37267749 39126868 40932390 42273665 42512117 41467343
3819 41467343 39531348 37313608 35330016 33773249 32642955 31849863 31295287 30910575 30670723
3810 30670723 30565338 30529737 30515293 30449363 30245929 29853801 29119124 28076693 26897708 25743517
3800 25743517 24763702 24040824 23558794 23257399 23047228 22888116 22758857 22667106 22491951 22080523
3790B2080523p88385j080535j153593j065646r25860p46829n66738m34336l58717
3781A4959884l23783l20307l52999l61619k90074k56748k07905j25443j01385
3772A2619621r8797j28988j35621j37602j46796j43379j47057j46051j28656j19232
3762A1287442j26054j33203j56429j83786k00446k37509k44837k32892k39384
3753I532902j89316j86354j46180j14582j02150o0181p2056l2941l1983l7382
3743H559777m9905m8657n7234l9839l8167m1902m1139k3708r911j8548l891m1813
3731H145063l1935j0231k6219l2518p447J2505q852M693J2525K7395L9524K2834
3719H147337Q2051Q4648R5414R7264Q3874Q5231J09675J15810J12656J52821J80519
$$ plain form
3790 22080523 21292138 20211603 19058010 17992364 17066504 16319675 15752937 15318601 14959884
3781 14959884 14636101 14315794 13962795 13601176 13311102 13054354 12846449 12721006 12619621
3772 12619621 12520824 12391836 12256215 12118613 11971817 11828438 11681381 11535330 11406674 11287442
3762 11287442 11161388 11028185 10871756 10687970 10487524 10250015 10005178 9772286 9532902
3753 9532902 9343586 9157232 9011052 8896470 8794320 8734139 8662083 8629142 8597159 8559777
3743 8559777 8509872 8461215 8403981 8364142 8325975 8284073 8242934 8219226 8209315 8190767 8186876 8145063
3731 8145063 8113128 8102897 8076678 8044160 8036713 8049218 8040366 8045059 8057584 8084979 8124503 8147337
3719 8147337 8229388 8314036 8409450 8506714 8590588 8675819 8785494 8901304 9013960 9166781 9347300
3708I347300K20387K28951K45169K49208K67987K84905L01458L03890L13309L64133
3698A2126697M23348M65198M75520N13992O06112O63985P56135Q50219R61139
3689A7842345J118893J248168J438598J576014J678364J762254J690443J560287
3681B9915366J364739J078387P68097M42561J45238j00179k85202l83178l64154
3672C2581675k39882p5840Q9458K01193L09869K96264J49872p3278l30004o05929
3662C2303398q81589j115591j299293j400666j413909j382970j321405j185030
3654B2302945j071863r69607q29758p49581o62362n80827m97998m41813l86088
3645A6113048l46168l15609k99797k89957k63938k24081j85359j30610j14091
$$ plain form
3708 9347300 9567687 9796638 10041807 10291015 10559002 10843907 11145365 11449255 11762564 12126697
3698 12126697 12550045 13015243 13490763 14004755 14610867 15274852 16030987 16881206 17842345
3689 17842345 18961238 20209406 21648004 23224018 24902382 26664636 28355079 29915366
3681 29915366 31280105 32358492 33126589 33569150 33714388 33614209 33329007 32945829 32581675
3672 32581675 32341793 32265953 32355411 32556604 32866473 33162737 33312609 33239331 32909327 32303398
3662 32303398 31421809 30306218 29006925 27606259 26192350 24809380 23487975 22302945
3654 22302945 21231082 20261475 19431717 18682136 18019774 17438947 16940949 16499136 16113048
3645 16113048 15766880 15451271 15151474 14861517 14597579 14373498 14188139 14057529 13943438
3636A3943438q7999m2074k9096j3914j9848R494K1020J2974J6235K7431N3713
3625A3891374N9107M8349J1769R300j2420l6342k3269l9217k5644k308K9562L5920
3613A3946181L7528L8853J7570N4693K1875M6132N5939N6950J09758J30219J44671
3602A4660369J58529K07681K41911K46056K63083K82348L08181L48604L36865
3593A7053627L31313L04387L15062L42090L62607L85934M27231M52939M48315
3584B0423505M34904M37014M34109M05418L49829L09636K56983K21097K07519
3575B3480014J73369J65449J70078J63100J61270J72651J96638K06583K50831
3566B5139983K31816K34479K05639J79795J93994K29054K76857L31206L90459
$$ plain form
3636 13943438 13855439 13813365 13784269 13770355 13750507 13760001 13781021 13793995 13810230 13837661 13891374
3625 13891374 13950481 13998830 14010599 14019899 14007479 13971137 13947868 13908651 13883007 13880699 13910261 13946181
3613 13946181 13983709 14022562 14040132 14094825 14116700 14162832 14218771 14275721 14385479 14515698 14660369
3602 14660369 14818898 15026579 15268490 15514546 15777629 16059977 16368158 16716762 17053627
3593 17053627 17384940 17689327 18004389 18346479 18709086 19095020 19522251 19975190 20423505
3584 20423505 20858409 21295423 21729532 22134950 22484779 22794415 23051398 23272495 23480014
3575 23480014 23653383 23818832 23988910 24152010 24313280 24485931 24682569 24889152 25139983
3566 25139983 25371799 25606278 25811917 25991712 26185706 26414760 26691617 27022823 27413282
3557B7413282M76758N65061P09545Q57279J068422J307758J595501J866938K064204
3548C7924748K249668K302993K270606K071637J766681J423269J054006O92456
3540E1756064L32576L0907j43818j85107j05401K1181J79579L38610M01181L78940
3530E3004712J71725j06343m67886q38980j236981j618756j948227k174381k266285
3521D2518598k253478k137226j975750j797478j540041j312256j136594r55187
3513B9410588q24930p00652o03291n05583m28374l59587k78390j94724j02578
3504B5412479l6812M4120J55257K32995L24428M13238N27791O54405P71322Q83232
3494B9382455J056709J208431J380535J579184J769307J982535K197453K354701
$$ plain form
3557 27413282 27890040 28455101 29164646 30021925 31090347 32398105 33993606 35860544 37924748
3548 37924748 40174416 42477409 44748015 46819652 48586333 50009602 51063608 51756064
3540 51756064 52088640 52119547 51975729 51790622 51685221 51706402 51885981 52224591 52625772 53004712
3530 53004712 53176437 53070094 52602208 51763228 50526247 48907491 46959264 44784883 42518598
3521 42518598 40265120 38127894 36152144 34354666 32814625 31502369 30365775 29410588
3513 29410588 28585658 27885006 27281715 26776132 26347758 25988171 25709781 25515057 25412479
3504 25412479 25375667 25419787 25575044 25808039 26132467 26545705 27073496 27727901 28499223 29382455
3494 29382455 30439164 31647595 33028130 34607314 36376621 38359156 40556609 42911310
3486D2911310K461729K491558K469787K348929K207002K114266K021611J903738
3478F0929930J724942J457067J148430P90664M84067J75171r1448l43863n60662
3469F5714298p02020q71601j016136j149483j275959j364259j491177j555392
3461E6288271j606709j628208j555234j489523j362117j200337j016046p92552
3453D5637545n41011k62944M1354L61249O72152J041195J427431J867534K234930
3444E2479435K340189K280727K609699L283461M058707M717853M516877K722432
3436G9009380J150081Q45710J166824J703402K067549K274771K339920K345784
3428I2903421K303596K276783K340547K575508K920266L350303L797845M268932
$$ plain form
3486 42911310 45373039 47864597 50334384 52683313 54890315 57004581 59026192 60929930
3478 60929930 62654872 64111939 65260369 66051033 66535100 66710271 66618823 66274960 65714298
3469 65714298 65012278 64140677 63124541 61975058 60699099 59334840 57843663 56288271
3461 56288271 54681562 53053354 51498120 50008597 48646480 47446143 46430097 45637545
3453 45637545 45096534 44833590 44874944 45236193 45908345 46949540 48376971 50244505 52479435
3444 52479435 54819624 57100351 59710050 62993511 67052218 71770071 76286948 79009380
3436 79009380 80159461 81005171 82171995 83875397 85942946 88217717 90557637 92903421
3428 92903421 95207017 97483800 99824347 102399855 105320121 108670424 112468269 116737201
3420A16737201M735064N136178N496169N606526N197174M195984L117993K275052
3412A52497341J497534P81387j82494k381032m930823n995070n808410m897054
3404A30581379l885728l028417k334798j850169j617574j561925j679276j967188
3396A12656304k435207k949714l460234l850988m132359m197376m153158m054050
3388H3423218l867385l627552l336122l001838k658209k284545j983732j698725
3380F0965110j434677j235224j072401q73412o91153m67984k51787m995K47920
3371E5181397N01762Q47768J213842J558204J934017K183304K299620K284492
3363F8004406K129256J953642J797771J676293J500968J284002R04679M33709
$$ plain form
3420 116737201 121472265 126608443 132104612 137711138 142908312 147104296 150222289 152497341
3412 152497341 153994875 154776262 154593768 152212736 147281913 141286843 135478433 130581379
3404 130581379 126695651 123667234 121332436 119482267 117864693 116302768 114623492 112656304
3396 112656304 110221097 107271383 103811149 99960161 95827802 91630426 87477268 83423218
3388 83423218 79555833 75928281 72592159 69590321 66932112 64647567 62663835 60965110
3380 60965110 59530433 58295209 57222808 56349396 55658243 55190259 54938472 54933477 55181397
3371 55181397 55683159 56530927 57744769 59302973 61236990 63420294 65719914 68004406
3363 68004406 70133662 72087304 73885075 75561368 77062336 78346338 79251017 79684726
3355G9684726o0800m73835p67954r40724j032757j035234r83807r69506r60933
3346G2459176r06032q66968q24036q50233r75901j185104j478211j808401k106897
3337F1457393k335551k541624k711320k761389k729271k621566k445038k278082
3329D1033552k068717j866890j652990j454407j257163j065718r10738p68263
3321B9988666o42565n55466m85316l86884k89504k29209k43001j96031j54604
3312B6806086j13844j9736J32235L19334N22301P35684R77329J184883J371798
3303C1916070J532239J317727M08558n25838j203207j462438j232991q94103n58267
3294B9297750l17891j58729R661J17841J69762J32472k3535j40002j60223j29559
$$ plain form
3355 79684726 79623926 79150091 78382137 77441413 76408656 75373422 74389615 73420109 72459176
3346 72459176 71553144 70686176 69862140 69011907 68036006 66850902 65372691 63564290 61457393
3337 61457393 59121842 56580218 53868898 51107509 48378238 45756672 43311634 41033552
3329 41033552 38964835 37097945 35444955 33990548 32733385 31667667 30756929 29988666
3321 29988666 29346101 28790635 28305319 27918435 27628931 27399722 27156721 26960690 26806086
3312 26806086 26692242 26672506 26804741 27124075 27646376 28382060 29359389 30544272 31916070
3303 31916070 33448309 34766036 35174594 34648756 33445549 31983111 30750120 29856017 29297750
3294 29297750 28979859 28821130 28830791 28948632 29118394 29250866 29227331 29087329 28927106 28797547
3284B8797547r9542J7846J16635K89478N08023P19540R97749J321558J583124
3275C4251958J803297J491701O62176n8647n04277l88473O8321N33536R39575
3266C8799167J260038J491695J676011J801277J899169J973332J946054J883643
3258E2730386J739422J566800J484095J432326J427308J405680J376548J257260
3250F4419825J091060Q66272O16506M40629L36100L23430K35246q362m32720q97730
3240F6990256j293825j642699j909049k179984k439589k686809k942686l078907
3232D8816708l129966l095045k994915k821976k649112k447454k233784k002044
3224B7442412j782172j568923j386864j233234j111622j020626q93692p97462
$$ plain form
3284 28797547 28698005 28715851 28832486 29121964 29629987 30349527 31347276 32668834 34251958
3275 34251958 36055255 37546956 38209132 38150485 37646208 37257735 37326056 37859592 38799167
3266 38799167 40059205 41550900 43226911 45028188 46927357 48900689 50846743 52730386
3258 52730386 54469808 56036608 57520703 58953029 60380337 61786017 63162565 64419825
3250 64419825 65510885 66377157 66993663 67434292 67770392 68093822 68329068 68320706 67887986 66990256
3240 66990256 65696431 64053732 62144683 59964699 57525110 54838301 51895615 48816708
3232 48816708 45686742 42591697 39596782 36774806 34125694 31678240 29444456 27442412
3224 27442412 25660240 24091317 22704453 21471219 20359597 19338971 18445279 17647817
3216A7647817p26716o51206o14913n58829m68532m28534l76326l40763k99054
3207A3182944k80904k42104k00436j71601j37672j21444j19843p6430q7257p6212
3197A1669041o5129r2516j30303j49547j65671j62489j65280j80298j60047j63880
3187A0233881j73686j62440j61548j40939j52658j44461j51258j44540j50398
3178H851953j76265j70726j69824j79259j70436j71868j67427j50251j48355j44160
3168G203382j38965j09687j16495q7845r2743p5604r4825p0776n0552m3698n6280
3157F265912o2608k3170l4332j0794J4799l105Q825j7135m1430o0059n3457n7860
3145E925586m8070n3453l5234j6145j8450q178jp615l645P243M876J5449J7123
$$ plain form
3216 17647817 16921101 16269895 15654982 15096153 14627621 14199087 13822761 13481998 13182944
3207 13182944 12902040 12659936 12459500 12287899 12150227 12028783 11908940 11832510 11745253 11669041
3197 11669041 11603912 11511396 11381093 11231546 11065875 10903386 10738106 10557808 10397761 10233881
3187 10233881 10060195 9897755 9736207 9595268 9442610 9298149 9146891 9002351 8851953
3178 8851953 8675688 8504962 8335138 8155879 7985443 7813575 7646148 7495897 7347542 7203382
3168 7203382 7064417 6954730 6838235 6750390 6657647 6582043 6487218 6416442 6365890 6322192 6265912
3157 6265912 6203304 6180134 6145802 6135008 6149807 6146702 6155527 6138392 6096962 6036903 5983446 5925586
3145 5925586 5877516 5824063 5788829 5772684 5754234 5746056 5746055 5738440 5734795 5742038 5746914 5762363 5779486
3132E779486K0914P116K3145J4232p007J931r666k8743R19p897j8102J8805O012
3119E801145k4218k2630l3825j8316J2163j667J5253K4550R525K5135N665K3755
3107E816535O6020Q1501J19531J32977J63374J78471J40137O1935J8818k1353
3097F757946P289J2087N8312O2815O2468P5979J05409J06404J10220J34204J67440
3086G660573K17137K13348K62142L17868L57425L89930L80904L19312K52296K26483
3076A0597418K44837K80961L53307L56557K99681K63494K15486J93037K05495
3067A3010273J87862J93102K15636L02440L62837L74771L82465L94937L50849
3058A5775172L47860L92881M51900N06416N69245O45683O82224O96664O92452
$$ plain form
3132 5779486 5800400 5807516 5830661 5844893 5837886 5839817 5830151 5801408 5802327 5794430 5776328 5795133 5801145
3119 5801145 5776927 5754297 5720472 5702156 5714319 5712652 5727905 5752455 5761980 5787115 5792780 5816535
3107 5816535 5882555 5964056 6083587 6216564 6379938 6558409 6698546 6760481 6779299 6757946
3097 6757946 6765235 6777322 6835634 6898449 6960917 7036896 7142305 7248709 7358929 7493133 7660573
3086 7660573 7877710 8091058 8353200 8671068 9028493 9418423 9799327 10118639 10370935 10597418
3076 10597418 10842255 11123216 11476523 11833080 12132761 12396255 12611741 12804778 13010273
3067 13010273 13198135 13391237 13606873 13909313 14272150 14646921 15029386 15424323 15775172
3058 15775172 16123032 16515913 16967813 17474229 18043474 18689157 19371381 20068045 20760497
3049B0760497P18843Q06063Q83538R65811J068512J161646J249809J334446J412493
3040C0361658J540689J712023J941193K170983K404039K657941K978363L321838
3032D9088727L732011M242773M868892N482913O161917O887762P699003Q724886
3024I6888884J0032342J1647264J3533715J5759681J8430684K1367097K4216459
3017B11876126K5909220K3832602J6632939Q930652O662007J0295455J5638517
3010C19777518J4860721J886238j7724030l1898494l6077166l3116516k7446292
3003A90261979k1881179j7317219j3803441j1283999r656934q762622q056688
2996I9499897p357851o581949n801881n133657m646140m294457l960423l714937
$$ plain form
3049 20760497 21479340 22285403 23168941 24134752 25203264 26364910 27614719 28949165 30361658
3040 30361658 31902347 33614370 35555563 37726546 40130585 42788526 45766889 49088727
3032 49088727 52820738 57063511 61932403 67415316 73577233 80464995 88163998 96888884
3024 96888884 106921226 118568490 132102205 147861886 166292570 187659667 211876126
3017 211876126 237785346 261617948 278250887 287181539 293843546 304139001 319777518
3010 319777518 334638239 336524477 318800447 286901953 250824787 217708271 190261979
3003 190261979 168380800 151063581 137260140 125976141 116319207 107556585 99499897
2996 99499897 92142046 85560097 79758216 74624559 69978419 65683962 61723539 58008602
2988E8008602l463134l208913k899920k658437k386404k146983j930166j728680
2980C7585965j545711j440767j327008j251842j152148j051982j004122r39725
2972B7872660r37665r23102q69503q17629p95543p71148p44714p14301p01186
2963B0597869o72192o11672n83212n66621n33650n32566m76419m73308m55743
2954A5692486m31641l81924l67200l76667l27379l31770k92339k91260k96553
2945A2595753k86396k90855k57707k66340k47824k44810k44277k56097k57948
2936A0243499k43635k49677k45049k40111k11688k10896k17543j72671j78433
2927H273796j74458j45071j25172j14325j01364r0437j05555j00254r4158q2217
$$ plain form
2988 58008602 54545468 51336555 48436635 45778198 43391794 41244811 39314645 37585965
2980 37585965 36040254 34599487 33272479 32020637 30868489 29816507 28812385 27872660
2972 27872660 26934995 26011893 25142390 24324761 23529218 22758070 22013356 21299055 20597869
2963 20597869 19925677 19314005 18730793 18164172 17630522 17097956 16621537 16148229 15692486
2954 15692486 15260845 14878921 14511721 14135054 13807675 13475905 13183566 12892306 12595753
2945 12595753 12309357 12018502 11760795 11494455 11246631 11001821 10757544 10501447 10243499
2936 10243499 9999864 9750187 9505138 9265027 9053339 8842443 8624900 8452229 8273796
2927 8273796 8099338 7954267 7829095 7714770 7613406 7522969 7417414 7317160 7223002 7140785
2917G140785p7090j05652j12905j12059j06325j01148j04913j11582j11709j19856
2907F077546r4729j14340r0021q8913q6856j00047r0321q5707j09920q6431o0837
2896E069424q5170r3372p0719p6623n8679o5804o9786p9943p1776o9120n3957
2885D274475p3924n8965k6351p3020o2013m6468n9567q2456p4381q1003o3066
2874C573261n4464o1327p2375n7726o1370o3607l8222n5728l5488j7295j0481
2863C045178m1200l9061n5368n0902j7123j7753l8418k3164m0063j2861j1180
2852B698085j4318J007p09N110j363p712j4609n686m582l3327l0150r107j3537
2839B569102m3448l7343m5172m3879n6399o6090n0844l3053k1457j1604m2405
$$ plain form
2917 7140785 7063695 6958043 6845138 6733079 6626754 6525606 6420693 6309111 6197402 6077546
2907 6077546 5982817 5868477 5778456 5689543 5602687 5502640 5412319 5326612 5216692 5130261 5069424
2896 5069424 4984254 4890882 4820163 4743540 4684861 4619057 4549271 4469328 4397552 4328432 4274475
2885 4274475 4200551 4141586 4115235 4042215 3980202 3933734 3874167 3791711 3717330 3636327 3573261
2874 3573261 3518797 3457470 3385095 3327369 3265999 3202392 3164170 3108442 3072954 3055659 3045178
2863 3045178 3003978 2964917 2909549 2858647 2841524 2823771 2785353 2762189 2722126 2709265 2698085
2852 2698085 2683767 2684774 2684065 2689175 2687812 2680100 2665491 2659805 2655223 2621896 2591746 2582639 2569102
2839 2569102 2525654 2488311 2443139 2399260 2342861 2276771 2225927 2192874 2171417 2159813 2117408
2828B117408l0853j0594m834K585R80k1782L821M13m926J0728m689J1334j2794
2815B056797J3083K2876J2969k121m045j758J2497n484p346r015j7632j8658k8386
2802B023777R314k1064m4856j6290l2138l4005k1742j9711k4862j6442k3584l7393
2790A741004k5113j7066n456j3127J291L757O336j3321l9568q291O944j5106j7913
2777A604371o241j0451j2047j3773j9528J716j515j3880M832j0210j3438Q251
2765A518087l131j7869k193P442j256m175j4006j889M620M894J2739L852M75J044
2751A508634K094Q257O322L4281K7241K73Q158M324M3914L8381M5779P5330Q2397
2738A885385O8221J01657J13438J34604J39591J36238R0812N3838L0510M6375
$$ plain form
2828 2117408 2086555 2075961 2071127 2073712 2074692 2052910 2056731 2057144 2052218 2062946 2058257 2069591 2056797
2815 2056797 2069880 2092756 2105725 2103604 2099559 2097801 2110298 2104814 2097468 2088453 2070821 2052163 2023777
2802 2023777 2033091 2012027 1967171 1950881 1918743 1884738 1862996 1843285 1818423 1801981 1778397 1741004
2790 1741004 1715891 1698825 1693369 1680242 1681533 1685290 1691626 1678305 1638737 1630446 1637390 1622284 1604371
2777 1604371 1598130 1587679 1575632 1561859 1542331 1544047 1542532 1528652 1533484 1523274 1509836 1518087
2765 1518087 1514956 1497087 1494894 1502336 1501080 1496905 1482899 1481010 1485630 1490524 1503263 1507115 1507590 1508634
2751 1508634 1510728 1518985 1525307 1559588 1586829 1587102 1595260 1599584 1643498 1681879 1727658 1802988 1885385
2738 1885385 1953606 2055263 2168701 2303305 2442896 2579134 2669946 2723784 2754294 2800669
2728B800669O7732O8228l743r1517j74536k21152j91266j69358j17227j17986
2718A849844r3168p5760m9011m7013l3036m7106n1061j3024l6504m5407l4338
2707A324416j7346m9656k5597R7l0087j1771o963L425M735k745j2034n97j5311
2694A160566l1704j6708o399j9847o853n465K893k680J492o822l6204l081m894
2681A024294q680j6016o626k5751j3807r464N149q442k5295J078j088j4487q106
2668H92759j0199j7041n045j1259j7003j7457l807O371j2167l0627j6976j6346
2656G41203j0191n492m782j9685K0920R471k3731l70l708j2090q922m068r008
2643F69547k634j9873K0984L2707k2800j2579j7854o610n061M302L029L593p45
$$ plain form
2728 2800669 2868401 2936629 2932886 2841369 2666833 2445681 2254415 2085057 1967830 1849844
2718 1849844 1756676 1680916 1631905 1584892 1551856 1504750 1453689 1440665 1404161 1358754 1324416
2707 1324416 1307070 1257414 1231817 1231914 1201827 1190056 1183093 1186518 1191253 1188508 1176474 1175877 1160566
2694 1160566 1128862 1112154 1105755 1085908 1079055 1073590 1076483 1073803 1075295 1068473 1032269 1029188 1024294
2681 1024294 1015614 999598 992972 967221 953414 943950 949099 940657 915362 916440 915352 900865 892759
2668 892759 882560 865519 860474 849215 832212 814755 810948 817319 805152 774525 757549 741203
2656 741203 731012 725520 720738 701053 721973 731444 707713 707343 703635 691545 682623 678555 669547
2643 669547 666913 647040 668024 700731 677931 665352 647498 640888 635827 640129 643158 646751 646006
2630F46006J052q61k1546k0260k874J21K664j5060M045K3064j918r773j3859O606
2616E97407O443J2381l4j995n177j5568p937L473m698r547j9447P597j5599O029
2602E53328O963n463m68j8414j2925j5389Q373j8440K070J1122J399N557j4607
2589E03106J4992m423q118m083l402l640j1943L792k0801j2200p008J8590M333
2576D69195J2497j3036k385p322j7487O311J2206m456Q000j1313j6462J5379N058
2563D56185j376j4833r033N34k408p759N760L359r501J6667J2852j0249L143j7247
2549D26094p39J206j1249O805J9055r659k2708P56J4790j2126q207N612o919K547
2535D05258Q97j198l871J724o096M013J145J3808l336r159K335l112q843M880
$$ plain form
2630 646006 647058 646197 624651 604391 601517 601638 604302 589242 593287 616351 614433 604660 590801 597407
2616 597407 603850 616231 616197 614202 609025 593457 585520 588993 584295 574748 555301 562898 547299 553328
2602 553328 560291 554828 554360 535946 523021 507632 516005 497565 499635 510757 512156 517713 503106
2589 503106 518098 513675 505557 501474 498072 494432 482489 486281 465480 453280 446272 464862 469195
2576 469195 481692 468656 466271 458949 441462 447773 459979 455523 463523 452210 435748 451127 456185
2563 456185 454809 439976 430943 431477 429069 421310 427070 430429 420928 437595 450447 440198 443341 426094
2549 426094 425355 426561 415312 422117 441172 431513 408805 409561 424351 412225 404018 409630 402711 405258
2535 405258 406155 404957 401086 402810 396714 400727 401872 415680 412344 403185 405520 402408 393565 398445
2521C98445J3999Q185k281j4398j0523P28J4657j5267r231k698Q824j1767j4116
2508C64557j3288J7788R545k921j9373m691J4259J8452n21N720q996N058q903
2495C76686l306n698p122J1922k962r44k649N632J2901J8831k7576o530P180J822
2481C78187o64o573n543p313l735M668L504k1395m302k4270J853K368k698N199
2467C19286n180J4771p842J4390j3121M198n932k3730R203N15j8234J896Q95J4382
2453C05497O831o266R479R927l961m519j9829J1282J6195j0219m034L183K541
2440C16107R018J0277k0634r021q464R324l912j5374R094K1683r376k3881Q493
2427B93334K8625N993M80o934j8560L068q069k281n605M662j5969O78J0462L697
$$ plain form
2521 398445 412444 420629 418348 403950 393427 394155 408812 393545 384314 381616 390440 378673 364557
2508 364557 351269 369057 378602 375681 356308 351617 365876 384328 383807 389527 380531 385589 376686
2495 376686 373380 367682 360560 372482 369520 368576 365927 371559 384460 403291 375715 369185 376365 378187
2481 378187 377523 370950 365407 358094 354359 359027 362531 341136 336834 312564 314417 316785 314087 319286
2467 319286 314106 328877 321035 335425 322304 326502 320570 296840 306043 306558 288324 290220 291115 305497
2453 305497 312328 306062 315541 325468 321507 316988 297159 308441 324636 314417 310383 313566 316107
2440 316107 325125 335402 314768 305747 297283 306607 302695 287321 296415 318098 308722 284841 293334
2427 293334 321959 327952 328432 321498 302938 306006 297937 295656 290051 294713 278744 279422 289884 293581
2413B93581J0056M281l16J696j4418j1419O710J0224K049J016p9l183r537J3437
2399C04098L638p985J699k427k910j7286j413j0809j5006J0040l502K298J4774
2386B75209J696M027o860m348j9651L895P019M69l459N666j1872k717K053J960
2372B53087J0529L0N264k972o90j1647M26n567L1465R79j2485j7773l863K1601
2358B68384n465M795k2598O675j805J2019J086N248p08K567N693r456j5036n127
2344B46272J6423j0826J5460L91j535O710r025j2270n323o870J4909m26j939P564
2330B59515j3074o254o765J4853M864l0113J1211J0333j6990J3561J9241J1235
2318B71617k5597k707J4146k90K716j998j8090N199J0435j1753n540J4633m800
$$ plain form
2413 293581 303637 307918 307602 309298 294880 283461 290171 300395 302444 303460 303381 300198 290661 304098
2399 304098 307736 299751 301450 299023 296113 278827 277414 266605 251599 261639 258137 260435 275209
2386 275209 276905 280932 274072 269724 250073 253968 260987 261456 257997 263663 251791 249074 251127 253087
2372 253087 263616 263646 268910 265938 265248 253601 254027 248460 279925 280904 268419 250646 246783 268384
2358 268384 262919 267714 245116 251791 249986 262005 263091 268339 267631 270198 275891 266435 251399 246272
2344 246272 262695 251869 267329 267720 266185 272895 263870 251600 246277 239407 254316 253890 251951 259515
2330 259515 246441 240187 233422 248275 253139 223026 234237 244570 227580 241141 260382 271617
2318 271617 246020 243313 257459 257169 259885 257887 239797 244996 255431 243678 238138 252771 247971
2305B47971K807R421j6581M321J3640M606q582P936R547j2469M947J2014M530
2292B84108o573j0605O209J8216k2651J3637j2404j5832L4064J08Q94J788Q045
2279B99004K683K034j624J7189J0029J561o437N016M0585J0281O607J8663K6336
2266D31927K7929L7042J5915K8796R723K3444O0391N5360Q9832Q9158J15051J24022
2254A108590J76801K12368K77848L64191J43581k36521l18541k96096k15506j52197
2244A064518j13735q3799q5500o9318l9814m9851l5211r304r831j9689l2581j2963
2232E02922k4407k6127k5615l926j2358k2604r901j2425k3033j1912P020m155
2220C33479o464l095R961l2417j1408L327L985Q38q755m684k409j1752M959P193
$$ plain form
2305 247971 250778 260199 243618 247939 261579 266185 257603 265539 275086 262617 267564 279578 284108
2292 284108 277535 266930 273139 291355 268704 282341 269937 254105 288169 288277 289171 290959 299004
2279 299004 301687 303721 302097 319286 329315 330876 324439 329455 370040 380321 386928 405591 431927
2266 431927 459856 496898 512813 541609 551332 574776 635167 690527 780359 869517 984568 1108590
2254 1108590 1285391 1497759 1775607 2139798 2283379 2046858 1728317 1432221 1216715 1064518
2244 1064518 950783 866984 781484 712166 672352 622501 587290 577986 568155 548466 515885 502922
2232 502922 478515 452388 426773 422847 410489 387885 377984 365559 342526 330614 337634 333479
2220 333479 327015 323920 333881 301464 290056 293383 297368 298206 289451 284767 282358 270606 275565 282758
2206B82758n697j3019O309l312K91P572k1546j0271j593J0236j1009m090J270
2193B37899Q354k759j3564K763L282j4727j0398K000J1378j375J0775m7J0780
2180B44361P287j5431j0787L290J704N264j7196j1458n571J3574J677O146o406
2167B16454j3377r85N396l060j393J126J1890k3647q667J1959L139r188L797m868
2153A88576j8223J5495J0594l578n859J4655r957j7685K826j1623l567J2971j026
2140A73599J5459k088k8033J0474J3301j4520n877J030K4144j469J170j2150n962
2127A69078j2632P78M34p614M599J982K0866j895K099J5068p92j8012j2839J5284
2113A76404M915r000j924m403M653l415j174J294O074R734k0390J4976M018r537
$$ plain form
2206 282758 277061 264042 270351 267039 267330 274902 253356 243085 241492 251728 240719 236629 237899
2193 237899 246253 243494 229930 232693 235975 221248 210850 212850 224228 222853 233628 233581 244361
2180 244361 251648 236217 225430 228720 230424 235688 218492 207034 201463 215037 216714 222860 216454
2167 216454 203077 202092 207488 204428 203035 204161 216051 192404 183737 195696 198835 189647 193444 188576
2153 188576 170353 185848 196442 192864 187005 201660 191703 174018 176844 165221 161654 174625 173599
2140 173599 189058 186970 158937 169411 182712 168192 162315 163345 187489 186020 187190 175040 169078
2127 169078 156446 157224 157658 150044 154643 156625 177491 175596 177695 192763 191971 173959 161120 176404
2113 176404 181319 172319 170395 165992 170645 167230 166056 167350 173424 183158 162768 177744 181762 172225
2099A72225l29j3942n442N781Q357O301n090J1621k142K312o383q459j2682m126
2085A48002Q613k228L905m90k782L487J192J766J0812k051M535j0508k849n000
2071A56404O050r622r634J3737J0727p579L573N674j2465R540q056j2504N943
2058A51788j0411l590n202J0528j7j1528K8805N8L432L09o732J0049l226j3592
2044A50671l963J2490j934p358J1669j1022k600m603q019K1996Q521p958o766
2031A51124j3217N460K748J3795n289j7624K506k432l799j584J2127J329j9375
2018A25769M335J7345m129j543l186o311l549O604J5312n855j3080m696J3690
2005A40706Q223j3142p601J475J3524j7983N162q657L889J901O245P336L715P503
$$ plain form
2099 172225 171896 157954 152512 158293 166650 172951 167861 179482 177340 179652 173269 164810 152128 148002
2085 148002 156615 154387 158292 157802 155020 158507 159699 161465 172277 170226 174761 164253 161404 156404
2071 156404 162454 152832 143198 156935 167662 160083 163656 169330 156865 166405 158349 145845 151788
2058 151788 141377 137787 132585 143113 143096 131568 160373 160431 163863 164172 157440 167489 164263 150671
2044 150671 146708 159198 157264 149906 161575 150553 147953 143350 135331 157327 165848 157890 151124
2031 151124 137907 143367 146115 159910 154621 136997 139503 137071 133272 131688 143815 145144 125769
2018 125769 130104 147449 143320 141777 138591 132280 128731 135335 150647 144792 131712 127016 140706
2005 140706 148929 135787 128186 129661 143185 125202 130364 121707 125596 127497 133742 141078 144793 152296
1991A52296P027j4643J0394J5655k3897k935M089n472j921Q33k983J575J531n58
1977A40991k053J3571J260q295j2270K50R463P250j4049l292j2003J4304j021
1964A34106l0174o435J8726Q565n819J985J5340n680R462k717j9656Q143j2519
1951A13327Q282j549P228J306J2722M579q764J154j6856j0338M830p32n400J209
1937A10998M731J2639J3513k149o076j229p955k3729N401K5740q090j4285J8619
1924A28128K617n92N466j2731J1371j948r969R49j0878J3338R683j7115l80r427
1910A08512j078N57n520J4292J2248j4240m914J2182R740j9220j6366J0812j0811
1897I6194p419J4937N107n598J2037L973j2296p269Q269Q060j728P411j723j796
$$ plain form
1991 152296 159323 144680 155074 170729 146832 143897 147986 142514 140593 141426 138443 140018 141549 140991
1977 140991 138938 152509 153769 145474 133204 133454 142917 150167 136118 132826 120823 135127 134106
1964 134106 103932 97497 116223 124788 118969 120954 136294 130614 140076 137359 117703 125846 113327
1951 113327 121609 120060 127288 128594 141316 145895 137131 138285 121429 111091 115921 115189 109789 110998
1937 110998 115729 128368 141881 139732 133656 132427 124472 100743 106144 131884 123794 109509 128128
1924 128128 130745 130153 135619 122888 134259 132311 122342 123291 112413 125751 135434 118319 117939 108512
1910 108512 107434 107991 102471 116763 129011 114771 109857 122039 131779 112559 96193 107005 96194
1897 96194 88775 103712 108819 103221 115258 119231 106935 99666 107935 115995 114267 121678 119955 118159
1883A18159m96j8158m181r84O826O959p389J3814p655j3004J5875J7677O820m714
1869A29549j2345j7955Q789K375o998j182J7320K056m005J692p418K568k2863
1856I1583L954J5870K931o648J699L360j131M907K774K523p512Q40J0799m697
1842A21252M237j5744n45J6909k4430n323o239J8138p35j1344J5743L825P89o662
1828A09871p362M00m488N624J2150m600j4887k206l983r500K7310J6652j4006
1815A10975K70N419R278n968j4502o329j8402L017q647K713J2729N410R791Q93
1801A06647j9314q593J2923J1237R335q70j0673o244O341r982K6585J2119j5533
1788A13978r584o890r316q263Q761m314P81J5545J7673j5104k6157j2634L972
$$ plain form
1883 118159 117663 99505 95324 94340 101166 108125 100736 114550 106895 93891 109766 127443 134263 129549
1869 129549 117204 99249 108038 110413 103415 102233 119553 121609 117604 119296 111878 114446 91583
1856 91583 95537 111407 114338 107690 109389 112749 111618 116525 119299 121822 114310 115150 125949 121252
1842 121252 125489 109745 109200 126109 101679 96356 90117 108255 107520 96176 111919 115744 116533 109871
1828 109871 102509 102909 98421 104045 116195 111595 96708 94502 90519 81019 108329 124981 110975
1815 110975 111245 116664 125942 119974 105472 99143 80741 83758 75111 77824 90553 95963 105754 106647
1801 106647 87333 78740 91663 102900 112235 111365 100692 94448 100789 90807 117392 129511 113978
1788 113978 104394 97504 88188 79925 88686 84372 85153 100698 118371 103267 77110 64476 68448
1775F8448R280J2666J2513l624K0188Q307q786n011j4768J3434J3682j9468J027
1762A07888J0213j3893o102o781N474p41M02r025J2363m038n728j190o463N045
1748H7424m582n339K7555M959k3782J6410j726m501J1867m391j8307N403P565
1735I8555l222j2350j577J4844L878q412o215n621P098K721Q28N453L517p647
1721I1850m797m625r547K6067j4188j3590J5324L509q447M721J0097j7597J0476
1708H9253P582q185j254N420j1389K930j368M284L8k026n645O077j8923J379J2664
1693H0837J762K254R556m216r923J3506K877M735J2337j9221q871L641l939J9697
1679A05032j0846o166O419r65R128q394j3778k84n00K832k452P698k236p763j019
$$ plain form
1775 68448 77728 90394 102907 99283 119471 127778 118992 113981 99213 112647 126329 106861 107888
1762 107888 118101 104208 98106 91325 96799 96058 96460 87435 99798 95760 90032 88842 82379 87424
1748 87424 82842 77503 105058 110017 86235 102645 100919 96418 108285 103894 85587 90990 98555
1735 98555 95333 82983 81406 96250 100128 91716 85501 79880 86978 89699 90527 95980 99497 91850
1721 91850 87053 82428 72881 98948 84760 71170 86494 90003 81556 86277 96374 78777 89253
1708 89253 96835 88650 87396 92816 81427 84357 82989 87273 87311 85285 79640 85717 66794 68173 80837
1693 80837 82599 84853 94409 90193 80270 93776 96653 101388 113725 94504 85633 89274 85335 105032
1679 105032 94186 88020 94439 93474 102602 94208 80430 80146 79646 82478 80026 87724 85488 77725 76706
1664G6706o37L960r5K773r88p141J4813n352q687J3253M719o603j50l162J7173
1649A00582P16k0078r279n147j3679J3894L892j4794O700J7716n436J6363k099
1636H9351j5024o662J5764j481q661N608k678j280J4679j4252j8699O460R220
1623G2345J5963j4493N144j841N493j0587J0616K003j4288J1649J7506J252j5272
1610H5490r158O851M720j0476K118J0132j7567j4795L232J1897j0709p616J3418
1597F7537J4466j3951K52j323o012J4737N99O0M058r530Q572q201n168J4007J951
1582H2054N968M727j0372m035K659j8997n093R157k852J847L292k37J986M995
1568G5099P113j6598q536J4766N21m523O967n038M55P465R975l460j796l636O121
$$ plain form
1664 76706 76069 80029 79934 82707 81719 74578 89391 84039 75352 88605 93324 86721 86571 83409 100582
1649 100582 101298 81220 71941 66794 53115 67009 70901 56107 62807 80523 75087 91450 89351
1636 89351 74327 67665 83429 81948 73287 78895 76217 74937 89616 75364 56665 63125 72345
1623 72345 88308 73815 78959 77118 82611 72024 82640 84643 70355 82004 99510 100762 85490
1610 85490 76332 83183 87903 77427 79545 89677 72110 57315 60547 72444 61735 54119 67537
1597 67537 82003 68052 68304 66981 60969 75706 76305 76365 80423 70893 79465 71264 66096 80103 82054
1582 82054 88022 92749 82377 78342 81001 62004 56911 66068 63216 65063 68355 68118 70104 75099
1568 75099 82212 65614 57078 71844 72365 67842 74809 69771 70226 77691 87666 84206 82410 78774 84895
1553H4895j5556r683K8791N305l2128J1583L302p36J405m053J3793m10j2669M575
1539G8414o903q21j614J8043P175q953n580n873J1790l435k0799p767m316m420
1525D4941J0616J5369O731m164m924n272M997j417N06P492m287j5773j675N710
1511E8850k92J3259l544J22M382q078J4513j1790m841J3307L904J0553L668k6298
1497F7715j7418M910K0764k297O341j7953J706k692k599J164o500O798J1655J55
1483G1749L502q272j412N804j7799j62l14R385n437r469Q028L224J5015j2252
1469F1590l553O246o648J7982J1993l014r613N68Q656q644m964m732J1453j406
1455G5914j4429M538k468o762M076k115j9065M118O785M945r550q485M915M332
$$ plain form
1553 84895 69339 59656 88447 93752 61624 73207 76509 75773 77178 73125 86918 86508 73839 78414
1539 78414 71511 70690 69076 87119 94294 85341 79761 73888 85678 82243 61444 53677 49361 44941
1525 44941 55557 70926 77657 73493 68569 63297 68294 66877 67383 74875 70588 54815 53140 58850
1511 58850 58558 71817 68273 68395 72777 64699 79212 67422 62581 75888 79792 90345 94013 67715
1497 67715 50297 55207 75971 73674 80015 62062 63768 61076 58477 59641 53141 59939 71594 71749
1483 71749 75251 66979 65567 71371 53572 53410 53096 62481 57044 47575 55603 58827 73842 61590
1469 61590 58037 64283 57635 75617 87610 84596 74983 75551 84207 75563 70599 65867 77320 75914
1455 75914 61485 66023 63555 56793 60869 58754 39689 43807 50592 55537 45987 37502 42417 46749
1441D6749J412M234j0221J2350n197q790m147J8131R121J5588k0495j4251J7060
1428F1544j2076K8279j3787k3897O906J0681J1862j3579M414K021P951J7778j4804
1415G3293j8122Q412Q369k0788r09J7376n045k4451N123J8247K181N018K2762
1402I1466j9066j3826q83l4r144l571M172Q178M878q287m517p310K799J5861J2112
1387G2828M149j1445j1791m603qJ1500M210j2518J842q677P08j272R660M289j1103
1372D7769R740P159m371n057J3119N527n392j7226r612K2438j913L998J6193j8768
1358F3604P226j3406M68p069M477J440n864K397J4699J865p951m80P848j0140
1344E9114Q009M965p959o673j264j6780o869J4050K2321L465k975n611j4627J2149
$$ plain form
1441 46749 48161 52395 42174 54524 49327 40537 36390 54521 63642 79230 58735 44484 61544
1428 61544 49468 77747 63960 40063 46969 57650 69512 55933 60347 62368 70319 88097 73293
1415 73293 55171 63583 71952 51164 50255 67631 62586 38135 43258 61505 63686 68704 91466
1402 91466 72400 58574 57691 57657 48513 44942 49114 57292 62170 53883 49366 42056 44855 60716 72828
1387 72828 76977 65532 53741 49138 49130 60630 64840 52322 54164 45487 46195 44923 54583 58872 47769
1372 47769 57509 64668 60297 55240 68359 73886 68494 51268 41656 64094 62181 66179 82372 63604
1358 63604 70830 57424 57892 50823 55300 56740 50876 53273 67972 69837 61886 61406 69254 59114
1344 59114 67123 72088 64129 57456 56192 39412 32543 46593 68914 72379 69404 63793 49166 61315
1330F1315o268p207P132K509m319K42N290K6667j36k4238K781q405m668r751R81
1315D1925M106p290Q701m140K471J5215J837J87l027j0400L307q621j6165m942
1301B3164N426K557L152j8121K7726j721O687k779k2864Q025L2667j748n14j0253
1287E1404j9759J126J3150J4286j2109J7674O504l610k5004j0725J043p59l876
1274B9345Q650n231K1183o680j6332r072J381K2507N145P479m054n840K641p745
1260D3377L747l71P453M152j6824l749M098n1j0252O244j10Q220N162R745n407
1245E5434k2179n695J4012N592j0968l117J8643r38K08l633N806O22j3994o585
1231C3208J367N335J0219j0431O271o137R539J1082m416j8104q884J3525l294
$$ plain form
1330 61315 55047 47840 54972 57481 53162 53404 58694 85361 85225 60987 63768 55363 50695 40944 41925
1315 41925 46031 38741 47442 43302 45773 60988 62825 63012 59985 49585 52892 44271 28106 23164
1301 23164 28590 31147 34299 16178 43904 42183 48870 46091 23227 31252 63919 62171 61657 51404
1287 51404 31645 32771 45921 60207 48098 65772 72276 68666 43662 32937 33980 33221 29345
1274 29345 37995 32764 53947 47267 30935 21863 23244 45751 50896 58375 54321 48481 51122 43377
1260 43377 47124 46753 54206 58358 41534 37785 41883 41832 31580 37824 37714 45934 51096 60841 55434
1245 55434 33255 27560 41572 47164 36196 33079 51722 50784 50992 47359 53165 53787 39793 33208
1231 33208 34575 39910 50129 39698 45969 39832 49371 60453 56037 37933 29049 42574 39280
1218C9280M537N935P923k0475k456K7345l343j3242n045l828r333L842K345Q460
1204D1945M068n753l706n198j92J1628M238L543j5736N324k564m870J1571p908
1190C6390K683M664k96J224K2296k719j4047J0616k798k8008l700L168N62n248
1176B4787R658L708P012q121Q62L965J416m831k968j410j711j2015P639p13m612
1161B2666K790J1417J1119R23j0263j1972P33M734j55O344l096O586p945n26J1736
1146D5091O984q543q448o096M87o386Q220J3617n773q60P64n161r028J3155M760
1131D2783o382r342P091P838p644K0793O470k6467k56q428l332R446M871p590
1117B9851J5800j1960K095N718J247M009q363j495R76l635p343J1022l231N291
$$ plain form
1218 39280 43817 49752 57675 37200 34744 62089 58746 45504 40459 36631 27298 31140 33485 41945
1204 41945 46013 40260 36554 31356 31164 42792 47030 50573 34837 40161 37597 32727 44298 36390
1190 36390 39073 43737 43441 44665 66961 64242 50195 60811 58013 30005 26305 29473 30035 24787
1176 24787 34445 38153 45165 37044 37906 41871 43287 38456 35488 34078 32367 20352 27991 27278 22666
1161 22666 25456 36873 47992 48915 38652 26680 27413 32147 31992 38336 35240 41826 33881 33355 45091
1146 45091 52075 43532 35084 28988 29475 23089 31309 44926 39153 38293 39057 33896 24868 38023 42783
1131 42783 36401 27059 34150 41988 34344 55137 61607 35140 34884 26456 23124 32570 37441 29851
1117 29851 45651 33691 35786 41504 42751 46760 38397 36902 37878 34243 26900 37922 34691 39982
1103C9982M436q609M739j966p319P508M162j1039J037o154R351n366M799Q385
1089D3946q061m05J3N360k899Q84j9978J7371J531p94j5037r10J7427M763j8329
1074B4882k1703J4602L841N942j717J3845Q31m633k315J8522M896j5290o94J05
1060D1114Q94l921P325j7892j6456J6015j833p557Q525R598M406j4023o024R643
1046B9814J0629K0639j7243j0925m629q01K0267J7086m342k1022k0587J4497J4832
1033D8215n611j3883j3162J2151q118n680J2766O790L51o039q40N870m53q025
1019B4332k538n944Q173N432L773N02k485j9232J1137J2331j4089n561J9559J7068
1005E2458M514k1775j17J955N395o926j6357J0013R69j5410r895m824p113J6542
$$ plain form
1103 39982 44418 35809 40548 38582 31263 38771 42933 31894 32931 26777 36128 30762 35561 43946
1089 43946 35885 35480 35493 40853 37954 38838 18860 36231 37762 36968 21931 21021 38448 43211 24882
1074 24882 3179 17781 21622 27564 25847 39692 40523 35890 33575 52097 56993 41703 41009 41114
1060 41114 42008 38087 45412 27520 11064 27079 25246 17689 26214 35812 40218 26195 20171 29814
1046 29814 40443 61082 43839 32914 28285 27484 47751 64837 60495 39473 18886 33383 48215
1033 48215 42604 28721 15559 27710 19592 13912 26678 33468 33819 27780 26940 32810 32357 24332
1019 24332 21794 15850 24023 29455 33228 33730 31245 12013 23150 35481 21392 15831 35390 52458
1005 52458 56972 35197 35080 37035 42430 35504 19147 29160 30129 14719 4824 0 -7113 9429
991I429l064j642N022n034M438j440o807J43J7369J3097l944K494j3638K2863
977C9286j2747k2208J5504J484J1063n613k309j2192j5827R881J5513P267j2966
964A6136j5613R984J9498J245OO95K534o129k0745L425M595o842J1727Q250K986
949C1752N927r345m164m736n606J0302j0221O017k488O965q52m403q403J8274
935B9019q555j3774j7578K862l245J6209j442l741l390L362N959L621j4714j0733
921a6140J2278R790J0409P749l354j2600o135M963J1673n362K0924K895M683k2555
907A9218J094n171j1873J2255J672J653J718q919j2922j5565J4872K1896n141
894A4787k151J3999j9842j3562J0354Q230m748M533K057j3138q4Q003J0280r634
$$ plain form
991 9429 6365 4723 9745 4711 9149 7709 902 1045 18414 31511 27567 30061 16423 39286
977 39286 26539 4331 19835 21319 32382 26769 24460 12268 -3559 6322 21835 29102 16136
964 16136 523 10507 30005 31250 31256 31951 34485 28356 7611 11036 15631 8789 20516 28766 31752
949 31752 37679 28334 24170 19434 13828 24130 13909 19926 17438 24403 23551 19148 10745 29019
935 29019 20464 6690 -10888 -8026 -11271 4938 3496 -245 -3635 -273 5686 9307 -5407 -16140
921 -16140 -3862 5928 16337 24086 20732 8132 1997 6960 18633 13271 34195 37090 41773 19218
907 19218 20312 15141 3268 15523 17195 18848 20566 11647 -1275 -16840 -1968 19928 14787
894 14787 12636 26635 6793 -6769 3585 11815 7067 11600 13657 519 435 8438 18718 9084
880I084j1829n570j162J2474L172o448M331R563j374q37N522J901l256O089o015
865A5645j4467J3257j1261L769J5363j7428M618M267J8142k7848j337Q945o377
852E288K441J2372Q982j1875p937l770n761R329P703r57l191r528P457r26o018
837C609J858j060n36J036j576O201o294N531Q76J1991M245j2353J768Q62N697
822B1855J2845j383o468R981j9784j1913j2948j0337J2109J3716K927o223j3625
809i248n601J3048j010j319P374m319l017O379P009r31j5962M06J3382k153m891
794h53J974K129L707p986n728J2822q321k830j53q952J7588J703N926Q691o407
779A3310k9195J287J1882J2972q519q791P83p697N065M926O918m18N234k907p149
$$ plain form
880 9084 -2745 -8315 -9477 2997 6169 -279 4052 13615 12241 11404 16926 18827 15571 21660 15645
865 15645 1178 14435 3174 6943 22306 4878 9496 13763 31905 4057 2720 11665 5288
852 5288 7729 20101 29083 17208 9271 5501 -260 9069 16772 15815 12624 3096 10553 9627 3609
837 3609 5467 4407 3871 4907 3331 9532 3238 8769 9645 21636 25881 13528 15296 16158 21855
822 21855 34700 33317 26849 36830 17046 5133 -7815 -18152 -6043 7673 10600 4377 -9248
809 -9248 -14849 -1801 -2811 -4130 3244 -1075 -4092 2287 9296 8365 -7597 -7191 6191 4038 -853
794 -853 1121 3250 6957 -1029 -6757 6065 -2256 -5086 -5239 -14191 3397 5100 11026 19717 13310
779 13310 -15885 -14598 -2716 10256 1737 -7054 -6271 -13968 -8903 -3977 2941 2523 7757 4850 -2299
764b299J1424K5549n357j4231j5402M13J3565L223r088k0167Q594J0624j0892
751d044N147N826p801o420r779L833J0520K755k948k095P604N151J607k4982n027
736b0653J9033o833O01J2646K293n085M937j5176J7372q515p263N58m320Q277
722b128j0506q520K164J693K019O242m950j561L003Q506j60j9140O399K0849j5765
707a1855J164K141j2827J1710K2305o276P14j492j3623K4008J5487j2990j6348
694B118q948J4768j0562j39k554k0195q633k352J5380J2451l246j3197M902r327
680b9534J7006O413l420q427N234j572m032q952J0990J5334n574Q76P83J4802
666I927j1418P042l053j254r695J738l200L24Q315l230j134q426J621P846k6900
$$ plain form
764 -2299 9125 34674 29317 15086 -316 97 13662 16885 7797 -12370 -3776 6848 -4044
751 -4044 1103 6929 -872 -7292 -17071 -13238 -2718 37 -2911 -5006 2598 7749 9356 -15626 -20653
736 -20653 -1620 -8453 -7852 4794 7087 2002 6939 -8237 9135 620 -6643 -6085 -10405 -2128
722 -2128 -12634 -21154 -18990 -17297 -15278 -9036 -13986 -15547 -12544 -4038 -4198 -23338 -16939 3910 -11855
707 -11855 -10691 -8550 -21377 -9667 12638 6362 7076 5584 -8039 15969 31456 18466 2118
694 2118 -6830 7938 -2624 -2763 -5317 -25512 -34145 -36497 -21117 -8666 -11912 -25109 -20207 -29534
680 -29534 -12528 -6115 -9535 -17962 -12728 -14300 -18332 -27284 -16294 -960 -6534 -5658 -4875 9927
666 9927 -1491 5551 2498 1244 -8451 -6713 -9913 -9589 -1274 -4504 -5638 -14064 -12443 -4597 -31497
651c1497M344L607M865N510p47n587Q057o051j7238P779J2062j9925J0249K70
637b4302p419K1982L94K961k729O019m227O397j2012m71m185J1581j186J145o149
622a2201j1378O70O768J0995j3642L089N153N563O897j887j0560n073K0935j1233
608e904j140M896R539J1094r604l0472J905R768J473P215J246p568j1878O822
594a2608J9959p036j6563J0092L388r854l571M244J0858k306r163m584j2138J2825
580a6457j8353M264L684J82K8476J2139k3857j5605R399q903k920M500P740o286
566b1997J58N447o087O484Q550J699o795j5095j5372K3502J3676n959k505P173
552g121j043k0135p702r636K6576O430J190J082o205J2095j4997J211j3714N899
$$ plain form
651 -31497 -27153 -23546 -18681 -13171 -13918 -19505 -11448 -17499 -34737 -26958 -14896 -34821 -24572 -24302
637 -24302 -31721 -9739 -9345 -6384 -9113 -3094 -7321 -924 -12936 -13407 -17592 -6011 -7197 -6052 -12201
622 -12201 -23579 -22909 -16141 -5146 -18788 -15699 -10546 -4983 1914 27 -10533 -15606 5329 -5904
608 -5904 -7044 -2148 7391 18485 8881 -21591 -19686 -9918 -8445 -1230 16 -7552 -19430 -12608
594 -12608 7351 315 -16248 -6156 -2768 -12622 -16193 -11949 -1091 -3397 -12560 -17144 -29282 -16457
580 -16457 -34810 -30546 -26862 -26680 1796 13935 -9922 -25527 -16128 -25031 -27951 -23451 -15711 -21997
566 -21997 -21839 -16392 -22479 -15995 -7445 -5746 -12541 -27636 -43008 -19506 -5830 -11789 -14294 -7121
552 -7121 -8164 -28299 -36001 -45637 -19061 -12631 -11441 -10359 -16564 -4469 -19466 -18255 -31969 -26070
538b6070J932J256K440J0319L142m505j0899m359o036J5134j601r207m380J7102
524a5732n549q648l268J573P723n59j6839k115K8239l100L066j3282P229P0j5061
509c6253J1235K340n394j1504L940J6708M342J6162p965r737J041O429k3291K0877
495a1070R219j4849j4521P034Q17j135l515Q337j1991n431J3631j8732k477J3880
481c0803J7484Q761j4999o717K618o567m859K3719r005j3855L397p655J1465M448
467b2568o992n429k382J5706l059o557O100k364j9002J901j908J1740R870j1733
453c6677J0302R696q163k4169N260N715l705r54N9M217Q671k184K0078j248o275
438a9377j4059q864Q380k859j016N351k867O342P913j623j4471J110L56O026O431
$$ plain form
538 -26070 -24138 -22882 -20442 -10123 -6981 -11486 -22385 -26744 -32780 -17646 -19247 -28454 -32834 -15732
524 -15732 -21281 -29929 -33197 -31624 -23901 -24460 -41299 -43414 -15175 -18275 -15209 -28491 -21262 -21192 -36253
509 -36253 -25018 -22678 -28072 -39576 -35636 -18928 -14586 1576 -6389 -16126 -15085 -8656 -31947 -11070
495 -11070 -1851 -16700 -31221 -24187 -23370 -24505 -28020 -19683 -31674 -37105 -23474 -42206 -44683 -30803
481 -30803 -13319 -4558 -19557 -26274 -23656 -30223 -35082 -11363 -20368 -34223 -30826 -38481 -27016 -22568
467 -22568 -29560 -34989 -37371 -21665 -24724 -31281 -25181 -27545 -46547 -44646 -46554 -34814 -24944 -36677
453 -36677 -26375 -16679 -24842 -49011 -43751 -38036 -41741 -42695 -42636 -38419 -29748 -31932 -11854 -13102 -19377
438 -19377 -33436 -42300 -33920 -36779 -37795 -32444 -35311 -28969 -21056 -22679 -37150 -36040 -35684 -29658 -23227
423b3227j503r628j5512J5276q527l379L718q313K1849K5372l2054K91J1530o11
409b4718q941r080K0607n52o760l765l990m477Q997Q649j2020j6296n455J1340
395d6461J1722J939O162j3149k4109J2762P479P303p749P1J239K368K4682n752
381b1493l843j1928J9685K986m0143p290J1579j954O36L518Q776j5867L998K0947
367c0393j133J872o922j256m92K715J938o326M3P410m980K359l385j7960J5173
352d1337l318K3955O202k1692q565Q715k722J0800j3148p261O612K460P473L756
338b8070q022K913q636o224K3030k50n564j4765j2626p806Q749K0404j337j3544
324e1748J101J5098RJ3702j2554o761j735K649M974q979K1268j7712J5729j4034
$$ plain form
423 -23227 -24730 -34358 -49870 -34594 -43121 -46500 -42782 -51095 -29246 -3874 -35928 -35637 -24107 -24718
409 -24718 -33659 -42739 -22132 -22684 -29444 -33209 -37199 -41676 -32679 -24030 -36050 -52346 -57801 -46461
395 -46461 -34739 -32800 -26638 -39787 -63896 -51134 -43655 -36352 -44101 -44030 -42791 -40423 -15741 -21493
381 -21493 -25336 -37264 -17579 -14593 -54736 -62026 -50447 -52401 -51765 -48247 -39471 -55338 -51340 -30393
367 -30393 -31526 -29654 -36576 -37832 -38324 -35609 -33671 -39997 -39954 -32544 -37524 -35165 -38550 -56510 -41337
352 -41337 -44655 -20700 -14498 -36190 -44755 -36040 -38762 -27962 -41110 -48371 -41759 -39299 -31826 -28070
338 -28070 -36092 -33179 -41815 -48039 -25009 -25259 -30823 -45588 -58214 -66020 -57271 -36867 -38204 -51748
324 -51748 -50647 -35549 -35540 -21838 -34392 -41153 -42888 -40239 -35265 -44244 -22976 -40688 -24959 -38993
310c8993r024K715n675r621P687j275P040R820K830j3200n659M732j113J7704
296c2032Q556m079J658j3590k180M976l255j2245j0480J0389J1393J2131k0919
283d9677j3098N938K033j0203m096J2564R024j2649M219m827n316J5689N77j3909
269f3731n327K5254n273M747j26j9124P920J2930j4103j0627r170J5083J1168
256e0379k764M496K429p741q201o039l248J2249J5950L523K488j0142Q106J8076
242b1197j8958K891J1106p379m601p98o317m820j2589K394M517K833j677J393
228e3202n195Q71K077J2293q800j1303n028l970N514J5090N582j1759j785L300
214e6315N830Q23J0974o166J283J2680o296n577J611q669J353o641m253L298J1350
$$ plain form
310 -38993 -48017 -45302 -50977 -60598 -52911 -54186 -47146 -37326 -34496 -47696 -53355 -48623 -49736 -32032
296 -32032 -23476 -27555 -25897 -39487 -41667 -36691 -39946 -52191 -62671 -52282 -40889 -28758 -49677
283 -49677 -62775 -56837 -54804 -65007 -69103 -56539 -47515 -60164 -55945 -60772 -66088 -50399 -49822 -63731
269 -63731 -69058 -43804 -49077 -44330 -44456 -63580 -55660 -42730 -56833 -67460 -76630 -61547 -50379
256 -50379 -53143 -48647 -46218 -53959 -62160 -68199 -71447 -59198 -43248 -39725 -37237 -47379 -39273 -21197
242 -21197 -40155 -37264 -26158 -33537 -38138 -38936 -45253 -50073 -62662 -60268 -55751 -52918 -54595 -53202
228 -53202 -58397 -57526 -55449 -43156 -51956 -63259 -68287 -72257 -66743 -51653 -46071 -57830 -59615 -56315
214 -56315 -50485 -49662 -38688 -44854 -43571 -30891 -37187 -42764 -41153 -49822 -48469 -55110 -59363 -56065 -44715
199d4715N303j4392j2891M449K819N480N958o026O895k966K920n522j2377P161
185e7904n599q368J7756j0228J286k915Q907o776K381M446N597J3411J1672O002
171b0332k2333o700n543J2936m711l438j4861j9166J6044O346l641J8813L610
158d2976j799J125j2812o455r575Q888Q300k046R772M255j1594j0033Q381m06
144e6975O209q771O77J0848j1542K663k2500J3108J4214l762j07m155n568j10
130f5771k279k510J2965n220q279m928p86K0939p0Q127P998j0531j808j2386m113
115f8652o617Q087J6204j059o749n194n141o91K871J0563l322n006M397k474j462
100f4245K74M763k52P453l296j0720J0741p886o785m574J0392M21M54m430j3502
$$ plain form
199 -44715 -39412 -53804 -66695 -62246 -59427 -53947 -47989 -54015 -47120 -50086 -47166 -52688 -65065 -57904
185 -57904 -63503 -71871 -54115 -64343 -63057 -65972 -57065 -63841 -61460 -57014 -51417 -38006 -26334 -20332
171 -20332 -42665 -49365 -54908 -41972 -46683 -50121 -64982 -84148 -68104 -61758 -65399 -46586 -42976
158 -42976 -44775 -43650 -56462 -62917 -72492 -63604 -55304 -57350 -47578 -43323 -54917 -64950 -56569 -56975
144 -56975 -50766 -59537 -58860 -48012 -59554 -56891 -79391 -66283 -52069 -55831 -55938 -60093 -65661 -65771
130 -65771 -68050 -70560 -57595 -62815 -71094 -76022 -76808 -55869 -55939 -47812 -39814 -50345 -52153 -64539 -68652
115 -68652 -75269 -67182 -50978 -52037 -58786 -63980 -69121 -69812 -66941 -56378 -59700 -64706 -60309 -62783 -64245
100 -64245 -63971 -59208 -59460 -52007 -55303 -66023 -55282 -63168 -69953 -74527 -64135 -63714 -63260 -67690 -81192
85h1192j510J2028N045j305N948K781k418p680O480k106q560P072j069m760O126
70f5120n185M922r47R232k32k1505R604j1927J0773P213n182k256O754l066J258
55f5664J887m697o423k2349j032K2785J6172j1996o695J4010J939L549L210l338
41e8642J0125k181k745j1109J408j0727P951L960j4556R93K731L404m373n489
27g9250o406J1144P617L685p987j477P52j192N827m410P53J549Q191o946Q112
12f0038j4071P564J1081j8204j561J849J0069r608j2252N496J0789K222
0f6664
$$ plain form
85 -81192 -82702 -70674 -65629 -66934 -60986 -58205 -60623 -68303 -61823 -63929 -72489 -65417 -66486 -71246 -65120
70 -65120 -70305 -65383 -66330 -57098 -57330 -78835 -69231 -81158 -70385 -63172 -68354 -70610 -63856 -66922 -65664
55 -65664 -63777 -68474 -74897 -97246 -98278 -75493 -59321 -71317 -78012 -64002 -62063 -58514 -55304 -58642
41 -58642 -48517 -50698 -53443 -64552 -63144 -73871 -65920 -61960 -76516 -75523 -72792 -69388 -73761 -79250
27 -79250 -85656 -74512 -66895 -63210 -71197 -72674 -71922 -73114 -67287 -71697 -70944 -69395 -61204 -68150 -60038
12 -60038 -74109 -66545 -55464 -73668 -75229 -73380 -63311 -72919 -85171 -79675 -68886 -66664
0 -66664
$$ Imaginary data points
##PAGE= N=2
##DATA TABLE= (X++(I..I)), XYDATA
16383a281877M016J1456K8871J5588J5994L021K0862Q251J8945K9723J6027Q205
16371a100918Q076J8386J7677J6595J9812J4150N371K7875J9927J684J7047J5633
16359i18685K4560P793J4176R493L802K6250J2475O353Q869K1826J8559J6711
16347g47818J746K3174K7817O093K5190O078J9713K0212l086J5963K2984P593
16335e74341K3439K4166J2471M120N596J2905K4709J1778P782K0565J5208J4786
16323c96816N373J7770K0788O843J0443J6274J0265J0576J5693K6552J1624J5143
16311b29472P104J9031J8164J986n093J4960J2842J5914J7664k52J9878L443R401
16298i4430J8422K1757J7470J4878L281J1014J1777Q594J7538j780Q198K3677
$$ plain form
16383 -1281877 -1277861 -1266405 -1237534 -1221946 -1205952 -1202931 -1182069 -1173818 -1154873 -1125150 -1109123 -1100918
16371 -1100918 -1092842 -1074456 -1056779 -1040184 -1020372 -1006222 -1000851 -972976 -953049 -951365 -934318 -918685
16359 -918685 -894125 -886332 -872156 -862663 -858861 -832611 -820136 -813783 -804914 -783088 -764529 -747818
16347 -747818 -746072 -722898 -695081 -688988 -663798 -657720 -638007 -617795 -620881 -604918 -581934 -574341
16335 -574341 -550902 -526736 -514265 -510145 -504549 -491644 -466935 -455157 -447375 -426810 -411602 -396816
16323 -396816 -391443 -373673 -352885 -346042 -335599 -319325 -309060 -298484 -282791 -256239 -244615 -229472
16311 -229472 -222368 -203337 -185173 -183187 -188280 -173320 -160478 -144564 -126900 -127152 -107274 -103831 -94430
16298 -94430 -76008 -54251 -36781 -21903 -18622 -7608 4169 12763 30301 28521 36719 60396
16286F0396K3542J6907J4411R055J4827J1744j4181J4617K2845J5701P497K93
16274A97654K1286n401J1414J5508J762J1454L093J3828R70K2694L1181l023o54
16261C21766M735K5779O057J3578K440J5836L680L910K5264M456J0118K559J2372
16248D52550J389L322J4143J691O766K5385J6830K343J6487M75P953k48j747K3642
16234E70981o78O647M648K1107L100l557J0854J6118J0504j053J676K065J4221
16221F56633J0609J5683J6471l572K113J4123P191M848j4645Q396J1676q290R682
16208G30918J8639K3987o184L036P426N618m552J4765M092O107J2544Q181j2243
16195H12334j0255P902P304l192Q296J7849J4588q216R486K1435l668J5179n420
$$ plain form
16286 60396 83938 100845 115256 124311 139138 150882 136701 151318 174163 189864 197361 197654
16274 197654 218940 213539 224953 240461 242223 253677 256770 270598 271568 294262 325443 322420 321766
16261 321766 326501 352280 358337 371915 374355 390191 393871 397781 423045 427501 437619 440178 452550
16248 452550 453939 457261 471404 473095 479861 505246 522076 524419 540906 541381 549334 549086 547339 570981
16234 570981 570303 576950 581598 602705 605805 602248 613102 629220 639724 638671 640347 642412 656633
16221 656633 667242 682925 699396 695824 697937 712060 719251 724099 709454 717850 729526 721236 730918
16208 730918 749557 773544 767360 770396 777822 783440 778888 793653 797745 803852 816396 824577 812334
16195 812334 802079 809981 817285 814093 822389 840238 854826 846610 856096 877531 873863 889042 883622
16182H83622n688J0664n732R31N316o27p47K2792Q854P7J6669o999J1972q51O131
16167I46384K621K522L508p792j037k81P833K7813L71o151R84l209p769K2738
16153I88535n429O599J8765j8869Q16o58J8684J0884j4465j35k617N908K743J5879
16139A026640l520K572J0110o830J8139r372q744L2j0704K1399J1946p001k737
16126A041930J1861q538p461J3138J6984j5852Q07Q612k97M583P532m071k658
16113A066570J2845k246J3723K136j3528K880Q906o338J5007j1351j0505N835
16101A083934O875L907Q637l3227M609J2766J1577J868q524J906J3105Q556R38
16088A116927j0718O26N38k258p033l497J6014j2221K540n981j0723L025J3904
$$ plain form
16182 883622 877934 888598 882866 883797 889113 888486 887739 910531 919385 919462 936131 929132 941104 940253 946384
16167 946384 949005 951527 955035 947243 946206 945925 953758 981571 981942 975791 976775 973566 965797 988535
16153 988535 983106 989705 1008470 989601 990417 989759 1008443 1019327 1004862 1004727 1002110 1008018 1010761 1026640
16139 1026640 1023120 1025692 1035802 1028972 1047111 1037739 1028995 1029027 1018323 1039722 1051668 1044667 1041930
16126 1041930 1053791 1045253 1037792 1050930 1067914 1052062 1052869 1061481 1061184 1065767 1073299 1069228 1066570
16113 1066570 1079415 1077169 1090892 1093028 1079500 1082380 1091286 1084948 1099955 1088604 1078099 1083934
16101 1083934 1090809 1094716 1103353 1070126 1074735 1087501 1099078 1100946 1092422 1094328 1107433 1115989 1116927
16088 1116927 1106209 1106835 1107373 1105115 1098082 1094585 1110599 1098378 1100918 1094937 1084214 1087239 1101143
16075A101143k402P648Q308O792M179p079O553p932Q290J0989r35J2964j0598
16062A137920r044k0586j592K1012n571n00J8018j9290j3566J1499J3293p71Q093
16049A138915J691p62j0763r347P438O614o118M363J7036R813k1259r525N381
16036A133477L407J4050o28k340j3203r775M285M098J172J0886j3227M936J8409
16023A155547k3201n947m098K145o713R3L743p556J2688R292J4938k2762N203
16010A133372j218K688j408M477j0273P338j019o477K0518j0076j7095J0119J6061
15997A147007j7382P785r958j4186J1423l651O638K3245j4324j337Q936K286L682
15984A150164k1391k58J7323p941J044q44K970K5507k3630j4550O709J389j4601
$$ plain form
16075 1101143 1098741 1106389 1114697 1121489 1125668 1118589 1125142 1117210 1125500 1136489 1135554 1148518 1137920
16062 1137920 1128876 1108290 1106698 1127710 1122139 1121639 1139657 1120367 1106801 1118300 1131593 1130822 1138915
16049 1138915 1140606 1139844 1129081 1119734 1127172 1133786 1127668 1132031 1149067 1158880 1137621 1128096 1133477
16036 1133477 1136884 1150934 1150306 1147966 1134763 1124988 1129273 1133371 1134543 1145429 1132202 1137138 1155547
16023 1155547 1132346 1126399 1122301 1124446 1117733 1117826 1121569 1114013 1126701 1135993 1150931 1128169 1133372
16010 1133372 1132154 1134842 1133434 1137911 1127638 1134976 1133957 1127480 1147998 1137922 1120827 1130946 1147007
15997 1147007 1129625 1137410 1127452 1113266 1124689 1121038 1127676 1150921 1136597 1135260 1144196 1146482 1150164
15984 1150164 1128773 1128515 1145838 1137897 1138941 1138097 1141067 1166574 1142944 1128394 1135103 1136492 1121891
15971A121891l965J0925J3236m234j0958q189m734K1021P677J4250J43N322j5947
15958A146438n887P174J0127l044j1338j6565j217Q82J1425J0233j9089l601J1021
15945A136559O452m527P325o325o098O133J278L383M817j3067J771M671J7118
15932A159490N481j9139r608r553o58R956p591L300J4224N437J583n991j0780
15919A136151k222R863J7625p024r683m5J553j908N418N128j9494k954J826K870
15905A137104n047k40J2737M128j5163P417L025R201P55N966P894j810j1313l24
15891A154330L67j4856r118j1657j012p712J0685J1008Q565K2326J1536j9177
15879A155285j3375M015L440l317J2998l360O844q338k3204O756J5347J849k706
$$ plain form
15971 1121891 1117926 1128851 1142087 1137853 1126895 1118706 1113972 1134993 1142670 1156920 1157063 1162385 1146438
15958 1146438 1140551 1147725 1157852 1154808 1143470 1126905 1125688 1126570 1137995 1148228 1129139 1125538 1136559
15945 1136559 1143011 1138484 1145809 1139484 1133386 1139519 1140797 1144180 1148997 1135930 1137701 1142372 1159490
15932 1159490 1164971 1145832 1136224 1126671 1126013 1135969 1128378 1131678 1145902 1151339 1152922 1146931 1136151
15919 1136151 1133929 1143792 1161417 1154393 1144710 1144665 1146218 1144310 1149728 1154856 1135362 1132408 1134234 1137104
15905 1137104 1132057 1131817 1144554 1148682 1133519 1140936 1143961 1153162 1153917 1159883 1167777 1165967 1154654 1154330
15891 1154330 1154697 1139841 1130723 1119066 1118054 1110342 1121027 1132035 1140600 1162926 1174462 1155285
15879 1155285 1141910 1145925 1149365 1146048 1159046 1155686 1162530 1154192 1130988 1137744 1153091 1154940 1152234
15866A152234P006M129J640M735m223l0021J1539k1988P83J0502J1295p135j5718
15853A124778K4611l987L092J179k206r355J4893J3600N548j6850j6081J4739
15841A153961O874O461j0174k108J1458q482K158J75L86p186Q028j288Oq33n522
15826A153914p269l095J2366J2969j6507n765N078k661p910p145Q213m441J3940
15813A151687K060j5104q873K474K3850k688J05N713L0904m497k4023N053k1401
15800A145260o365m683K1941j056K824Q66R34R743j2791k3314P185J9561o887
15787A153218J767k639k3922q37Q586P917O168J8327j7432j7391J2089R595l81
15774A155065k201m586K2180O283m603l74r342j4560N85J5076O109j4875o910
$$ plain form
15866 1152234 1159240 1163369 1165009 1169744 1165521 1135500 1147039 1125051 1125834 1136336 1147631 1140496 1124778
15853 1124778 1149389 1145402 1148494 1149673 1147467 1138112 1153005 1166605 1172153 1155303 1139222 1153961
15841 1153961 1160835 1167296 1157122 1155014 1166472 1157990 1160148 1160323 1160709 1153523 1161551 1160263 1160269 1159436 1153914
15826 1153914 1146645 1143550 1155916 1168885 1152378 1146613 1151691 1149030 1141120 1133975 1142188 1137747 1151687
15813 1151687 1153747 1138643 1129770 1132244 1156094 1153406 1153511 1159224 1190128 1185631 1161608 1166661 1145260
15800 1145260 1138895 1134212 1156153 1155097 1157921 1158787 1159721 1169464 1156673 1133359 1140544 1160105 1153218
15787 1153218 1154985 1152346 1128424 1127587 1136173 1144090 1150258 1168585 1151153 1133762 1145851 1155446 1155065
15774 1155065 1152864 1148278 1170458 1176741 1172138 1171764 1162422 1147862 1148447 1163523 1169632 1154757 1147847
15761A147847J4343k803o144m492J1665j4769k4396J7354P733L9K3498J49j347
$$ plain form
15761 1147847 1162190 1159387 1153243 1148751 1160416 1145647 1121251 1138605 1146338 1146377 1169875 1170024 1168677
$$ [...]
##END NTUPLES=NMR SPECTRUM
##END=
